Not builtConsole Output

Started calculate disk usage of build
Finished Calculation of disk usage of build in 0 seconds
Started calculate disk usage of workspace
Finished Calculation of disk usage of workspace in 0 seconds
[INFO] ------------------------------------------------------------------------
[INFO] Reactor Summary:
[INFO] 
[INFO] MicroProfile Reactive Streams Support 1.0-SNAPSHOT . SUCCESS [  5.042 s]
[INFO] MicroProfile Reactive Streams Operators SPI ........ SUCCESS [ 14.179 s]
[INFO] MicroProfile Reactive Streams Operators ............ FAILURE [ 13.266 s]
[INFO] MicroProfile Reactive Streams Operators Core ....... SKIPPED
[INFO] MicroProfile Reactive Streams Operators TCK ........ SKIPPED
[INFO] MicroProfile Reactive Streams Operators TCK Arquillian SKIPPED
[INFO] MicroProfile Reactive Streams Operators Specification 1.0-SNAPSHOT SKIPPED
[INFO] ------------------------------------------------------------------------
[INFO] BUILD FAILURE
[INFO] ------------------------------------------------------------------------
[INFO] Total time: 41.119 s
[INFO] Finished at: 2018-09-27T23:30:11-04:00
[INFO] ------------------------------------------------------------------------
Waiting for Jenkins to finish collecting data
[ERROR] Failed to execute goal org.apache.maven.plugins:maven-javadoc-plugin:2.10.4:jar (attach-javadocs) on project microprofile-reactive-streams-operators: MavenReportException: Error while generating Javadoc:
[ERROR] Exit code: 1 - Picked up JAVA_TOOL_OPTIONS: -Xmx2G -Djava.io.tmpdir=/tmp/genie.microprofile
[ERROR] /home/hudson/genie.microprofile/.jenkins/jobs/reactive-streams-prs/workspace/api/src/main/java/org/eclipse/microprofile/reactive/streams/CompletionSubscriber.java:59: warning: no @param for <T>
[ERROR] static <T, R> CompletionSubscriber<T, R> of(Subscriber<T> subscriber, CompletionStage<R> completion) {
[ERROR] ^
[ERROR] /home/hudson/genie.microprofile/.jenkins/jobs/reactive-streams-prs/workspace/api/src/main/java/org/eclipse/microprofile/reactive/streams/CompletionSubscriber.java:59: warning: no @param for <R>
[ERROR] static <T, R> CompletionSubscriber<T, R> of(Subscriber<T> subscriber, CompletionStage<R> completion) {
[ERROR] ^
[ERROR] /home/hudson/genie.microprofile/.jenkins/jobs/reactive-streams-prs/workspace/api/src/main/java/org/eclipse/microprofile/reactive/streams/ProcessorBuilder.java:347: warning: no @param for <S>
[ERROR] <S> SubscriberBuilder<T, S> to(SubscriberBuilder<R, S> subscriber);
[ERROR] ^
[ERROR] /home/hudson/genie.microprofile/.jenkins/jobs/reactive-streams-prs/workspace/api/src/main/java/org/eclipse/microprofile/reactive/streams/ProcessorBuilder.java:455: warning: no @param for <S>
[ERROR] <S> ProcessorBuilder<T, S> via(ProcessorBuilder<R, S> processor);
[ERROR] ^
[ERROR] /home/hudson/genie.microprofile/.jenkins/jobs/reactive-streams-prs/workspace/api/src/main/java/org/eclipse/microprofile/reactive/streams/ProcessorBuilder.java:464: warning: no @param for <S>
[ERROR] <S> ProcessorBuilder<T, S> via(Processor<R, S> processor);
[ERROR] ^
[ERROR] /home/hudson/genie.microprofile/.jenkins/jobs/reactive-streams-prs/workspace/api/src/main/java/org/eclipse/microprofile/reactive/streams/PublisherBuilder.java:346: warning: no @param for <R>
[ERROR] <R> CompletionRunner<R> to(SubscriberBuilder<T, R> subscriber);
[ERROR] ^
[ERROR] /home/hudson/genie.microprofile/.jenkins/jobs/reactive-streams-prs/workspace/api/src/main/java/org/eclipse/microprofile/reactive/streams/PublisherBuilder.java:354: warning: no @param for <R>
[ERROR] <R> PublisherBuilder<R> via(ProcessorBuilder<T, R> processor);
[ERROR] ^
[ERROR] /home/hudson/genie.microprofile/.jenkins/jobs/reactive-streams-prs/workspace/api/src/main/java/org/eclipse/microprofile/reactive/streams/PublisherBuilder.java:362: warning: no @param for <R>
[ERROR] <R> PublisherBuilder<R> via(Processor<T, R> processor);
[ERROR] ^
[ERROR] /home/hudson/genie.microprofile/.jenkins/jobs/reactive-streams-prs/workspace/api/src/main/java/org/eclipse/microprofile/reactive/streams/PublisherBuilder.java:435: warning: no @param for <S>
[ERROR] <S> PublisherBuilder<S> onErrorResumeWithRsPublisher(Function<Throwable, Publisher<? extends S>> errorHandler);
[ERROR] ^
[ERROR] /home/hudson/genie.microprofile/.jenkins/jobs/reactive-streams-prs/workspace/api/src/main/java/org/eclipse/microprofile/reactive/streams/package-info.java:28: warning: empty <p> tag
[ERROR] * <p>
[ERROR] ^
[ERROR] /home/hudson/genie.microprofile/.jenkins/jobs/reactive-streams-prs/workspace/api/src/main/java/org/eclipse/microprofile/reactive/streams/package-info.java:30: error: reference not found
[ERROR] * <li>{@link org.eclipse.microprofile.reactive.streams.PublisherBuilderImpl}, which when built produces a
[ERROR] ^
[ERROR] /home/hudson/genie.microprofile/.jenkins/jobs/reactive-streams-prs/workspace/api/src/main/java/org/eclipse/microprofile/reactive/streams/package-info.java:32: error: reference not found
[ERROR] * <li>{@link org.eclipse.microprofile.reactive.streams.SubscriberBuilderImpl}, which when built produces a
[ERROR] ^
[ERROR] /home/hudson/genie.microprofile/.jenkins/jobs/reactive-streams-prs/workspace/api/src/main/java/org/eclipse/microprofile/reactive/streams/package-info.java:34: error: reference not found
[ERROR] * <li>{@link org.eclipse.microprofile.reactive.streams.ProcessorBuilderImpl}, which when built produces a
[ERROR] ^
[ERROR] /home/hudson/genie.microprofile/.jenkins/jobs/reactive-streams-prs/workspace/api/src/main/java/org/eclipse/microprofile/reactive/streams/package-info.java:36: error: reference not found
[ERROR] * <li>{@link org.eclipse.microprofile.reactive.streams.CompletionRunnerImpl}, which when built produces a
[ERROR] ^
[ERROR] /home/hudson/genie.microprofile/.jenkins/jobs/reactive-streams-prs/workspace/api/src/main/java/org/eclipse/microprofile/reactive/streams/package-info.java:41: error: reference not found
[ERROR] * {@link org.eclipse.microprofile.reactive.streams.ProcessorBuilderImpl#toList()} changes the builder to a
[ERROR] ^
[ERROR] /home/hudson/genie.microprofile/.jenkins/jobs/reactive-streams-prs/workspace/api/src/main/java/org/eclipse/microprofile/reactive/streams/package-info.java:42: error: reference not found
[ERROR] * {@link org.eclipse.microprofile.reactive.streams.SubscriberBuilderImpl}, since the processor now has a termination
[ERROR] ^
[ERROR] /home/hudson/genie.microprofile/.jenkins/jobs/reactive-streams-prs/workspace/api/src/main/java/org/eclipse/microprofile/reactive/streams/package-info.java:52: error: reference not found
[ERROR] * {@link org.eclipse.microprofile.reactive.streams.ProcessorBuilderImpl#toList()}, the result will be a
[ERROR] ^
[ERROR] /home/hudson/genie.microprofile/.jenkins/jobs/reactive-streams-prs/workspace/api/src/main/java/org/eclipse/microprofile/reactive/streams/package-info.java:54: error: reference not found
[ERROR] * of {@link org.eclipse.microprofile.reactive.streams.ProcessorBuilderImpl#findFirst()}, it's an
[ERROR] ^
[ERROR] /home/hudson/genie.microprofile/.jenkins/jobs/reactive-streams-prs/workspace/api/src/main/java/org/eclipse/microprofile/reactive/streams/package-info.java:59: error: reference not found
[ERROR] * The {@link org.eclipse.microprofile.reactive.streams.CompletionRunnerImpl} builds a closed graph, in that case both a
[ERROR] ^
[ERROR] /home/hudson/genie.microprofile/.jenkins/jobs/reactive-streams-prs/workspace/api/src/main/java/org/eclipse/microprofile/reactive/streams/package-info.java:68: warning: empty <p> tag
[ERROR] * <p>
[ERROR] ^
[ERROR] 
[ERROR] Command line was: /opt/public/common/java/oracle/jdk1.8.0_162_x64/jre/../bin/javadoc @options @packages
[ERROR] 
[ERROR] Refer to the generated Javadoc files in '/home/hudson/genie.microprofile/.jenkins/jobs/reactive-streams-prs/workspace/api/target/apidocs' dir.
Started
Build failed before it gets to this module
Started calculate disk usage of build
Finished Calculation of disk usage of build in 0 seconds
Started calculate disk usage of workspace
Finished Calculation of disk usage of workspace in 0 seconds
Finished: NOT_BUILT