FailedConsole Output

22:24:11 GitHub pull request #91 of commit f37e3ba9f1ef7df2f4c0fbc47b5aac8ae09c8a45, no merge conflicts.
22:24:12 Setting status of f37e3ba9f1ef7df2f4c0fbc47b5aac8ae09c8a45 to PENDING with url https://hudson.eclipse.org/microprofile/job/reactive-streams-prs/88/ and message: 'Build started for merge commit.'
22:24:12 Building in workspace /home/hudson/genie.microprofile/.jenkins/jobs/reactive-streams-prs/workspace
22:24:12 [WS-CLEANUP] Deleting project workspace...
22:24:12 [WS-CLEANUP] Done
22:24:12 Cloning the remote Git repository
22:24:12 Cloning repository https://github.com/eclipse/microprofile-reactive-streams.git
22:24:12  > /usr/local/bin/git init /home/hudson/genie.microprofile/.jenkins/jobs/reactive-streams-prs/workspace # timeout=10
22:24:12 Fetching upstream changes from https://github.com/eclipse/microprofile-reactive-streams.git
22:24:12  > /usr/local/bin/git --version # timeout=10
22:24:12 Setting http proxy: proxy.eclipse.org:9898
22:24:12  > /usr/local/bin/git fetch --tags --progress https://github.com/eclipse/microprofile-reactive-streams.git +refs/heads/*:refs/remotes/origin/*
22:24:14  > /usr/local/bin/git config remote.origin.url https://github.com/eclipse/microprofile-reactive-streams.git # timeout=10
22:24:14  > /usr/local/bin/git config --add remote.origin.fetch +refs/heads/*:refs/remotes/origin/* # timeout=10
22:24:14  > /usr/local/bin/git config remote.origin.url https://github.com/eclipse/microprofile-reactive-streams.git # timeout=10
22:24:14 Fetching upstream changes from https://github.com/eclipse/microprofile-reactive-streams.git
22:24:14 Setting http proxy: proxy.eclipse.org:9898
22:24:14  > /usr/local/bin/git fetch --tags --progress https://github.com/eclipse/microprofile-reactive-streams.git +refs/pull/*:refs/remotes/origin/pr/*
22:24:15  > /usr/local/bin/git rev-parse refs/remotes/origin/pr/91/merge^{commit} # timeout=10
22:24:15  > /usr/local/bin/git rev-parse refs/remotes/origin/origin/pr/91/merge^{commit} # timeout=10
22:24:15 Checking out Revision e72330f795bfa913867fbf34cb3cccb208898db3 (refs/remotes/origin/pr/91/merge)
22:24:15  > /usr/local/bin/git config core.sparsecheckout # timeout=10
22:24:15  > /usr/local/bin/git checkout -f e72330f795bfa913867fbf34cb3cccb208898db3
22:24:15 Commit message: "Merge f37e3ba9f1ef7df2f4c0fbc47b5aac8ae09c8a45 into 3a3ac9702c725f68444cdc6c534e655a3cd63213"
22:24:15 First time build. Skipping changelog.
22:24:15 Parsing POMs
22:24:16 Modules changed, recalculating dependency graph
22:24:19 Established TCP socket on 51264
22:24:19 [workspace] $ /shared/common/jdk1.8.0_x64-latest/bin/java -Xmx2G -Djava.io.tmpdir=/tmp/genie.microprofile -cp /home/hudson/genie.microprofile/.jenkins/plugins/maven-plugin/WEB-INF/lib/maven35-agent-1.12-alpha-1.jar:/shared/common/apache-maven-latest/boot/plexus-classworlds-2.5.2.jar:/shared/common/apache-maven-latest/conf/logging jenkins.maven3.agent.Maven35Main /shared/common/apache-maven-latest /home/hudson/genie.microprofile/.jenkins/war/WEB-INF/lib/remoting-3.21.jar /home/hudson/genie.microprofile/.jenkins/plugins/maven-plugin/WEB-INF/lib/maven35-interceptor-1.12-alpha-1.jar /home/hudson/genie.microprofile/.jenkins/plugins/maven-plugin/WEB-INF/lib/maven3-interceptor-commons-1.12-alpha-1.jar 51264
22:24:19 Picked up JAVA_TOOL_OPTIONS: -Xmx2G -Djava.io.tmpdir=/tmp/genie.microprofile
22:24:20 <===[JENKINS REMOTING CAPACITY]===>channel started
22:24:21 Executing Maven:  -B -f /home/hudson/genie.microprofile/.jenkins/jobs/reactive-streams-prs/workspace/pom.xml install
22:24:23 [INFO] Scanning for projects...
22:24:23 [WARNING] 
22:24:23 [WARNING] Some problems were encountered while building the effective model for org.eclipse.microprofile.reactive.streams:microprofile-reactive-streams-operators:jar:1.0-SNAPSHOT
22:24:23 [WARNING] 'build.plugins.plugin.version' for org.eclipse.microprofile.maven:microprofile-maven-build-extension is missing. @ org.eclipse.microprofile.reactive.streams:microprofile-reactive-streams-parent:1.0-SNAPSHOT, /home/hudson/genie.microprofile/.jenkins/jobs/reactive-streams-prs/workspace/pom.xml, line 261, column 21
22:24:23 [WARNING] 
22:24:23 [WARNING] Some problems were encountered while building the effective model for org.eclipse.microprofile.reactive.streams:microprofile-reactive-streams-operators-tck:jar:1.0-SNAPSHOT
22:24:23 [WARNING] 'build.plugins.plugin.version' for org.eclipse.microprofile.maven:microprofile-maven-build-extension is missing. @ org.eclipse.microprofile.reactive.streams:microprofile-reactive-streams-operators-tck:[unknown-version], /home/hudson/genie.microprofile/.jenkins/jobs/reactive-streams-prs/workspace/tck/pom.xml, line 88, column 21
22:24:23 [WARNING] 
22:24:23 [WARNING] Some problems were encountered while building the effective model for org.eclipse.microprofile.reactive.streams:microprofile-reactive-streams-operators-tck-arquillian:jar:1.0-SNAPSHOT
22:24:23 [WARNING] 'build.plugins.plugin.version' for org.eclipse.microprofile.maven:microprofile-maven-build-extension is missing. @ org.eclipse.microprofile.reactive.streams:microprofile-reactive-streams-operators-tck-arquillian:[unknown-version], /home/hudson/genie.microprofile/.jenkins/jobs/reactive-streams-prs/workspace/tck-arquillian/pom.xml, line 102, column 21
22:24:23 [WARNING] 
22:24:23 [WARNING] Some problems were encountered while building the effective model for org.eclipse.microprofile.reactive.streams:microprofile-reactive-streams-operators-spec:pom:1.0-SNAPSHOT
22:24:23 [WARNING] 'build.plugins.plugin.version' for org.eclipse.microprofile.maven:microprofile-maven-build-extension is missing. @ org.eclipse.microprofile.reactive.streams:microprofile-reactive-streams-parent:1.0-SNAPSHOT, /home/hudson/genie.microprofile/.jenkins/jobs/reactive-streams-prs/workspace/pom.xml, line 261, column 21
22:24:23 [WARNING] 
22:24:23 [WARNING] Some problems were encountered while building the effective model for org.eclipse.microprofile.reactive.streams:microprofile-reactive-streams-parent:pom:1.0-SNAPSHOT
22:24:23 [WARNING] 'build.plugins.plugin.version' for org.eclipse.microprofile.maven:microprofile-maven-build-extension is missing. @ line 261, column 21
22:24:23 [WARNING] 
22:24:23 [WARNING] It is highly recommended to fix these problems because they threaten the stability of your build.
22:24:23 [WARNING] 
22:24:23 [WARNING] For this reason, future Maven versions might no longer support building such malformed projects.
22:24:23 [WARNING] 
22:24:23 [INFO] ------------------------------------------------------------------------
22:24:23 [INFO] Reactor Build Order:
22:24:23 [INFO] 
22:24:23 [INFO] MicroProfile Reactive Streams Support                              [pom]
22:24:23 [INFO] MicroProfile Reactive Streams Operators                            [jar]
22:24:23 [INFO] MicroProfile Reactive Streams Operators TCK                        [jar]
22:24:23 [INFO] MicroProfile Reactive Streams Operators TCK Arquillian             [jar]
22:24:23 [INFO] MicroProfile Reactive Streams Operators Specification              [pom]
22:24:23 [INFO] 
22:24:23 [INFO] --< org.eclipse.microprofile.reactive.streams:microprofile-reactive-streams-parent >--
22:24:23 [INFO] Building MicroProfile Reactive Streams Support 1.0-SNAPSHOT        [1/5]
22:24:23 [INFO] --------------------------------[ pom ]---------------------------------
22:24:23 [INFO] 
22:24:23 [INFO] --- apache-rat-plugin:0.12:check (rat-check) @ microprofile-reactive-streams-parent ---
22:24:24 [INFO] Enabled default license matchers.
22:24:24 [INFO] Will parse SCM ignores for exclusions...
22:24:24 [INFO] Parsing exclusions from /home/hudson/genie.microprofile/.jenkins/jobs/reactive-streams-prs/workspace/.gitignore
22:24:24 [INFO] Finished adding exclusions from SCM ignore files.
22:24:24 [INFO] 78 implicit excludes (use -debug for more details).
22:24:24 [INFO] Exclude: **/*.svg
22:24:24 [INFO] Exclude: **/target
22:24:24 [INFO] Exclude: .travis.yml.*
22:24:24 [INFO] Exclude: bnd.bnd
22:24:24 [INFO] Exclude: *.log
22:24:24 [INFO] Exclude: .checkstyle
22:24:24 [INFO] Exclude: .factorypath
22:24:24 [INFO] Exclude: .editorconfig
22:24:24 [INFO] Exclude: **/node_modules/**
22:24:24 [INFO] Exclude: **/*.json
22:24:24 [INFO] 7 resources included (use -debug for more details)
22:24:24 [INFO] Rat check: Summary over all files. Unapproved: 0, unknown: 0, generated: 0, approved: 5 licenses.
22:24:25 [INFO] 
22:24:25 [INFO] --- maven-checkstyle-plugin:3.0.0:checkstyle-aggregate (verify-style) @ microprofile-reactive-streams-parent ---
22:24:27 [INFO] Starting audit...
22:24:27 Audit done.
22:24:27 [WARNING] Unable to locate Source XRef to link to - DISABLED
22:24:28 [INFO] 
22:24:28 [INFO] --- maven-install-plugin:2.4:install (default-install) @ microprofile-reactive-streams-parent ---
22:24:28 [INFO] Installing /home/hudson/genie.microprofile/.jenkins/jobs/reactive-streams-prs/workspace/pom.xml to /opt/public/hipp/homes/genie.microprofile/.m2/repository/org/eclipse/microprofile/reactive/streams/microprofile-reactive-streams-parent/1.0-SNAPSHOT/microprofile-reactive-streams-parent-1.0-SNAPSHOT.pom
22:24:28 [WARNING] Attempt to (de-)serialize anonymous class hudson.maven.reporters.MavenArtifactArchiver$2; see: https://jenkins.io/redirect/serialization-of-anonymous-classes/
22:24:28 [WARNING] Attempt to (de-)serialize anonymous class hudson.maven.reporters.MavenFingerprinter$1; see: https://jenkins.io/redirect/serialization-of-anonymous-classes/
22:24:29 Started calculate disk usage of build
22:24:29 Finished Calculation of disk usage of build in 0 seconds
22:24:29 Started calculate disk usage of workspace
22:24:29 Finished Calculation of disk usage of workspace in 0 seconds
22:24:30 [INFO] 
22:24:30 [INFO] --< org.eclipse.microprofile.reactive.streams:microprofile-reactive-streams-operators >--
22:24:30 [INFO] Building MicroProfile Reactive Streams Operators 1.0-SNAPSHOT      [2/5]
22:24:30 [INFO] --------------------------------[ jar ]---------------------------------
22:24:30 [INFO] 
22:24:30 [INFO] --- apache-rat-plugin:0.12:check (rat-check) @ microprofile-reactive-streams-operators ---
22:24:30 [INFO] Enabled default license matchers.
22:24:30 [INFO] Will parse SCM ignores for exclusions...
22:24:30 [INFO] Parsing exclusions from /home/hudson/genie.microprofile/.jenkins/jobs/reactive-streams-prs/workspace/api/.gitignore
22:24:30 [INFO] Finished adding exclusions from SCM ignore files.
22:24:30 [INFO] 64 implicit excludes (use -debug for more details).
22:24:30 [INFO] Exclude: **/*.svg
22:24:30 [INFO] Exclude: **/target
22:24:30 [INFO] Exclude: .travis.yml.*
22:24:30 [INFO] Exclude: bnd.bnd
22:24:30 [INFO] Exclude: *.log
22:24:30 [INFO] Exclude: .checkstyle
22:24:30 [INFO] Exclude: .factorypath
22:24:30 [INFO] Exclude: .editorconfig
22:24:30 [INFO] Exclude: **/node_modules/**
22:24:30 [INFO] Exclude: **/*.json
22:24:30 [INFO] 23 resources included (use -debug for more details)
22:24:30 [INFO] Rat check: Summary over all files. Unapproved: 0, unknown: 0, generated: 0, approved: 22 licenses.
22:24:30 [INFO] 
22:24:30 [INFO] --- frontend-maven-plugin:1.6:install-node-and-npm (install-node-and-run-npm-install) @ microprofile-reactive-streams-operators ---
22:24:30 [INFO] Installing node version v8.11.3
22:24:30 [INFO] Unpacking /opt/public/hipp/homes/genie.microprofile/.m2/repository/com/github/eirslett/node/8.11.3/node-8.11.3-linux-x64.tar.gz into /home/hudson/genie.microprofile/.jenkins/jobs/reactive-streams-prs/workspace/api/node/tmp
22:24:31 [INFO] Copying node binary from /home/hudson/genie.microprofile/.jenkins/jobs/reactive-streams-prs/workspace/api/node/tmp/node-v8.11.3-linux-x64/bin/node to /home/hudson/genie.microprofile/.jenkins/jobs/reactive-streams-prs/workspace/api/node/node
22:24:35 [INFO] Extracting NPM
22:24:35 [INFO] Installed node locally.
22:24:35 [INFO] 
22:24:35 [INFO] --- frontend-maven-plugin:1.6:npm (install-node-and-run-npm-install) @ microprofile-reactive-streams-operators ---
22:24:35 [INFO] Running 'npm install' in /home/hudson/genie.microprofile/.jenkins/jobs/reactive-streams-prs/workspace/api
22:24:37 [INFO] 
22:24:37 [INFO] > puppeteer@1.7.0 install /jobs/genie.microprofile/reactive-streams-prs/workspace/api/node_modules/puppeteer
22:24:37 [INFO] > node install.js
22:24:37 [INFO] 
22:24:39 [ERROR] 
22:24:43 [INFO] Chromium downloaded to /jobs/genie.microprofile/reactive-streams-prs/workspace/api/node_modules/puppeteer/.local-chromium/linux-579032
22:24:43 [INFO] added 47 packages in 6.785s
22:24:43 [INFO] 
22:24:43 [INFO] --- maven-resources-plugin:2.6:resources (default-resources) @ microprofile-reactive-streams-operators ---
22:24:43 [INFO] Using 'UTF-8' encoding to copy filtered resources.
22:24:43 [INFO] skip non existing resourceDirectory /home/hudson/genie.microprofile/.jenkins/jobs/reactive-streams-prs/workspace/api/src/main/resources
22:24:43 [INFO] 
22:24:43 [INFO] --- maven-compiler-plugin:3.1:compile (default-compile) @ microprofile-reactive-streams-operators ---
22:24:43 [INFO] Changes detected - recompiling the module!
22:24:43 [INFO] Compiling 16 source files to /home/hudson/genie.microprofile/.jenkins/jobs/reactive-streams-prs/workspace/api/target/classes
22:24:45 [WARNING] /home/hudson/genie.microprofile/.jenkins/jobs/reactive-streams-prs/workspace/api/src/main/java/org/eclipse/microprofile/reactive/streams/PublisherBuilder.java: Some input files use unchecked or unsafe operations.
22:24:45 [WARNING] /home/hudson/genie.microprofile/.jenkins/jobs/reactive-streams-prs/workspace/api/src/main/java/org/eclipse/microprofile/reactive/streams/PublisherBuilder.java: Recompile with -Xlint:unchecked for details.
22:24:45 [INFO] 
22:24:45 [INFO] --- maven-checkstyle-plugin:3.0.0:checkstyle-aggregate (verify-style) @ microprofile-reactive-streams-operators ---
22:24:45 [INFO] 
22:24:45 [INFO] --- bnd-maven-plugin:3.4.0:bnd-process (default) @ microprofile-reactive-streams-operators ---
22:24:45 [INFO] 
22:24:45 [INFO] --- maven-resources-plugin:2.6:testResources (default-testResources) @ microprofile-reactive-streams-operators ---
22:24:45 [INFO] Using 'UTF-8' encoding to copy filtered resources.
22:24:45 [INFO] skip non existing resourceDirectory /home/hudson/genie.microprofile/.jenkins/jobs/reactive-streams-prs/workspace/api/src/test/resources
22:24:45 [INFO] 
22:24:45 [INFO] --- maven-compiler-plugin:3.1:testCompile (default-testCompile) @ microprofile-reactive-streams-operators ---
22:24:45 [INFO] No sources to compile
22:24:45 [INFO] 
22:24:45 [INFO] --- maven-surefire-plugin:2.12.4:test (default-test) @ microprofile-reactive-streams-operators ---
22:24:45 [INFO] No tests to run.
22:24:45 [JENKINS] Recording test results
22:24:45 [INFO] 
22:24:45 [INFO] --- frontend-maven-plugin:1.6:npm (generate-marble-diagrams) @ microprofile-reactive-streams-operators ---
22:24:45 [INFO] Running 'npm run-script generate-marble-diagrams' in /home/hudson/genie.microprofile/.jenkins/jobs/reactive-streams-prs/workspace/api
22:24:46 [INFO] 
22:24:46 [INFO] > svg-marbles@1.0.0 generate-marble-diagrams /jobs/genie.microprofile/reactive-streams-prs/workspace/api
22:24:46 [INFO] > node src/docs/js/generate-marble-diagrams.js
22:24:46 [INFO] 
22:24:46 [INFO] Error: Failed to launch chrome!
22:24:46 [INFO] /jobs/genie.microprofile/reactive-streams-prs/workspace/api/node_modules/puppeteer/.local-chromium/linux-579032/chrome-linux/chrome: error while loading shared libraries: libnss3.so: cannot open shared object file: No such file or directory
22:24:46 [INFO] 
22:24:46 [INFO] 
22:24:46 [INFO] TROUBLESHOOTING: https://github.com/GoogleChrome/puppeteer/blob/master/docs/troubleshooting.md
22:24:46 [INFO] 
22:24:46 [INFO]     at onClose (/jobs/genie.microprofile/reactive-streams-prs/workspace/api/node_modules/puppeteer/lib/Launcher.js:299:14)
22:24:46 [INFO]     at Interface.helper.addEventListener (/jobs/genie.microprofile/reactive-streams-prs/workspace/api/node_modules/puppeteer/lib/Launcher.js:288:50)
22:24:46 [INFO]     at emitNone (events.js:111:20)
22:24:46 [INFO]     at Interface.emit (events.js:208:7)
22:24:46 [INFO]     at Interface.close (readline.js:368:8)
22:24:46 [INFO]     at Socket.onend (readline.js:147:10)
22:24:46 [INFO]     at emitNone (events.js:111:20)
22:24:46 [INFO]     at Socket.emit (events.js:208:7)
22:24:46 [INFO]     at endReadableNT (_stream_readable.js:1064:12)
22:24:46 [INFO]     at _combinedTickCallback (internal/process/next_tick.js:138:11)
22:24:46 [ERROR] npm ERR! code ELIFECYCLE
22:24:46 [ERROR] npm ERR! errno 1
22:24:46 [ERROR] npm ERR! svg-marbles@1.0.0 generate-marble-diagrams: `node src/docs/js/generate-marble-diagrams.js`
22:24:46 [ERROR] npm ERR! Exit status 1
22:24:46 [ERROR] npm ERR! 
22:24:46 [ERROR] npm ERR! Failed at the svg-marbles@1.0.0 generate-marble-diagrams script.
22:24:46 [ERROR] npm ERR! This is probably not a problem with npm. There is likely additional logging output above.
22:24:46 [ERROR] 
22:24:46 [ERROR] npm ERR! A complete log of this run can be found in:
22:24:46 [ERROR] npm ERR!     /opt/public/hipp/homes/genie.microprofile/.npm/_logs/2018-08-15T02_24_46_292Z-debug.log
22:24:48 Started calculate disk usage of build
22:24:48 Finished Calculation of disk usage of build in 0 seconds
22:24:48 Started calculate disk usage of workspace
22:24:48 Finished Calculation of disk usage of workspace in 0 seconds
22:24:49 [INFO] ------------------------------------------------------------------------
22:24:49 [INFO] Reactor Summary:
22:24:49 [INFO] 
22:24:49 [INFO] MicroProfile Reactive Streams Support 1.0-SNAPSHOT . SUCCESS [  4.805 s]
22:24:49 [INFO] MicroProfile Reactive Streams Operators ............ FAILURE [ 16.273 s]
22:24:49 [INFO] MicroProfile Reactive Streams Operators TCK ........ SKIPPED
22:24:49 [INFO] MicroProfile Reactive Streams Operators TCK Arquillian SKIPPED
22:24:49 [INFO] MicroProfile Reactive Streams Operators Specification 1.0-SNAPSHOT SKIPPED
22:24:49 [INFO] ------------------------------------------------------------------------
22:24:49 [INFO] BUILD FAILURE
22:24:49 [INFO] ------------------------------------------------------------------------
22:24:49 [INFO] Total time: 26.899 s
22:24:49 [INFO] Finished at: 2018-08-14T22:24:49-04:00
22:24:49 [INFO] ------------------------------------------------------------------------
22:24:49 Waiting for Jenkins to finish collecting data
22:24:49 [ERROR] Failed to execute goal com.github.eirslett:frontend-maven-plugin:1.6:npm (generate-marble-diagrams) on project microprofile-reactive-streams-operators: Failed to run task: 'npm run-script generate-marble-diagrams' failed. org.apache.commons.exec.ExecuteException: Process exited with an error: 1 (Exit value: 1) -> [Help 1]
22:24:49 [ERROR] 
22:24:49 [ERROR] To see the full stack trace of the errors, re-run Maven with the -e switch.
22:24:49 [ERROR] Re-run Maven using the -X switch to enable full debug logging.
22:24:49 [ERROR] 
22:24:49 [ERROR] For more information about the errors and possible solutions, please read the following articles:
22:24:49 [ERROR] [Help 1] http://cwiki.apache.org/confluence/display/MAVEN/MojoFailureException
22:24:49 [ERROR] 
22:24:49 [JENKINS] Archiving /home/hudson/genie.microprofile/.jenkins/jobs/reactive-streams-prs/workspace/tck-arquillian/pom.xml to org.eclipse.microprofile.reactive.streams/microprofile-reactive-streams-operators-tck-arquillian/1.0-SNAPSHOT/microprofile-reactive-streams-operators-tck-arquillian-1.0-SNAPSHOT.pom
22:24:49 [ERROR] After correcting the problems, you can resume the build with the command
22:24:49 [ERROR]   mvn <goals> -rf :microprofile-reactive-streams-operators
22:24:49 [JENKINS] Archiving /home/hudson/genie.microprofile/.jenkins/jobs/reactive-streams-prs/workspace/pom.xml to org.eclipse.microprofile.reactive.streams/microprofile-reactive-streams-parent/1.0-SNAPSHOT/microprofile-reactive-streams-parent-1.0-SNAPSHOT.pom
22:24:49 [JENKINS] Archiving /home/hudson/genie.microprofile/.jenkins/jobs/reactive-streams-prs/workspace/tck/pom.xml to org.eclipse.microprofile.reactive.streams/microprofile-reactive-streams-operators-tck/1.0-SNAPSHOT/microprofile-reactive-streams-operators-tck-1.0-SNAPSHOT.pom
22:24:49 [JENKINS] Archiving /home/hudson/genie.microprofile/.jenkins/jobs/reactive-streams-prs/workspace/api/pom.xml to org.eclipse.microprofile.reactive.streams/microprofile-reactive-streams-operators/1.0-SNAPSHOT/microprofile-reactive-streams-operators-1.0-SNAPSHOT.pom
22:24:49 [JENKINS] Archiving /home/hudson/genie.microprofile/.jenkins/jobs/reactive-streams-prs/workspace/spec/pom.xml to org.eclipse.microprofile.reactive.streams/microprofile-reactive-streams-operators-spec/1.0-SNAPSHOT/microprofile-reactive-streams-operators-spec-1.0-SNAPSHOT.pom
22:24:52 channel stopped
22:24:53 Started calculate disk usage of build
22:24:53 Finished Calculation of disk usage of build in 0 seconds
22:24:55 Started calculate disk usage of workspace
22:24:55 Finished Calculation of disk usage of workspace in 0 seconds
22:24:56 Setting status of f37e3ba9f1ef7df2f4c0fbc47b5aac8ae09c8a45 to FAILURE with url https://hudson.eclipse.org/microprofile/job/reactive-streams-prs/88/ and message: 'Build finished. '
22:24:56 Finished: FAILURE