Console Output

[INFO] ------------------------------------------------------------------------
[INFO] Reactor Summary for MicroProfile Reactive Messaging 2.0-SNAPSHOT:
[INFO] 
[INFO] MicroProfile Reactive Messaging .................... FAILURE [ 33.264 s]
[INFO] MicroProfile Reactive Messaging API ................ SKIPPED
[INFO] MicroProfile Reactive Messaging - TCK .............. SKIPPED
[INFO] MicroProfile Reactive Messaging Specification ...... SKIPPED
[INFO] ------------------------------------------------------------------------
[INFO] BUILD FAILURE
[INFO] ------------------------------------------------------------------------
[INFO] Total time:  40.262 s
[INFO] Finished at: 2021-03-19T10:31:35Z
[INFO] ------------------------------------------------------------------------
Waiting for Jenkins to finish collecting data
[ERROR] Failed to execute goal on project microprofile-reactive-messaging-api: Could not resolve dependencies for project org.eclipse.microprofile.reactive.messaging:microprofile-reactive-messaging-api:jar:2.0-SNAPSHOT: Could not find artifact org.eclipse.microprofile.reactive-streams-operators:microprofile-reactive-streams-operators-api:jar:2.0 in eclipse.maven.central.mirror (https://repo.eclipse.org/content/repositories/maven_central/) -> [Help 1]
[ERROR] 
[ERROR] To see the full stack trace of the errors, re-run Maven with the -e switch.
[ERROR] Re-run Maven using the -X switch to enable full debug logging.
[ERROR] 
[ERROR] For more information about the errors and possible solutions, please read the following articles:
[ERROR] [Help 1] http://cwiki.apache.org/confluence/display/MAVEN/DependencyResolutionException
[ERROR] 
[ERROR] After correcting the problems, you can resume the build with the command
[ERROR]   mvn <goals> -rf :microprofile-reactive-messaging-api
Started
Running as SYSTEM
Build failed before it gets to this module
Finished: NOT_BUILT