Console Output

[INFO] ------------------------------------------------------------------------
[INFO] Reactor Summary for MicroProfile Context Propagation 1.1-SNAPSHOT:
[INFO] 
[INFO] MicroProfile Context Propagation ................... FAILURE [ 26.673 s]
[INFO] MicroProfile Context Propagation ................... SKIPPED
[INFO] microprofile-context-propagation-tck ............... SKIPPED
[INFO] MicroProfile Context Propagation Specification ..... SKIPPED
[INFO] ------------------------------------------------------------------------
[INFO] BUILD FAILURE
[INFO] ------------------------------------------------------------------------
[INFO] Total time:  28.017 s
[INFO] Finished at: 2020-07-20T12:51:24Z
[INFO] ------------------------------------------------------------------------
Waiting for Jenkins to finish collecting data
[ERROR] Failed to execute goal org.apache.maven.plugins:maven-checkstyle-plugin:3.0.0:checkstyle-aggregate (verify-style) on project microprofile-context-propagation-parent: An error has occurred in Checkstyle report generation. Failed during checkstyle execution: There are 2 errors reported by Checkstyle 6.18 with /home/jenkins/agent/workspace/microprofile-concurrency-prs/mp_checkstyle_rules.xml ruleset. -> [Help 1]
[ERROR] 
[ERROR] To see the full stack trace of the errors, re-run Maven with the -e switch.
[ERROR] Re-run Maven using the -X switch to enable full debug logging.
[ERROR] 
[ERROR] For more information about the errors and possible solutions, please read the following articles:
[ERROR] [Help 1] http://cwiki.apache.org/confluence/display/MAVEN/MojoExecutionException
Started
Running as SYSTEM
Build failed before it gets to this module
Finished: NOT_BUILT