FailedConsole Output

02:54:00 Started by timer
02:54:00 Building in workspace /home/hudson/genie.microprofile/.jenkins/jobs/OpenTracing-maven-snapshots/workspace
02:54:00 [WS-CLEANUP] Deleting project workspace...
02:54:00 [WS-CLEANUP] Done
02:54:00 Cloning the remote Git repository
02:54:00 Cloning repository https://github.com/eclipse/microprofile-opentracing.git
02:54:00  > /usr/local/bin/git init /home/hudson/genie.microprofile/.jenkins/jobs/OpenTracing-maven-snapshots/workspace # timeout=10
02:54:00 Fetching upstream changes from https://github.com/eclipse/microprofile-opentracing.git
02:54:00  > /usr/local/bin/git --version # timeout=10
02:54:00 Setting http proxy: proxy.eclipse.org:9898
02:54:00  > /usr/local/bin/git fetch --tags --progress https://github.com/eclipse/microprofile-opentracing.git +refs/heads/*:refs/remotes/origin/*
02:54:03  > /usr/local/bin/git config remote.origin.url https://github.com/eclipse/microprofile-opentracing.git # timeout=10
02:54:03  > /usr/local/bin/git config --add remote.origin.fetch +refs/heads/*:refs/remotes/origin/* # timeout=10
02:54:03  > /usr/local/bin/git config remote.origin.url https://github.com/eclipse/microprofile-opentracing.git # timeout=10
02:54:03 Fetching upstream changes from https://github.com/eclipse/microprofile-opentracing.git
02:54:03 Setting http proxy: proxy.eclipse.org:9898
02:54:03  > /usr/local/bin/git fetch --tags --progress https://github.com/eclipse/microprofile-opentracing.git +refs/heads/*:refs/remotes/origin/*
02:54:04  > /usr/local/bin/git rev-parse refs/remotes/origin/master^{commit} # timeout=10
02:54:04  > /usr/local/bin/git rev-parse refs/remotes/origin/origin/master^{commit} # timeout=10
02:54:04 Checking out Revision 79dba4af093ea2b3363e204f5d1fcda37041966b (refs/remotes/origin/master)
02:54:04  > /usr/local/bin/git config core.sparsecheckout # timeout=10
02:54:04  > /usr/local/bin/git checkout -f 79dba4af093ea2b3363e204f5d1fcda37041966b
02:54:04 Commit message: "Merge pull request #5 from Steve-Fontes/fontes-updates"
02:54:04  > /usr/local/bin/git rev-list 79dba4af093ea2b3363e204f5d1fcda37041966b # timeout=10
02:54:04 Parsing POMs
02:54:04 Established TCP socket on 36761
02:54:04 [workspace] $ /shared/common/jdk1.8.0_x64-latest/bin/java -cp /home/hudson/genie.microprofile/.jenkins/plugins/maven-plugin/WEB-INF/lib/maven33-agent-1.12-alpha-1.jar:/shared/common/apache-maven-latest/boot/plexus-classworlds-2.5.2.jar:/shared/common/apache-maven-latest/conf/logging jenkins.maven3.agent.Maven33Main /shared/common/apache-maven-latest /home/hudson/genie.microprofile/.jenkins/war/WEB-INF/lib/remoting-3.10.2.jar /home/hudson/genie.microprofile/.jenkins/plugins/maven-plugin/WEB-INF/lib/maven33-interceptor-1.12-alpha-1.jar /home/hudson/genie.microprofile/.jenkins/plugins/maven-plugin/WEB-INF/lib/maven3-interceptor-commons-1.12-alpha-1.jar 36761
02:54:06 <===[JENKINS REMOTING CAPACITY]===>channel started
02:54:07 Executing Maven:  -B -f /home/hudson/genie.microprofile/.jenkins/jobs/OpenTracing-maven-snapshots/workspace/pom.xml -pl !spec -Peclipse-jarsigner install
02:54:09 [INFO] Scanning for projects...
02:54:09 Started calculate disk usage of build
02:54:09 Finished Calculation of disk usage of build in 0 seconds
02:54:09 Started calculate disk usage of workspace
02:54:09 Finished Calculation of disk usage of workspace in 0 seconds
02:54:10 [INFO] ------------------------------------------------------------------------
02:54:10 [INFO] Reactor Build Order:
02:54:10 [INFO] 
02:54:10 [INFO] microprofile-opentracing-parent
02:54:10 [INFO] microProfile-opentracing-api
02:54:10 [INFO] microprofile-opentracing-tck
02:54:10 [INFO]                                                                         
02:54:10 [INFO] ------------------------------------------------------------------------
02:54:10 [INFO] Building microprofile-opentracing-parent 0.1-SNAPSHOT
02:54:10 [INFO] ------------------------------------------------------------------------
02:54:10 [INFO] 
02:54:10 [INFO] --- apache-rat-plugin:0.12:check (rat-check) @ microprofile-opentracing-parent ---
02:54:12 [INFO] Enabled default license matchers.
02:54:12 [INFO] Will parse SCM ignores for exclusions...
02:54:12 [INFO] Parsing exclusions from /home/hudson/genie.microprofile/.jenkins/jobs/OpenTracing-maven-snapshots/workspace/.gitignore
02:54:12 [INFO] Finished adding exclusions from SCM ignore files.
02:54:12 [INFO] 74 implicit excludes (use -debug for more details).
02:54:12 [INFO] Exclude: .travis.yml.*
02:54:12 [INFO] Exclude: bnd.bnd
02:54:12 [INFO] Exclude: *.log
02:54:12 [INFO] Exclude: .checkstyle
02:54:12 [INFO] Exclude: .factorypath
02:54:12 [INFO] Exclude: .editorconfig
02:54:12 [INFO] 4 resources included (use -debug for more details)
02:54:12 [INFO] Rat check: Summary over all files. Unapproved: 0, unknown: 0, generated: 0, approved: 2 licenses.
02:54:12 [INFO] 
02:54:12 [INFO] --- maven-checkstyle-plugin:2.17:check (verify-style) @ microprofile-opentracing-parent ---
02:54:14 [INFO] Starting audit...
02:54:14 Audit done.
02:54:14 [INFO] 
02:54:14 [INFO] --- maven-install-plugin:2.4:install (default-install) @ microprofile-opentracing-parent ---
02:54:15 [INFO] Installing /home/hudson/genie.microprofile/.jenkins/jobs/OpenTracing-maven-snapshots/workspace/pom.xml to /opt/public/hipp/homes/genie.microprofile/.m2/repository/org/eclipse/microprofile/opentracing/parent/microprofile-opentracing-parent/0.1-SNAPSHOT/microprofile-opentracing-parent-0.1-SNAPSHOT.pom
02:54:15 Started calculate disk usage of build
02:54:15 Finished Calculation of disk usage of build in 0 seconds
02:54:15 Started calculate disk usage of workspace
02:54:15 Finished Calculation of disk usage of workspace in 0 seconds
02:54:15 [INFO]                                                                         
02:54:15 [INFO] ------------------------------------------------------------------------
02:54:15 [INFO] Building microProfile-opentracing-api 1.0-SNAPSHOT
02:54:15 [INFO] ------------------------------------------------------------------------
02:54:15 [INFO] 
02:54:15 [INFO] --- apache-rat-plugin:0.12:check (rat-check) @ microprofile-opentracing-api ---
02:54:15 [INFO] Enabled default license matchers.
02:54:15 [INFO] Will parse SCM ignores for exclusions...
02:54:15 [INFO] Parsing exclusions from /home/hudson/genie.microprofile/.jenkins/jobs/OpenTracing-maven-snapshots/workspace/api/.gitignore
02:54:15 [INFO] Finished adding exclusions from SCM ignore files.
02:54:15 [INFO] 62 implicit excludes (use -debug for more details).
02:54:15 [INFO] Exclude: .travis.yml.*
02:54:15 [INFO] Exclude: bnd.bnd
02:54:15 [INFO] Exclude: *.log
02:54:15 [INFO] Exclude: .checkstyle
02:54:15 [INFO] Exclude: .factorypath
02:54:15 [INFO] Exclude: .editorconfig
02:54:15 [INFO] 6 resources included (use -debug for more details)
02:54:15 [INFO] Rat check: Summary over all files. Unapproved: 0, unknown: 0, generated: 0, approved: 3 licenses.
02:54:15 [INFO] 
02:54:15 [INFO] --- maven-resources-plugin:2.6:resources (default-resources) @ microprofile-opentracing-api ---
02:54:15 [INFO] Using 'UTF-8' encoding to copy filtered resources.
02:54:15 [INFO] Copying 2 resources
02:54:16 [INFO] 
02:54:16 [INFO] --- maven-compiler-plugin:3.1:compile (default-compile) @ microprofile-opentracing-api ---
02:54:16 [INFO] Changes detected - recompiling the module!
02:54:16 [INFO] Compiling 2 source files to /home/hudson/genie.microprofile/.jenkins/jobs/OpenTracing-maven-snapshots/workspace/api/target/classes
02:54:17 [INFO] 
02:54:17 [INFO] --- maven-checkstyle-plugin:2.17:check (verify-style) @ microprofile-opentracing-api ---
02:54:17 [INFO] Starting audit...
02:54:17 Audit done.
02:54:17 [INFO] 
02:54:17 [INFO] --- bnd-maven-plugin:2.4.1:bnd-process (default) @ microprofile-opentracing-api ---
02:54:18 [INFO] 
02:54:18 [INFO] --- maven-resources-plugin:2.6:testResources (default-testResources) @ microprofile-opentracing-api ---
02:54:18 [INFO] Using 'UTF-8' encoding to copy filtered resources.
02:54:18 [INFO] skip non existing resourceDirectory /home/hudson/genie.microprofile/.jenkins/jobs/OpenTracing-maven-snapshots/workspace/api/src/test/resources
02:54:18 [INFO] 
02:54:18 [INFO] --- maven-compiler-plugin:3.1:testCompile (default-testCompile) @ microprofile-opentracing-api ---
02:54:18 [INFO] No sources to compile
02:54:18 [INFO] 
02:54:18 [INFO] --- maven-surefire-plugin:2.12.4:test (default-test) @ microprofile-opentracing-api ---
02:54:19 [INFO] No tests to run.
02:54:19 [JENKINS] Recording test results
02:54:19 [INFO] 
02:54:19 [INFO] --- maven-jar-plugin:3.0.2:jar (default-jar) @ microprofile-opentracing-api ---
02:54:19 [INFO] Building jar: /home/hudson/genie.microprofile/.jenkins/jobs/OpenTracing-maven-snapshots/workspace/api/target/microprofile-opentracing-api-1.0-SNAPSHOT.jar
02:54:19 [INFO] 
02:54:19 [INFO] --- maven-javadoc-plugin:2.10.3:jar (attach-javadocs) @ microprofile-opentracing-api ---
02:54:21 [INFO] 
02:54:21 Loading source files for package org.eclipse.microprofile.opentracing...
02:54:21 Constructing Javadoc information...
02:54:21 Standard Doclet version 1.8.0_131
02:54:21 Building tree for all the packages and classes...
02:54:21 Generating /home/hudson/genie.microprofile/.jenkins/jobs/OpenTracing-maven-snapshots/workspace/api/target/apidocs/org/eclipse/microprofile/opentracing/Traced.html...
02:54:21 Generating /home/hudson/genie.microprofile/.jenkins/jobs/OpenTracing-maven-snapshots/workspace/api/target/apidocs/org/eclipse/microprofile/opentracing/package-frame.html...
02:54:21 Generating /home/hudson/genie.microprofile/.jenkins/jobs/OpenTracing-maven-snapshots/workspace/api/target/apidocs/org/eclipse/microprofile/opentracing/package-summary.html...
02:54:21 Generating /home/hudson/genie.microprofile/.jenkins/jobs/OpenTracing-maven-snapshots/workspace/api/target/apidocs/org/eclipse/microprofile/opentracing/package-tree.html...
02:54:21 Generating /home/hudson/genie.microprofile/.jenkins/jobs/OpenTracing-maven-snapshots/workspace/api/target/apidocs/constant-values.html...
02:54:21 Generating /home/hudson/genie.microprofile/.jenkins/jobs/OpenTracing-maven-snapshots/workspace/api/target/apidocs/org/eclipse/microprofile/opentracing/class-use/Traced.html...
02:54:21 Generating /home/hudson/genie.microprofile/.jenkins/jobs/OpenTracing-maven-snapshots/workspace/api/target/apidocs/org/eclipse/microprofile/opentracing/package-use.html...
02:54:21 Building index for all the packages and classes...
02:54:21 Generating /home/hudson/genie.microprofile/.jenkins/jobs/OpenTracing-maven-snapshots/workspace/api/target/apidocs/overview-tree.html...
02:54:21 Generating /home/hudson/genie.microprofile/.jenkins/jobs/OpenTracing-maven-snapshots/workspace/api/target/apidocs/index-all.html...
02:54:21 Generating /home/hudson/genie.microprofile/.jenkins/jobs/OpenTracing-maven-snapshots/workspace/api/target/apidocs/deprecated-list.html...
02:54:21 Building index for all classes...
02:54:21 Generating /home/hudson/genie.microprofile/.jenkins/jobs/OpenTracing-maven-snapshots/workspace/api/target/apidocs/allclasses-frame.html...
02:54:21 Generating /home/hudson/genie.microprofile/.jenkins/jobs/OpenTracing-maven-snapshots/workspace/api/target/apidocs/allclasses-noframe.html...
02:54:21 Generating /home/hudson/genie.microprofile/.jenkins/jobs/OpenTracing-maven-snapshots/workspace/api/target/apidocs/index.html...
02:54:21 Generating /home/hudson/genie.microprofile/.jenkins/jobs/OpenTracing-maven-snapshots/workspace/api/target/apidocs/help-doc.html...
02:54:22 [INFO] Building jar: /home/hudson/genie.microprofile/.jenkins/jobs/OpenTracing-maven-snapshots/workspace/api/target/microprofile-opentracing-api-1.0-SNAPSHOT-javadoc.jar
02:54:22 [INFO] 
02:54:22 [INFO] --- maven-install-plugin:2.4:install (default-install) @ microprofile-opentracing-api ---
02:54:22 [INFO] Installing /home/hudson/genie.microprofile/.jenkins/jobs/OpenTracing-maven-snapshots/workspace/api/target/microprofile-opentracing-api-1.0-SNAPSHOT.jar to /opt/public/hipp/homes/genie.microprofile/.m2/repository/org/eclipse/microprofile/opentracing/microprofile-opentracing-api/1.0-SNAPSHOT/microprofile-opentracing-api-1.0-SNAPSHOT.jar
02:54:22 [INFO] Installing /home/hudson/genie.microprofile/.jenkins/jobs/OpenTracing-maven-snapshots/workspace/api/pom.xml to /opt/public/hipp/homes/genie.microprofile/.m2/repository/org/eclipse/microprofile/opentracing/microprofile-opentracing-api/1.0-SNAPSHOT/microprofile-opentracing-api-1.0-SNAPSHOT.pom
02:54:22 [INFO] Installing /home/hudson/genie.microprofile/.jenkins/jobs/OpenTracing-maven-snapshots/workspace/api/target/microprofile-opentracing-api-1.0-SNAPSHOT-javadoc.jar to /opt/public/hipp/homes/genie.microprofile/.m2/repository/org/eclipse/microprofile/opentracing/microprofile-opentracing-api/1.0-SNAPSHOT/microprofile-opentracing-api-1.0-SNAPSHOT-javadoc.jar
02:54:22 Started calculate disk usage of build
02:54:22 Finished Calculation of disk usage of build in 0 seconds
02:54:22 Started calculate disk usage of workspace
02:54:22 Finished Calculation of disk usage of workspace in 0 seconds
02:54:22 [INFO]                                                                         
02:54:22 [INFO] ------------------------------------------------------------------------
02:54:22 [INFO] Building microprofile-opentracing-tck 1.0-SNAPSHOT
02:54:22 [INFO] ------------------------------------------------------------------------
02:54:23 [INFO] 
02:54:23 [INFO] --- apache-rat-plugin:0.12:check (rat-check) @ microprofile-opentracing-tck ---
02:54:23 [INFO] Enabled default license matchers.
02:54:23 [INFO] Will parse SCM ignores for exclusions...
02:54:23 [INFO] Parsing exclusions from /home/hudson/genie.microprofile/.jenkins/jobs/OpenTracing-maven-snapshots/workspace/tck/.gitignore
02:54:23 [INFO] Finished adding exclusions from SCM ignore files.
02:54:23 [INFO] 63 implicit excludes (use -debug for more details).
02:54:23 [INFO] Exclude: .travis.yml.*
02:54:23 [INFO] Exclude: bnd.bnd
02:54:23 [INFO] Exclude: *.log
02:54:23 [INFO] Exclude: .checkstyle
02:54:23 [INFO] Exclude: .factorypath
02:54:23 [INFO] Exclude: .editorconfig
02:54:23 [INFO] 12 resources included (use -debug for more details)
02:54:23 [INFO] Rat check: Summary over all files. Unapproved: 0, unknown: 0, generated: 0, approved: 7 licenses.
02:54:23 [INFO] 
02:54:23 [INFO] --- maven-resources-plugin:2.6:resources (default-resources) @ microprofile-opentracing-tck ---
02:54:23 [INFO] Using 'UTF-8' encoding to copy filtered resources.
02:54:23 [INFO] Copying 2 resources
02:54:24 [INFO] 
02:54:24 [INFO] --- maven-compiler-plugin:3.1:compile (default-compile) @ microprofile-opentracing-tck ---
02:54:24 [INFO] Changes detected - recompiling the module!
02:54:24 [INFO] Compiling 3 source files to /home/hudson/genie.microprofile/.jenkins/jobs/OpenTracing-maven-snapshots/workspace/tck/target/classes
02:54:24 [INFO] -------------------------------------------------------------
02:54:24 [ERROR] COMPILATION ERROR : 
02:54:24 [INFO] -------------------------------------------------------------
02:54:24 [ERROR] /home/hudson/genie.microprofile/.jenkins/jobs/OpenTracing-maven-snapshots/workspace/tck/src/main/java/org/eclipse/microprofile/opentracing/tck/application/TestClassAnnotationApp.java:[22,44] cannot find symbol
02:54:24   symbol:   class NoTrace
02:54:24   location: package org.eclipse.microprofile.opentracing
02:54:24 [ERROR] /home/hudson/genie.microprofile/.jenkins/jobs/OpenTracing-maven-snapshots/workspace/tck/src/main/java/org/eclipse/microprofile/opentracing/tck/application/TestClassAnnotationApp.java:[23,44] cannot find symbol
02:54:24   symbol:   class Trace
02:54:24   location: package org.eclipse.microprofile.opentracing
02:54:24 [ERROR] /home/hudson/genie.microprofile/.jenkins/jobs/OpenTracing-maven-snapshots/workspace/tck/src/main/java/org/eclipse/microprofile/opentracing/tck/application/TestClassAnnotationApp.java:[32,2] cannot find symbol
02:54:24   symbol: class Trace
02:54:24 [ERROR] /home/hudson/genie.microprofile/.jenkins/jobs/OpenTracing-maven-snapshots/workspace/tck/src/main/java/org/eclipse/microprofile/opentracing/tck/application/TestMethodAnnotationApp.java:[22,44] cannot find symbol
02:54:24   symbol:   class Trace
02:54:24   location: package org.eclipse.microprofile.opentracing
02:54:24 [ERROR] /home/hudson/genie.microprofile/.jenkins/jobs/OpenTracing-maven-snapshots/workspace/tck/src/main/java/org/eclipse/microprofile/opentracing/tck/application/TestClassAnnotationApp.java:[46,6] cannot find symbol
02:54:24   symbol:   class NoTrace
02:54:24   location: class org.eclipse.microprofile.opentracing.tck.application.TestClassAnnotationApp
02:54:24 [ERROR] /home/hudson/genie.microprofile/.jenkins/jobs/OpenTracing-maven-snapshots/workspace/tck/src/main/java/org/eclipse/microprofile/opentracing/tck/application/TestClassAnnotationApp.java:[54,6] cannot find symbol
02:54:24   symbol:   class Trace
02:54:24   location: class org.eclipse.microprofile.opentracing.tck.application.TestClassAnnotationApp
02:54:24 [ERROR] /home/hudson/genie.microprofile/.jenkins/jobs/OpenTracing-maven-snapshots/workspace/tck/src/main/java/org/eclipse/microprofile/opentracing/tck/application/TestMethodAnnotationApp.java:[36,6] cannot find symbol
02:54:24   symbol:   class Trace
02:54:24   location: class org.eclipse.microprofile.opentracing.tck.application.TestMethodAnnotationApp
02:54:24 [ERROR] /home/hudson/genie.microprofile/.jenkins/jobs/OpenTracing-maven-snapshots/workspace/tck/src/main/java/org/eclipse/microprofile/opentracing/tck/application/TestMethodAnnotationApp.java:[51,6] cannot find symbol
02:54:24   symbol:   class Trace
02:54:24   location: class org.eclipse.microprofile.opentracing.tck.application.TestMethodAnnotationApp
02:54:24 [ERROR] /home/hudson/genie.microprofile/.jenkins/jobs/OpenTracing-maven-snapshots/workspace/tck/src/main/java/org/eclipse/microprofile/opentracing/tck/application/TestMethodAnnotationApp.java:[59,6] cannot find symbol
02:54:24   symbol:   class Trace
02:54:24   location: class org.eclipse.microprofile.opentracing.tck.application.TestMethodAnnotationApp
02:54:24 [ERROR] /home/hudson/genie.microprofile/.jenkins/jobs/OpenTracing-maven-snapshots/workspace/tck/src/main/java/org/eclipse/microprofile/opentracing/tck/application/TestMethodAnnotationApp.java:[67,6] cannot find symbol
02:54:24   symbol:   class Trace
02:54:24   location: class org.eclipse.microprofile.opentracing.tck.application.TestMethodAnnotationApp
02:54:24 [INFO] 10 errors 
02:54:24 [INFO] -------------------------------------------------------------
02:54:24 Started calculate disk usage of build
02:54:24 Finished Calculation of disk usage of build in 0 seconds
02:54:24 Started calculate disk usage of workspace
02:54:24 Finished Calculation of disk usage of workspace in 0 seconds
02:54:25 [INFO] ------------------------------------------------------------------------
02:54:25 [INFO] Reactor Summary:
02:54:25 [INFO] 
02:54:25 [INFO] microprofile-opentracing-parent .................... SUCCESS [  5.110 s]
02:54:25 [INFO] microProfile-opentracing-api ....................... SUCCESS [  6.788 s]
02:54:25 [INFO] microprofile-opentracing-tck ....................... FAILURE [  2.163 s]
02:54:25 [INFO] ------------------------------------------------------------------------
02:54:25 [INFO] BUILD FAILURE
02:54:25 [INFO] ------------------------------------------------------------------------
02:54:25 [INFO] Total time: 16.103 s
02:54:25 [INFO] Finished at: 2017-11-15T02:54:25-05:00
02:54:25 [INFO] Final Memory: 53M/1926M
02:54:25 [INFO] ------------------------------------------------------------------------
02:54:25 [WARNING] The requested profile "eclipse-jarsigner" could not be activated because it does not exist.
02:54:25 Waiting for Jenkins to finish collecting data
02:54:25 [ERROR] Failed to execute goal org.apache.maven.plugins:maven-compiler-plugin:3.1:compile (default-compile) on project microprofile-opentracing-tck: Compilation failure: Compilation failure:
02:54:25 [ERROR] /home/hudson/genie.microprofile/.jenkins/jobs/OpenTracing-maven-snapshots/workspace/tck/src/main/java/org/eclipse/microprofile/opentracing/tck/application/TestClassAnnotationApp.java:[22,44] cannot find symbol
02:54:25 [ERROR] symbol:   class NoTrace
02:54:25 [ERROR] location: package org.eclipse.microprofile.opentracing
02:54:25 [ERROR] /home/hudson/genie.microprofile/.jenkins/jobs/OpenTracing-maven-snapshots/workspace/tck/src/main/java/org/eclipse/microprofile/opentracing/tck/application/TestClassAnnotationApp.java:[23,44] cannot find symbol
02:54:25 [ERROR] symbol:   class Trace
02:54:25 [ERROR] location: package org.eclipse.microprofile.opentracing
02:54:25 [ERROR] /home/hudson/genie.microprofile/.jenkins/jobs/OpenTracing-maven-snapshots/workspace/tck/src/main/java/org/eclipse/microprofile/opentracing/tck/application/TestClassAnnotationApp.java:[32,2] cannot find symbol
02:54:25 [JENKINS] Archiving /home/hudson/genie.microprofile/.jenkins/jobs/OpenTracing-maven-snapshots/workspace/pom.xml to org.eclipse.microprofile.opentracing.parent/microprofile-opentracing-parent/0.1-SNAPSHOT/microprofile-opentracing-parent-0.1-SNAPSHOT.pom
02:54:25 [ERROR] symbol: class Trace
02:54:25 [ERROR] /home/hudson/genie.microprofile/.jenkins/jobs/OpenTracing-maven-snapshots/workspace/tck/src/main/java/org/eclipse/microprofile/opentracing/tck/application/TestMethodAnnotationApp.java:[22,44] cannot find symbol
02:54:25 [ERROR] symbol:   class Trace
02:54:25 [ERROR] location: package org.eclipse.microprofile.opentracing
02:54:25 [ERROR] /home/hudson/genie.microprofile/.jenkins/jobs/OpenTracing-maven-snapshots/workspace/tck/src/main/java/org/eclipse/microprofile/opentracing/tck/application/TestClassAnnotationApp.java:[46,6] cannot find symbol
02:54:25 [JENKINS] Archiving /home/hudson/genie.microprofile/.jenkins/jobs/OpenTracing-maven-snapshots/workspace/api/pom.xml to org.eclipse.microprofile.opentracing/microprofile-opentracing-api/1.0-SNAPSHOT/microprofile-opentracing-api-1.0-SNAPSHOT.pom
02:54:25 [JENKINS] Archiving /home/hudson/genie.microprofile/.jenkins/jobs/OpenTracing-maven-snapshots/workspace/api/target/microprofile-opentracing-api-1.0-SNAPSHOT.jar to org.eclipse.microprofile.opentracing/microprofile-opentracing-api/1.0-SNAPSHOT/microprofile-opentracing-api-1.0-SNAPSHOT.jar
02:54:25 [JENKINS] Archiving /home/hudson/genie.microprofile/.jenkins/jobs/OpenTracing-maven-snapshots/workspace/api/target/microprofile-opentracing-api-1.0-SNAPSHOT-javadoc.jar to org.eclipse.microprofile.opentracing/microprofile-opentracing-api/1.0-SNAPSHOT/microprofile-opentracing-api-1.0-SNAPSHOT-javadoc.jar
02:54:25 [ERROR] symbol:   class NoTrace
02:54:25 [ERROR] location: class org.eclipse.microprofile.opentracing.tck.application.TestClassAnnotationApp
02:54:25 [ERROR] /home/hudson/genie.microprofile/.jenkins/jobs/OpenTracing-maven-snapshots/workspace/tck/src/main/java/org/eclipse/microprofile/opentracing/tck/application/TestClassAnnotationApp.java:[54,6] cannot find symbol
02:54:25 [ERROR] symbol:   class Trace
02:54:25 [ERROR] location: class org.eclipse.microprofile.opentracing.tck.application.TestClassAnnotationApp
02:54:25 [ERROR] /home/hudson/genie.microprofile/.jenkins/jobs/OpenTracing-maven-snapshots/workspace/tck/src/main/java/org/eclipse/microprofile/opentracing/tck/application/TestMethodAnnotationApp.java:[36,6] cannot find symbol
02:54:25 [JENKINS] Archiving /home/hudson/genie.microprofile/.jenkins/jobs/OpenTracing-maven-snapshots/workspace/tck/pom.xml to org.eclipse.microprofile.opentracing/microprofile-opentracing-tck/1.0-SNAPSHOT/microprofile-opentracing-tck-1.0-SNAPSHOT.pom
02:54:25 [ERROR] symbol:   class Trace
02:54:25 [ERROR] location: class org.eclipse.microprofile.opentracing.tck.application.TestMethodAnnotationApp
02:54:25 [ERROR] /home/hudson/genie.microprofile/.jenkins/jobs/OpenTracing-maven-snapshots/workspace/tck/src/main/java/org/eclipse/microprofile/opentracing/tck/application/TestMethodAnnotationApp.java:[51,6] cannot find symbol
02:54:25 [ERROR] symbol:   class Trace
02:54:25 [ERROR] location: class org.eclipse.microprofile.opentracing.tck.application.TestMethodAnnotationApp
02:54:25 [ERROR] /home/hudson/genie.microprofile/.jenkins/jobs/OpenTracing-maven-snapshots/workspace/tck/src/main/java/org/eclipse/microprofile/opentracing/tck/application/TestMethodAnnotationApp.java:[59,6] cannot find symbol
02:54:25 [ERROR] symbol:   class Trace
02:54:25 [ERROR] location: class org.eclipse.microprofile.opentracing.tck.application.TestMethodAnnotationApp
02:54:25 [ERROR] /home/hudson/genie.microprofile/.jenkins/jobs/OpenTracing-maven-snapshots/workspace/tck/src/main/java/org/eclipse/microprofile/opentracing/tck/application/TestMethodAnnotationApp.java:[67,6] cannot find symbol
02:54:25 [ERROR] symbol:   class Trace
02:54:25 [ERROR] location: class org.eclipse.microprofile.opentracing.tck.application.TestMethodAnnotationApp
02:54:25 [ERROR] -> [Help 1]
02:54:25 [ERROR] 
02:54:25 [ERROR] To see the full stack trace of the errors, re-run Maven with the -e switch.
02:54:25 [ERROR] Re-run Maven using the -X switch to enable full debug logging.
02:54:25 [ERROR] 
02:54:25 [ERROR] For more information about the errors and possible solutions, please read the following articles:
02:54:25 [ERROR] [Help 1] http://cwiki.apache.org/confluence/display/MAVEN/MojoFailureException
02:54:25 [ERROR] 
02:54:25 [ERROR] After correcting the problems, you can resume the build with the command
02:54:25 [ERROR]   mvn <goals> -rf :microprofile-opentracing-tck
02:54:25 channel stopped
02:54:26 Started calculate disk usage of build
02:54:26 Finished Calculation of disk usage of build in 0 seconds
02:54:26 Started calculate disk usage of workspace
02:54:26 Finished Calculation of disk usage of workspace in 0 seconds
02:54:26 Sending e-mails to: microprofile-dev@eclipse.org
02:54:26 Finished: FAILURE