FailedConsole Output

15:54:06 Started by an SCM change
15:54:06 Building in workspace /home/hudson/genie.microprofile/.jenkins/jobs/OpenTracing-maven-snapshots/workspace
15:54:06 [WS-CLEANUP] Deleting project workspace...
15:54:06 [WS-CLEANUP] Done
15:54:06 Cloning the remote Git repository
15:54:06 Cloning repository https://github.com/eclipse/microprofile-opentracing.git
15:54:06  > /usr/local/bin/git init /home/hudson/genie.microprofile/.jenkins/jobs/OpenTracing-maven-snapshots/workspace # timeout=10
15:54:06 Fetching upstream changes from https://github.com/eclipse/microprofile-opentracing.git
15:54:06  > /usr/local/bin/git --version # timeout=10
15:54:06 Setting http proxy: proxy.eclipse.org:9898
15:54:06  > /usr/local/bin/git fetch --tags --progress https://github.com/eclipse/microprofile-opentracing.git +refs/heads/*:refs/remotes/origin/*
15:54:10  > /usr/local/bin/git config remote.origin.url https://github.com/eclipse/microprofile-opentracing.git # timeout=10
15:54:10  > /usr/local/bin/git config --add remote.origin.fetch +refs/heads/*:refs/remotes/origin/* # timeout=10
15:54:10  > /usr/local/bin/git config remote.origin.url https://github.com/eclipse/microprofile-opentracing.git # timeout=10
15:54:10 Fetching upstream changes from https://github.com/eclipse/microprofile-opentracing.git
15:54:10 Setting http proxy: proxy.eclipse.org:9898
15:54:10  > /usr/local/bin/git fetch --tags --progress https://github.com/eclipse/microprofile-opentracing.git +refs/heads/*:refs/remotes/origin/*
15:54:10  > /usr/local/bin/git rev-parse refs/remotes/origin/master^{commit} # timeout=10
15:54:10  > /usr/local/bin/git rev-parse refs/remotes/origin/origin/master^{commit} # timeout=10
15:54:10 Checking out Revision 79dba4af093ea2b3363e204f5d1fcda37041966b (refs/remotes/origin/master)
15:54:10  > /usr/local/bin/git config core.sparsecheckout # timeout=10
15:54:10  > /usr/local/bin/git checkout -f 79dba4af093ea2b3363e204f5d1fcda37041966b
15:54:10 Commit message: "Merge pull request #5 from Steve-Fontes/fontes-updates"
15:54:10  > /usr/local/bin/git rev-list 7f56bbefae4f09c152b5295a5437c926672557ab # timeout=10
15:54:10 Parsing POMs
15:54:10 Established TCP socket on 54550
15:54:10 [workspace] $ /shared/common/jdk1.8.0_x64-latest/bin/java -cp /home/hudson/genie.microprofile/.jenkins/plugins/maven-plugin/WEB-INF/lib/maven33-agent-1.12-alpha-1.jar:/shared/common/apache-maven-latest/boot/plexus-classworlds-2.5.2.jar:/shared/common/apache-maven-latest/conf/logging jenkins.maven3.agent.Maven33Main /shared/common/apache-maven-latest /home/hudson/genie.microprofile/.jenkins/war/WEB-INF/lib/remoting-3.10.2.jar /home/hudson/genie.microprofile/.jenkins/plugins/maven-plugin/WEB-INF/lib/maven33-interceptor-1.12-alpha-1.jar /home/hudson/genie.microprofile/.jenkins/plugins/maven-plugin/WEB-INF/lib/maven3-interceptor-commons-1.12-alpha-1.jar 54550
15:54:12 <===[JENKINS REMOTING CAPACITY]===>channel started
15:54:14 Executing Maven:  -B -f /home/hudson/genie.microprofile/.jenkins/jobs/OpenTracing-maven-snapshots/workspace/pom.xml -pl !spec -Peclipse-jarsigner install
15:54:15 [INFO] Scanning for projects...
15:54:16 Started calculate disk usage of build
15:54:16 Finished Calculation of disk usage of build in 0 seconds
15:54:16 Started calculate disk usage of workspace
15:54:16 Finished Calculation of disk usage of workspace in 0 seconds
15:54:16 [INFO] ------------------------------------------------------------------------
15:54:16 [INFO] Reactor Build Order:
15:54:16 [INFO] 
15:54:16 [INFO] microprofile-opentracing-parent
15:54:16 [INFO] microProfile-opentracing-api
15:54:16 [INFO] microprofile-opentracing-tck
15:54:16 [INFO]                                                                         
15:54:16 [INFO] ------------------------------------------------------------------------
15:54:16 [INFO] Building microprofile-opentracing-parent 0.1-SNAPSHOT
15:54:16 [INFO] ------------------------------------------------------------------------
15:54:16 [INFO] 
15:54:16 [INFO] --- apache-rat-plugin:0.12:check (rat-check) @ microprofile-opentracing-parent ---
15:54:18 [INFO] Enabled default license matchers.
15:54:18 [INFO] Will parse SCM ignores for exclusions...
15:54:18 [INFO] Parsing exclusions from /home/hudson/genie.microprofile/.jenkins/jobs/OpenTracing-maven-snapshots/workspace/.gitignore
15:54:18 [INFO] Finished adding exclusions from SCM ignore files.
15:54:18 [INFO] 74 implicit excludes (use -debug for more details).
15:54:18 [INFO] Exclude: .travis.yml.*
15:54:18 [INFO] Exclude: bnd.bnd
15:54:18 [INFO] Exclude: *.log
15:54:18 [INFO] Exclude: .checkstyle
15:54:18 [INFO] Exclude: .factorypath
15:54:18 [INFO] Exclude: .editorconfig
15:54:18 [INFO] 4 resources included (use -debug for more details)
15:54:18 [INFO] Rat check: Summary over all files. Unapproved: 0, unknown: 0, generated: 0, approved: 2 licenses.
15:54:18 [INFO] 
15:54:18 [INFO] --- maven-checkstyle-plugin:2.17:check (verify-style) @ microprofile-opentracing-parent ---
15:54:20 [INFO] Starting audit...
15:54:20 Audit done.
15:54:20 [INFO] 
15:54:20 [INFO] --- maven-install-plugin:2.4:install (default-install) @ microprofile-opentracing-parent ---
15:54:20 [INFO] Installing /home/hudson/genie.microprofile/.jenkins/jobs/OpenTracing-maven-snapshots/workspace/pom.xml to /opt/public/hipp/homes/genie.microprofile/.m2/repository/org/eclipse/microprofile/opentracing/parent/microprofile-opentracing-parent/0.1-SNAPSHOT/microprofile-opentracing-parent-0.1-SNAPSHOT.pom
15:54:21 Started calculate disk usage of build
15:54:21 Finished Calculation of disk usage of build in 0 seconds
15:54:21 Started calculate disk usage of workspace
15:54:21 Finished Calculation of disk usage of workspace in 0 seconds
15:54:21 [INFO]                                                                         
15:54:21 [INFO] ------------------------------------------------------------------------
15:54:21 [INFO] Building microProfile-opentracing-api 1.0-SNAPSHOT
15:54:21 [INFO] ------------------------------------------------------------------------
15:54:21 [INFO] 
15:54:21 [INFO] --- apache-rat-plugin:0.12:check (rat-check) @ microprofile-opentracing-api ---
15:54:21 [INFO] Enabled default license matchers.
15:54:21 [INFO] Will parse SCM ignores for exclusions...
15:54:21 [INFO] Parsing exclusions from /home/hudson/genie.microprofile/.jenkins/jobs/OpenTracing-maven-snapshots/workspace/api/.gitignore
15:54:21 [INFO] Finished adding exclusions from SCM ignore files.
15:54:21 [INFO] 62 implicit excludes (use -debug for more details).
15:54:21 [INFO] Exclude: .travis.yml.*
15:54:21 [INFO] Exclude: bnd.bnd
15:54:21 [INFO] Exclude: *.log
15:54:21 [INFO] Exclude: .checkstyle
15:54:21 [INFO] Exclude: .factorypath
15:54:21 [INFO] Exclude: .editorconfig
15:54:21 [INFO] 6 resources included (use -debug for more details)
15:54:21 [INFO] Rat check: Summary over all files. Unapproved: 0, unknown: 0, generated: 0, approved: 3 licenses.
15:54:21 [INFO] 
15:54:21 [INFO] --- maven-resources-plugin:2.6:resources (default-resources) @ microprofile-opentracing-api ---
15:54:21 [INFO] Using 'UTF-8' encoding to copy filtered resources.
15:54:21 [INFO] Copying 2 resources
15:54:21 [INFO] 
15:54:21 [INFO] --- maven-compiler-plugin:3.1:compile (default-compile) @ microprofile-opentracing-api ---
15:54:22 [INFO] Changes detected - recompiling the module!
15:54:22 [INFO] Compiling 2 source files to /home/hudson/genie.microprofile/.jenkins/jobs/OpenTracing-maven-snapshots/workspace/api/target/classes
15:54:22 [INFO] 
15:54:22 [INFO] --- maven-checkstyle-plugin:2.17:check (verify-style) @ microprofile-opentracing-api ---
15:54:23 [INFO] Starting audit...
15:54:23 Audit done.
15:54:23 [INFO] 
15:54:23 [INFO] --- bnd-maven-plugin:2.4.1:bnd-process (default) @ microprofile-opentracing-api ---
15:54:23 [INFO] 
15:54:23 [INFO] --- maven-resources-plugin:2.6:testResources (default-testResources) @ microprofile-opentracing-api ---
15:54:23 [INFO] Using 'UTF-8' encoding to copy filtered resources.
15:54:23 [INFO] skip non existing resourceDirectory /home/hudson/genie.microprofile/.jenkins/jobs/OpenTracing-maven-snapshots/workspace/api/src/test/resources
15:54:23 [INFO] 
15:54:23 [INFO] --- maven-compiler-plugin:3.1:testCompile (default-testCompile) @ microprofile-opentracing-api ---
15:54:23 [INFO] No sources to compile
15:54:23 [INFO] 
15:54:23 [INFO] --- maven-surefire-plugin:2.12.4:test (default-test) @ microprofile-opentracing-api ---
15:54:23 [INFO] No tests to run.
15:54:23 [JENKINS] Recording test results
15:54:23 [INFO] 
15:54:23 [INFO] --- maven-jar-plugin:3.0.2:jar (default-jar) @ microprofile-opentracing-api ---
15:54:24 [INFO] Building jar: /home/hudson/genie.microprofile/.jenkins/jobs/OpenTracing-maven-snapshots/workspace/api/target/microprofile-opentracing-api-1.0-SNAPSHOT.jar
15:54:24 [INFO] 
15:54:24 [INFO] --- maven-javadoc-plugin:2.10.3:jar (attach-javadocs) @ microprofile-opentracing-api ---
15:54:26 [INFO] 
15:54:26 Loading source files for package org.eclipse.microprofile.opentracing...
15:54:26 Constructing Javadoc information...
15:54:26 Standard Doclet version 1.8.0_131
15:54:26 Building tree for all the packages and classes...
15:54:26 Generating /home/hudson/genie.microprofile/.jenkins/jobs/OpenTracing-maven-snapshots/workspace/api/target/apidocs/org/eclipse/microprofile/opentracing/Traced.html...
15:54:26 Generating /home/hudson/genie.microprofile/.jenkins/jobs/OpenTracing-maven-snapshots/workspace/api/target/apidocs/org/eclipse/microprofile/opentracing/package-frame.html...
15:54:26 Generating /home/hudson/genie.microprofile/.jenkins/jobs/OpenTracing-maven-snapshots/workspace/api/target/apidocs/org/eclipse/microprofile/opentracing/package-summary.html...
15:54:26 Generating /home/hudson/genie.microprofile/.jenkins/jobs/OpenTracing-maven-snapshots/workspace/api/target/apidocs/org/eclipse/microprofile/opentracing/package-tree.html...
15:54:26 Generating /home/hudson/genie.microprofile/.jenkins/jobs/OpenTracing-maven-snapshots/workspace/api/target/apidocs/constant-values.html...
15:54:26 Generating /home/hudson/genie.microprofile/.jenkins/jobs/OpenTracing-maven-snapshots/workspace/api/target/apidocs/org/eclipse/microprofile/opentracing/class-use/Traced.html...
15:54:26 Generating /home/hudson/genie.microprofile/.jenkins/jobs/OpenTracing-maven-snapshots/workspace/api/target/apidocs/org/eclipse/microprofile/opentracing/package-use.html...
15:54:26 Building index for all the packages and classes...
15:54:26 Generating /home/hudson/genie.microprofile/.jenkins/jobs/OpenTracing-maven-snapshots/workspace/api/target/apidocs/overview-tree.html...
15:54:26 Generating /home/hudson/genie.microprofile/.jenkins/jobs/OpenTracing-maven-snapshots/workspace/api/target/apidocs/index-all.html...
15:54:26 Generating /home/hudson/genie.microprofile/.jenkins/jobs/OpenTracing-maven-snapshots/workspace/api/target/apidocs/deprecated-list.html...
15:54:26 Building index for all classes...
15:54:26 Generating /home/hudson/genie.microprofile/.jenkins/jobs/OpenTracing-maven-snapshots/workspace/api/target/apidocs/allclasses-frame.html...
15:54:26 Generating /home/hudson/genie.microprofile/.jenkins/jobs/OpenTracing-maven-snapshots/workspace/api/target/apidocs/allclasses-noframe.html...
15:54:26 Generating /home/hudson/genie.microprofile/.jenkins/jobs/OpenTracing-maven-snapshots/workspace/api/target/apidocs/index.html...
15:54:26 Generating /home/hudson/genie.microprofile/.jenkins/jobs/OpenTracing-maven-snapshots/workspace/api/target/apidocs/help-doc.html...
15:54:26 [INFO] Building jar: /home/hudson/genie.microprofile/.jenkins/jobs/OpenTracing-maven-snapshots/workspace/api/target/microprofile-opentracing-api-1.0-SNAPSHOT-javadoc.jar
15:54:26 [INFO] 
15:54:26 [INFO] --- maven-install-plugin:2.4:install (default-install) @ microprofile-opentracing-api ---
15:54:26 [INFO] Installing /home/hudson/genie.microprofile/.jenkins/jobs/OpenTracing-maven-snapshots/workspace/api/target/microprofile-opentracing-api-1.0-SNAPSHOT.jar to /opt/public/hipp/homes/genie.microprofile/.m2/repository/org/eclipse/microprofile/opentracing/microprofile-opentracing-api/1.0-SNAPSHOT/microprofile-opentracing-api-1.0-SNAPSHOT.jar
15:54:26 [INFO] Installing /home/hudson/genie.microprofile/.jenkins/jobs/OpenTracing-maven-snapshots/workspace/api/pom.xml to /opt/public/hipp/homes/genie.microprofile/.m2/repository/org/eclipse/microprofile/opentracing/microprofile-opentracing-api/1.0-SNAPSHOT/microprofile-opentracing-api-1.0-SNAPSHOT.pom
15:54:26 [INFO] Installing /home/hudson/genie.microprofile/.jenkins/jobs/OpenTracing-maven-snapshots/workspace/api/target/microprofile-opentracing-api-1.0-SNAPSHOT-javadoc.jar to /opt/public/hipp/homes/genie.microprofile/.m2/repository/org/eclipse/microprofile/opentracing/microprofile-opentracing-api/1.0-SNAPSHOT/microprofile-opentracing-api-1.0-SNAPSHOT-javadoc.jar
15:54:27 Started calculate disk usage of build
15:54:27 Finished Calculation of disk usage of build in 0 seconds
15:54:27 Started calculate disk usage of workspace
15:54:27 Finished Calculation of disk usage of workspace in 0 seconds
15:54:27 [INFO]                                                                         
15:54:27 [INFO] ------------------------------------------------------------------------
15:54:27 [INFO] Building microprofile-opentracing-tck 1.0-SNAPSHOT
15:54:27 [INFO] ------------------------------------------------------------------------
15:54:27 [INFO] 
15:54:27 [INFO] --- apache-rat-plugin:0.12:check (rat-check) @ microprofile-opentracing-tck ---
15:54:27 [INFO] Enabled default license matchers.
15:54:27 [INFO] Will parse SCM ignores for exclusions...
15:54:27 [INFO] Parsing exclusions from /home/hudson/genie.microprofile/.jenkins/jobs/OpenTracing-maven-snapshots/workspace/tck/.gitignore
15:54:27 [INFO] Finished adding exclusions from SCM ignore files.
15:54:27 [INFO] 63 implicit excludes (use -debug for more details).
15:54:27 [INFO] Exclude: .travis.yml.*
15:54:27 [INFO] Exclude: bnd.bnd
15:54:27 [INFO] Exclude: *.log
15:54:27 [INFO] Exclude: .checkstyle
15:54:27 [INFO] Exclude: .factorypath
15:54:27 [INFO] Exclude: .editorconfig
15:54:27 [INFO] 12 resources included (use -debug for more details)
15:54:27 [INFO] Rat check: Summary over all files. Unapproved: 0, unknown: 0, generated: 0, approved: 7 licenses.
15:54:28 [INFO] 
15:54:28 [INFO] --- maven-resources-plugin:2.6:resources (default-resources) @ microprofile-opentracing-tck ---
15:54:28 [INFO] Using 'UTF-8' encoding to copy filtered resources.
15:54:28 [INFO] Copying 2 resources
15:54:28 [INFO] 
15:54:28 [INFO] --- maven-compiler-plugin:3.1:compile (default-compile) @ microprofile-opentracing-tck ---
15:54:28 [INFO] Changes detected - recompiling the module!
15:54:28 [INFO] Compiling 3 source files to /home/hudson/genie.microprofile/.jenkins/jobs/OpenTracing-maven-snapshots/workspace/tck/target/classes
15:54:28 [INFO] -------------------------------------------------------------
15:54:28 [ERROR] COMPILATION ERROR : 
15:54:28 [INFO] -------------------------------------------------------------
15:54:28 [ERROR] /home/hudson/genie.microprofile/.jenkins/jobs/OpenTracing-maven-snapshots/workspace/tck/src/main/java/org/eclipse/microprofile/opentracing/tck/application/TestClassAnnotationApp.java:[22,44] cannot find symbol
15:54:28   symbol:   class NoTrace
15:54:28   location: package org.eclipse.microprofile.opentracing
15:54:28 [ERROR] /home/hudson/genie.microprofile/.jenkins/jobs/OpenTracing-maven-snapshots/workspace/tck/src/main/java/org/eclipse/microprofile/opentracing/tck/application/TestClassAnnotationApp.java:[23,44] cannot find symbol
15:54:28   symbol:   class Trace
15:54:28   location: package org.eclipse.microprofile.opentracing
15:54:28 [ERROR] /home/hudson/genie.microprofile/.jenkins/jobs/OpenTracing-maven-snapshots/workspace/tck/src/main/java/org/eclipse/microprofile/opentracing/tck/application/TestClassAnnotationApp.java:[32,2] cannot find symbol
15:54:28   symbol: class Trace
15:54:28 [ERROR] /home/hudson/genie.microprofile/.jenkins/jobs/OpenTracing-maven-snapshots/workspace/tck/src/main/java/org/eclipse/microprofile/opentracing/tck/application/TestMethodAnnotationApp.java:[22,44] cannot find symbol
15:54:28   symbol:   class Trace
15:54:28   location: package org.eclipse.microprofile.opentracing
15:54:28 [ERROR] /home/hudson/genie.microprofile/.jenkins/jobs/OpenTracing-maven-snapshots/workspace/tck/src/main/java/org/eclipse/microprofile/opentracing/tck/application/TestClassAnnotationApp.java:[46,6] cannot find symbol
15:54:28   symbol:   class NoTrace
15:54:28   location: class org.eclipse.microprofile.opentracing.tck.application.TestClassAnnotationApp
15:54:28 [ERROR] /home/hudson/genie.microprofile/.jenkins/jobs/OpenTracing-maven-snapshots/workspace/tck/src/main/java/org/eclipse/microprofile/opentracing/tck/application/TestClassAnnotationApp.java:[54,6] cannot find symbol
15:54:28   symbol:   class Trace
15:54:28   location: class org.eclipse.microprofile.opentracing.tck.application.TestClassAnnotationApp
15:54:28 [ERROR] /home/hudson/genie.microprofile/.jenkins/jobs/OpenTracing-maven-snapshots/workspace/tck/src/main/java/org/eclipse/microprofile/opentracing/tck/application/TestMethodAnnotationApp.java:[36,6] cannot find symbol
15:54:28   symbol:   class Trace
15:54:28   location: class org.eclipse.microprofile.opentracing.tck.application.TestMethodAnnotationApp
15:54:28 [ERROR] /home/hudson/genie.microprofile/.jenkins/jobs/OpenTracing-maven-snapshots/workspace/tck/src/main/java/org/eclipse/microprofile/opentracing/tck/application/TestMethodAnnotationApp.java:[51,6] cannot find symbol
15:54:28   symbol:   class Trace
15:54:28   location: class org.eclipse.microprofile.opentracing.tck.application.TestMethodAnnotationApp
15:54:28 [ERROR] /home/hudson/genie.microprofile/.jenkins/jobs/OpenTracing-maven-snapshots/workspace/tck/src/main/java/org/eclipse/microprofile/opentracing/tck/application/TestMethodAnnotationApp.java:[59,6] cannot find symbol
15:54:28   symbol:   class Trace
15:54:28   location: class org.eclipse.microprofile.opentracing.tck.application.TestMethodAnnotationApp
15:54:28 [ERROR] /home/hudson/genie.microprofile/.jenkins/jobs/OpenTracing-maven-snapshots/workspace/tck/src/main/java/org/eclipse/microprofile/opentracing/tck/application/TestMethodAnnotationApp.java:[67,6] cannot find symbol
15:54:28   symbol:   class Trace
15:54:28   location: class org.eclipse.microprofile.opentracing.tck.application.TestMethodAnnotationApp
15:54:28 [INFO] 10 errors 
15:54:28 [INFO] -------------------------------------------------------------
15:54:28 Started calculate disk usage of build
15:54:28 Finished Calculation of disk usage of build in 0 seconds
15:54:28 Started calculate disk usage of workspace
15:54:28 Finished Calculation of disk usage of workspace in 0 seconds
15:54:28 [INFO] ------------------------------------------------------------------------
15:54:28 [INFO] Reactor Summary:
15:54:28 [INFO] 
15:54:28 [INFO] microprofile-opentracing-parent .................... SUCCESS [  4.297 s]
15:54:28 [INFO] microProfile-opentracing-api ....................... SUCCESS [  5.627 s]
15:54:28 [INFO] microprofile-opentracing-tck ....................... FAILURE [  1.425 s]
15:54:28 [INFO] ------------------------------------------------------------------------
15:54:28 [INFO] BUILD FAILURE
15:54:28 [INFO] ------------------------------------------------------------------------
15:54:28 [INFO] Total time: 13.201 s
15:54:28 [INFO] Finished at: 2017-11-13T15:54:28-05:00
15:54:29 [INFO] Final Memory: 53M/1900M
15:54:29 [INFO] ------------------------------------------------------------------------
15:54:29 [WARNING] The requested profile "eclipse-jarsigner" could not be activated because it does not exist.
15:54:29 [ERROR] Failed to execute goal org.apache.maven.plugins:maven-compiler-plugin:3.1:compile (default-compile) on project microprofile-opentracing-tck: Compilation failure: Compilation failure:
15:54:29 [ERROR] /home/hudson/genie.microprofile/.jenkins/jobs/OpenTracing-maven-snapshots/workspace/tck/src/main/java/org/eclipse/microprofile/opentracing/tck/application/TestClassAnnotationApp.java:[22,44] cannot find symbol
15:54:29 [ERROR] symbol:   class NoTrace
15:54:29 [ERROR] location: package org.eclipse.microprofile.opentracing
15:54:29 [ERROR] /home/hudson/genie.microprofile/.jenkins/jobs/OpenTracing-maven-snapshots/workspace/tck/src/main/java/org/eclipse/microprofile/opentracing/tck/application/TestClassAnnotationApp.java:[23,44] cannot find symbol
15:54:29 [ERROR] symbol:   class Trace
15:54:29 [ERROR] location: package org.eclipse.microprofile.opentracing
15:54:29 [JENKINS] Archiving /home/hudson/genie.microprofile/.jenkins/jobs/OpenTracing-maven-snapshots/workspace/pom.xml to org.eclipse.microprofile.opentracing.parent/microprofile-opentracing-parent/0.1-SNAPSHOT/microprofile-opentracing-parent-0.1-SNAPSHOT.pom
15:54:29 [ERROR] /home/hudson/genie.microprofile/.jenkins/jobs/OpenTracing-maven-snapshots/workspace/tck/src/main/java/org/eclipse/microprofile/opentracing/tck/application/TestClassAnnotationApp.java:[32,2] cannot find symbol
15:54:29 [ERROR] symbol: class Trace
15:54:29 [ERROR] /home/hudson/genie.microprofile/.jenkins/jobs/OpenTracing-maven-snapshots/workspace/tck/src/main/java/org/eclipse/microprofile/opentracing/tck/application/TestMethodAnnotationApp.java:[22,44] cannot find symbol
15:54:29 [ERROR] symbol:   class Trace
15:54:29 [ERROR] location: package org.eclipse.microprofile.opentracing
15:54:29 [ERROR] /home/hudson/genie.microprofile/.jenkins/jobs/OpenTracing-maven-snapshots/workspace/tck/src/main/java/org/eclipse/microprofile/opentracing/tck/application/TestClassAnnotationApp.java:[46,6] cannot find symbol
15:54:29 [JENKINS] Archiving /home/hudson/genie.microprofile/.jenkins/jobs/OpenTracing-maven-snapshots/workspace/api/pom.xml to org.eclipse.microprofile.opentracing/microprofile-opentracing-api/1.0-SNAPSHOT/microprofile-opentracing-api-1.0-SNAPSHOT.pom
15:54:29 [JENKINS] Archiving /home/hudson/genie.microprofile/.jenkins/jobs/OpenTracing-maven-snapshots/workspace/api/target/microprofile-opentracing-api-1.0-SNAPSHOT.jar to org.eclipse.microprofile.opentracing/microprofile-opentracing-api/1.0-SNAPSHOT/microprofile-opentracing-api-1.0-SNAPSHOT.jar
15:54:29 [JENKINS] Archiving /home/hudson/genie.microprofile/.jenkins/jobs/OpenTracing-maven-snapshots/workspace/api/target/microprofile-opentracing-api-1.0-SNAPSHOT-javadoc.jar to org.eclipse.microprofile.opentracing/microprofile-opentracing-api/1.0-SNAPSHOT/microprofile-opentracing-api-1.0-SNAPSHOT-javadoc.jar
15:54:29 [ERROR] symbol:   class NoTrace
15:54:29 [ERROR] location: class org.eclipse.microprofile.opentracing.tck.application.TestClassAnnotationApp
15:54:29 [ERROR] /home/hudson/genie.microprofile/.jenkins/jobs/OpenTracing-maven-snapshots/workspace/tck/src/main/java/org/eclipse/microprofile/opentracing/tck/application/TestClassAnnotationApp.java:[54,6] cannot find symbol
15:54:29 [ERROR] symbol:   class Trace
15:54:29 [JENKINS] Archiving /home/hudson/genie.microprofile/.jenkins/jobs/OpenTracing-maven-snapshots/workspace/tck/pom.xml to org.eclipse.microprofile.opentracing/microprofile-opentracing-tck/1.0-SNAPSHOT/microprofile-opentracing-tck-1.0-SNAPSHOT.pom
15:54:29 [ERROR] location: class org.eclipse.microprofile.opentracing.tck.application.TestClassAnnotationApp
15:54:29 [ERROR] /home/hudson/genie.microprofile/.jenkins/jobs/OpenTracing-maven-snapshots/workspace/tck/src/main/java/org/eclipse/microprofile/opentracing/tck/application/TestMethodAnnotationApp.java:[36,6] cannot find symbol
15:54:29 [ERROR] symbol:   class Trace
15:54:29 [ERROR] location: class org.eclipse.microprofile.opentracing.tck.application.TestMethodAnnotationApp
15:54:29 [ERROR] /home/hudson/genie.microprofile/.jenkins/jobs/OpenTracing-maven-snapshots/workspace/tck/src/main/java/org/eclipse/microprofile/opentracing/tck/application/TestMethodAnnotationApp.java:[51,6] cannot find symbol
15:54:29 [ERROR] symbol:   class Trace
15:54:29 [ERROR] location: class org.eclipse.microprofile.opentracing.tck.application.TestMethodAnnotationApp
15:54:29 [ERROR] /home/hudson/genie.microprofile/.jenkins/jobs/OpenTracing-maven-snapshots/workspace/tck/src/main/java/org/eclipse/microprofile/opentracing/tck/application/TestMethodAnnotationApp.java:[59,6] cannot find symbol
15:54:29 [ERROR] symbol:   class Trace
15:54:29 [ERROR] location: class org.eclipse.microprofile.opentracing.tck.application.TestMethodAnnotationApp
15:54:29 [ERROR] /home/hudson/genie.microprofile/.jenkins/jobs/OpenTracing-maven-snapshots/workspace/tck/src/main/java/org/eclipse/microprofile/opentracing/tck/application/TestMethodAnnotationApp.java:[67,6] cannot find symbol
15:54:29 [ERROR] symbol:   class Trace
15:54:29 [ERROR] location: class org.eclipse.microprofile.opentracing.tck.application.TestMethodAnnotationApp
15:54:29 [ERROR] -> [Help 1]
15:54:29 [ERROR] 
15:54:29 [ERROR] To see the full stack trace of the errors, re-run Maven with the -e switch.
15:54:29 [ERROR] Re-run Maven using the -X switch to enable full debug logging.
15:54:29 [ERROR] 
15:54:29 [ERROR] For more information about the errors and possible solutions, please read the following articles:
15:54:29 [ERROR] [Help 1] http://cwiki.apache.org/confluence/display/MAVEN/MojoFailureException
15:54:29 [ERROR] 
15:54:29 [ERROR] After correcting the problems, you can resume the build with the command
15:54:29 [ERROR]   mvn <goals> -rf :microprofile-opentracing-tck
15:54:29 channel stopped
15:54:29 Started calculate disk usage of build
15:54:29 Finished Calculation of disk usage of build in 0 seconds
15:54:29 Started calculate disk usage of workspace
15:54:29 Finished Calculation of disk usage of workspace in 0 seconds
15:54:29 Sending e-mails to: microprofile-dev@eclipse.org
15:54:29 Finished: FAILURE