Not builtConsole Output

[INFO] ------------------------------------------------------------------------
[INFO] Reactor Summary for MicroProfile OpenAPI 2.0.0-SNAPSHOT:
[INFO] 
[INFO] MicroProfile OpenAPI ............................... SUCCESS [ 11.902 s]
[INFO] MicroProfile OpenAPI API ........................... FAILURE [06:22 min]
[INFO] MicroProfile OpenAPI TCK ........................... SKIPPED
[INFO] MicroProfile OpenAPI SPI ........................... SKIPPED
[INFO] ------------------------------------------------------------------------
[INFO] BUILD FAILURE
[INFO] ------------------------------------------------------------------------
[INFO] Total time:  06:36 min
[INFO] Finished at: 2020-09-11T06:51:15Z
[INFO] ------------------------------------------------------------------------
Waiting for Jenkins to finish collecting data
[ERROR] Failed to execute goal org.apache.maven.plugins:maven-deploy-plugin:2.7:deploy (default-deploy) on project microprofile-openapi-api: Failed to deploy artifacts: Could not transfer artifact org.eclipse.microprofile.openapi:microprofile-openapi-api:jar:javadoc:2.0.0-20200911.064510-18 from/to ossrh (https://oss.sonatype.org/content/repositories/snapshots/): Transfer failed for https://oss.sonatype.org/content/repositories/snapshots/org/eclipse/microprofile/openapi/microprofile-openapi-api/2.0.0-SNAPSHOT/microprofile-openapi-api-2.0.0-20200911.064510-18-javadoc.jar 504 Gateway Time-out -> [Help 1]
[ERROR] 
[ERROR] To see the full stack trace of the errors, re-run Maven with the -e switch.
[ERROR] Re-run Maven using the -X switch to enable full debug logging.
[ERROR] 
[ERROR] For more information about the errors and possible solutions, please read the following articles:
[ERROR] [Help 1] http://cwiki.apache.org/confluence/display/MAVEN/MojoExecutionException
[ERROR] 
[ERROR] After correcting the problems, you can resume the build with the command
[ERROR]   mvn <goals> -rf :microprofile-openapi-api
Started
Running as SYSTEM
Build failed before it gets to this module
Finished: NOT_BUILT