Not builtConsole Output

[INFO] ------------------------------------------------------------------------
[INFO] Reactor Summary for MicroProfile OpenAPI 2.0.0-SNAPSHOT:
[INFO] 
[INFO] MicroProfile OpenAPI ............................... SUCCESS [ 14.999 s]
[INFO] MicroProfile OpenAPI API ........................... FAILURE [ 11.084 s]
[INFO] MicroProfile OpenAPI TCK ........................... SKIPPED
[INFO] MicroProfile OpenAPI SPI ........................... SKIPPED
[INFO] ------------------------------------------------------------------------
[INFO] BUILD FAILURE
[INFO] ------------------------------------------------------------------------
[INFO] Total time:  28.301 s
[INFO] Finished at: 2020-07-16T06:45:07Z
[INFO] ------------------------------------------------------------------------
Waiting for Jenkins to finish collecting data
[ERROR] Failed to execute goal biz.aQute.bnd:bnd-baseline-maven-plugin:4.3.0:baseline (baseline) on project microprofile-openapi-api: An error occurred while calculating the baseline: The baselining plugin detected versioning errors -> [Help 1]
[ERROR] 
[ERROR] To see the full stack trace of the errors, re-run Maven with the -e switch.
[ERROR] Re-run Maven using the -X switch to enable full debug logging.
[ERROR] 
[ERROR] For more information about the errors and possible solutions, please read the following articles:
[ERROR] [Help 1] http://cwiki.apache.org/confluence/display/MAVEN/MojoExecutionException
[ERROR] 
[ERROR] After correcting the problems, you can resume the build with the command
[ERROR]   mvn <goals> -rf :microprofile-openapi-api
Started
Running as SYSTEM
Build failed before it gets to this module
Finished: NOT_BUILT