FailedConsole Output

07:26:09 GitHub pull request #466 of commit 0b9645e90fa68d5dd37afcbfd57585a77d7dc178, no merge conflicts.
07:26:09 Setting status of 0b9645e90fa68d5dd37afcbfd57585a77d7dc178 to PENDING with url https://hudson.eclipse.org/microprofile/job/Metrics%20pull-requests/189/ and message: 'Build started for merge commit.'
07:26:10 Building in workspace /home/hudson/genie.microprofile/.jenkins/jobs/Metrics pull-requests/workspace
07:26:10 [WS-CLEANUP] Deleting project workspace...
07:26:10 [WS-CLEANUP] Deferred wipeout is used...
07:26:10 [WS-CLEANUP] Done
07:26:10 No credentials specified
07:26:10 Cloning the remote Git repository
07:26:10 Cloning repository https://github.com/eclipse/microprofile-metrics.git
07:26:10  > /usr/local/bin/git init /home/hudson/genie.microprofile/.jenkins/jobs/Metrics pull-requests/workspace # timeout=10
07:26:10 Fetching upstream changes from https://github.com/eclipse/microprofile-metrics.git
07:26:10  > /usr/local/bin/git --version # timeout=10
07:26:10 Setting http proxy: proxy.eclipse.org:9898
07:26:10  > /usr/local/bin/git fetch --tags --progress https://github.com/eclipse/microprofile-metrics.git +refs/heads/*:refs/remotes/origin/*
07:26:13  > /usr/local/bin/git config remote.origin.url https://github.com/eclipse/microprofile-metrics.git # timeout=10
07:26:13  > /usr/local/bin/git config --add remote.origin.fetch +refs/heads/*:refs/remotes/origin/* # timeout=10
07:26:13  > /usr/local/bin/git config remote.origin.url https://github.com/eclipse/microprofile-metrics.git # timeout=10
07:26:13 Fetching upstream changes from https://github.com/eclipse/microprofile-metrics.git
07:26:13 Setting http proxy: proxy.eclipse.org:9898
07:26:13  > /usr/local/bin/git fetch --tags --progress https://github.com/eclipse/microprofile-metrics.git +refs/pull/*:refs/remotes/origin/pr/*
07:26:14  > /usr/local/bin/git rev-parse refs/remotes/origin/pr/466/merge^{commit} # timeout=10
07:26:14  > /usr/local/bin/git rev-parse refs/remotes/origin/origin/pr/466/merge^{commit} # timeout=10
07:26:14 Checking out Revision e243712eeff9d033d427bc2a511cac206ee3cad2 (refs/remotes/origin/pr/466/merge)
07:26:14  > /usr/local/bin/git config core.sparsecheckout # timeout=10
07:26:14  > /usr/local/bin/git checkout -f e243712eeff9d033d427bc2a511cac206ee3cad2
07:26:14 Commit message: "Merge 0b9645e90fa68d5dd37afcbfd57585a77d7dc178 into e065e79ba644ad5b1f546bcd2209954c183b0f92"
07:26:14 First time build. Skipping changelog.
07:26:14 Parsing POMs
07:26:19 Established TCP socket on 33423
07:26:19 [workspace] $ /shared/common/jdk1.8.0_x64-latest/bin/java -Xmx2G -Djava.io.tmpdir=/tmp/genie.microprofile -DforkCount=2 -cp /home/hudson/genie.microprofile/.jenkins/plugins/maven-plugin/WEB-INF/lib/maven35-agent-1.12.jar:/shared/common/apache-maven-latest/boot/plexus-classworlds-2.5.2.jar:/shared/common/apache-maven-latest/conf/logging jenkins.maven3.agent.Maven35Main /shared/common/apache-maven-latest /home/hudson/genie.microprofile/.jenkins/war/WEB-INF/lib/remoting-3.27.jar /home/hudson/genie.microprofile/.jenkins/plugins/maven-plugin/WEB-INF/lib/maven35-interceptor-1.12.jar /home/hudson/genie.microprofile/.jenkins/plugins/maven-plugin/WEB-INF/lib/maven3-interceptor-commons-1.12.jar 33423
07:26:19 Picked up JAVA_TOOL_OPTIONS: -Xmx2G -Djava.io.tmpdir=/tmp/genie.microprofile -DforkCount=2
07:26:22 <===[JENKINS REMOTING CAPACITY]===>channel started
07:26:23 Executing Maven:  -B -f /home/hudson/genie.microprofile/.jenkins/jobs/Metrics pull-requests/workspace/pom.xml install
07:26:25 [INFO] Scanning for projects...
07:26:25 [INFO] ------------------------------------------------------------------------
07:26:25 [INFO] Reactor Build Order:
07:26:25 [INFO] 
07:26:25 [INFO] MicroProfile Metrics                                               [pom]
07:26:25 [INFO] MicroProfile Metrics API                                           [jar]
07:26:25 [INFO] MicroProfile Metrics Specification                                 [pom]
07:26:25 [INFO] MicroProfile Metrics REST-TCK                                      [jar]
07:26:25 [INFO] MicroProfile Metrics API-TCK                                       [jar]
07:26:25 [INFO] 
07:26:25 [INFO] ----< org.eclipse.microprofile.metrics:microprofile-metrics-parent >----
07:26:25 [INFO] Building MicroProfile Metrics 2.2-SNAPSHOT                         [1/5]
07:26:25 [INFO] --------------------------------[ pom ]---------------------------------
07:26:25 [INFO] 
07:26:25 [INFO] --- apache-rat-plugin:0.12:check (rat-check) @ microprofile-metrics-parent ---
07:26:26 [INFO] Enabled default license matchers.
07:26:26 [INFO] Will parse SCM ignores for exclusions...
07:26:26 [INFO] Parsing exclusions from /home/hudson/genie.microprofile/.jenkins/jobs/Metrics pull-requests/workspace/.gitignore
07:26:26 [INFO] Finished adding exclusions from SCM ignore files.
07:26:26 [INFO] 76 implicit excludes (use -debug for more details).
07:26:26 [INFO] Exclude: .travis.yml.*
07:26:26 [INFO] Exclude: **/bnd.bnd
07:26:26 [INFO] Exclude: *.log
07:26:26 [INFO] Exclude: .checkstyle
07:26:26 [INFO] Exclude: .factorypath
07:26:26 [INFO] Exclude: .editorconfig
07:26:26 [INFO] Exclude: **/target/
07:26:26 [INFO] Exclude: **/bin/
07:26:26 [INFO] Exclude: **/*.iml
07:26:26 [INFO] Exclude: **/*.idea
07:26:26 [INFO] Exclude: **/*.ipr
07:26:26 [INFO] 9 resources included (use -debug for more details)
07:26:27 [INFO] Rat check: Summary over all files. Unapproved: 0, unknown: 0, generated: 0, approved: 7 licenses.
07:26:27 [INFO] 
07:26:27 [INFO] --- maven-checkstyle-plugin:2.17:check (verify-style) @ microprofile-metrics-parent ---
07:26:28 [INFO] Starting audit...
07:26:28 Audit done.
07:26:28 [INFO] 
07:26:28 [INFO] --- maven-install-plugin:2.4:install (default-install) @ microprofile-metrics-parent ---
07:26:28 [INFO] Installing /home/hudson/genie.microprofile/.jenkins/jobs/Metrics pull-requests/workspace/pom.xml to /opt/public/hipp/homes/genie.microprofile/.m2/repository/org/eclipse/microprofile/metrics/microprofile-metrics-parent/2.2-SNAPSHOT/microprofile-metrics-parent-2.2-SNAPSHOT.pom
07:26:30 Started calculate disk usage of build
07:26:30 Finished Calculation of disk usage of build in 0 seconds
07:26:31 Started calculate disk usage of workspace
07:26:31 Finished Calculation of disk usage of workspace in 0 seconds
07:26:31 [INFO] 
07:26:31 [INFO] -----< org.eclipse.microprofile.metrics:microprofile-metrics-api >------
07:26:31 [INFO] Building MicroProfile Metrics API 2.2-SNAPSHOT                     [2/5]
07:26:31 [INFO] --------------------------------[ jar ]---------------------------------
07:26:31 [INFO] 
07:26:31 [INFO] --- apache-rat-plugin:0.12:check (rat-check) @ microprofile-metrics-api ---
07:26:31 [INFO] Enabled default license matchers.
07:26:31 [INFO] Will parse SCM ignores for exclusions...
07:26:31 [INFO] Parsing exclusions from /home/hudson/genie.microprofile/.jenkins/jobs/Metrics pull-requests/workspace/api/.gitignore
07:26:31 [INFO] Finished adding exclusions from SCM ignore files.
07:26:31 [INFO] 67 implicit excludes (use -debug for more details).
07:26:31 [INFO] Exclude: .travis.yml.*
07:26:31 [INFO] Exclude: **/bnd.bnd
07:26:31 [INFO] Exclude: *.log
07:26:31 [INFO] Exclude: .checkstyle
07:26:31 [INFO] Exclude: .factorypath
07:26:31 [INFO] Exclude: .editorconfig
07:26:31 [INFO] Exclude: **/target/
07:26:31 [INFO] Exclude: **/bin/
07:26:31 [INFO] Exclude: **/*.iml
07:26:31 [INFO] Exclude: **/*.idea
07:26:31 [INFO] Exclude: **/*.ipr
07:26:31 [INFO] 30 resources included (use -debug for more details)
07:26:32 [INFO] Rat check: Summary over all files. Unapproved: 0, unknown: 0, generated: 0, approved: 30 licenses.
07:26:32 [INFO] 
07:26:32 [INFO] --- maven-resources-plugin:2.6:resources (default-resources) @ microprofile-metrics-api ---
07:26:32 [INFO] Using 'UTF-8' encoding to copy filtered resources.
07:26:32 [INFO] skip non existing resourceDirectory /home/hudson/genie.microprofile/.jenkins/jobs/Metrics pull-requests/workspace/api/src/main/resources
07:26:32 [INFO] 
07:26:32 [INFO] --- maven-compiler-plugin:3.1:compile (default-compile) @ microprofile-metrics-api ---
07:26:32 [INFO] Changes detected - recompiling the module!
07:26:32 [INFO] Compiling 29 source files to /home/hudson/genie.microprofile/.jenkins/jobs/Metrics pull-requests/workspace/api/target/classes
07:26:33 [INFO] 
07:26:33 [INFO] --- maven-checkstyle-plugin:2.17:check (verify-style) @ microprofile-metrics-api ---
07:26:34 [INFO] Starting audit...
07:26:34 /jobs/genie.microprofile/Metrics pull-requests/workspace/api/src/main/java/org/eclipse/microprofile/metrics/MetricID.java:131:9: error: '}' at column 9 should be alone on a line.
07:26:34 Audit done.
07:26:35 Started calculate disk usage of build
07:26:35 Finished Calculation of disk usage of build in 0 seconds
07:26:36 Started calculate disk usage of workspace
07:26:36 Finished Calculation of disk usage of workspace in 0 seconds
07:26:37 [INFO] ------------------------------------------------------------------------
07:26:37 [INFO] Reactor Summary for MicroProfile Metrics 2.2-SNAPSHOT:
07:26:37 [INFO] 
07:26:37 [INFO] MicroProfile Metrics ............................... SUCCESS [  3.206 s]
07:26:37 [INFO] MicroProfile Metrics API ........................... FAILURE [  2.475 s]
07:26:37 [INFO] MicroProfile Metrics Specification ................. SKIPPED
07:26:37 [INFO] MicroProfile Metrics REST-TCK ...................... SKIPPED
07:26:37 [INFO] MicroProfile Metrics API-TCK ....................... SKIPPED
07:26:37 [INFO] ------------------------------------------------------------------------
07:26:37 [INFO] BUILD FAILURE
07:26:37 [INFO] ------------------------------------------------------------------------
07:26:37 [INFO] Total time:  12.812 s
07:26:37 [INFO] Finished at: 2019-10-16T07:26:37-04:00
07:26:37 [INFO] ------------------------------------------------------------------------
07:26:37 Waiting for Jenkins to finish collecting data
07:26:37 [ERROR] Failed to execute goal org.apache.maven.plugins:maven-checkstyle-plugin:2.17:check (verify-style) on project microprofile-metrics-api: Failed during checkstyle execution: There is 1 error reported by Checkstyle 6.11.2 with /home/hudson/genie.microprofile/.jenkins/jobs/Metrics pull-requests/workspace/api/target/checkstyle-rules.xml ruleset. -> [Help 1]
07:26:37 [ERROR] 
07:26:37 [ERROR] To see the full stack trace of the errors, re-run Maven with the -e switch.
07:26:37 [ERROR] Re-run Maven using the -X switch to enable full debug logging.
07:26:37 [ERROR] 
07:26:37 [ERROR] For more information about the errors and possible solutions, please read the following articles:
07:26:37 [ERROR] [Help 1] http://cwiki.apache.org/confluence/display/MAVEN/MojoExecutionException
07:26:37 [JENKINS] Archiving /home/hudson/genie.microprofile/.jenkins/jobs/Metrics pull-requests/workspace/pom.xml to org.eclipse.microprofile.metrics/microprofile-metrics-parent/2.2-SNAPSHOT/microprofile-metrics-parent-2.2-SNAPSHOT.pom
07:26:37 [ERROR] 
07:26:37 [ERROR] After correcting the problems, you can resume the build with the command
07:26:37 [ERROR]   mvn <goals> -rf :microprofile-metrics-api
07:26:37 [JENKINS] Archiving /home/hudson/genie.microprofile/.jenkins/jobs/Metrics pull-requests/workspace/api/pom.xml to org.eclipse.microprofile.metrics/microprofile-metrics-api/2.2-SNAPSHOT/microprofile-metrics-api-2.2-SNAPSHOT.pom
07:26:37 [JENKINS] Archiving /home/hudson/genie.microprofile/.jenkins/jobs/Metrics pull-requests/workspace/spec/pom.xml to org.eclipse.microprofile.metrics/microprofile-metrics-spec/2.2-SNAPSHOT/microprofile-metrics-spec-2.2-SNAPSHOT.pom
07:26:37 [JENKINS] Archiving /home/hudson/genie.microprofile/.jenkins/jobs/Metrics pull-requests/workspace/tck/api/pom.xml to org.eclipse.microprofile.metrics/microprofile-metrics-api-tck/2.2-SNAPSHOT/microprofile-metrics-api-tck-2.2-SNAPSHOT.pom
07:26:37 [JENKINS] Archiving /home/hudson/genie.microprofile/.jenkins/jobs/Metrics pull-requests/workspace/tck/rest/pom.xml to org.eclipse.microprofile.metrics/microprofile-metrics-rest-tck/2.2-SNAPSHOT/microprofile-metrics-rest-tck-2.2-SNAPSHOT.pom
07:26:44 channel stopped
07:26:47 Started calculate disk usage of build
07:26:47 Finished Calculation of disk usage of build in 0 seconds
07:26:48 Started calculate disk usage of workspace
07:26:48 Finished Calculation of disk usage of workspace in 0 seconds
07:26:49 Setting status of 0b9645e90fa68d5dd37afcbfd57585a77d7dc178 to FAILURE with url https://hudson.eclipse.org/microprofile/job/Metrics%20pull-requests/189/ and message: 'Build finished. '
07:26:50 Finished: FAILURE