FailedConsole Output

01:42:27 Started by timer
01:42:27 Running as SYSTEM
01:42:27 Agent default-agent-m19nl is provisioned from template Kubernetes Pod Template
01:42:27 ---
01:42:27 apiVersion: "v1"
01:42:27 kind: "Pod"
01:42:27 metadata:
01:42:27   annotations: {}
01:42:27   labels:
01:42:27     jenkins: "slave"
01:42:27   name: "default-agent-m19nl"
01:42:27 spec:
01:42:27   containers:
01:42:27   - env:
01:42:27     - name: "MAVEN_OPTS"
01:42:27       value: "-Dorg.slf4j.simpleLogger.log.org.apache.maven.cli.transfer.Slf4jMavenTransferListener=warn"
01:42:27     - name: "JENKINS_SECRET"
01:42:27       value: "********"
01:42:27     - name: "JENKINS_TUNNEL"
01:42:27       value: "jenkins-discovery.microprofile.svc.cluster.local:50000"
01:42:27     - name: "JENKINS_AGENT_NAME"
01:42:27       value: "default-agent-m19nl"
01:42:27     - name: "MAVEN_CONFIG"
01:42:27       value: "-B -e"
01:42:27     - name: "JENKINS_NAME"
01:42:27       value: "default-agent-m19nl"
01:42:27     - name: "JENKINS_AGENT_WORKDIR"
01:42:27       value: "/home/jenkins/agent"
01:42:27     - name: "JENKINS_URL"
01:42:27       value: "http://jenkins-ui.microprofile.svc.cluster.local/microprofile/"
01:42:27     - name: "HOME"
01:42:27       value: "/home/jenkins"
01:42:27     image: "eclipsecbijenkins/jenkins-agent:3.35@sha256:5d06ebec6e9dffc44fb41009a51d085a83944a23f651416531b960143d186340"
01:42:27     imagePullPolicy: "IfNotPresent"
01:42:27     name: "jnlp"
01:42:27     resources:
01:42:27       limits:
01:42:27         memory: "4096Mi"
01:42:27         cpu: "2000m"
01:42:27       requests:
01:42:27         memory: "4096Mi"
01:42:27         cpu: "1000m"
01:42:27     securityContext:
01:42:27       privileged: false
01:42:27     tty: true
01:42:27     volumeMounts:
01:42:27     - mountPath: "/home/jenkins/agent"
01:42:27       name: "workspace-volume"
01:42:27       readOnly: false
01:42:27     - mountPath: "/home/jenkins/.m2/toolchains.xml"
01:42:27       name: "toolchains-xml"
01:42:27       readOnly: true
01:42:27       subPath: "toolchains.xml"
01:42:27     - mountPath: "/opt/tools"
01:42:27       name: "volume-0"
01:42:27       readOnly: false
01:42:27     - mountPath: "/home/jenkins"
01:42:27       name: "volume-2"
01:42:27       readOnly: false
01:42:27     - mountPath: "/home/jenkins/.m2/repository"
01:42:27       name: "volume-3"
01:42:27       readOnly: false
01:42:27     - mountPath: "/home/jenkins/.m2/settings-security.xml"
01:42:27       name: "settings-security-xml"
01:42:27       readOnly: true
01:42:27       subPath: "settings-security.xml"
01:42:27     - mountPath: "/home/jenkins/.m2/settings.xml"
01:42:27       name: "settings-xml"
01:42:27       readOnly: true
01:42:27       subPath: "settings.xml"
01:42:27     - mountPath: "/home/jenkins/.ssh"
01:42:27       name: "volume-1"
01:42:27       readOnly: false
01:42:27     workingDir: "/home/jenkins/agent"
01:42:27   nodeSelector: {}
01:42:27   restartPolicy: "Never"
01:42:27   volumes:
01:42:27   - name: "settings-security-xml"
01:42:27     secret:
01:42:27       items:
01:42:27       - key: "settings-security.xml"
01:42:27         path: "settings-security.xml"
01:42:27       secretName: "m2-secret-dir"
01:42:27   - name: "volume-0"
01:42:27     persistentVolumeClaim:
01:42:27       claimName: "tools-claim-jiro-microprofile"
01:42:27       readOnly: true
01:42:27   - configMap:
01:42:27       items:
01:42:27       - key: "toolchains.xml"
01:42:27         path: "toolchains.xml"
01:42:27       name: "m2-dir"
01:42:27     name: "toolchains-xml"
01:42:27   - emptyDir:
01:42:27       medium: ""
01:42:27     name: "volume-2"
01:42:27   - configMap:
01:42:27       name: "known-hosts"
01:42:27     name: "volume-1"
01:42:27   - name: "settings-xml"
01:42:27     secret:
01:42:27       items:
01:42:27       - key: "settings.xml"
01:42:27         path: "settings.xml"
01:42:27       secretName: "m2-secret-dir"
01:42:27   - emptyDir:
01:42:27       medium: ""
01:42:27     name: "workspace-volume"
01:42:27   - emptyDir:
01:42:27       medium: ""
01:42:27     name: "volume-3"
01:42:27 
01:42:27 Building remotely on default-agent-m19nl in workspace /home/jenkins/agent/workspace/JWT-Auth-maven-snapshots
01:42:27 [WS-CLEANUP] Deleting project workspace...
01:42:27 [WS-CLEANUP] Deferred wipeout is used...
01:42:30 No credentials specified
01:42:30 Cloning the remote Git repository
01:42:30 Cloning repository https://github.com/eclipse/microprofile-jwt-auth.git
01:42:30  > git init /home/jenkins/agent/workspace/JWT-Auth-maven-snapshots # timeout=10
01:42:30 Fetching upstream changes from https://github.com/eclipse/microprofile-jwt-auth.git
01:42:30  > git --version # timeout=10
01:42:30  > git fetch --tags --force --progress -- https://github.com/eclipse/microprofile-jwt-auth.git +refs/heads/*:refs/remotes/origin/*
01:42:31  > git config remote.origin.url https://github.com/eclipse/microprofile-jwt-auth.git # timeout=10
01:42:31  > git config --add remote.origin.fetch +refs/heads/*:refs/remotes/origin/* # timeout=10
01:42:31  > git config remote.origin.url https://github.com/eclipse/microprofile-jwt-auth.git # timeout=10
01:42:31 Fetching upstream changes from https://github.com/eclipse/microprofile-jwt-auth.git
01:42:31  > git fetch --tags --force --progress -- https://github.com/eclipse/microprofile-jwt-auth.git +refs/heads/*:refs/remotes/origin/*
01:42:31  > git rev-parse refs/remotes/origin/master^{commit} # timeout=10
01:42:31  > git rev-parse refs/remotes/origin/origin/master^{commit} # timeout=10
01:42:31 Checking out Revision 91997341d52c4ffa25aeafa308a1f0dd2463b628 (refs/remotes/origin/master)
01:42:31  > git config core.sparsecheckout # timeout=10
01:42:31  > git checkout -f 91997341d52c4ffa25aeafa308a1f0dd2463b628
01:42:32 Commit message: "[maven-release-plugin] prepare for next development iteration"
01:42:32  > git rev-list --no-walk 91997341d52c4ffa25aeafa308a1f0dd2463b628 # timeout=10
01:42:32 Parsing POMs
01:42:41 Downloaded artifact https://repo.eclipse.org/content/repositories/maven_central/javax/javaee-api/7.0/javaee-api-7.0.pom
01:42:41 Downloaded artifact https://repo.eclipse.org/content/repositories/maven_central/net/java/jvnet-parent/3/jvnet-parent-3.pom
01:42:41 Downloaded artifact https://repo.eclipse.org/content/repositories/maven_central/org/jboss/arquillian/arquillian-bom/1.1.13.Final/arquillian-bom-1.1.13.Final.pom
01:42:42 Downloaded artifact https://repo.eclipse.org/content/repositories/maven_central/org/jboss/shrinkwrap/shrinkwrap-bom/1.2.6/shrinkwrap-bom-1.2.6.pom
01:42:42 Downloaded artifact https://repo.eclipse.org/content/repositories/maven_central/org/jboss/shrinkwrap/resolver/shrinkwrap-resolver-bom/2.2.4/shrinkwrap-resolver-bom-2.2.4.pom
01:42:42 Downloaded artifact https://repo.eclipse.org/content/repositories/maven_central/org/jboss/shrinkwrap/descriptors/shrinkwrap-descriptors-bom/2.0.0-alpha-10/shrinkwrap-descriptors-bom-2.0.0-alpha-10.pom
01:42:42 Modules changed, recalculating dependency graph
01:42:42 Established TCP socket on 45019
01:42:42 Copied maven35-agent.jar
01:42:42 Copied maven35-interceptor.jar
01:42:42 Copied maven3-interceptor-commons.jar
01:42:42 [JWT-Auth-maven-snapshots] $ /opt/tools/java/oracle/jdk-8/latest/bin/java -Dorg.slf4j.simpleLogger.log.org.apache.maven.cli.transfer.Slf4jMavenTransferListener=warn -cp /home/jenkins/agent/maven35-agent.jar:/opt/tools/apache-maven/latest/boot/plexus-classworlds-2.5.2.jar:/opt/tools/apache-maven/latest/conf/logging jenkins.maven3.agent.Maven35Main /opt/tools/apache-maven/latest /usr/share/jenkins/agent.jar /home/jenkins/agent/maven35-interceptor.jar /home/jenkins/agent/maven3-interceptor-commons.jar 45019
01:42:42 Picked up JAVA_TOOL_OPTIONS: -XX:+IgnoreUnrecognizedVMOptions -XX:+UseContainerSupport -XX:+UnlockExperimentalVMOptions -XX:+UseCGroupMemoryLimitForHeap
01:42:42 Picked up _JAVA_OPTIONS: -XX:MaxRAMPercentage=64.0
01:42:44 <===[JENKINS REMOTING CAPACITY]===>channel started
01:42:49 Executing Maven:  -B -f /home/jenkins/agent/workspace/JWT-Auth-maven-snapshots/pom.xml -pl !spec -Peclipse-jarsigner install
01:42:50 [INFO] Scanning for projects...
01:42:51 [INFO] ------------------------------------------------------------------------
01:42:51 [INFO] Reactor Build Order:
01:42:51 [INFO] 
01:42:51 [INFO] MicroProfile JWT Auth Parent                                       [pom]
01:42:51 [INFO] MicroProfile JWT Auth API                                          [jar]
01:42:51 [INFO] MicroProfile JWT Auth TCK Harness                                  [jar]
01:42:51 [INFO] 
01:42:51 [INFO] -----< org.eclipse.microprofile.jwt:microprofile-jwt-auth-parent >------
01:42:51 [INFO] Building MicroProfile JWT Auth Parent 1.2-SNAPSHOT                 [1/3]
01:42:51 [INFO] --------------------------------[ pom ]---------------------------------
01:42:52 [INFO] 
01:42:52 [INFO] --- apache-rat-plugin:0.12:check (rat-check) @ microprofile-jwt-auth-parent ---
01:43:01 [INFO] Enabled default license matchers.
01:43:01 [INFO] Will parse SCM ignores for exclusions...
01:43:01 [INFO] Parsing exclusions from /home/jenkins/agent/workspace/JWT-Auth-maven-snapshots/.gitignore
01:43:01 [INFO] Finished adding exclusions from SCM ignore files.
01:43:01 [INFO] 75 implicit excludes (use -debug for more details).
01:43:01 [INFO] Exclude: .travis.yml.*
01:43:01 [INFO] Exclude: bnd.bnd
01:43:01 [INFO] Exclude: **/*.json
01:43:01 [INFO] Exclude: **/*.jwk
01:43:01 [INFO] Exclude: **/META-INF/services/*
01:43:01 [INFO] Exclude: *.log
01:43:01 [INFO] Exclude: .checkstyle
01:43:01 [INFO] Exclude: .factorypath
01:43:01 [INFO] Exclude: .editorconfig
01:43:01 [INFO] Exclude: sandbox/**
01:43:01 [INFO] 7 resources included (use -debug for more details)
01:43:01 [INFO] Rat check: Summary over all files. Unapproved: 0, unknown: 0, generated: 0, approved: 5 licenses.
01:43:01 [INFO] 
01:43:01 [INFO] --- maven-checkstyle-plugin:2.17:check (verify-style) @ microprofile-jwt-auth-parent ---
01:43:10 [INFO] Starting audit...
01:43:10 Audit done.
01:43:10 [INFO] 
01:43:10 [INFO] --- maven-install-plugin:2.4:install (default-install) @ microprofile-jwt-auth-parent ---
01:43:11 [INFO] Installing /home/jenkins/agent/workspace/JWT-Auth-maven-snapshots/pom.xml to /home/jenkins/.m2/repository/org/eclipse/microprofile/jwt/microprofile-jwt-auth-parent/1.2-SNAPSHOT/microprofile-jwt-auth-parent-1.2-SNAPSHOT.pom
01:43:12 [INFO] 
01:43:12 [INFO] -------< org.eclipse.microprofile.jwt:microprofile-jwt-auth-api >-------
01:43:12 [INFO] Building MicroProfile JWT Auth API 1.2-SNAPSHOT                    [2/3]
01:43:12 [INFO] --------------------------------[ jar ]---------------------------------
01:43:14 [INFO] 
01:43:14 [INFO] --- apache-rat-plugin:0.12:check (rat-check) @ microprofile-jwt-auth-api ---
01:43:14 [INFO] Enabled default license matchers.
01:43:14 [INFO] Will parse SCM ignores for exclusions...
01:43:14 [INFO] Finished adding exclusions from SCM ignore files.
01:43:14 [INFO] 61 implicit excludes (use -debug for more details).
01:43:14 [INFO] Exclude: .travis.yml.*
01:43:14 [INFO] Exclude: bnd.bnd
01:43:14 [INFO] Exclude: **/*.json
01:43:14 [INFO] Exclude: **/*.jwk
01:43:14 [INFO] Exclude: **/META-INF/services/*
01:43:14 [INFO] Exclude: *.log
01:43:14 [INFO] Exclude: .checkstyle
01:43:14 [INFO] Exclude: .factorypath
01:43:14 [INFO] Exclude: .editorconfig
01:43:14 [INFO] Exclude: sandbox/**
01:43:14 [INFO] 10 resources included (use -debug for more details)
01:43:14 [INFO] Rat check: Summary over all files. Unapproved: 0, unknown: 0, generated: 0, approved: 10 licenses.
01:43:14 [INFO] 
01:43:14 [INFO] --- maven-resources-plugin:2.6:resources (default-resources) @ microprofile-jwt-auth-api ---
01:43:15 [INFO] Using 'UTF-8' encoding to copy filtered resources.
01:43:15 [INFO] skip non existing resourceDirectory /home/jenkins/agent/workspace/JWT-Auth-maven-snapshots/api/src/main/resources
01:43:15 [INFO] 
01:43:15 [INFO] --- maven-compiler-plugin:3.1:compile (default-compile) @ microprofile-jwt-auth-api ---
01:43:18 [INFO] Changes detected - recompiling the module!
01:43:18 [INFO] Compiling 9 source files to /home/jenkins/agent/workspace/JWT-Auth-maven-snapshots/api/target/classes
01:43:19 [INFO] 
01:43:19 [INFO] --- maven-checkstyle-plugin:2.17:check (verify-style) @ microprofile-jwt-auth-api ---
01:43:19 [INFO] Starting audit...
01:43:19 Audit done.
01:43:19 [INFO] 
01:43:19 [INFO] --- bnd-maven-plugin:3.4.0:bnd-process (default) @ microprofile-jwt-auth-api ---
01:43:20 [INFO] 
01:43:20 [INFO] --- maven-resources-plugin:2.6:testResources (default-testResources) @ microprofile-jwt-auth-api ---
01:43:20 [INFO] Using 'UTF-8' encoding to copy filtered resources.
01:43:20 [INFO] skip non existing resourceDirectory /home/jenkins/agent/workspace/JWT-Auth-maven-snapshots/api/src/test/resources
01:43:20 [INFO] 
01:43:20 [INFO] --- maven-compiler-plugin:3.1:testCompile (default-testCompile) @ microprofile-jwt-auth-api ---
01:43:20 [INFO] No sources to compile
01:43:20 [INFO] 
01:43:20 [INFO] --- maven-surefire-plugin:2.12.4:test (default-test) @ microprofile-jwt-auth-api ---
01:43:21 [INFO] No tests to run.
01:43:22 [JENKINS] Recording test results
01:43:22 [INFO] 
01:43:22 [INFO] --- maven-jar-plugin:3.0.2:jar (default-jar) @ microprofile-jwt-auth-api ---
01:43:28 [INFO] Building jar: /home/jenkins/agent/workspace/JWT-Auth-maven-snapshots/api/target/microprofile-jwt-auth-api-1.2-SNAPSHOT.jar
01:43:28 [INFO] 
01:43:28 [INFO] --- maven-javadoc-plugin:2.10.4:jar (attach-javadocs) @ microprofile-jwt-auth-api ---
01:43:32 [INFO] 
01:43:32 Loading source files for package org.eclipse.microprofile.auth...
01:43:32 Loading source files for package org.eclipse.microprofile.jwt...
01:43:32 Loading source files for package org.eclipse.microprofile.jwt.config...
01:43:32 Constructing Javadoc information...
01:43:32 Standard Doclet version 1.8.0_202
01:43:32 Building tree for all the packages and classes...
01:43:32 Generating /home/jenkins/agent/workspace/JWT-Auth-maven-snapshots/api/target/apidocs/org/eclipse/microprofile/auth/LoginConfig.html...
01:43:32 Generating /home/jenkins/agent/workspace/JWT-Auth-maven-snapshots/api/target/apidocs/org/eclipse/microprofile/jwt/Claim.html...
01:43:32 Generating /home/jenkins/agent/workspace/JWT-Auth-maven-snapshots/api/target/apidocs/org/eclipse/microprofile/jwt/ClaimLiteral.html...
01:43:32 Generating /home/jenkins/agent/workspace/JWT-Auth-maven-snapshots/api/target/apidocs/org/eclipse/microprofile/jwt/Claims.html...
01:43:32 Generating /home/jenkins/agent/workspace/JWT-Auth-maven-snapshots/api/target/apidocs/org/eclipse/microprofile/jwt/ClaimValue.html...
01:43:32 Generating /home/jenkins/agent/workspace/JWT-Auth-maven-snapshots/api/target/apidocs/org/eclipse/microprofile/jwt/JsonWebToken.html...
01:43:32 Generating /home/jenkins/agent/workspace/JWT-Auth-maven-snapshots/api/target/apidocs/org/eclipse/microprofile/jwt/config/Names.html...
01:43:32 Generating /home/jenkins/agent/workspace/JWT-Auth-maven-snapshots/api/target/apidocs/overview-frame.html...
01:43:32 Generating /home/jenkins/agent/workspace/JWT-Auth-maven-snapshots/api/target/apidocs/org/eclipse/microprofile/auth/package-frame.html...
01:43:32 Generating /home/jenkins/agent/workspace/JWT-Auth-maven-snapshots/api/target/apidocs/org/eclipse/microprofile/auth/package-summary.html...
01:43:32 Generating /home/jenkins/agent/workspace/JWT-Auth-maven-snapshots/api/target/apidocs/org/eclipse/microprofile/auth/package-tree.html...
01:43:32 Generating /home/jenkins/agent/workspace/JWT-Auth-maven-snapshots/api/target/apidocs/org/eclipse/microprofile/jwt/package-frame.html...
01:43:32 Generating /home/jenkins/agent/workspace/JWT-Auth-maven-snapshots/api/target/apidocs/org/eclipse/microprofile/jwt/package-summary.html...
01:43:32 Generating /home/jenkins/agent/workspace/JWT-Auth-maven-snapshots/api/target/apidocs/org/eclipse/microprofile/jwt/package-tree.html...
01:43:32 Generating /home/jenkins/agent/workspace/JWT-Auth-maven-snapshots/api/target/apidocs/org/eclipse/microprofile/jwt/config/package-frame.html...
01:43:32 Generating /home/jenkins/agent/workspace/JWT-Auth-maven-snapshots/api/target/apidocs/org/eclipse/microprofile/jwt/config/package-summary.html...
01:43:32 Generating /home/jenkins/agent/workspace/JWT-Auth-maven-snapshots/api/target/apidocs/org/eclipse/microprofile/jwt/config/package-tree.html...
01:43:32 Generating /home/jenkins/agent/workspace/JWT-Auth-maven-snapshots/api/target/apidocs/constant-values.html...
01:43:32 Generating /home/jenkins/agent/workspace/JWT-Auth-maven-snapshots/api/target/apidocs/serialized-form.html...
01:43:32 Generating /home/jenkins/agent/workspace/JWT-Auth-maven-snapshots/api/target/apidocs/org/eclipse/microprofile/auth/class-use/LoginConfig.html...
01:43:32 Generating /home/jenkins/agent/workspace/JWT-Auth-maven-snapshots/api/target/apidocs/org/eclipse/microprofile/jwt/class-use/JsonWebToken.html...
01:43:32 Generating /home/jenkins/agent/workspace/JWT-Auth-maven-snapshots/api/target/apidocs/org/eclipse/microprofile/jwt/class-use/Claims.html...
01:43:32 Generating /home/jenkins/agent/workspace/JWT-Auth-maven-snapshots/api/target/apidocs/org/eclipse/microprofile/jwt/class-use/ClaimValue.html...
01:43:32 Generating /home/jenkins/agent/workspace/JWT-Auth-maven-snapshots/api/target/apidocs/org/eclipse/microprofile/jwt/class-use/ClaimLiteral.html...
01:43:32 Generating /home/jenkins/agent/workspace/JWT-Auth-maven-snapshots/api/target/apidocs/org/eclipse/microprofile/jwt/class-use/Claim.html...
01:43:32 Generating /home/jenkins/agent/workspace/JWT-Auth-maven-snapshots/api/target/apidocs/org/eclipse/microprofile/jwt/config/class-use/Names.html...
01:43:32 Generating /home/jenkins/agent/workspace/JWT-Auth-maven-snapshots/api/target/apidocs/org/eclipse/microprofile/auth/package-use.html...
01:43:32 Generating /home/jenkins/agent/workspace/JWT-Auth-maven-snapshots/api/target/apidocs/org/eclipse/microprofile/jwt/package-use.html...
01:43:32 Generating /home/jenkins/agent/workspace/JWT-Auth-maven-snapshots/api/target/apidocs/org/eclipse/microprofile/jwt/config/package-use.html...
01:43:32 Building index for all the packages and classes...
01:43:32 Generating /home/jenkins/agent/workspace/JWT-Auth-maven-snapshots/api/target/apidocs/overview-tree.html...
01:43:32 Generating /home/jenkins/agent/workspace/JWT-Auth-maven-snapshots/api/target/apidocs/index-all.html...
01:43:32 Generating /home/jenkins/agent/workspace/JWT-Auth-maven-snapshots/api/target/apidocs/deprecated-list.html...
01:43:32 Building index for all classes...
01:43:32 Generating /home/jenkins/agent/workspace/JWT-Auth-maven-snapshots/api/target/apidocs/allclasses-frame.html...
01:43:32 Generating /home/jenkins/agent/workspace/JWT-Auth-maven-snapshots/api/target/apidocs/allclasses-noframe.html...
01:43:32 Generating /home/jenkins/agent/workspace/JWT-Auth-maven-snapshots/api/target/apidocs/index.html...
01:43:32 Generating /home/jenkins/agent/workspace/JWT-Auth-maven-snapshots/api/target/apidocs/overview-summary.html...
01:43:32 Generating /home/jenkins/agent/workspace/JWT-Auth-maven-snapshots/api/target/apidocs/help-doc.html...
01:43:32 2 warnings
01:43:32 [WARNING] Javadoc Warnings
01:43:32 [WARNING] Picked up JAVA_TOOL_OPTIONS: -XX:+IgnoreUnrecognizedVMOptions -XX:+UseContainerSupport -XX:+UnlockExperimentalVMOptions -XX:+UseCGroupMemoryLimitForHeap
01:43:32 [WARNING] Picked up _JAVA_OPTIONS: -XX:MaxRAMPercentage=64.0
01:43:32 [WARNING] /home/jenkins/agent/workspace/JWT-Auth-maven-snapshots/api/src/main/java/org/eclipse/microprofile/auth/LoginConfig.java:61: warning: no description for @return
01:43:32 [WARNING] * @return
01:43:32 [WARNING] ^
01:43:32 [WARNING] /home/jenkins/agent/workspace/JWT-Auth-maven-snapshots/api/src/main/java/org/eclipse/microprofile/jwt/JsonWebToken.java:146: warning: no @param for <T>
01:43:32 [WARNING] <T> T getClaim(String claimName);
01:43:32 [WARNING] ^
01:43:32 [INFO] Building jar: /home/jenkins/agent/workspace/JWT-Auth-maven-snapshots/api/target/microprofile-jwt-auth-api-1.2-SNAPSHOT-javadoc.jar
01:43:33 [INFO] 
01:43:33 [INFO] >>> maven-source-plugin:3.0.1:jar (attach-sources) > generate-sources @ microprofile-jwt-auth-api >>>
01:43:33 [INFO] 
01:43:33 [INFO] --- apache-rat-plugin:0.12:check (rat-check) @ microprofile-jwt-auth-api ---
01:43:33 [INFO] Enabled default license matchers.
01:43:33 [INFO] Will parse SCM ignores for exclusions...
01:43:33 [INFO] Finished adding exclusions from SCM ignore files.
01:43:33 [INFO] 61 implicit excludes (use -debug for more details).
01:43:33 [INFO] Exclude: .travis.yml.*
01:43:33 [INFO] Exclude: bnd.bnd
01:43:33 [INFO] Exclude: **/*.json
01:43:33 [INFO] Exclude: **/*.jwk
01:43:33 [INFO] Exclude: **/META-INF/services/*
01:43:33 [INFO] Exclude: *.log
01:43:33 [INFO] Exclude: .checkstyle
01:43:33 [INFO] Exclude: .factorypath
01:43:33 [INFO] Exclude: .editorconfig
01:43:33 [INFO] Exclude: sandbox/**
01:43:33 [INFO] 10 resources included (use -debug for more details)
01:43:33 [INFO] Rat check: Summary over all files. Unapproved: 0, unknown: 0, generated: 0, approved: 10 licenses.
01:43:33 [WARNING] Failed to getClass for org.apache.maven.plugins.source.SourceJarMojo
01:43:33 [INFO] 
01:43:33 [INFO] <<< maven-source-plugin:3.0.1:jar (attach-sources) < generate-sources @ microprofile-jwt-auth-api <<<
01:43:33 [INFO] 
01:43:33 [INFO] 
01:43:33 [INFO] --- maven-source-plugin:3.0.1:jar (attach-sources) @ microprofile-jwt-auth-api ---
01:43:33 [INFO] Building jar: /home/jenkins/agent/workspace/JWT-Auth-maven-snapshots/api/target/microprofile-jwt-auth-api-1.2-SNAPSHOT-sources.jar
01:43:33 [INFO] 
01:43:33 [INFO] --- maven-jar-plugin:3.0.2:test-jar (default) @ microprofile-jwt-auth-api ---
01:43:33 [WARNING] JAR will be empty - no content was marked for inclusion!
01:43:33 [INFO] Building jar: /home/jenkins/agent/workspace/JWT-Auth-maven-snapshots/api/target/microprofile-jwt-auth-api-1.2-SNAPSHOT-tests.jar
01:43:34 [INFO] 
01:43:34 [INFO] --- eclipse-jarsigner-plugin:1.1.4:sign (default) @ microprofile-jwt-auth-api ---
01:43:37 [INFO] Signing jar: /home/jenkins/agent/workspace/JWT-Auth-maven-snapshots/api/target/microprofile-jwt-auth-api-1.2-SNAPSHOT.jar
01:43:39 [INFO] Signing jar: /home/jenkins/agent/workspace/JWT-Auth-maven-snapshots/api/target/microprofile-jwt-auth-api-1.2-SNAPSHOT-javadoc.jar
01:43:40 [INFO] Signing jar: /home/jenkins/agent/workspace/JWT-Auth-maven-snapshots/api/target/microprofile-jwt-auth-api-1.2-SNAPSHOT-sources.jar
01:43:41 [INFO] Signing jar: /home/jenkins/agent/workspace/JWT-Auth-maven-snapshots/api/target/microprofile-jwt-auth-api-1.2-SNAPSHOT-tests.jar
01:43:43 [INFO] 
01:43:43 [INFO] --- maven-install-plugin:2.4:install (default-install) @ microprofile-jwt-auth-api ---
01:43:43 [INFO] Installing /home/jenkins/agent/workspace/JWT-Auth-maven-snapshots/api/target/microprofile-jwt-auth-api-1.2-SNAPSHOT.jar to /home/jenkins/.m2/repository/org/eclipse/microprofile/jwt/microprofile-jwt-auth-api/1.2-SNAPSHOT/microprofile-jwt-auth-api-1.2-SNAPSHOT.jar
01:43:43 [INFO] Installing /home/jenkins/agent/workspace/JWT-Auth-maven-snapshots/api/pom.xml to /home/jenkins/.m2/repository/org/eclipse/microprofile/jwt/microprofile-jwt-auth-api/1.2-SNAPSHOT/microprofile-jwt-auth-api-1.2-SNAPSHOT.pom
01:43:43 [INFO] Installing /home/jenkins/agent/workspace/JWT-Auth-maven-snapshots/api/target/microprofile-jwt-auth-api-1.2-SNAPSHOT-javadoc.jar to /home/jenkins/.m2/repository/org/eclipse/microprofile/jwt/microprofile-jwt-auth-api/1.2-SNAPSHOT/microprofile-jwt-auth-api-1.2-SNAPSHOT-javadoc.jar
01:43:43 [INFO] Installing /home/jenkins/agent/workspace/JWT-Auth-maven-snapshots/api/target/microprofile-jwt-auth-api-1.2-SNAPSHOT-sources.jar to /home/jenkins/.m2/repository/org/eclipse/microprofile/jwt/microprofile-jwt-auth-api/1.2-SNAPSHOT/microprofile-jwt-auth-api-1.2-SNAPSHOT-sources.jar
01:43:43 [INFO] Installing /home/jenkins/agent/workspace/JWT-Auth-maven-snapshots/api/target/microprofile-jwt-auth-api-1.2-SNAPSHOT-tests.jar to /home/jenkins/.m2/repository/org/eclipse/microprofile/jwt/microprofile-jwt-auth-api/1.2-SNAPSHOT/microprofile-jwt-auth-api-1.2-SNAPSHOT-tests.jar
01:43:44 [INFO] 
01:43:44 [INFO] -------< org.eclipse.microprofile.jwt:microprofile-jwt-auth-tck >-------
01:43:44 [INFO] Building MicroProfile JWT Auth TCK Harness 1.2-SNAPSHOT            [3/3]
01:43:44 [INFO] --------------------------------[ jar ]---------------------------------
01:43:51 [INFO] 
01:43:51 [INFO] --- apache-rat-plugin:0.12:check (rat-check) @ microprofile-jwt-auth-tck ---
01:43:51 [INFO] Enabled default license matchers.
01:43:51 [INFO] Will parse SCM ignores for exclusions...
01:43:51 [INFO] Finished adding exclusions from SCM ignore files.
01:43:51 [INFO] 61 implicit excludes (use -debug for more details).
01:43:51 [INFO] Exclude: .travis.yml.*
01:43:51 [INFO] Exclude: bnd.bnd
01:43:51 [INFO] Exclude: **/*.json
01:43:51 [INFO] Exclude: **/*.jwk
01:43:51 [INFO] Exclude: **/META-INF/services/*
01:43:51 [INFO] Exclude: *.log
01:43:51 [INFO] Exclude: .checkstyle
01:43:51 [INFO] Exclude: .factorypath
01:43:51 [INFO] Exclude: .editorconfig
01:43:51 [INFO] Exclude: sandbox/**
01:43:51 [INFO] 69 resources included (use -debug for more details)
01:43:51 [INFO] Rat check: Summary over all files. Unapproved: 0, unknown: 0, generated: 0, approved: 65 licenses.
01:43:51 [INFO] 
01:43:51 [INFO] --- asciidoctor-maven-plugin:1.5.5:process-asciidoc (generate-pdf-doc) @ microprofile-jwt-auth-tck ---
01:43:57 [INFO] Using 'UTF-8' encoding to copy filtered resources.
01:43:57 [INFO] ignoreDelta true
01:43:57 [INFO] Copying 80 resources
01:43:57 [INFO] Copying file pom.xml
01:43:57 [INFO] Copying file src/main/java/org/eclipse/microprofile/jwt/tck/arquillian/BaseExtension.java
01:43:57 [INFO] Copying file src/main/java/org/eclipse/microprofile/jwt/tck/arquillian/BaseWarArchiveProcessor.java
01:43:57 [INFO] Copying file src/main/java/org/eclipse/microprofile/jwt/tck/util/ITokenParser.java
01:43:57 [INFO] Copying file src/main/java/org/eclipse/microprofile/jwt/tck/util/MpJwtTestVersion.java
01:43:57 [INFO] Copying file src/main/java/org/eclipse/microprofile/jwt/tck/util/TokenUtils.java
01:43:57 [INFO] Copying file src/test/java/org/eclipse/microprofile/jwt/tck/TCKConstants.java
01:43:57 [INFO] Copying file src/test/java/org/eclipse/microprofile/jwt/tck/config/AltApplication.java
01:43:57 [INFO] Copying file src/test/java/org/eclipse/microprofile/jwt/tck/config/IssNoValidationBadIssTest.java
01:43:57 [INFO] Copying file src/test/java/org/eclipse/microprofile/jwt/tck/config/IssNoValidationNoIssTest.java
01:43:57 [INFO] Copying file src/test/java/org/eclipse/microprofile/jwt/tck/config/IssValidationFailTest.java
01:43:57 [INFO] Copying file src/test/java/org/eclipse/microprofile/jwt/tck/config/IssValidationTest.java
01:43:57 [INFO] Copying file src/test/java/org/eclipse/microprofile/jwt/tck/config/JwksApplication.java
01:43:57 [INFO] Copying file src/test/java/org/eclipse/microprofile/jwt/tck/config/PEMApplication.java
01:43:57 [INFO] Copying file src/test/java/org/eclipse/microprofile/jwt/tck/config/PublicKeyAsBase64JWKTest.java
01:43:57 [INFO] Copying file src/test/java/org/eclipse/microprofile/jwt/tck/config/PublicKeyAsFileLocationURLTest.java
01:43:57 [INFO] Copying file src/test/java/org/eclipse/microprofile/jwt/tck/config/PublicKeyAsJWKLocationTest.java
01:43:57 [INFO] Copying file src/test/java/org/eclipse/microprofile/jwt/tck/config/PublicKeyAsJWKLocationURLTest.java
01:43:57 [INFO] Copying file src/test/java/org/eclipse/microprofile/jwt/tck/config/PublicKeyAsJWKSLocationTest.java
01:43:57 [INFO] Copying file src/test/java/org/eclipse/microprofile/jwt/tck/config/PublicKeyAsJWKSTest.java
01:43:57 [INFO] Copying file src/test/java/org/eclipse/microprofile/jwt/tck/config/PublicKeyAsJWKTest.java
01:43:57 [INFO] Copying file src/test/java/org/eclipse/microprofile/jwt/tck/config/PublicKeyAsPEMEndpoint.java
01:43:57 [INFO] Copying file src/test/java/org/eclipse/microprofile/jwt/tck/config/PublicKeyAsPEMLocationTest.java
01:43:57 [INFO] Copying file src/test/java/org/eclipse/microprofile/jwt/tck/config/PublicKeyAsPEMLocationURLTest.java
01:43:57 [INFO] Copying file src/test/java/org/eclipse/microprofile/jwt/tck/config/PublicKeyAsPEMTest.java
01:43:57 [INFO] Copying file src/test/java/org/eclipse/microprofile/jwt/tck/config/PublicKeyEndpoint.java
01:43:57 [INFO] Copying file src/test/java/org/eclipse/microprofile/jwt/tck/config/SimpleTokenUtils.java
01:43:57 [INFO] Copying file src/test/java/org/eclipse/microprofile/jwt/tck/container/ejb/EjbEndpoint.java
01:43:57 [INFO] Copying file src/test/java/org/eclipse/microprofile/jwt/tck/container/ejb/EjbTest.java
01:43:57 [INFO] Copying file src/test/java/org/eclipse/microprofile/jwt/tck/container/ejb/IService.java
01:43:57 [INFO] Copying file src/test/java/org/eclipse/microprofile/jwt/tck/container/ejb/ServiceEJB.java
01:43:57 [INFO] Copying file src/test/java/org/eclipse/microprofile/jwt/tck/container/jacc/SubjectEndpoint.java
01:43:57 [INFO] Copying file src/test/java/org/eclipse/microprofile/jwt/tck/container/jacc/SubjectTest.java
01:43:57 [INFO] Copying file src/test/java/org/eclipse/microprofile/jwt/tck/container/jaxrs/AppScopedEndpoint.java
01:43:57 [INFO] Copying file src/test/java/org/eclipse/microprofile/jwt/tck/container/jaxrs/AppScopedTest.java
01:43:57 [INFO] Copying file src/test/java/org/eclipse/microprofile/jwt/tck/container/jaxrs/ClaimValueInjectionEndpoint.java
01:43:57 [INFO] Copying file src/test/java/org/eclipse/microprofile/jwt/tck/container/jaxrs/ClaimValueInjectionTest.java
01:43:57 [INFO] Copying file src/test/java/org/eclipse/microprofile/jwt/tck/container/jaxrs/InvalidTokenTest.java
01:43:57 [INFO] Copying file src/test/java/org/eclipse/microprofile/jwt/tck/container/jaxrs/JsonValueInjectionTest.java
01:43:57 [INFO] Copying file src/test/java/org/eclipse/microprofile/jwt/tck/container/jaxrs/JsonValuejectionEndpoint.java
01:43:57 [INFO] Copying file src/test/java/org/eclipse/microprofile/jwt/tck/container/jaxrs/PrimitiveInjectionEndpoint.java
01:43:57 [INFO] Copying file src/test/java/org/eclipse/microprofile/jwt/tck/container/jaxrs/PrimitiveInjectionTest.java
01:43:57 [INFO] Copying file src/test/java/org/eclipse/microprofile/jwt/tck/container/jaxrs/PrincipalInjectionEndpoint.java
01:43:57 [INFO] Copying file src/test/java/org/eclipse/microprofile/jwt/tck/container/jaxrs/PrincipalInjectionTest.java
01:43:57 [INFO] Copying file src/test/java/org/eclipse/microprofile/jwt/tck/container/jaxrs/ProviderInjectionEndpoint.java
01:43:57 [INFO] Copying file src/test/java/org/eclipse/microprofile/jwt/tck/container/jaxrs/ProviderInjectionTest.java
01:43:57 [INFO] Copying file src/test/java/org/eclipse/microprofile/jwt/tck/container/jaxrs/RequiredClaimsEndpoint.java
01:43:57 [INFO] Copying file src/test/java/org/eclipse/microprofile/jwt/tck/container/jaxrs/RequiredClaimsTest.java
01:43:57 [INFO] Copying file src/test/java/org/eclipse/microprofile/jwt/tck/container/jaxrs/RolesAllowedTest.java
01:43:57 [INFO] Copying file src/test/java/org/eclipse/microprofile/jwt/tck/container/jaxrs/RolesEndpoint.java
01:43:57 [INFO] Copying file src/test/java/org/eclipse/microprofile/jwt/tck/container/jaxrs/TCKApplication.java
01:43:57 [INFO] Copying file src/test/java/org/eclipse/microprofile/jwt/tck/container/jaxrs/UnsecureTCKApplication.java
01:43:57 [INFO] Copying file src/test/java/org/eclipse/microprofile/jwt/tck/container/jaxrs/UnsecuredPingEndpoint.java
01:43:57 [INFO] Copying file src/test/java/org/eclipse/microprofile/jwt/tck/container/jaxrs/UnsecuredPingTest.java
01:43:57 [INFO] Copying file src/test/java/org/eclipse/microprofile/jwt/tck/container/servlet/ServiceServlet.java
01:43:57 [INFO] Copying file src/test/java/org/eclipse/microprofile/jwt/tck/container/servlet/ServletTest.java
01:43:57 [INFO] Copying file src/test/java/org/eclipse/microprofile/jwt/tck/parsing/DebugTest.java
01:43:57 [INFO] Copying file src/test/java/org/eclipse/microprofile/jwt/tck/util/TokenUtilsTest.java
01:43:57 [INFO] Copying file src/test/resources/META-INF/microprofile-config-location.properties
01:43:57 [INFO] Copying file src/test/resources/META-INF/microprofile-config.properties
01:43:57 [INFO] Copying file src/test/resources/RequiredClaims.json
01:43:57 [INFO] Copying file src/test/resources/Token1.json
01:43:57 [INFO] Copying file src/test/resources/Token2.json
01:43:57 [INFO] Copying file src/test/resources/TokenBadIss.json
01:43:57 [INFO] Copying file src/test/resources/TokenNoIss.json
01:43:57 [INFO] Copying file src/test/resources/beans.xml
01:43:57 [INFO] Copying file src/test/resources/jwt-content1.json
01:43:57 [INFO] Copying file src/test/resources/privateKey.pem
01:43:57 [INFO] Copying file src/test/resources/privateKey4k.pem
01:43:57 [INFO] Copying file src/test/resources/publicKey.pem
01:43:57 [INFO] Copying file src/test/resources/publicKey4k.pem
01:43:57 [INFO] Copying file src/test/resources/signer-key4k.jwk
01:43:57 [INFO] Copying file src/test/resources/signer-keyset4k.jwk
01:43:57 [INFO] Copying file src/test/resources/testJWTCallerPrincipal.json
01:43:57 [INFO] Copying file src/test/resources/usePreferredName.json
01:43:57 [INFO] Copying file src/test/resources/useSubject.json
01:43:57 [INFO] Copying file tck-base-suite.xml
01:43:57 [INFO] Copying file tck-full-suite.xml
01:43:57 [INFO] Copying file tck-null-suite.xml
01:43:57 [INFO] Copying file target/rat.txt
01:44:03 asciidoctor: ERROR: README.adoc: line 89: only book doctypes can contain level 0 sections
01:44:03 asciidoctor: ERROR: README.adoc: line 89: only book doctypes can contain level 0 sections
01:44:11 [INFO] Rendered /home/jenkins/agent/workspace/JWT-Auth-maven-snapshots/tck/README.adoc
01:44:11 [INFO] 
01:44:11 [INFO] --- maven-resources-plugin:2.6:resources (default-resources) @ microprofile-jwt-auth-tck ---
01:44:11 [INFO] Using 'UTF-8' encoding to copy filtered resources.
01:44:11 [INFO] skip non existing resourceDirectory /home/jenkins/agent/workspace/JWT-Auth-maven-snapshots/tck/src/main/resources
01:44:11 [INFO] 
01:44:11 [INFO] --- maven-compiler-plugin:3.1:compile (default-compile) @ microprofile-jwt-auth-tck ---
01:44:11 [INFO] Changes detected - recompiling the module!
01:44:11 [INFO] Compiling 5 source files to /home/jenkins/agent/workspace/JWT-Auth-maven-snapshots/tck/target/classes
01:44:12 [INFO] 
01:44:12 [INFO] --- maven-checkstyle-plugin:2.17:check (verify-style) @ microprofile-jwt-auth-tck ---
01:44:13 [INFO] Starting audit...
01:44:13 Audit done.
01:44:13 [INFO] 
01:44:13 [INFO] --- maven-resources-plugin:2.6:testResources (default-testResources) @ microprofile-jwt-auth-tck ---
01:44:13 [INFO] Using 'UTF-8' encoding to copy filtered resources.
01:44:13 [INFO] Copying 18 resources
01:44:13 [INFO] 
01:44:13 [INFO] --- maven-compiler-plugin:3.1:testCompile (default-testCompile) @ microprofile-jwt-auth-tck ---
01:44:13 [INFO] Changes detected - recompiling the module!
01:44:13 [INFO] Compiling 52 source files to /home/jenkins/agent/workspace/JWT-Auth-maven-snapshots/tck/target/test-classes
01:44:15 [INFO] 
01:44:15 [INFO] --- maven-surefire-plugin:2.20:test (default-test) @ microprofile-jwt-auth-tck ---
01:44:17 [INFO] 
01:44:17 [INFO] -------------------------------------------------------
01:44:17 [INFO]  T E S T S
01:44:17 [INFO] -------------------------------------------------------
01:44:18 [INFO] Running TestSuite
01:44:18 [INFO] Tests run: 0, Failures: 0, Errors: 0, Skipped: 0, Time elapsed: 0.285 s - in TestSuite
01:44:18 [INFO] 
01:44:18 [INFO] Results:
01:44:18 [INFO] 
01:44:18 [INFO] Tests run: 0, Failures: 0, Errors: 0, Skipped: 0
01:44:18 [INFO] 
01:44:18 [JENKINS] Recording test results
01:44:19 [INFO] 
01:44:19 [INFO] --- maven-jar-plugin:3.0.2:jar (default-jar) @ microprofile-jwt-auth-tck ---
01:44:19 [INFO] Building jar: /home/jenkins/agent/workspace/JWT-Auth-maven-snapshots/tck/target/microprofile-jwt-auth-tck-1.2-SNAPSHOT.jar
01:44:19 [INFO] 
01:44:19 [INFO] --- maven-javadoc-plugin:2.10.4:jar (attach-javadocs) @ microprofile-jwt-auth-tck ---
01:44:21 [INFO] 
01:44:21 Loading source files for package org.eclipse.microprofile.jwt.tck.arquillian...
01:44:21 Loading source files for package org.eclipse.microprofile.jwt.tck.util...
01:44:21 Constructing Javadoc information...
01:44:21 Standard Doclet version 1.8.0_202
01:44:21 Building tree for all the packages and classes...
01:44:21 Generating /home/jenkins/agent/workspace/JWT-Auth-maven-snapshots/tck/target/apidocs/org/eclipse/microprofile/jwt/tck/arquillian/BaseExtension.html...
01:44:21 Generating /home/jenkins/agent/workspace/JWT-Auth-maven-snapshots/tck/target/apidocs/org/eclipse/microprofile/jwt/tck/arquillian/BaseWarArchiveProcessor.html...
01:44:21 Generating /home/jenkins/agent/workspace/JWT-Auth-maven-snapshots/tck/target/apidocs/org/eclipse/microprofile/jwt/tck/util/ITokenParser.html...
01:44:21 Generating /home/jenkins/agent/workspace/JWT-Auth-maven-snapshots/tck/target/apidocs/org/eclipse/microprofile/jwt/tck/util/MpJwtTestVersion.html...
01:44:21 Generating /home/jenkins/agent/workspace/JWT-Auth-maven-snapshots/tck/target/apidocs/org/eclipse/microprofile/jwt/tck/util/TokenUtils.html...
01:44:21 Generating /home/jenkins/agent/workspace/JWT-Auth-maven-snapshots/tck/target/apidocs/org/eclipse/microprofile/jwt/tck/util/TokenUtils.InvalidClaims.html...
01:44:21 Generating /home/jenkins/agent/workspace/JWT-Auth-maven-snapshots/tck/target/apidocs/overview-frame.html...
01:44:21 Generating /home/jenkins/agent/workspace/JWT-Auth-maven-snapshots/tck/target/apidocs/org/eclipse/microprofile/jwt/tck/arquillian/package-frame.html...
01:44:21 Generating /home/jenkins/agent/workspace/JWT-Auth-maven-snapshots/tck/target/apidocs/org/eclipse/microprofile/jwt/tck/arquillian/package-summary.html...
01:44:21 Generating /home/jenkins/agent/workspace/JWT-Auth-maven-snapshots/tck/target/apidocs/org/eclipse/microprofile/jwt/tck/arquillian/package-tree.html...
01:44:21 Generating /home/jenkins/agent/workspace/JWT-Auth-maven-snapshots/tck/target/apidocs/org/eclipse/microprofile/jwt/tck/util/package-frame.html...
01:44:21 Generating /home/jenkins/agent/workspace/JWT-Auth-maven-snapshots/tck/target/apidocs/org/eclipse/microprofile/jwt/tck/util/package-summary.html...
01:44:21 Generating /home/jenkins/agent/workspace/JWT-Auth-maven-snapshots/tck/target/apidocs/org/eclipse/microprofile/jwt/tck/util/package-tree.html...
01:44:21 Generating /home/jenkins/agent/workspace/JWT-Auth-maven-snapshots/tck/target/apidocs/constant-values.html...
01:44:21 Generating /home/jenkins/agent/workspace/JWT-Auth-maven-snapshots/tck/target/apidocs/org/eclipse/microprofile/jwt/tck/arquillian/class-use/BaseWarArchiveProcessor.html...
01:44:21 Generating /home/jenkins/agent/workspace/JWT-Auth-maven-snapshots/tck/target/apidocs/org/eclipse/microprofile/jwt/tck/arquillian/class-use/BaseExtension.html...
01:44:21 Generating /home/jenkins/agent/workspace/JWT-Auth-maven-snapshots/tck/target/apidocs/org/eclipse/microprofile/jwt/tck/util/class-use/TokenUtils.html...
01:44:21 Generating /home/jenkins/agent/workspace/JWT-Auth-maven-snapshots/tck/target/apidocs/org/eclipse/microprofile/jwt/tck/util/class-use/TokenUtils.InvalidClaims.html...
01:44:21 Generating /home/jenkins/agent/workspace/JWT-Auth-maven-snapshots/tck/target/apidocs/org/eclipse/microprofile/jwt/tck/util/class-use/MpJwtTestVersion.html...
01:44:21 Generating /home/jenkins/agent/workspace/JWT-Auth-maven-snapshots/tck/target/apidocs/org/eclipse/microprofile/jwt/tck/util/class-use/ITokenParser.html...
01:44:21 Generating /home/jenkins/agent/workspace/JWT-Auth-maven-snapshots/tck/target/apidocs/org/eclipse/microprofile/jwt/tck/arquillian/package-use.html...
01:44:21 Generating /home/jenkins/agent/workspace/JWT-Auth-maven-snapshots/tck/target/apidocs/org/eclipse/microprofile/jwt/tck/util/package-use.html...
01:44:21 Building index for all the packages and classes...
01:44:21 Generating /home/jenkins/agent/workspace/JWT-Auth-maven-snapshots/tck/target/apidocs/overview-tree.html...
01:44:21 Generating /home/jenkins/agent/workspace/JWT-Auth-maven-snapshots/tck/target/apidocs/index-all.html...
01:44:21 Generating /home/jenkins/agent/workspace/JWT-Auth-maven-snapshots/tck/target/apidocs/deprecated-list.html...
01:44:21 Building index for all classes...
01:44:21 Generating /home/jenkins/agent/workspace/JWT-Auth-maven-snapshots/tck/target/apidocs/allclasses-frame.html...
01:44:21 Generating /home/jenkins/agent/workspace/JWT-Auth-maven-snapshots/tck/target/apidocs/allclasses-noframe.html...
01:44:21 Generating /home/jenkins/agent/workspace/JWT-Auth-maven-snapshots/tck/target/apidocs/index.html...
01:44:21 Generating /home/jenkins/agent/workspace/JWT-Auth-maven-snapshots/tck/target/apidocs/overview-summary.html...
01:44:21 Generating /home/jenkins/agent/workspace/JWT-Auth-maven-snapshots/tck/target/apidocs/help-doc.html...
01:44:21 [WARNING] Javadoc Warnings
01:44:21 [WARNING] Picked up JAVA_TOOL_OPTIONS: -XX:+IgnoreUnrecognizedVMOptions -XX:+UseContainerSupport -XX:+UnlockExperimentalVMOptions -XX:+UseCGroupMemoryLimitForHeap
01:44:21 [WARNING] Picked up _JAVA_OPTIONS: -XX:MaxRAMPercentage=64.0
01:44:21 [INFO] Building jar: /home/jenkins/agent/workspace/JWT-Auth-maven-snapshots/tck/target/microprofile-jwt-auth-tck-1.2-SNAPSHOT-javadoc.jar
01:44:21 [INFO] 
01:44:21 [INFO] >>> maven-source-plugin:3.0.1:jar (attach-sources) > generate-sources @ microprofile-jwt-auth-tck >>>
01:44:21 [INFO] 
01:44:21 [INFO] --- apache-rat-plugin:0.12:check (rat-check) @ microprofile-jwt-auth-tck ---
01:44:21 [INFO] Enabled default license matchers.
01:44:21 [INFO] Will parse SCM ignores for exclusions...
01:44:21 [INFO] Finished adding exclusions from SCM ignore files.
01:44:21 [INFO] 61 implicit excludes (use -debug for more details).
01:44:21 [INFO] Exclude: .travis.yml.*
01:44:21 [INFO] Exclude: bnd.bnd
01:44:21 [INFO] Exclude: **/*.json
01:44:21 [INFO] Exclude: **/*.jwk
01:44:21 [INFO] Exclude: **/META-INF/services/*
01:44:21 [INFO] Exclude: *.log
01:44:21 [INFO] Exclude: .checkstyle
01:44:21 [INFO] Exclude: .factorypath
01:44:21 [INFO] Exclude: .editorconfig
01:44:21 [INFO] Exclude: sandbox/**
01:44:21 [INFO] 69 resources included (use -debug for more details)
01:44:21 [INFO] Rat check: Summary over all files. Unapproved: 0, unknown: 0, generated: 0, approved: 65 licenses.
01:44:21 [WARNING] Failed to getClass for org.apache.maven.plugins.source.SourceJarMojo
01:44:21 [INFO] 
01:44:21 [INFO] <<< maven-source-plugin:3.0.1:jar (attach-sources) < generate-sources @ microprofile-jwt-auth-tck <<<
01:44:21 [INFO] 
01:44:21 [INFO] 
01:44:21 [INFO] --- maven-source-plugin:3.0.1:jar (attach-sources) @ microprofile-jwt-auth-tck ---
01:44:21 [INFO] Building jar: /home/jenkins/agent/workspace/JWT-Auth-maven-snapshots/tck/target/microprofile-jwt-auth-tck-1.2-SNAPSHOT-sources.jar
01:44:21 [INFO] 
01:44:21 [INFO] >>> maven-source-plugin:3.0.1:test-jar (attach-sources) > generate-sources @ microprofile-jwt-auth-tck >>>
01:44:21 [INFO] 
01:44:21 [INFO] --- apache-rat-plugin:0.12:check (rat-check) @ microprofile-jwt-auth-tck ---
01:44:21 [INFO] Enabled default license matchers.
01:44:21 [INFO] Will parse SCM ignores for exclusions...
01:44:21 [INFO] Finished adding exclusions from SCM ignore files.
01:44:21 [INFO] 61 implicit excludes (use -debug for more details).
01:44:21 [INFO] Exclude: .travis.yml.*
01:44:21 [INFO] Exclude: bnd.bnd
01:44:21 [INFO] Exclude: **/*.json
01:44:21 [INFO] Exclude: **/*.jwk
01:44:21 [INFO] Exclude: **/META-INF/services/*
01:44:21 [INFO] Exclude: *.log
01:44:21 [INFO] Exclude: .checkstyle
01:44:21 [INFO] Exclude: .factorypath
01:44:21 [INFO] Exclude: .editorconfig
01:44:21 [INFO] Exclude: sandbox/**
01:44:21 [INFO] 69 resources included (use -debug for more details)
01:44:21 [INFO] Rat check: Summary over all files. Unapproved: 0, unknown: 0, generated: 0, approved: 65 licenses.
01:44:21 [WARNING] Failed to getClass for org.apache.maven.plugins.source.TestSourceJarMojo
01:44:21 [INFO] 
01:44:21 [INFO] <<< maven-source-plugin:3.0.1:test-jar (attach-sources) < generate-sources @ microprofile-jwt-auth-tck <<<
01:44:21 [INFO] 
01:44:21 [INFO] 
01:44:21 [INFO] --- maven-source-plugin:3.0.1:test-jar (attach-sources) @ microprofile-jwt-auth-tck ---
01:44:21 [INFO] Building jar: /home/jenkins/agent/workspace/JWT-Auth-maven-snapshots/tck/target/microprofile-jwt-auth-tck-1.2-SNAPSHOT-test-sources.jar
01:44:22 [INFO] 
01:44:22 [INFO] --- eclipse-jarsigner-plugin:1.1.4:sign (default) @ microprofile-jwt-auth-tck ---
01:44:22 [INFO] Signing jar: /home/jenkins/agent/workspace/JWT-Auth-maven-snapshots/tck/target/microprofile-jwt-auth-tck-1.2-SNAPSHOT.jar
01:44:23 [INFO] Signing jar: /home/jenkins/agent/workspace/JWT-Auth-maven-snapshots/tck/target/microprofile-jwt-auth-tck-1.2-SNAPSHOT-javadoc.jar
01:44:24 [INFO] Signing jar: /home/jenkins/agent/workspace/JWT-Auth-maven-snapshots/tck/target/microprofile-jwt-auth-tck-1.2-SNAPSHOT-sources.jar
01:44:26 [INFO] Signing jar: /home/jenkins/agent/workspace/JWT-Auth-maven-snapshots/tck/target/microprofile-jwt-auth-tck-1.2-SNAPSHOT-test-sources.jar
01:44:28 [INFO] 
01:44:28 [INFO] --- maven-jar-plugin:3.0.2:test-jar (default) @ microprofile-jwt-auth-tck ---
01:44:28 [INFO] Building jar: /home/jenkins/agent/workspace/JWT-Auth-maven-snapshots/tck/target/microprofile-jwt-auth-tck-1.2-SNAPSHOT-tests.jar
01:44:28 [INFO] 
01:44:28 [INFO] --- maven-install-plugin:2.4:install (default-install) @ microprofile-jwt-auth-tck ---
01:44:28 [INFO] Installing /home/jenkins/agent/workspace/JWT-Auth-maven-snapshots/tck/target/microprofile-jwt-auth-tck-1.2-SNAPSHOT.jar to /home/jenkins/.m2/repository/org/eclipse/microprofile/jwt/microprofile-jwt-auth-tck/1.2-SNAPSHOT/microprofile-jwt-auth-tck-1.2-SNAPSHOT.jar
01:44:28 [INFO] Installing /home/jenkins/agent/workspace/JWT-Auth-maven-snapshots/tck/pom.xml to /home/jenkins/.m2/repository/org/eclipse/microprofile/jwt/microprofile-jwt-auth-tck/1.2-SNAPSHOT/microprofile-jwt-auth-tck-1.2-SNAPSHOT.pom
01:44:28 [INFO] Installing /home/jenkins/agent/workspace/JWT-Auth-maven-snapshots/tck/target/microprofile-jwt-auth-tck-1.2-SNAPSHOT-javadoc.jar to /home/jenkins/.m2/repository/org/eclipse/microprofile/jwt/microprofile-jwt-auth-tck/1.2-SNAPSHOT/microprofile-jwt-auth-tck-1.2-SNAPSHOT-javadoc.jar
01:44:28 [INFO] Installing /home/jenkins/agent/workspace/JWT-Auth-maven-snapshots/tck/target/microprofile-jwt-auth-tck-1.2-SNAPSHOT-sources.jar to /home/jenkins/.m2/repository/org/eclipse/microprofile/jwt/microprofile-jwt-auth-tck/1.2-SNAPSHOT/microprofile-jwt-auth-tck-1.2-SNAPSHOT-sources.jar
01:44:28 [INFO] Installing /home/jenkins/agent/workspace/JWT-Auth-maven-snapshots/tck/target/microprofile-jwt-auth-tck-1.2-SNAPSHOT-test-sources.jar to /home/jenkins/.m2/repository/org/eclipse/microprofile/jwt/microprofile-jwt-auth-tck/1.2-SNAPSHOT/microprofile-jwt-auth-tck-1.2-SNAPSHOT-test-sources.jar
01:44:28 [INFO] Installing /home/jenkins/agent/workspace/JWT-Auth-maven-snapshots/tck/target/microprofile-jwt-auth-tck-1.2-SNAPSHOT-tests.jar to /home/jenkins/.m2/repository/org/eclipse/microprofile/jwt/microprofile-jwt-auth-tck/1.2-SNAPSHOT/microprofile-jwt-auth-tck-1.2-SNAPSHOT-tests.jar
01:44:29 [INFO] ------------------------------------------------------------------------
01:44:29 [INFO] Reactor Summary for MicroProfile JWT Auth Parent 1.2-SNAPSHOT:
01:44:29 [INFO] 
01:44:29 [INFO] MicroProfile JWT Auth Parent ....................... SUCCESS [ 19.565 s]
01:44:29 [INFO] MicroProfile JWT Auth API .......................... SUCCESS [ 31.008 s]
01:44:29 [INFO] MicroProfile JWT Auth TCK Harness .................. SUCCESS [ 44.529 s]
01:44:29 [INFO] ------------------------------------------------------------------------
01:44:29 [INFO] BUILD SUCCESS
01:44:29 [INFO] ------------------------------------------------------------------------
01:44:29 [INFO] Total time:  01:39 min
01:44:29 [INFO] Finished at: 2019-11-06T06:44:29Z
01:44:29 [INFO] ------------------------------------------------------------------------
01:44:29 Waiting for Jenkins to finish collecting data
01:44:30 [JENKINS] Archiving /home/jenkins/agent/workspace/JWT-Auth-maven-snapshots/api/pom.xml to org.eclipse.microprofile.jwt/microprofile-jwt-auth-api/1.2-SNAPSHOT/microprofile-jwt-auth-api-1.2-SNAPSHOT.pom
01:44:30 [JENKINS] Archiving /home/jenkins/agent/workspace/JWT-Auth-maven-snapshots/api/target/microprofile-jwt-auth-api-1.2-SNAPSHOT.jar to org.eclipse.microprofile.jwt/microprofile-jwt-auth-api/1.2-SNAPSHOT/microprofile-jwt-auth-api-1.2-SNAPSHOT.jar
01:44:30 [JENKINS] Archiving /home/jenkins/agent/workspace/JWT-Auth-maven-snapshots/api/target/microprofile-jwt-auth-api-1.2-SNAPSHOT-javadoc.jar to org.eclipse.microprofile.jwt/microprofile-jwt-auth-api/1.2-SNAPSHOT/microprofile-jwt-auth-api-1.2-SNAPSHOT-javadoc.jar
01:44:30 [JENKINS] Archiving /home/jenkins/agent/workspace/JWT-Auth-maven-snapshots/api/target/microprofile-jwt-auth-api-1.2-SNAPSHOT-sources.jar to org.eclipse.microprofile.jwt/microprofile-jwt-auth-api/1.2-SNAPSHOT/microprofile-jwt-auth-api-1.2-SNAPSHOT-sources.jar
01:44:30 [JENKINS] Archiving /home/jenkins/agent/workspace/JWT-Auth-maven-snapshots/api/target/microprofile-jwt-auth-api-1.2-SNAPSHOT-tests.jar to org.eclipse.microprofile.jwt/microprofile-jwt-auth-api/1.2-SNAPSHOT/microprofile-jwt-auth-api-1.2-SNAPSHOT-tests.jar
01:44:30 [JENKINS] Archiving /home/jenkins/agent/workspace/JWT-Auth-maven-snapshots/pom.xml to org.eclipse.microprofile.jwt/microprofile-jwt-auth-parent/1.2-SNAPSHOT/microprofile-jwt-auth-parent-1.2-SNAPSHOT.pom
01:44:30 [JENKINS] Archiving /home/jenkins/agent/workspace/JWT-Auth-maven-snapshots/tck/pom.xml to org.eclipse.microprofile.jwt/microprofile-jwt-auth-tck/1.2-SNAPSHOT/microprofile-jwt-auth-tck-1.2-SNAPSHOT.pom
01:44:30 [JENKINS] Archiving /home/jenkins/agent/workspace/JWT-Auth-maven-snapshots/tck/target/microprofile-jwt-auth-tck-1.2-SNAPSHOT.jar to org.eclipse.microprofile.jwt/microprofile-jwt-auth-tck/1.2-SNAPSHOT/microprofile-jwt-auth-tck-1.2-SNAPSHOT.jar
01:44:30 [JENKINS] Archiving /home/jenkins/agent/workspace/JWT-Auth-maven-snapshots/tck/target/microprofile-jwt-auth-tck-1.2-SNAPSHOT-javadoc.jar to org.eclipse.microprofile.jwt/microprofile-jwt-auth-tck/1.2-SNAPSHOT/microprofile-jwt-auth-tck-1.2-SNAPSHOT-javadoc.jar
01:44:30 [JENKINS] Archiving /home/jenkins/agent/workspace/JWT-Auth-maven-snapshots/tck/target/microprofile-jwt-auth-tck-1.2-SNAPSHOT-sources.jar to org.eclipse.microprofile.jwt/microprofile-jwt-auth-tck/1.2-SNAPSHOT/microprofile-jwt-auth-tck-1.2-SNAPSHOT-sources.jar
01:44:30 [JENKINS] Archiving /home/jenkins/agent/workspace/JWT-Auth-maven-snapshots/tck/target/microprofile-jwt-auth-tck-1.2-SNAPSHOT-test-sources.jar to org.eclipse.microprofile.jwt/microprofile-jwt-auth-tck/1.2-SNAPSHOT/microprofile-jwt-auth-tck-1.2-SNAPSHOT-test-sources.jar
01:44:30 [JENKINS] Archiving /home/jenkins/agent/workspace/JWT-Auth-maven-snapshots/tck/target/microprofile-jwt-auth-tck-1.2-SNAPSHOT-tests.jar to org.eclipse.microprofile.jwt/microprofile-jwt-auth-tck/1.2-SNAPSHOT/microprofile-jwt-auth-tck-1.2-SNAPSHOT-tests.jar
01:44:31 channel stopped
01:44:31 No artifacts are recorded for moduleorg.eclipse.microprofile.jwt:microprofile-jwt-auth-spec. Is this a Maven project?
01:44:31 Maven RedeployPublisher use remote default-agent-m19nl maven settings from : /home/jenkins/.m2/settings.xml
01:44:32 [INFO] Deployment in https://repo.eclipse.org/content/repositories/microprofile-snapshots/ (id=repo.eclipse.org,uniqueVersion=true)
01:44:32 Deploying the main artifact microprofile-jwt-auth-api-1.2-SNAPSHOT.jar
01:44:32 Downloading from repo.eclipse.org: https://repo.eclipse.org/content/repositories/microprofile-snapshots/org/eclipse/microprofile/jwt/microprofile-jwt-auth-api/1.2-SNAPSHOT/maven-metadata.xml
01:44:32 Downloaded from repo.eclipse.org: https://repo.eclipse.org/content/repositories/microprofile-snapshots/org/eclipse/microprofile/jwt/microprofile-jwt-auth-api/1.2-SNAPSHOT/maven-metadata.xml (1.4 kB at 5.5 kB/s)
01:44:32 Uploading to repo.eclipse.org: https://repo.eclipse.org/content/repositories/microprofile-snapshots/org/eclipse/microprofile/jwt/microprofile-jwt-auth-api/1.2-SNAPSHOT/microprofile-jwt-auth-api-1.2-20191106.064432-525.jar
01:44:32 Uploading to repo.eclipse.org: https://repo.eclipse.org/content/repositories/microprofile-snapshots/org/eclipse/microprofile/jwt/microprofile-jwt-auth-api/1.2-SNAPSHOT/microprofile-jwt-auth-api-1.2-20191106.064432-525.pom
01:44:32 ERROR: Failed to deploy artifacts: Could not transfer artifact org.eclipse.microprofile.jwt:microprofile-jwt-auth-api:jar:1.2-20191106.064432-525 from/to repo.eclipse.org (https://repo.eclipse.org/content/repositories/microprofile-snapshots/): Failed to transfer file https://repo.eclipse.org/content/repositories/microprofile-snapshots/org/eclipse/microprofile/jwt/microprofile-jwt-auth-api/1.2-SNAPSHOT/microprofile-jwt-auth-api-1.2-20191106.064432-525.jar with status code 401
01:44:32 org.apache.maven.artifact.deployer.ArtifactDeploymentException: Failed to deploy artifacts: Could not transfer artifact org.eclipse.microprofile.jwt:microprofile-jwt-auth-api:jar:1.2-20191106.064432-525 from/to repo.eclipse.org (https://repo.eclipse.org/content/repositories/microprofile-snapshots/): Failed to transfer file https://repo.eclipse.org/content/repositories/microprofile-snapshots/org/eclipse/microprofile/jwt/microprofile-jwt-auth-api/1.2-SNAPSHOT/microprofile-jwt-auth-api-1.2-20191106.064432-525.jar with status code 401
01:44:32 	at org.apache.maven.artifact.deployer.DefaultArtifactDeployer.deploy(DefaultArtifactDeployer.java:146)
01:44:32 	at hudson.maven.reporters.MavenArtifactRecord.deploy(MavenArtifactRecord.java:198)
01:44:32 	at hudson.maven.RedeployPublisher.perform(RedeployPublisher.java:176)
01:44:32 	at hudson.tasks.BuildStepMonitor$1.perform(BuildStepMonitor.java:20)
01:44:32 	at hudson.model.AbstractBuild$AbstractBuildExecution.perform(AbstractBuild.java:741)
01:44:32 	at hudson.model.AbstractBuild$AbstractBuildExecution.performAllBuildSteps(AbstractBuild.java:690)
01:44:32 	at hudson.maven.MavenModuleSetBuild$MavenModuleSetBuildExecution.post2(MavenModuleSetBuild.java:1074)
01:44:32 	at hudson.model.AbstractBuild$AbstractBuildExecution.post(AbstractBuild.java:635)
01:44:32 	at hudson.model.Run.execute(Run.java:1840)
01:44:32 	at hudson.maven.MavenModuleSetBuild.run(MavenModuleSetBuild.java:543)
01:44:32 	at hudson.model.ResourceController.execute(ResourceController.java:97)
01:44:32 	at hudson.model.Executor.run(Executor.java:429)
01:44:32 Caused by: org.eclipse.aether.deployment.DeploymentException: Failed to deploy artifacts: Could not transfer artifact org.eclipse.microprofile.jwt:microprofile-jwt-auth-api:jar:1.2-20191106.064432-525 from/to repo.eclipse.org (https://repo.eclipse.org/content/repositories/microprofile-snapshots/): Failed to transfer file https://repo.eclipse.org/content/repositories/microprofile-snapshots/org/eclipse/microprofile/jwt/microprofile-jwt-auth-api/1.2-SNAPSHOT/microprofile-jwt-auth-api-1.2-20191106.064432-525.jar with status code 401
01:44:32 	at org.eclipse.aether.internal.impl.DefaultDeployer.deploy(DefaultDeployer.java:295)
01:44:32 	at org.eclipse.aether.internal.impl.DefaultDeployer.deploy(DefaultDeployer.java:223)
01:44:32 	at org.eclipse.aether.internal.impl.DefaultRepositorySystem.deploy(DefaultRepositorySystem.java:384)
01:44:32 	at org.apache.maven.artifact.deployer.DefaultArtifactDeployer.deploy(DefaultArtifactDeployer.java:142)
01:44:32 	... 11 more
01:44:32 Caused by: org.eclipse.aether.transfer.ArtifactTransferException: Could not transfer artifact org.eclipse.microprofile.jwt:microprofile-jwt-auth-api:jar:1.2-20191106.064432-525 from/to repo.eclipse.org (https://repo.eclipse.org/content/repositories/microprofile-snapshots/): Failed to transfer file https://repo.eclipse.org/content/repositories/microprofile-snapshots/org/eclipse/microprofile/jwt/microprofile-jwt-auth-api/1.2-SNAPSHOT/microprofile-jwt-auth-api-1.2-20191106.064432-525.jar with status code 401
01:44:32 	at org.eclipse.aether.connector.basic.ArtifactTransportListener.transferFailed(ArtifactTransportListener.java:52)
01:44:32 	at org.eclipse.aether.connector.basic.BasicRepositoryConnector$TaskRunner.run(BasicRepositoryConnector.java:365)
01:44:32 	at org.eclipse.aether.connector.basic.BasicRepositoryConnector.put(BasicRepositoryConnector.java:284)
01:44:32 	at org.eclipse.aether.internal.impl.DefaultDeployer.deploy(DefaultDeployer.java:289)
01:44:32 	... 14 more
01:44:32 Caused by: org.apache.maven.wagon.TransferFailedException: Failed to transfer file https://repo.eclipse.org/content/repositories/microprofile-snapshots/org/eclipse/microprofile/jwt/microprofile-jwt-auth-api/1.2-SNAPSHOT/microprofile-jwt-auth-api-1.2-20191106.064432-525.jar with status code 401
01:44:32 	at org.apache.maven.wagon.shared.http.AbstractHttpClientWagon.put(AbstractHttpClientWagon.java:756)
01:44:32 	at org.apache.maven.wagon.shared.http.AbstractHttpClientWagon.put(AbstractHttpClientWagon.java:670)
01:44:32 	at org.apache.maven.wagon.shared.http.AbstractHttpClientWagon.put(AbstractHttpClientWagon.java:652)
01:44:32 	at org.apache.maven.wagon.shared.http.AbstractHttpClientWagon.put(AbstractHttpClientWagon.java:646)
01:44:32 	at org.apache.maven.wagon.shared.http.AbstractHttpClientWagon.put(AbstractHttpClientWagon.java:626)
01:44:32 	at org.eclipse.aether.transport.wagon.WagonTransporter$PutTaskRunner.run(WagonTransporter.java:686)
01:44:32 	at org.eclipse.aether.transport.wagon.WagonTransporter.execute(WagonTransporter.java:435)
01:44:32 	at org.eclipse.aether.transport.wagon.WagonTransporter.put(WagonTransporter.java:418)
01:44:32 	at org.eclipse.aether.connector.basic.BasicRepositoryConnector$PutTaskRunner.runTask(BasicRepositoryConnector.java:512)
01:44:32 	at org.eclipse.aether.connector.basic.BasicRepositoryConnector$TaskRunner.run(BasicRepositoryConnector.java:360)
01:44:32 	... 16 more
01:44:32 [INFO] Deployment failed after 0.5 sec
01:44:32 Build step 'Deploy artifacts to Maven repository' changed build result to FAILURE
01:44:33 Sending e-mails to: microprofile-dev@eclipse.org
01:44:33 Finished: FAILURE