AbortedConsole Output

Skipping 2,027 KB.. Full Log
83"/>
                </observation>
              </component>
            </organizer>
          </entry>
        </section>
      </component>
      <component>
        <section>
          <templateId root="2.16.840.1.113883.10.20.22.2.41"/>
          <code code="8653-8" codeSystem="2.16.840.1.113883.6.1" codeSystemName="LOINC" displayName="HOSPITAL DISCHARGE INSTRUCTIONS"/>
          <title>HOSPITAL DISCHARGE INSTRUCTIONS</title>
          <text>
                  <content>
                     Ms. Jones, you have been seen by Dr. Henry Seven at Local Community Hospital from August 8th until August 13th 2012. You are currently being discharged from Local Community Hospital. Dr. Seven has provided the following instructions to you at this time; should you have any questions please contact a member of your healthcare team prior to discharge. If you have left the hospital and have questions, please contact Dr. Seven at 555-555-1002. 
                     Instructions:
                  </content>
                  <list listType="ordered">
                     <item>Take all medications as prescribed.</item>
                     <item>Please monitor your peak flows. If your peak flows drop to 50% of normal, call my office immediately or return to the Emergency Room.</item>
                     <item>If you experience any of the following symptoms, call my office immediately or return to the Emergency Room:
                        <list listType="ordered">
                           <item>Shortness of Breath</item>
                           <item>Dizziness or Light-headedness</item>
                           <item>Fever, chills, or diffuse body aches</item>
                           <item>Pain or redness at the site of any previous intravenous catheter</item>
                           <item>Any other unusual problem</item>
                        </list>
                     </item>
                  </list>
               </text>
        </section>
      </component>
    </structuredBody>
  </component>
</ClinicalDocument>Tests run: 14, Failures: 0, Errors: 0, Skipped: 0, Time elapsed: 3.191 sec
Running org.eclipse.mdht.uml.cda.operations.EntryRelationshipOperationsTest
Tests run: 1, Failures: 0, Errors: 0, Skipped: 0, Time elapsed: 0.002 sec
Running org.eclipse.mdht.uml.cda.operations.EncounterOperationsTest
Tests run: 4, Failures: 1, Errors: 0, Skipped: 0, Time elapsed: 0.006 sec <<< FAILURE!
org.eclipse.mdht.uml.cda.operations.EncounterOperationsTest.testGetEntryRelationshipTargetsClinicalStatementIllegalArgumentException()  Time elapsed: 0.004 sec  <<< FAILURE!
java.lang.IllegalArgumentException: targetClass must be an EClass
	at org.eclipse.mdht.uml.cda.operations.ClinicalStatementOperations.getEntryRelationshipTargets(ClinicalStatementOperations.java:287)
	at org.eclipse.mdht.uml.cda.operations.ClinicalStatementOperationsTest.testGetEntryRelationshipTargetsClinicalStatementIllegalArgumentException(ClinicalStatementOperationsTest.java:92)
	at sun.reflect.NativeMethodAccessorImpl.invoke0(Native Method)
	at sun.reflect.NativeMethodAccessorImpl.invoke(NativeMethodAccessorImpl.java:62)
	at sun.reflect.DelegatingMethodAccessorImpl.invoke(DelegatingMethodAccessorImpl.java:43)
	at java.lang.reflect.Method.invoke(Method.java:498)
	at org.apache.maven.surefire.junit.PojoTestSet.executeTestMethod(PojoTestSet.java:151)
	at org.apache.maven.surefire.junit.PojoTestSet.executeTestMethods(PojoTestSet.java:102)
	at org.apache.maven.surefire.junit.PojoTestSet.execute(PojoTestSet.java:83)
	at org.apache.maven.surefire.junit.JUnit3Provider.executeTestSet(JUnit3Provider.java:121)
	at org.apache.maven.surefire.junit.JUnit3Provider.invoke(JUnit3Provider.java:98)
	at sun.reflect.NativeMethodAccessorImpl.invoke0(Native Method)
	at sun.reflect.NativeMethodAccessorImpl.invoke(NativeMethodAccessorImpl.java:62)
	at sun.reflect.DelegatingMethodAccessorImpl.invoke(DelegatingMethodAccessorImpl.java:43)
	at java.lang.reflect.Method.invoke(Method.java:498)
	at org.apache.maven.surefire.util.ReflectionUtils.invokeMethodWithArray(ReflectionUtils.java:189)
	at org.apache.maven.surefire.booter.ProviderFactory$ProviderProxy.invoke(ProviderFactory.java:165)
	at org.apache.maven.surefire.booter.ProviderFactory.invokeProvider(ProviderFactory.java:85)
	at org.apache.maven.surefire.booter.ForkedBooter.runSuitesInProcess(ForkedBooter.java:115)
	at org.apache.maven.surefire.booter.ForkedBooter.main(ForkedBooter.java:75)

Running org.eclipse.mdht.uml.cda.operations.OrganizerOperationsTest
Tests run: 4, Failures: 1, Errors: 0, Skipped: 0, Time elapsed: 0.001 sec <<< FAILURE!
org.eclipse.mdht.uml.cda.operations.OrganizerOperationsTest.testGetEntryRelationshipTargetsClinicalStatementIllegalArgumentException()  Time elapsed: 0.001 sec  <<< FAILURE!
java.lang.IllegalArgumentException: targetClass must be an EClass
	at org.eclipse.mdht.uml.cda.operations.ClinicalStatementOperations.getEntryRelationshipTargets(ClinicalStatementOperations.java:287)
	at org.eclipse.mdht.uml.cda.operations.ClinicalStatementOperationsTest.testGetEntryRelationshipTargetsClinicalStatementIllegalArgumentException(ClinicalStatementOperationsTest.java:92)
	at sun.reflect.NativeMethodAccessorImpl.invoke0(Native Method)
	at sun.reflect.NativeMethodAccessorImpl.invoke(NativeMethodAccessorImpl.java:62)
	at sun.reflect.DelegatingMethodAccessorImpl.invoke(DelegatingMethodAccessorImpl.java:43)
	at java.lang.reflect.Method.invoke(Method.java:498)
	at org.apache.maven.surefire.junit.PojoTestSet.executeTestMethod(PojoTestSet.java:151)
	at org.apache.maven.surefire.junit.PojoTestSet.executeTestMethods(PojoTestSet.java:102)
	at org.apache.maven.surefire.junit.PojoTestSet.execute(PojoTestSet.java:83)
	at org.apache.maven.surefire.junit.JUnit3Provider.executeTestSet(JUnit3Provider.java:121)
	at org.apache.maven.surefire.junit.JUnit3Provider.invoke(JUnit3Provider.java:98)
	at sun.reflect.NativeMethodAccessorImpl.invoke0(Native Method)
	at sun.reflect.NativeMethodAccessorImpl.invoke(NativeMethodAccessorImpl.java:62)
	at sun.reflect.DelegatingMethodAccessorImpl.invoke(DelegatingMethodAccessorImpl.java:43)
	at java.lang.reflect.Method.invoke(Method.java:498)
	at org.apache.maven.surefire.util.ReflectionUtils.invokeMethodWithArray(ReflectionUtils.java:189)
	at org.apache.maven.surefire.booter.ProviderFactory$ProviderProxy.invoke(ProviderFactory.java:165)
	at org.apache.maven.surefire.booter.ProviderFactory.invokeProvider(ProviderFactory.java:85)
	at org.apache.maven.surefire.booter.ForkedBooter.runSuitesInProcess(ForkedBooter.java:115)
	at org.apache.maven.surefire.booter.ForkedBooter.main(ForkedBooter.java:75)

Running org.eclipse.mdht.uml.cda.operations.Component4OperationsTest
Tests run: 1, Failures: 0, Errors: 0, Skipped: 0, Time elapsed: 0 sec
Running org.eclipse.mdht.uml.cda.operations.SubstanceAdministrationOperationsTest
Tests run: 4, Failures: 1, Errors: 0, Skipped: 0, Time elapsed: 0.001 sec <<< FAILURE!
org.eclipse.mdht.uml.cda.operations.SubstanceAdministrationOperationsTest.testGetEntryRelationshipTargetsClinicalStatementIllegalArgumentException()  Time elapsed: 0 sec  <<< FAILURE!
java.lang.IllegalArgumentException: targetClass must be an EClass
	at org.eclipse.mdht.uml.cda.operations.ClinicalStatementOperations.getEntryRelationshipTargets(ClinicalStatementOperations.java:287)
	at org.eclipse.mdht.uml.cda.operations.ClinicalStatementOperationsTest.testGetEntryRelationshipTargetsClinicalStatementIllegalArgumentException(ClinicalStatementOperationsTest.java:92)
	at sun.reflect.NativeMethodAccessorImpl.invoke0(Native Method)
	at sun.reflect.NativeMethodAccessorImpl.invoke(NativeMethodAccessorImpl.java:62)
	at sun.reflect.DelegatingMethodAccessorImpl.invoke(DelegatingMethodAccessorImpl.java:43)
	at java.lang.reflect.Method.invoke(Method.java:498)
	at org.apache.maven.surefire.junit.PojoTestSet.executeTestMethod(PojoTestSet.java:151)
	at org.apache.maven.surefire.junit.PojoTestSet.executeTestMethods(PojoTestSet.java:102)
	at org.apache.maven.surefire.junit.PojoTestSet.execute(PojoTestSet.java:83)
	at org.apache.maven.surefire.junit.JUnit3Provider.executeTestSet(JUnit3Provider.java:121)
	at org.apache.maven.surefire.junit.JUnit3Provider.invoke(JUnit3Provider.java:98)
	at sun.reflect.NativeMethodAccessorImpl.invoke0(Native Method)
	at sun.reflect.NativeMethodAccessorImpl.invoke(NativeMethodAccessorImpl.java:62)
	at sun.reflect.DelegatingMethodAccessorImpl.invoke(DelegatingMethodAccessorImpl.java:43)
	at java.lang.reflect.Method.invoke(Method.java:498)
	at org.apache.maven.surefire.util.ReflectionUtils.invokeMethodWithArray(ReflectionUtils.java:189)
	at org.apache.maven.surefire.booter.ProviderFactory$ProviderProxy.invoke(ProviderFactory.java:165)
	at org.apache.maven.surefire.booter.ProviderFactory.invokeProvider(ProviderFactory.java:85)
	at org.apache.maven.surefire.booter.ForkedBooter.runSuitesInProcess(ForkedBooter.java:115)
	at org.apache.maven.surefire.booter.ForkedBooter.main(ForkedBooter.java:75)

Running org.eclipse.mdht.uml.cda.operations.StrucDocTextOperationsTest
Tests run: 6, Failures: 1, Errors: 0, Skipped: 0, Time elapsed: 0.042 sec <<< FAILURE!
org.eclipse.mdht.uml.cda.operations.StrucDocTextOperationsTest.testAddTextNull()  Time elapsed: 0.042 sec  <<< FAILURE!
java.lang.IllegalArgumentException: text is null
	at org.eclipse.mdht.uml.cda.operations.StrucDocTextOperations.addText(StrucDocTextOperations.java:71)
	at org.eclipse.mdht.uml.cda.operations.StrucDocTextOperationsTest.testAddTextNull(StrucDocTextOperationsTest.java:53)

Running org.eclipse.mdht.uml.cda.operations.AssignedAuthorOperationsTest
Tests run: 1, Failures: 0, Errors: 0, Skipped: 0, Time elapsed: 0.002 sec
Running org.eclipse.mdht.uml.cda.operations.ObservationOperationsTest
Tests run: 4, Failures: 1, Errors: 0, Skipped: 0, Time elapsed: 0 sec <<< FAILURE!
org.eclipse.mdht.uml.cda.operations.ObservationOperationsTest.testGetEntryRelationshipTargetsClinicalStatementIllegalArgumentException()  Time elapsed: 0 sec  <<< FAILURE!
java.lang.IllegalArgumentException: targetClass must be an EClass
	at org.eclipse.mdht.uml.cda.operations.ClinicalStatementOperations.getEntryRelationshipTargets(ClinicalStatementOperations.java:287)
	at org.eclipse.mdht.uml.cda.operations.ClinicalStatementOperationsTest.testGetEntryRelationshipTargetsClinicalStatementIllegalArgumentException(ClinicalStatementOperationsTest.java:92)
	at sun.reflect.NativeMethodAccessorImpl.invoke0(Native Method)
	at sun.reflect.NativeMethodAccessorImpl.invoke(NativeMethodAccessorImpl.java:62)
	at sun.reflect.DelegatingMethodAccessorImpl.invoke(DelegatingMethodAccessorImpl.java:43)
	at java.lang.reflect.Method.invoke(Method.java:498)
	at org.apache.maven.surefire.junit.PojoTestSet.executeTestMethod(PojoTestSet.java:151)
	at org.apache.maven.surefire.junit.PojoTestSet.executeTestMethods(PojoTestSet.java:102)
	at org.apache.maven.surefire.junit.PojoTestSet.execute(PojoTestSet.java:83)
	at org.apache.maven.surefire.junit.JUnit3Provider.executeTestSet(JUnit3Provider.java:121)
	at org.apache.maven.surefire.junit.JUnit3Provider.invoke(JUnit3Provider.java:98)
	at sun.reflect.NativeMethodAccessorImpl.invoke0(Native Method)
	at sun.reflect.NativeMethodAccessorImpl.invoke(NativeMethodAccessorImpl.java:62)
	at sun.reflect.DelegatingMethodAccessorImpl.invoke(DelegatingMethodAccessorImpl.java:43)
	at java.lang.reflect.Method.invoke(Method.java:498)
	at org.apache.maven.surefire.util.ReflectionUtils.invokeMethodWithArray(ReflectionUtils.java:189)
	at org.apache.maven.surefire.booter.ProviderFactory$ProviderProxy.invoke(ProviderFactory.java:165)
	at org.apache.maven.surefire.booter.ProviderFactory.invokeProvider(ProviderFactory.java:85)
	at org.apache.maven.surefire.booter.ForkedBooter.runSuitesInProcess(ForkedBooter.java:115)
	at org.apache.maven.surefire.booter.ForkedBooter.main(ForkedBooter.java:75)

Running org.eclipse.mdht.uml.cda.operations.ClinicalDocumentOperationsTest
Tests run: 1, Failures: 0, Errors: 0, Skipped: 0, Time elapsed: 0 sec
Running org.eclipse.mdht.uml.cda.operations.ProcedureOperationsTest
Tests run: 4, Failures: 1, Errors: 0, Skipped: 0, Time elapsed: 0.001 sec <<< FAILURE!
org.eclipse.mdht.uml.cda.operations.ProcedureOperationsTest.testGetEntryRelationshipTargetsClinicalStatementIllegalArgumentException()  Time elapsed: 0.001 sec  <<< FAILURE!
java.lang.IllegalArgumentException: targetClass must be an EClass
	at org.eclipse.mdht.uml.cda.operations.ClinicalStatementOperations.getEntryRelationshipTargets(ClinicalStatementOperations.java:287)
	at org.eclipse.mdht.uml.cda.operations.ClinicalStatementOperationsTest.testGetEntryRelationshipTargetsClinicalStatementIllegalArgumentException(ClinicalStatementOperationsTest.java:92)
	at sun.reflect.NativeMethodAccessorImpl.invoke0(Native Method)
	at sun.reflect.NativeMethodAccessorImpl.invoke(NativeMethodAccessorImpl.java:62)
	at sun.reflect.DelegatingMethodAccessorImpl.invoke(DelegatingMethodAccessorImpl.java:43)
	at java.lang.reflect.Method.invoke(Method.java:498)
	at org.apache.maven.surefire.junit.PojoTestSet.executeTestMethod(PojoTestSet.java:151)
	at org.apache.maven.surefire.junit.PojoTestSet.executeTestMethods(PojoTestSet.java:102)
	at org.apache.maven.surefire.junit.PojoTestSet.execute(PojoTestSet.java:83)
	at org.apache.maven.surefire.junit.JUnit3Provider.executeTestSet(JUnit3Provider.java:121)
	at org.apache.maven.surefire.junit.JUnit3Provider.invoke(JUnit3Provider.java:98)
	at sun.reflect.NativeMethodAccessorImpl.invoke0(Native Method)
	at sun.reflect.NativeMethodAccessorImpl.invoke(NativeMethodAccessorImpl.java:62)
	at sun.reflect.DelegatingMethodAccessorImpl.invoke(DelegatingMethodAccessorImpl.java:43)
	at java.lang.reflect.Method.invoke(Method.java:498)
	at org.apache.maven.surefire.util.ReflectionUtils.invokeMethodWithArray(ReflectionUtils.java:189)
	at org.apache.maven.surefire.booter.ProviderFactory$ProviderProxy.invoke(ProviderFactory.java:165)
	at org.apache.maven.surefire.booter.ProviderFactory.invokeProvider(ProviderFactory.java:85)
	at org.apache.maven.surefire.booter.ForkedBooter.runSuitesInProcess(ForkedBooter.java:115)
	at org.apache.maven.surefire.booter.ForkedBooter.main(ForkedBooter.java:75)

Running org.eclipse.mdht.uml.cda.operations.EntryOperationsTest
Tests run: 1, Failures: 0, Errors: 0, Skipped: 0, Time elapsed: 0.001 sec
Running org.eclipse.mdht.uml.cda.operations.SupplyOperationsTest
Tests run: 4, Failures: 1, Errors: 0, Skipped: 0, Time elapsed: 0.001 sec <<< FAILURE!
org.eclipse.mdht.uml.cda.operations.SupplyOperationsTest.testGetEntryRelationshipTargetsClinicalStatementIllegalArgumentException()  Time elapsed: 0.001 sec  <<< FAILURE!
java.lang.IllegalArgumentException: targetClass must be an EClass
	at org.eclipse.mdht.uml.cda.operations.ClinicalStatementOperations.getEntryRelationshipTargets(ClinicalStatementOperations.java:287)
	at org.eclipse.mdht.uml.cda.operations.ClinicalStatementOperationsTest.testGetEntryRelationshipTargetsClinicalStatementIllegalArgumentException(ClinicalStatementOperationsTest.java:92)
	at sun.reflect.NativeMethodAccessorImpl.invoke0(Native Method)
	at sun.reflect.NativeMethodAccessorImpl.invoke(NativeMethodAccessorImpl.java:62)
	at sun.reflect.DelegatingMethodAccessorImpl.invoke(DelegatingMethodAccessorImpl.java:43)
	at java.lang.reflect.Method.invoke(Method.java:498)
	at org.apache.maven.surefire.junit.PojoTestSet.executeTestMethod(PojoTestSet.java:151)
	at org.apache.maven.surefire.junit.PojoTestSet.executeTestMethods(PojoTestSet.java:102)
	at org.apache.maven.surefire.junit.PojoTestSet.execute(PojoTestSet.java:83)
	at org.apache.maven.surefire.junit.JUnit3Provider.executeTestSet(JUnit3Provider.java:121)
	at org.apache.maven.surefire.junit.JUnit3Provider.invoke(JUnit3Provider.java:98)
	at sun.reflect.NativeMethodAccessorImpl.invoke0(Native Method)
	at sun.reflect.NativeMethodAccessorImpl.invoke(NativeMethodAccessorImpl.java:62)
	at sun.reflect.DelegatingMethodAccessorImpl.invoke(DelegatingMethodAccessorImpl.java:43)
	at java.lang.reflect.Method.invoke(Method.java:498)
	at org.apache.maven.surefire.util.ReflectionUtils.invokeMethodWithArray(ReflectionUtils.java:189)
	at org.apache.maven.surefire.booter.ProviderFactory$ProviderProxy.invoke(ProviderFactory.java:165)
	at org.apache.maven.surefire.booter.ProviderFactory.invokeProvider(ProviderFactory.java:85)
	at org.apache.maven.surefire.booter.ForkedBooter.runSuitesInProcess(ForkedBooter.java:115)
	at org.apache.maven.surefire.booter.ForkedBooter.main(ForkedBooter.java:75)

Running org.eclipse.mdht.uml.cda.operations.RegionOfInterestOperationsTest
Tests run: 4, Failures: 1, Errors: 0, Skipped: 0, Time elapsed: 0.002 sec <<< FAILURE!
org.eclipse.mdht.uml.cda.operations.RegionOfInterestOperationsTest.testGetEntryRelationshipTargetsClinicalStatementIllegalArgumentException()  Time elapsed: 0.002 sec  <<< FAILURE!
java.lang.IllegalArgumentException: targetClass must be an EClass
	at org.eclipse.mdht.uml.cda.operations.ClinicalStatementOperations.getEntryRelationshipTargets(ClinicalStatementOperations.java:287)
	at org.eclipse.mdht.uml.cda.operations.ClinicalStatementOperationsTest.testGetEntryRelationshipTargetsClinicalStatementIllegalArgumentException(ClinicalStatementOperationsTest.java:92)
	at sun.reflect.NativeMethodAccessorImpl.invoke0(Native Method)
	at sun.reflect.NativeMethodAccessorImpl.invoke(NativeMethodAccessorImpl.java:62)
	at sun.reflect.DelegatingMethodAccessorImpl.invoke(DelegatingMethodAccessorImpl.java:43)
	at java.lang.reflect.Method.invoke(Method.java:498)
	at org.apache.maven.surefire.junit.PojoTestSet.executeTestMethod(PojoTestSet.java:151)
	at org.apache.maven.surefire.junit.PojoTestSet.executeTestMethods(PojoTestSet.java:102)
	at org.apache.maven.surefire.junit.PojoTestSet.execute(PojoTestSet.java:83)
	at org.apache.maven.surefire.junit.JUnit3Provider.executeTestSet(JUnit3Provider.java:121)
	at org.apache.maven.surefire.junit.JUnit3Provider.invoke(JUnit3Provider.java:98)
	at sun.reflect.NativeMethodAccessorImpl.invoke0(Native Method)
	at sun.reflect.NativeMethodAccessorImpl.invoke(NativeMethodAccessorImpl.java:62)
	at sun.reflect.DelegatingMethodAccessorImpl.invoke(DelegatingMethodAccessorImpl.java:43)
	at java.lang.reflect.Method.invoke(Method.java:498)
	at org.apache.maven.surefire.util.ReflectionUtils.invokeMethodWithArray(ReflectionUtils.java:189)
	at org.apache.maven.surefire.booter.ProviderFactory$ProviderProxy.invoke(ProviderFactory.java:165)
	at org.apache.maven.surefire.booter.ProviderFactory.invokeProvider(ProviderFactory.java:85)
	at org.apache.maven.surefire.booter.ForkedBooter.runSuitesInProcess(ForkedBooter.java:115)
	at org.apache.maven.surefire.booter.ForkedBooter.main(ForkedBooter.java:75)

Running org.eclipse.mdht.uml.cda.operations.ActOperationsTest
Tests run: 4, Failures: 1, Errors: 0, Skipped: 0, Time elapsed: 0.001 sec <<< FAILURE!
org.eclipse.mdht.uml.cda.operations.ActOperationsTest.testGetEntryRelationshipTargetsClinicalStatementIllegalArgumentException()  Time elapsed: 0.001 sec  <<< FAILURE!
java.lang.IllegalArgumentException: targetClass must be an EClass
	at org.eclipse.mdht.uml.cda.operations.ClinicalStatementOperations.getEntryRelationshipTargets(ClinicalStatementOperations.java:287)
	at org.eclipse.mdht.uml.cda.operations.ClinicalStatementOperationsTest.testGetEntryRelationshipTargetsClinicalStatementIllegalArgumentException(ClinicalStatementOperationsTest.java:92)
	at sun.reflect.NativeMethodAccessorImpl.invoke0(Native Method)
	at sun.reflect.NativeMethodAccessorImpl.invoke(NativeMethodAccessorImpl.java:62)
	at sun.reflect.DelegatingMethodAccessorImpl.invoke(DelegatingMethodAccessorImpl.java:43)
	at java.lang.reflect.Method.invoke(Method.java:498)
	at org.apache.maven.surefire.junit.PojoTestSet.executeTestMethod(PojoTestSet.java:151)
	at org.apache.maven.surefire.junit.PojoTestSet.executeTestMethods(PojoTestSet.java:102)
	at org.apache.maven.surefire.junit.PojoTestSet.execute(PojoTestSet.java:83)
	at org.apache.maven.surefire.junit.JUnit3Provider.executeTestSet(JUnit3Provider.java:121)
	at org.apache.maven.surefire.junit.JUnit3Provider.invoke(JUnit3Provider.java:98)
	at sun.reflect.NativeMethodAccessorImpl.invoke0(Native Method)
	at sun.reflect.NativeMethodAccessorImpl.invoke(NativeMethodAccessorImpl.java:62)
	at sun.reflect.DelegatingMethodAccessorImpl.invoke(DelegatingMethodAccessorImpl.java:43)
	at java.lang.reflect.Method.invoke(Method.java:498)
	at org.apache.maven.surefire.util.ReflectionUtils.invokeMethodWithArray(ReflectionUtils.java:189)
	at org.apache.maven.surefire.booter.ProviderFactory$ProviderProxy.invoke(ProviderFactory.java:165)
	at org.apache.maven.surefire.booter.ProviderFactory.invokeProvider(ProviderFactory.java:85)
	at org.apache.maven.surefire.booter.ForkedBooter.runSuitesInProcess(ForkedBooter.java:115)
	at org.apache.maven.surefire.booter.ForkedBooter.main(ForkedBooter.java:75)

Running org.eclipse.mdht.uml.cda.operations.Component2OperationsTest
Tests run: 1, Failures: 0, Errors: 0, Skipped: 0, Time elapsed: 0 sec
Running org.eclipse.mdht.uml.cda.operations.ManufacturedProductOperationsTest
Tests run: 1, Failures: 0, Errors: 0, Skipped: 0, Time elapsed: 0.001 sec
Running org.eclipse.mdht.uml.cda.operations.SectionOperationsTest
Tests run: 1, Failures: 0, Errors: 0, Skipped: 0, Time elapsed: 0 sec
Running org.eclipse.mdht.uml.cda.operations.ReferenceOperationsTest
Tests run: 1, Failures: 0, Errors: 0, Skipped: 0, Time elapsed: 0.033 sec
Running org.eclipse.mdht.uml.cda.operations.ParticipantRoleOperationsTest
Tests run: 1, Failures: 0, Errors: 0, Skipped: 0, Time elapsed: 0 sec
Running org.eclipse.mdht.uml.cda.operations.GuardianOperationsTest
Tests run: 1, Failures: 0, Errors: 0, Skipped: 0, Time elapsed: 0.001 sec
Running org.eclipse.mdht.uml.cda.operations.ObservationMediaOperationsTest
Tests run: 4, Failures: 1, Errors: 0, Skipped: 0, Time elapsed: 0.002 sec <<< FAILURE!
org.eclipse.mdht.uml.cda.operations.ObservationMediaOperationsTest.testGetEntryRelationshipTargetsClinicalStatementIllegalArgumentException()  Time elapsed: 0.002 sec  <<< FAILURE!
java.lang.IllegalArgumentException: targetClass must be an EClass
	at org.eclipse.mdht.uml.cda.operations.ClinicalStatementOperations.getEntryRelationshipTargets(ClinicalStatementOperations.java:287)
	at org.eclipse.mdht.uml.cda.operations.ClinicalStatementOperationsTest.testGetEntryRelationshipTargetsClinicalStatementIllegalArgumentException(ClinicalStatementOperationsTest.java:92)
	at sun.reflect.NativeMethodAccessorImpl.invoke0(Native Method)
	at sun.reflect.NativeMethodAccessorImpl.invoke(NativeMethodAccessorImpl.java:62)
	at sun.reflect.DelegatingMethodAccessorImpl.invoke(DelegatingMethodAccessorImpl.java:43)
	at java.lang.reflect.Method.invoke(Method.java:498)
	at org.apache.maven.surefire.junit.PojoTestSet.executeTestMethod(PojoTestSet.java:151)
	at org.apache.maven.surefire.junit.PojoTestSet.executeTestMethods(PojoTestSet.java:102)
	at org.apache.maven.surefire.junit.PojoTestSet.execute(PojoTestSet.java:83)
	at org.apache.maven.surefire.junit.JUnit3Provider.executeTestSet(JUnit3Provider.java:121)
	at org.apache.maven.surefire.junit.JUnit3Provider.invoke(JUnit3Provider.java:98)
	at sun.reflect.NativeMethodAccessorImpl.invoke0(Native Method)
	at sun.reflect.NativeMethodAccessorImpl.invoke(NativeMethodAccessorImpl.java:62)
	at sun.reflect.DelegatingMethodAccessorImpl.invoke(DelegatingMethodAccessorImpl.java:43)
	at java.lang.reflect.Method.invoke(Method.java:498)
	at org.apache.maven.surefire.util.ReflectionUtils.invokeMethodWithArray(ReflectionUtils.java:189)
	at org.apache.maven.surefire.booter.ProviderFactory$ProviderProxy.invoke(ProviderFactory.java:165)
	at org.apache.maven.surefire.booter.ProviderFactory.invokeProvider(ProviderFactory.java:85)
	at org.apache.maven.surefire.booter.ForkedBooter.runSuitesInProcess(ForkedBooter.java:115)
	at org.apache.maven.surefire.booter.ForkedBooter.main(ForkedBooter.java:75)

Running org.eclipse.mdht.uml.cda.operations.Informant12OperationsTest
Tests run: 1, Failures: 0, Errors: 0, Skipped: 0, Time elapsed: 0.001 sec

Results :

Failed tests:   org.eclipse.mdht.uml.cda.operations.EncounterOperationsTest.testGetEntryRelationshipTargetsClinicalStatementIllegalArgumentException(): targetClass must be an EClass
  org.eclipse.mdht.uml.cda.operations.OrganizerOperationsTest.testGetEntryRelationshipTargetsClinicalStatementIllegalArgumentException(): targetClass must be an EClass
  org.eclipse.mdht.uml.cda.operations.SubstanceAdministrationOperationsTest.testGetEntryRelationshipTargetsClinicalStatementIllegalArgumentException(): targetClass must be an EClass
  org.eclipse.mdht.uml.cda.operations.StrucDocTextOperationsTest.testAddTextNull(): text is null
  org.eclipse.mdht.uml.cda.operations.ObservationOperationsTest.testGetEntryRelationshipTargetsClinicalStatementIllegalArgumentException(): targetClass must be an EClass
  org.eclipse.mdht.uml.cda.operations.ProcedureOperationsTest.testGetEntryRelationshipTargetsClinicalStatementIllegalArgumentException(): targetClass must be an EClass
  org.eclipse.mdht.uml.cda.operations.SupplyOperationsTest.testGetEntryRelationshipTargetsClinicalStatementIllegalArgumentException(): targetClass must be an EClass
  org.eclipse.mdht.uml.cda.operations.RegionOfInterestOperationsTest.testGetEntryRelationshipTargetsClinicalStatementIllegalArgumentException(): targetClass must be an EClass
  org.eclipse.mdht.uml.cda.operations.ActOperationsTest.testGetEntryRelationshipTargetsClinicalStatementIllegalArgumentException(): targetClass must be an EClass
  org.eclipse.mdht.uml.cda.operations.ObservationMediaOperationsTest.testGetEntryRelationshipTargetsClinicalStatementIllegalArgumentException(): targetClass must be an EClass

Tests run: 68, Failures: 10, Errors: 0, Skipped: 0

[ERROR] There are test failures.

Please refer to /home/jenkins/agent/workspace/MDHT-master/cda/tests/org.eclipse.mdht.uml.cda.test/target/surefire-reports for the individual test results.
[INFO] 
[INFO] --- maven-antrun-plugin:1.7:run (test-reports) @ org.eclipse.mdht.uml.cda.test ---
Downloading: https://repo.eclipse.org/content/repositories/cbi-releases/ant/ant-junit/1.6.2/ant-junit-1.6.2.pom
           
Downloading: https://repo.eclipse.org/content/repositories/mylyn/ant/ant-junit/1.6.2/ant-junit-1.6.2.pom
           
Downloading: https://repo.eclipse.org/content/repositories/maven_central/ant/ant-junit/1.6.2/ant-junit-1.6.2.pom
146/146 B   
            
Downloaded: https://repo.eclipse.org/content/repositories/maven_central/ant/ant-junit/1.6.2/ant-junit-1.6.2.pom (146 B at 0.4 KB/sec)
Downloading: https://repo.eclipse.org/content/repositories/cbi-releases/org/apache/maven/maven-plugin-api/2.0.11/maven-plugin-api-2.0.11.pom
            
Downloading: https://repo.eclipse.org/content/repositories/mylyn/org/apache/maven/maven-plugin-api/2.0.11/maven-plugin-api-2.0.11.pom
            
Downloading: https://repo.eclipse.org/content/repositories/maven_central/org/apache/maven/maven-plugin-api/2.0.11/maven-plugin-api-2.0.11.pom
2/2 KB      
         
Downloaded: https://repo.eclipse.org/content/repositories/maven_central/org/apache/maven/maven-plugin-api/2.0.11/maven-plugin-api-2.0.11.pom (2 KB at 36.6 KB/sec)
Downloading: https://repo.eclipse.org/content/repositories/cbi-releases/org/apache/maven/maven/2.0.11/maven-2.0.11.pom
         
Downloading: https://repo.eclipse.org/content/repositories/mylyn/org/apache/maven/maven/2.0.11/maven-2.0.11.pom
         
Downloading: https://repo.eclipse.org/content/repositories/maven_central/org/apache/maven/maven/2.0.11/maven-2.0.11.pom
4/22 KB   
8/22 KB   
12/22 KB   
16/22 KB   
20/22 KB   
22/22 KB   
           
Downloaded: https://repo.eclipse.org/content/repositories/maven_central/org/apache/maven/maven/2.0.11/maven-2.0.11.pom (22 KB at 533.1 KB/sec)
Downloading: https://repo.eclipse.org/content/repositories/cbi-releases/org/apache/maven/maven-parent/12/maven-parent-12.pom
           
Downloading: https://repo.eclipse.org/content/repositories/mylyn/org/apache/maven/maven-parent/12/maven-parent-12.pom
           
Downloading: https://repo.eclipse.org/content/repositories/maven_central/org/apache/maven/maven-parent/12/maven-parent-12.pom
4/22 KB    
8/22 KB   
12/22 KB   
16/22 KB   
20/22 KB   
22/22 KB   
           
Downloaded: https://repo.eclipse.org/content/repositories/maven_central/org/apache/maven/maven-parent/12/maven-parent-12.pom (22 KB at 517.8 KB/sec)
Downloading: https://repo.eclipse.org/content/repositories/cbi-releases/org/apache/maven/maven-project/2.0.11/maven-project-2.0.11.pom
           
Downloading: https://repo.eclipse.org/content/repositories/mylyn/org/apache/maven/maven-project/2.0.11/maven-project-2.0.11.pom
           
Downloading: https://repo.eclipse.org/content/repositories/maven_central/org/apache/maven/maven-project/2.0.11/maven-project-2.0.11.pom
3/3 KB     
         
Downloaded: https://repo.eclipse.org/content/repositories/maven_central/org/apache/maven/maven-project/2.0.11/maven-project-2.0.11.pom (3 KB at 73.3 KB/sec)
Downloading: https://repo.eclipse.org/content/repositories/cbi-releases/org/apache/maven/maven-settings/2.0.11/maven-settings-2.0.11.pom
         
Downloading: https://repo.eclipse.org/content/repositories/mylyn/org/apache/maven/maven-settings/2.0.11/maven-settings-2.0.11.pom
         
Downloading: https://repo.eclipse.org/content/repositories/maven_central/org/apache/maven/maven-settings/2.0.11/maven-settings-2.0.11.pom
3/3 KB   
         
Downloaded: https://repo.eclipse.org/content/repositories/maven_central/org/apache/maven/maven-settings/2.0.11/maven-settings-2.0.11.pom (3 KB at 49.6 KB/sec)
Downloading: https://repo.eclipse.org/content/repositories/cbi-releases/org/apache/maven/maven-model/2.0.11/maven-model-2.0.11.pom
         
Downloading: https://repo.eclipse.org/content/repositories/mylyn/org/apache/maven/maven-model/2.0.11/maven-model-2.0.11.pom
         
Downloading: https://repo.eclipse.org/content/repositories/maven_central/org/apache/maven/maven-model/2.0.11/maven-model-2.0.11.pom
4/4 KB   
         
Downloaded: https://repo.eclipse.org/content/repositories/maven_central/org/apache/maven/maven-model/2.0.11/maven-model-2.0.11.pom (4 KB at 77.3 KB/sec)
Downloading: https://repo.eclipse.org/content/repositories/cbi-releases/org/codehaus/plexus/plexus-utils/1.5.6/plexus-utils-1.5.6.pom
         
Downloading: https://repo.eclipse.org/content/repositories/mylyn/org/codehaus/plexus/plexus-utils/1.5.6/plexus-utils-1.5.6.pom
         
Downloading: https://repo.eclipse.org/content/repositories/maven_central/org/codehaus/plexus/plexus-utils/1.5.6/plexus-utils-1.5.6.pom
4/6 KB   
6/6 KB   
         
Downloaded: https://repo.eclipse.org/content/repositories/maven_central/org/codehaus/plexus/plexus-utils/1.5.6/plexus-utils-1.5.6.pom (6 KB at 161.8 KB/sec)
Downloading: https://repo.eclipse.org/content/repositories/cbi-releases/org/codehaus/plexus/plexus/1.0.12/plexus-1.0.12.pom
         
Downloading: https://repo.eclipse.org/content/repositories/mylyn/org/codehaus/plexus/plexus/1.0.12/plexus-1.0.12.pom
         
Downloading: https://repo.eclipse.org/content/repositories/maven_central/org/codehaus/plexus/plexus/1.0.12/plexus-1.0.12.pom
4/10 KB   
8/10 KB   
10/10 KB   
           
Downloaded: https://repo.eclipse.org/content/repositories/maven_central/org/codehaus/plexus/plexus/1.0.12/plexus-1.0.12.pom (10 KB at 308.7 KB/sec)
Downloading: https://repo.eclipse.org/content/repositories/cbi-releases/org/codehaus/plexus/plexus-interpolation/1.1/plexus-interpolation-1.1.pom
           
Downloading: https://repo.eclipse.org/content/repositories/mylyn/org/codehaus/plexus/plexus-interpolation/1.1/plexus-interpolation-1.1.pom
           
Downloading: https://repo.eclipse.org/content/repositories/maven_central/org/codehaus/plexus/plexus-interpolation/1.1/plexus-interpolation-1.1.pom
2/2 KB     
         
Downloaded: https://repo.eclipse.org/content/repositories/maven_central/org/codehaus/plexus/plexus-interpolation/1.1/plexus-interpolation-1.1.pom (2 KB at 46.8 KB/sec)
Downloading: https://repo.eclipse.org/content/repositories/cbi-releases/org/apache/maven/maven-profile/2.0.11/maven-profile-2.0.11.pom
         
Downloading: https://repo.eclipse.org/content/repositories/mylyn/org/apache/maven/maven-profile/2.0.11/maven-profile-2.0.11.pom
         
Downloading: https://repo.eclipse.org/content/repositories/maven_central/org/apache/maven/maven-profile/2.0.11/maven-profile-2.0.11.pom
2/2 KB   
         
Downloaded: https://repo.eclipse.org/content/repositories/maven_central/org/apache/maven/maven-profile/2.0.11/maven-profile-2.0.11.pom (2 KB at 51.2 KB/sec)
Downloading: https://repo.eclipse.org/content/repositories/cbi-releases/org/apache/maven/maven-artifact-manager/2.0.11/maven-artifact-manager-2.0.11.pom
         
Downloading: https://repo.eclipse.org/content/repositories/mylyn/org/apache/maven/maven-artifact-manager/2.0.11/maven-artifact-manager-2.0.11.pom
         
Downloading: https://repo.eclipse.org/content/repositories/maven_central/org/apache/maven/maven-artifact-manager/2.0.11/maven-artifact-manager-2.0.11.pom
3/3 KB   
         
Downloaded: https://repo.eclipse.org/content/repositories/maven_central/org/apache/maven/maven-artifact-manager/2.0.11/maven-artifact-manager-2.0.11.pom (3 KB at 65.9 KB/sec)
Downloading: https://repo.eclipse.org/content/repositories/cbi-releases/org/apache/maven/maven-repository-metadata/2.0.11/maven-repository-metadata-2.0.11.pom
         
Downloading: https://repo.eclipse.org/content/repositories/mylyn/org/apache/maven/maven-repository-metadata/2.0.11/maven-repository-metadata-2.0.11.pom
         
Downloading: https://repo.eclipse.org/content/repositories/maven_central/org/apache/maven/maven-repository-metadata/2.0.11/maven-repository-metadata-2.0.11.pom
3/3 KB   
         
Downloaded: https://repo.eclipse.org/content/repositories/maven_central/org/apache/maven/maven-repository-metadata/2.0.11/maven-repository-metadata-2.0.11.pom (3 KB at 56.5 KB/sec)
Downloading: https://repo.eclipse.org/content/repositories/cbi-releases/org/apache/maven/maven-artifact/2.0.11/maven-artifact-2.0.11.pom
         
Downloading: https://repo.eclipse.org/content/repositories/mylyn/org/apache/maven/maven-artifact/2.0.11/maven-artifact-2.0.11.pom
         
Downloading: https://repo.eclipse.org/content/repositories/maven_central/org/apache/maven/maven-artifact/2.0.11/maven-artifact-2.0.11.pom
2/2 KB   
         
Downloaded: https://repo.eclipse.org/content/repositories/maven_central/org/apache/maven/maven-artifact/2.0.11/maven-artifact-2.0.11.pom (2 KB at 40.7 KB/sec)
Downloading: https://repo.eclipse.org/content/repositories/cbi-releases/org/apache/maven/maven-plugin-registry/2.0.11/maven-plugin-registry-2.0.11.pom
         
Downloading: https://repo.eclipse.org/content/repositories/mylyn/org/apache/maven/maven-plugin-registry/2.0.11/maven-plugin-registry-2.0.11.pom
         
Downloading: https://repo.eclipse.org/content/repositories/maven_central/org/apache/maven/maven-plugin-registry/2.0.11/maven-plugin-registry-2.0.11.pom
2/2 KB   
         
Downloaded: https://repo.eclipse.org/content/repositories/maven_central/org/apache/maven/maven-plugin-registry/2.0.11/maven-plugin-registry-2.0.11.pom (2 KB at 44.9 KB/sec)
Downloading: https://repo.eclipse.org/content/repositories/cbi-releases/org/apache/ant/ant/1.8.2/ant-1.8.2.pom
         
Downloading: https://repo.eclipse.org/content/repositories/mylyn/org/apache/ant/ant/1.8.2/ant-1.8.2.pom
         
Downloading: https://repo.eclipse.org/content/repositories/maven_central/org/apache/ant/ant/1.8.2/ant-1.8.2.pom
4/10 KB   
8/10 KB   
10/10 KB   
           
Downloaded: https://repo.eclipse.org/content/repositories/maven_central/org/apache/ant/ant/1.8.2/ant-1.8.2.pom (10 KB at 235.2 KB/sec)
Downloading: https://repo.eclipse.org/content/repositories/cbi-releases/org/apache/ant/ant-parent/1.8.2/ant-parent-1.8.2.pom
           
Downloading: https://repo.eclipse.org/content/repositories/mylyn/org/apache/ant/ant-parent/1.8.2/ant-parent-1.8.2.pom
           
Downloading: https://repo.eclipse.org/content/repositories/maven_central/org/apache/ant/ant-parent/1.8.2/ant-parent-1.8.2.pom
4/5 KB     
5/5 KB   
         
Downloaded: https://repo.eclipse.org/content/repositories/maven_central/org/apache/ant/ant-parent/1.8.2/ant-parent-1.8.2.pom (5 KB at 117.4 KB/sec)
Downloading: https://repo.eclipse.org/content/repositories/cbi-releases/org/apache/ant/ant-launcher/1.8.2/ant-launcher-1.8.2.pom
         
Downloading: https://repo.eclipse.org/content/repositories/mylyn/org/apache/ant/ant-launcher/1.8.2/ant-launcher-1.8.2.pom
         
Downloading: https://repo.eclipse.org/content/repositories/maven_central/org/apache/ant/ant-launcher/1.8.2/ant-launcher-1.8.2.pom
3/3 KB   
         
Downloaded: https://repo.eclipse.org/content/repositories/maven_central/org/apache/ant/ant-launcher/1.8.2/ant-launcher-1.8.2.pom (3 KB at 60.6 KB/sec)
Downloading: https://repo.eclipse.org/content/repositories/cbi-releases/ant/ant-junit/1.6.2/ant-junit-1.6.2.jar
Downloading: https://repo.eclipse.org/content/repositories/cbi-releases/org/codehaus/plexus/plexus-interpolation/1.1/plexus-interpolation-1.1.jar
Downloading: https://repo.eclipse.org/content/repositories/cbi-releases/org/apache/ant/ant/1.8.2/ant-1.8.2.jar
Downloading: https://repo.eclipse.org/content/repositories/cbi-releases/org/apache/ant/ant-launcher/1.8.2/ant-launcher-1.8.2.jar
         
         
         
         
Downloading: https://repo.eclipse.org/content/repositories/mylyn/ant/ant-junit/1.6.2/ant-junit-1.6.2.jar
Downloading: https://repo.eclipse.org/content/repositories/mylyn/org/codehaus/plexus/plexus-interpolation/1.1/plexus-interpolation-1.1.jar
Downloading: https://repo.eclipse.org/content/repositories/mylyn/org/apache/ant/ant/1.8.2/ant-1.8.2.jar
Downloading: https://repo.eclipse.org/content/repositories/mylyn/org/apache/ant/ant-launcher/1.8.2/ant-launcher-1.8.2.jar
         
         
         
         
Downloading: https://repo.eclipse.org/content/repositories/maven_central/ant/ant-junit/1.6.2/ant-junit-1.6.2.jar
Downloading: https://repo.eclipse.org/content/repositories/maven_central/org/codehaus/plexus/plexus-interpolation/1.1/plexus-interpolation-1.1.jar
Downloading: https://repo.eclipse.org/content/repositories/maven_central/org/apache/ant/ant/1.8.2/ant-1.8.2.jar
Downloading: https://repo.eclipse.org/content/repositories/maven_central/org/apache/ant/ant-launcher/1.8.2/ant-launcher-1.8.2.jar
4/1889 KB   
8/1889 KB   
12/1889 KB   
16/1889 KB   
4/13 KB   16/1889 KB   
8/13 KB   16/1889 KB   
8/13 KB   20/1889 KB   
8/13 KB   24/1889 KB   
12/13 KB   24/1889 KB   
13/13 KB   24/1889 KB   
13/13 KB   28/1889 KB   
13/13 KB   31/1889 KB   
13/13 KB   35/1889 KB   
13/13 KB   39/1889 KB   
13/13 KB   43/1889 KB   
13/13 KB   47/1889 KB   
13/13 KB   51/1889 KB   
13/13 KB   55/1889 KB   
13/13 KB   59/1889 KB   
13/13 KB   63/1889 KB   
13/13 KB   67/1889 KB   
13/13 KB   70/1889 KB   
13/13 KB   74/1889 KB   
13/13 KB   78/1889 KB   
13/13 KB   82/1889 KB   
13/13 KB   86/1889 KB   
13/13 KB   4/35 KB   86/1889 KB   
13/13 KB   8/35 KB   86/1889 KB   
13/13 KB   8/35 KB   90/1889 KB   
13/13 KB   8/35 KB   94/1889 KB   
13/13 KB   12/35 KB   94/1889 KB   
13/13 KB   16/35 KB   94/1889 KB   
13/13 KB   16/35 KB   98/1889 KB   
13/13 KB   16/35 KB   102/1889 KB   
13/13 KB   20/35 KB   102/1889 KB   
13/13 KB   24/35 KB   102/1889 KB   
13/13 KB   24/35 KB   106/1889 KB   
13/13 KB   28/35 KB   106/1889 KB   
13/13 KB   28/35 KB   110/1889 KB   
13/13 KB   31/35 KB   110/1889 KB   
13/13 KB   35/35 KB   110/1889 KB   
13/13 KB   35/35 KB   114/1889 KB   
13/13 KB   35/35 KB   117/1889 KB   
13/13 KB   35/35 KB   121/1889 KB   
13/13 KB   35/35 KB   125/1889 KB   
13/13 KB   35/35 KB   129/1889 KB   
13/13 KB   35/35 KB   133/1889 KB   
13/13 KB   35/35 KB   137/1889 KB   
13/13 KB   35/35 KB   141/1889 KB   
13/13 KB   35/35 KB   145/1889 KB   
13/13 KB   35/35 KB   149/1889 KB   
                                    
Downloaded: https://repo.eclipse.org/content/repositories/maven_central/org/apache/ant/ant-launcher/1.8.2/ant-launcher-1.8.2.jar (13 KB at 273.5 KB/sec)
35/35 KB   153/1889 KB              
35/35 KB   156/1889 KB   
35/35 KB   160/1889 KB   
35/35 KB   164/1889 KB   
35/35 KB   168/1889 KB   
35/35 KB   172/1889 KB   
35/35 KB   176/1889 KB   
35/35 KB   180/1889 KB   
35/35 KB   184/1889 KB   
35/35 KB   188/1889 KB   
35/35 KB   192/1889 KB   
35/35 KB   195/1889 KB   
35/35 KB   199/1889 KB   
35/35 KB   203/1889 KB   
35/35 KB   207/1889 KB   
35/35 KB   211/1889 KB   
35/35 KB   215/1889 KB   
35/35 KB   219/1889 KB   
35/35 KB   223/1889 KB   
35/35 KB   227/1889 KB   
35/35 KB   231/1889 KB   
35/35 KB   235/1889 KB   
35/35 KB   239/1889 KB   
35/35 KB   242/1889 KB   
35/35 KB   246/1889 KB   
35/35 KB   250/1889 KB   
35/35 KB   254/1889 KB   
35/35 KB   258/1889 KB   
35/35 KB   262/1889 KB   
35/35 KB   266/1889 KB   
35/35 KB   270/1889 KB   
35/35 KB   274/1889 KB   
35/35 KB   278/1889 KB   
35/35 KB   281/1889 KB   
35/35 KB   285/1889 KB   
                         
289/1889 KB              
Downloaded: https://repo.eclipse.org/content/repositories/maven_central/org/codehaus/plexus/plexus-interpolation/1.1/plexus-interpolation-1.1.jar (35 KB at 679.4 KB/sec)
293/1889 KB   
297/1889 KB   
301/1889 KB   
305/1889 KB   
309/1889 KB   
313/1889 KB   
317/1889 KB   
320/1889 KB   
324/1889 KB   
328/1889 KB   
332/1889 KB   
336/1889 KB   
340/1889 KB   
344/1889 KB   
348/1889 KB   
352/1889 KB   
356/1889 KB   
360/1889 KB   
364/1889 KB   
367/1889 KB   
371/1889 KB   
375/1889 KB   
379/1889 KB   
383/1889 KB   
387/1889 KB   
391/1889 KB   
395/1889 KB   
399/1889 KB   
403/1889 KB   
406/1889 KB   
410/1889 KB   
414/1889 KB   
418/1889 KB   
422/1889 KB   
426/1889 KB   
430/1889 KB   
434/1889 KB   
438/1889 KB   
442/1889 KB   
445/1889 KB   
449/1889 KB   
453/1889 KB   
457/1889 KB   
461/1889 KB   
465/1889 KB   
469/1889 KB   
473/1889 KB   
477/1889 KB   
481/1889 KB   
485/1889 KB   
489/1889 KB   
492/1889 KB   
496/1889 KB   
500/1889 KB   
504/1889 KB   
508/1889 KB   
512/1889 KB   
516/1889 KB   
520/1889 KB   
524/1889 KB   
528/1889 KB   
531/1889 KB   
535/1889 KB   
539/1889 KB   
543/1889 KB   
547/1889 KB   
551/1889 KB   
555/1889 KB   
559/1889 KB   
563/1889 KB   
567/1889 KB   
570/1889 KB   
574/1889 KB   
578/1889 KB   
582/1889 KB   
586/1889 KB   
590/1889 KB   
594/1889 KB   
598/1889 KB   
602/1889 KB   
606/1889 KB   
610/1889 KB   
614/1889 KB   
617/1889 KB   
621/1889 KB   
625/1889 KB   
629/1889 KB   
633/1889 KB   
637/1889 KB   
641/1889 KB   
645/1889 KB   
649/1889 KB   
653/1889 KB   
656/1889 KB   
660/1889 KB   
664/1889 KB   
668/1889 KB   
672/1889 KB   
676/1889 KB   
680/1889 KB   
684/1889 KB   
688/1889 KB   
692/1889 KB   
695/1889 KB   
699/1889 KB   
703/1889 KB   
707/1889 KB   
711/1889 KB   
715/1889 KB   
719/1889 KB   
723/1889 KB   
727/1889 KB   
731/1889 KB   
735/1889 KB   
739/1889 KB   
742/1889 KB   
746/1889 KB   
750/1889 KB   
754/1889 KB   
758/1889 KB   
762/1889 KB   
766/1889 KB   
770/1889 KB   
774/1889 KB   
778/1889 KB   
781/1889 KB   
785/1889 KB   
789/1889 KB   
793/1889 KB   
797/1889 KB   
801/1889 KB   
805/1889 KB   
809/1889 KB   
813/1889 KB   
817/1889 KB   
820/1889 KB   
824/1889 KB   
828/1889 KB   
832/1889 KB   
836/1889 KB   
840/1889 KB   
844/1889 KB   
848/1889 KB   
852/1889 KB   
856/1889 KB   
860/1889 KB   
864/1889 KB   
867/1889 KB   
871/1889 KB   
875/1889 KB   
879/1889 KB   
883/1889 KB   
887/1889 KB   
891/1889 KB   
895/1889 KB   
899/1889 KB   
903/1889 KB   
906/1889 KB   
910/1889 KB   
914/1889 KB   
918/1889 KB   
922/1889 KB   
926/1889 KB   
930/1889 KB   
934/1889 KB   
938/1889 KB   
942/1889 KB   
945/1889 KB   
949/1889 KB   
953/1889 KB   
957/1889 KB   
961/1889 KB   
965/1889 KB   
969/1889 KB   
973/1889 KB   
977/1889 KB   
981/1889 KB   
985/1889 KB   
989/1889 KB   
992/1889 KB   
996/1889 KB   
1000/1889 KB   
1004/1889 KB   
1008/1889 KB   
1012/1889 KB   
1016/1889 KB   
1020/1889 KB   
1024/1889 KB   
1028/1889 KB   
1031/1889 KB   
1035/1889 KB   
1039/1889 KB   
1043/1889 KB   
1047/1889 KB   
1051/1889 KB   
1055/1889 KB   
1059/1889 KB   
1063/1889 KB   
1067/1889 KB   
1070/1889 KB   
1074/1889 KB   
1078/1889 KB   
1082/1889 KB   
1086/1889 KB   
1090/1889 KB   
1094/1889 KB   
1098/1889 KB   
1102/1889 KB   
1106/1889 KB   
1110/1889 KB   
1114/1889 KB   
1117/1889 KB   
1121/1889 KB   
1125/1889 KB   
1129/1889 KB   
1133/1889 KB   
1137/1889 KB   
1141/1889 KB   
1145/1889 KB   
1149/1889 KB   
1153/1889 KB   
1156/1889 KB   
1160/1889 KB   
1164/1889 KB   
1168/1889 KB   
1172/1889 KB   
1176/1889 KB   
1180/1889 KB   
1184/1889 KB   
1188/1889 KB   
1192/1889 KB   
1195/1889 KB   
1199/1889 KB   
1203/1889 KB   
1207/1889 KB   
1211/1889 KB   
1215/1889 KB   
1219/1889 KB   
1223/1889 KB   
1227/1889 KB   
1231/1889 KB   
4/72 KB   1231/1889 KB   
4/72 KB   1235/1889 KB   
8/72 KB   1235/1889 KB   
8/72 KB   1239/1889 KB   
8/72 KB   1242/1889 KB   
12/72 KB   1242/1889 KB   
16/72 KB   1242/1889 KB   
16/72 KB   1246/1889 KB   
16/72 KB   1250/1889 KB   
20/72 KB   1250/1889 KB   
24/72 KB   1250/1889 KB   
24/72 KB   1254/1889 KB   
24/72 KB   1258/1889 KB   
28/72 KB   1258/1889 KB   
28/72 KB   1262/1889 KB   
31/72 KB   1262/1889 KB   
31/72 KB   1266/1889 KB   
35/72 KB   1266/1889 KB   
35/72 KB   1270/1889 KB   
39/72 KB   1270/1889 KB   
39/72 KB   1274/1889 KB   
39/72 KB   1278/1889 KB   
43/72 KB   1278/1889 KB   
43/72 KB   1281/1889 KB   
47/72 KB   1281/1889 KB   
47/72 KB   1285/1889 KB   
51/72 KB   1285/1889 KB   
51/72 KB   1289/1889 KB   
55/72 KB   1289/1889 KB   
55/72 KB   1293/1889 KB   
59/72 KB   1293/1889 KB   
59/72 KB   1297/1889 KB   
63/72 KB   1297/1889 KB   
63/72 KB   1301/1889 KB   
67/72 KB   1301/1889 KB   
67/72 KB   1305/1889 KB   
70/72 KB   1305/1889 KB   
72/72 KB   1305/1889 KB   
72/72 KB   1309/1889 KB   
72/72 KB   1313/1889 KB   
72/72 KB   1317/1889 KB   
72/72 KB   1320/1889 KB   
72/72 KB   1324/1889 KB   
72/72 KB   1328/1889 KB   
72/72 KB   1332/1889 KB   
72/72 KB   1336/1889 KB   
72/72 KB   1340/1889 KB   
72/72 KB   1344/1889 KB   
72/72 KB   1348/1889 KB   
72/72 KB   1352/1889 KB   
72/72 KB   1356/1889 KB   
72/72 KB   1360/1889 KB   
72/72 KB   1364/1889 KB   
72/72 KB   1367/1889 KB   
72/72 KB   1371/1889 KB   
72/72 KB   1375/1889 KB   
72/72 KB   1379/1889 KB   
72/72 KB   1383/1889 KB   
72/72 KB   1387/1889 KB   
72/72 KB   1391/1889 KB   
72/72 KB   1395/1889 KB   
72/72 KB   1399/1889 KB   
72/72 KB   1403/1889 KB   
72/72 KB   1406/1889 KB   
72/72 KB   1410/1889 KB   
72/72 KB   1414/1889 KB   
72/72 KB   1418/1889 KB   
72/72 KB   1422/1889 KB   
72/72 KB   1426/1889 KB   
72/72 KB   1430/1889 KB   
72/72 KB   1434/1889 KB   
72/72 KB   1438/1889 KB   
72/72 KB   1442/1889 KB   
72/72 KB   1445/1889 KB   
72/72 KB   1449/1889 KB   
72/72 KB   1453/1889 KB   
72/72 KB   1457/1889 KB   
72/72 KB   1461/1889 KB   
                          
Downloaded: https://repo.eclipse.org/content/repositories/maven_central/ant/ant-junit/1.6.2/ant-junit-1.6.2.jar (72 KB at 489.4 KB/sec)
1465/1889 KB              
1469/1889 KB   
1473/1889 KB   
1477/1889 KB   
1481/1889 KB   
1485/1889 KB   
1489/1889 KB   
1492/1889 KB   
1496/1889 KB   
1500/1889 KB   
1504/1889 KB   
1508/1889 KB   
1512/1889 KB   
1516/1889 KB   
1520/1889 KB   
1524/1889 KB   
1528/1889 KB   
1531/1889 KB   
1535/1889 KB   
1539/1889 KB   
1543/1889 KB   
1547/1889 KB   
1551/1889 KB   
1555/1889 KB   
1559/1889 KB   
1563/1889 KB   
1567/1889 KB   
1570/1889 KB   
1574/1889 KB   
1578/1889 KB   
1582/1889 KB   
1586/1889 KB   
1590/1889 KB   
1594/1889 KB   
1598/1889 KB   
1602/1889 KB   
1606/1889 KB   
1610/1889 KB   
1614/1889 KB   
1617/1889 KB   
1621/1889 KB   
1625/1889 KB   
1629/1889 KB   
1633/1889 KB   
1637/1889 KB   
1641/1889 KB   
1645/1889 KB   
1649/1889 KB   
1653/1889 KB   
1656/1889 KB   
1660/1889 KB   
1664/1889 KB   
1668/1889 KB   
1672/1889 KB   
1676/1889 KB   
1680/1889 KB   
1684/1889 KB   
1688/1889 KB   
1692/1889 KB   
1695/1889 KB   
1699/1889 KB   
1703/1889 KB   
1707/1889 KB   
1711/1889 KB   
1715/1889 KB   
1719/1889 KB   
1723/1889 KB   
1727/1889 KB   
1731/1889 KB   
1735/1889 KB   
1739/1889 KB   
1742/1889 KB   
1746/1889 KB   
1750/1889 KB   
1754/1889 KB   
1758/1889 KB   
1762/1889 KB   
1766/1889 KB   
1770/1889 KB   
1774/1889 KB   
1778/1889 KB   
1781/1889 KB   
1785/1889 KB   
1789/1889 KB   
1793/1889 KB   
1797/1889 KB   
1801/1889 KB   
1805/1889 KB   
1809/1889 KB   
1813/1889 KB   
1817/1889 KB   
1820/1889 KB   
1824/1889 KB   
1828/1889 KB   
1832/1889 KB   
1836/1889 KB   
1840/1889 KB   
1844/1889 KB   
1848/1889 KB   
1852/1889 KB   
1856/1889 KB   
1860/1889 KB   
1864/1889 KB   
1867/1889 KB   
1871/1889 KB   
1875/1889 KB   
1879/1889 KB   
1883/1889 KB   
1887/1889 KB   
1889/1889 KB   
               
Downloaded: https://repo.eclipse.org/content/repositories/maven_central/org/apache/ant/ant/1.8.2/ant-1.8.2.jar (1889 KB at 10549.8 KB/sec)
[WARNING] Parameter tasks is deprecated, use target instead
[INFO] Executing tasks

main:
[junitreport] Transform time: 685ms
[INFO] Executed tasks
[INFO] 
[INFO] --- tycho-source-plugin:1.4.0:plugin-source (plugin-source) @ org.eclipse.mdht.uml.cda.test ---
[WARNING] Bundle-Vendor header not found in /home/jenkins/agent/workspace/MDHT-master/cda/tests/org.eclipse.mdht.uml.cda.test/META-INF/MANIFEST.MF, fallback to 'unknown' for source bundle
[INFO] Building jar: /home/jenkins/agent/workspace/MDHT-master/cda/tests/org.eclipse.mdht.uml.cda.test/target/org.eclipse.mdht.uml.cda.test-3.0.0-SNAPSHOT-sources.jar
[INFO] 
[INFO] --- target-platform-configuration:1.4.0:target-platform (default-target-platform) @ org.eclipse.mdht.uml.cda.test ---
[INFO] 
[INFO] --- tycho-packaging-plugin:1.4.0:package-plugin (default-package-plugin) @ org.eclipse.mdht.uml.cda.test ---
[INFO] Building jar: /home/jenkins/agent/workspace/MDHT-master/cda/tests/org.eclipse.mdht.uml.cda.test/target/org.eclipse.mdht.uml.cda.test-3.0.0-SNAPSHOT.jar
[INFO] 
[INFO] --- tycho-p2-plugin:1.4.0:p2-metadata-default (default-p2-metadata-default) @ org.eclipse.mdht.uml.cda.test ---
[INFO] 
[INFO] --- tycho-source-feature-plugin:1.4.0:source-feature (source-feature) @ org.eclipse.mdht.uml.cda.test ---
[INFO] 
[INFO] --- tycho-pack200b-plugin:1.4.0:pack (pack200-pack) @ org.eclipse.mdht.uml.cda.test ---
[INFO] Pack200 packing jar /home/jenkins/agent/workspace/MDHT-master/cda/tests/org.eclipse.mdht.uml.cda.test/target/org.eclipse.mdht.uml.cda.test-3.0.0-SNAPSHOT.jar
[INFO] 
[INFO] --- tycho-p2-plugin:1.4.0:p2-metadata (attach-p2-metadata) @ org.eclipse.mdht.uml.cda.test ---
[INFO]                                                                         
[INFO] ------------------------------------------------------------------------
[INFO] Building org.eclipse.mdht.uml.cda.basic 3.0.0-SNAPSHOT
[INFO] ------------------------------------------------------------------------
[INFO] 
[INFO] --- maven-clean-plugin:2.6:clean (default-clean) @ org.eclipse.mdht.uml.cda.basic ---
[INFO] Deleting /home/jenkins/agent/workspace/MDHT-master/cda/features/org.eclipse.mdht.uml.cda.basic-feature/target
[INFO] 
[INFO] --- tycho-packaging-plugin:1.4.0:build-qualifier-aggregator (default-build-qualifier-aggregator) @ org.eclipse.mdht.uml.cda.basic ---
[INFO] The project's OSGi version is 3.0.0.201912080601
[INFO] 
[INFO] --- tycho-packaging-plugin:1.4.0:validate-id (default-validate-id) @ org.eclipse.mdht.uml.cda.basic ---
[INFO] 
[INFO] --- tycho-packaging-plugin:1.4.0:validate-version (default-validate-version) @ org.eclipse.mdht.uml.cda.basic ---
[INFO] 
[INFO] --- tycho-source-plugin:1.4.0:plugin-source (plugin-source) @ org.eclipse.mdht.uml.cda.basic ---
[INFO] 
[INFO] --- target-platform-configuration:1.4.0:target-platform (default-target-platform) @ org.eclipse.mdht.uml.cda.basic ---
[INFO] 
[INFO] --- tycho-packaging-plugin:1.4.0:package-feature (default-package-feature) @ org.eclipse.mdht.uml.cda.basic ---
[INFO] Building jar: /home/jenkins/agent/workspace/MDHT-master/cda/features/org.eclipse.mdht.uml.cda.basic-feature/target/org.eclipse.mdht.uml.cda.basic-3.0.0-SNAPSHOT.jar
[INFO] 
[INFO] --- tycho-p2-plugin:1.4.0:p2-metadata-default (default-p2-metadata-default) @ org.eclipse.mdht.uml.cda.basic ---
[INFO] 
[INFO] --- tycho-p2-plugin:1.4.0:feature-p2-metadata (default-feature-p2-metadata) @ org.eclipse.mdht.uml.cda.basic ---
[INFO] 
[INFO] --- tycho-source-feature-plugin:1.4.0:source-feature (source-feature) @ org.eclipse.mdht.uml.cda.basic ---
[INFO] Building jar: /home/jenkins/agent/workspace/MDHT-master/cda/features/org.eclipse.mdht.uml.cda.basic-feature/target/org.eclipse.mdht.uml.cda.basic-3.0.0-SNAPSHOT-sources-feature.jar
[INFO] 
[INFO] --- tycho-pack200b-plugin:1.4.0:pack (pack200-pack) @ org.eclipse.mdht.uml.cda.basic ---
[INFO] 
[INFO] --- tycho-p2-plugin:1.4.0:p2-metadata (attach-p2-metadata) @ org.eclipse.mdht.uml.cda.basic ---
[INFO]                                                                         
[INFO] ------------------------------------------------------------------------
[INFO] Building org.eclipse.mdht.uml.cda.tooling 3.0.0-SNAPSHOT
[INFO] ------------------------------------------------------------------------
[INFO] 
[INFO] --- maven-clean-plugin:2.6:clean (default-clean) @ org.eclipse.mdht.uml.cda.tooling ---
[INFO] Deleting /home/jenkins/agent/workspace/MDHT-master/cda/features/org.eclipse.mdht.uml.cda.tooling-feature/target
[INFO] 
[INFO] --- tycho-packaging-plugin:1.4.0:build-qualifier-aggregator (default-build-qualifier-aggregator) @ org.eclipse.mdht.uml.cda.tooling ---
[INFO] The project's OSGi version is 3.0.0.201912080601
[INFO] 
[INFO] --- tycho-packaging-plugin:1.4.0:validate-id (default-validate-id) @ org.eclipse.mdht.uml.cda.tooling ---
[INFO] 
[INFO] --- tycho-packaging-plugin:1.4.0:validate-version (default-validate-version) @ org.eclipse.mdht.uml.cda.tooling ---
[INFO] 
[INFO] --- tycho-source-plugin:1.4.0:plugin-source (plugin-source) @ org.eclipse.mdht.uml.cda.tooling ---
[INFO] 
[INFO] --- target-platform-configuration:1.4.0:target-platform (default-target-platform) @ org.eclipse.mdht.uml.cda.tooling ---
[INFO] 
[INFO] --- tycho-packaging-plugin:1.4.0:package-feature (default-package-feature) @ org.eclipse.mdht.uml.cda.tooling ---
[INFO] Building jar: /home/jenkins/agent/workspace/MDHT-master/cda/features/org.eclipse.mdht.uml.cda.tooling-feature/target/org.eclipse.mdht.uml.cda.tooling-3.0.0-SNAPSHOT.jar
[INFO] 
[INFO] --- tycho-p2-plugin:1.4.0:p2-metadata-default (default-p2-metadata-default) @ org.eclipse.mdht.uml.cda.tooling ---
[INFO] 
[INFO] --- tycho-p2-plugin:1.4.0:feature-p2-metadata (default-feature-p2-metadata) @ org.eclipse.mdht.uml.cda.tooling ---
[INFO] 
[INFO] --- tycho-source-feature-plugin:1.4.0:source-feature (source-feature) @ org.eclipse.mdht.uml.cda.tooling ---
[INFO] Building jar: /home/jenkins/agent/workspace/MDHT-master/cda/features/org.eclipse.mdht.uml.cda.tooling-feature/target/org.eclipse.mdht.uml.cda.tooling-3.0.0-SNAPSHOT-sources-feature.jar
[INFO] 
[INFO] --- tycho-pack200b-plugin:1.4.0:pack (pack200-pack) @ org.eclipse.mdht.uml.cda.tooling ---
[INFO] 
[INFO] --- tycho-p2-plugin:1.4.0:p2-metadata (attach-p2-metadata) @ org.eclipse.mdht.uml.cda.tooling ---
[INFO]                                                                         
[INFO] ------------------------------------------------------------------------
[INFO] Building fhir 0.5.0-SNAPSHOT
[INFO] ------------------------------------------------------------------------
[INFO] 
[INFO] --- maven-clean-plugin:2.6:clean (default-clean) @ fhir ---
[INFO] 
[INFO] --- tycho-source-plugin:1.4.0:plugin-source (plugin-source) @ fhir ---
[INFO] 
[INFO] --- tycho-source-feature-plugin:1.4.0:source-feature (source-feature) @ fhir ---
[INFO] 
[INFO] --- tycho-pack200b-plugin:1.4.0:pack (pack200-pack) @ fhir ---
[INFO] 
[INFO] --- tycho-p2-plugin:1.4.0:p2-metadata (attach-p2-metadata) @ fhir ---
[INFO]                                                                         
[INFO] ------------------------------------------------------------------------
[INFO] Building org.eclipse.mdht.fhir.xsd 0.5.0-SNAPSHOT
[INFO] ------------------------------------------------------------------------
[INFO] 
[INFO] --- maven-clean-plugin:2.6:clean (default-clean) @ org.eclipse.mdht.fhir.xsd ---
[INFO] 
[INFO] --- tycho-packaging-plugin:1.4.0:build-qualifier (default-build-qualifier) @ org.eclipse.mdht.fhir.xsd ---
[INFO] The project's OSGi version is 0.5.0.201912080601
[INFO] 
[INFO] --- tycho-packaging-plugin:1.4.0:validate-id (default-validate-id) @ org.eclipse.mdht.fhir.xsd ---
[INFO] 
[INFO] --- tycho-packaging-plugin:1.4.0:validate-version (default-validate-version) @ org.eclipse.mdht.fhir.xsd ---
[INFO] 
[INFO] --- maven-resources-plugin:2.6:resources (default-resources) @ org.eclipse.mdht.fhir.xsd ---
[INFO] Using 'UTF-8' encoding to copy filtered resources.
[INFO] skip non existing resourceDirectory /home/jenkins/agent/workspace/MDHT-master/fhir/plugins/org.eclipse.mdht.fhir.xsd/src/main/resources
[INFO] 
[INFO] --- tycho-compiler-plugin:1.4.0:compile (default-compile) @ org.eclipse.mdht.fhir.xsd ---
[INFO] Compiling 2140 source files to /home/jenkins/agent/workspace/MDHT-master/fhir/plugins/org.eclipse.mdht.fhir.xsd/target/classes
[WARNING] /home/jenkins/agent/workspace/MDHT-master/fhir/plugins/org.eclipse.mdht.fhir.xsd/src/org/w3/_1999/xhtml/impl/XhtmlFactoryImpl.java:[1347] 
	return (List)XMLTypeFactory.eINSTANCE.createFromString(XMLTypePackage.Literals.NMTOKENS, initialValue);
	       ^^^^^^^^^^^^^^^^^^^^^^^^^^^^^^^^^^^^^^^^^^^^^^^^^^^^^^^^^^^^^^^^^^^^^^^^^^^^^^^^^^^^^^^^^^^^^^^
Type safety: The expression of type List needs unchecked conversion to conform to List<String>
[WARNING] /home/jenkins/agent/workspace/MDHT-master/fhir/plugins/org.eclipse.mdht.fhir.xsd/src/org/w3/_1999/xhtml/impl/XhtmlFactoryImpl.java:[1347] 
	return (List)XMLTypeFactory.eINSTANCE.createFromString(XMLTypePackage.Literals.NMTOKENS, initialValue);
	        ^^^^
List is a raw type. References to generic type List<E> should be parameterized
[WARNING] /home/jenkins/agent/workspace/MDHT-master/fhir/plugins/org.eclipse.mdht.fhir.xsd/src/org/hl7/fhir/util/FhirValidator.java:[14522] 
	if (xmlTypeValidator.validateGYear(datePrimitiveBase, tempDiagnostics, context)) return true;
	                     ^^^^^^^^^^^^^^^^^^^^^^^^^^^^^^^^^^^^^^^^^^^^^^^^^^^^^^^^^^
The method validateGYear(Object, DiagnosticChain, Map<Object,Object>) from the type XMLTypeValidator is deprecated
[WARNING] /home/jenkins/agent/workspace/MDHT-master/fhir/plugins/org.eclipse.mdht.fhir.xsd/src/org/hl7/fhir/util/FhirValidator.java:[14525] 
	if (xmlTypeValidator.validateGYearMonth(datePrimitiveBase, tempDiagnostics, context)) return true;
	                     ^^^^^^^^^^^^^^^^^^^^^^^^^^^^^^^^^^^^^^^^^^^^^^^^^^^^^^^^^^^^^^^
The method validateGYearMonth(Object, DiagnosticChain, Map<Object,Object>) from the type XMLTypeValidator is deprecated
[WARNING] /home/jenkins/agent/workspace/MDHT-master/fhir/plugins/org.eclipse.mdht.fhir.xsd/src/org/hl7/fhir/util/FhirValidator.java:[14528] 
	if (xmlTypeValidator.validateDate(datePrimitiveBase, tempDiagnostics, context)) return true;
	                     ^^^^^^^^^^^^^^^^^^^^^^^^^^^^^^^^^^^^^^^^^^^^^^^^^^^^^^^^^
The method validateDate(Object, DiagnosticChain, Map<Object,Object>) from the type XMLTypeValidator is deprecated
[WARNING] /home/jenkins/agent/workspace/MDHT-master/fhir/plugins/org.eclipse.mdht.fhir.xsd/src/org/hl7/fhir/util/FhirValidator.java:[14536] 
	if (xmlTypeValidator.validateGYear(datePrimitiveBase, null, context)) return true;
	                     ^^^^^^^^^^^^^^^^^^^^^^^^^^^^^^^^^^^^^^^^^^^^^^^
The method validateGYear(Object, DiagnosticChain, Map<Object,Object>) from the type XMLTypeValidator is deprecated
[WARNING] /home/jenkins/agent/workspace/MDHT-master/fhir/plugins/org.eclipse.mdht.fhir.xsd/src/org/hl7/fhir/util/FhirValidator.java:[14539] 
	if (xmlTypeValidator.validateGYearMonth(datePrimitiveBase, null, context)) return true;
	                     ^^^^^^^^^^^^^^^^^^^^^^^^^^^^^^^^^^^^^^^^^^^^^^^^^^^^
The method validateGYearMonth(Object, DiagnosticChain, Map<Object,Object>) from the type XMLTypeValidator is deprecated
[WARNING] /home/jenkins/agent/workspace/MDHT-master/fhir/plugins/org.eclipse.mdht.fhir.xsd/src/org/hl7/fhir/util/FhirValidator.java:[14542] 
	if (xmlTypeValidator.validateDate(datePrimitiveBase, null, context)) return true;
	                     ^^^^^^^^^^^^^^^^^^^^^^^^^^^^^^^^^^^^^^^^^^^^^^
The method validateDate(Object, DiagnosticChain, Map<Object,Object>) from the type XMLTypeValidator is deprecated
[WARNING] /home/jenkins/agent/workspace/MDHT-master/fhir/plugins/org.eclipse.mdht.fhir.xsd/src/org/hl7/fhir/util/FhirValidator.java:[14602] 
	if (xmlTypeValidator.validateGYear(dateTimePrimitiveBase, tempDiagnostics, context)) return true;
	                     ^^^^^^^^^^^^^^^^^^^^^^^^^^^^^^^^^^^^^^^^^^^^^^^^^^^^^^^^^^^^^^
The method validateGYear(Object, DiagnosticChain, Map<Object,Object>) from the type XMLTypeValidator is deprecated
[WARNING] /home/jenkins/agent/workspace/MDHT-master/fhir/plugins/org.eclipse.mdht.fhir.xsd/src/org/hl7/fhir/util/FhirValidator.java:[14605] 
	if (xmlTypeValidator.validateGYearMonth(dateTimePrimitiveBase, tempDiagnostics, context)) return true;
	                     ^^^^^^^^^^^^^^^^^^^^^^^^^^^^^^^^^^^^^^^^^^^^^^^^^^^^^^^^^^^^^^^^^^^
The method validateGYearMonth(Object, DiagnosticChain, Map<Object,Object>) from the type XMLTypeValidator is deprecated
[WARNING] /home/jenkins/agent/workspace/MDHT-master/fhir/plugins/org.eclipse.mdht.fhir.xsd/src/org/hl7/fhir/util/FhirValidator.java:[14608] 
	if (xmlTypeValidator.validateDate(dateTimePrimitiveBase, tempDiagnostics, context)) return true;
	                     ^^^^^^^^^^^^^^^^^^^^^^^^^^^^^^^^^^^^^^^^^^^^^^^^^^^^^^^^^^^^^
The method validateDate(Object, DiagnosticChain, Map<Object,Object>) from the type XMLTypeValidator is deprecated
[WARNING] /home/jenkins/agent/workspace/MDHT-master/fhir/plugins/org.eclipse.mdht.fhir.xsd/src/org/hl7/fhir/util/FhirValidator.java:[14611] 
	if (xmlTypeValidator.validateDateTime(dateTimePrimitiveBase, tempDiagnostics, context)) return true;
	                     ^^^^^^^^^^^^^^^^^^^^^^^^^^^^^^^^^^^^^^^^^^^^^^^^^^^^^^^^^^^^^^^^^
The method validateDateTime(Object, DiagnosticChain, Map<Object,Object>) from the type XMLTypeValidator is deprecated
[WARNING] /home/jenkins/agent/workspace/MDHT-master/fhir/plugins/org.eclipse.mdht.fhir.xsd/src/org/hl7/fhir/util/FhirValidator.java:[14619] 
	if (xmlTypeValidator.validateGYear(dateTimePrimitiveBase, null, context)) return true;
	                     ^^^^^^^^^^^^^^^^^^^^^^^^^^^^^^^^^^^^^^^^^^^^^^^^^^^
The method validateGYear(Object, DiagnosticChain, Map<Object,Object>) from the type XMLTypeValidator is deprecated
[WARNING] /home/jenkins/agent/workspace/MDHT-master/fhir/plugins/org.eclipse.mdht.fhir.xsd/src/org/hl7/fhir/util/FhirValidator.java:[14622] 
	if (xmlTypeValidator.validateGYearMonth(dateTimePrimitiveBase, null, context)) return true;
	                     ^^^^^^^^^^^^^^^^^^^^^^^^^^^^^^^^^^^^^^^^^^^^^^^^^^^^^^^^
The method validateGYearMonth(Object, DiagnosticChain, Map<Object,Object>) from the type XMLTypeValidator is deprecated
[WARNING] /home/jenkins/agent/workspace/MDHT-master/fhir/plugins/org.eclipse.mdht.fhir.xsd/src/org/hl7/fhir/util/FhirValidator.java:[14625] 
	if (xmlTypeValidator.validateDate(dateTimePrimitiveBase, null, context)) return true;
	                     ^^^^^^^^^^^^^^^^^^^^^^^^^^^^^^^^^^^^^^^^^^^^^^^^^^
The method validateDate(Object, DiagnosticChain, Map<Object,Object>) from the type XMLTypeValidator is deprecated
[WARNING] /home/jenkins/agent/workspace/MDHT-master/fhir/plugins/org.eclipse.mdht.fhir.xsd/src/org/hl7/fhir/util/FhirValidator.java:[14628] 
	if (xmlTypeValidator.validateDateTime(dateTimePrimitiveBase, null, context)) return true;
	                     ^^^^^^^^^^^^^^^^^^^^^^^^^^^^^^^^^^^^^^^^^^^^^^^^^^^^^^
The method validateDateTime(Object, DiagnosticChain, Map<Object,Object>) from the type XMLTypeValidator is deprecated
16 problems (16 warnings)
[INFO] 
[INFO] --- maven-resources-plugin:2.6:testResources (default-testResources) @ org.eclipse.mdht.fhir.xsd ---
[INFO] Using 'UTF-8' encoding to copy filtered resources.
[INFO] skip non existing resourceDirectory /home/jenkins/agent/workspace/MDHT-master/fhir/plugins/org.eclipse.mdht.fhir.xsd/src/test/resources
[INFO] 
[INFO] --- tycho-source-plugin:1.4.0:plugin-source (plugin-source) @ org.eclipse.mdht.fhir.xsd ---
[INFO] Building jar: /home/jenkins/agent/workspace/MDHT-master/fhir/plugins/org.eclipse.mdht.fhir.xsd/target/org.eclipse.mdht.fhir.xsd-0.5.0-SNAPSHOT-sources.jar
[INFO] 
[INFO] --- target-platform-configuration:1.4.0:target-platform (default-target-platform) @ org.eclipse.mdht.fhir.xsd ---
[INFO] 
[INFO] --- tycho-packaging-plugin:1.4.0:package-plugin (default-package-plugin) @ org.eclipse.mdht.fhir.xsd ---
[INFO] Building jar: /home/jenkins/agent/workspace/MDHT-master/fhir/plugins/org.eclipse.mdht.fhir.xsd/target/org.eclipse.mdht.fhir.xsd-0.5.0-SNAPSHOT.jar
[INFO] 
[INFO] --- tycho-p2-plugin:1.4.0:p2-metadata-default (default-p2-metadata-default) @ org.eclipse.mdht.fhir.xsd ---
[INFO] 
[INFO] --- tycho-source-feature-plugin:1.4.0:source-feature (source-feature) @ org.eclipse.mdht.fhir.xsd ---
[INFO] 
[INFO] --- tycho-pack200b-plugin:1.4.0:pack (pack200-pack) @ org.eclipse.mdht.fhir.xsd ---
[INFO] Pack200 packing jar /home/jenkins/agent/workspace/MDHT-master/fhir/plugins/org.eclipse.mdht.fhir.xsd/target/org.eclipse.mdht.fhir.xsd-0.5.0-SNAPSHOT.jar
[INFO] 
[INFO] --- tycho-p2-plugin:1.4.0:p2-metadata (attach-p2-metadata) @ org.eclipse.mdht.fhir.xsd ---
[INFO]                                                                         
[INFO] ------------------------------------------------------------------------
[INFO] Building org.eclipse.mdht.uml.fhir.core 0.5.0-SNAPSHOT
[INFO] ------------------------------------------------------------------------
[INFO] 
[INFO] --- maven-clean-plugin:2.6:clean (default-clean) @ org.eclipse.mdht.uml.fhir.core ---
[INFO] 
[INFO] --- tycho-packaging-plugin:1.4.0:build-qualifier (default-build-qualifier) @ org.eclipse.mdht.uml.fhir.core ---
[INFO] The project's OSGi version is 0.5.0.201912080601
[INFO] 
[INFO] --- tycho-packaging-plugin:1.4.0:validate-id (default-validate-id) @ org.eclipse.mdht.uml.fhir.core ---
[INFO] 
[INFO] --- tycho-packaging-plugin:1.4.0:validate-version (default-validate-version) @ org.eclipse.mdht.uml.fhir.core ---
[INFO] 
[INFO] --- maven-resources-plugin:2.6:resources (default-resources) @ org.eclipse.mdht.uml.fhir.core ---
[INFO] Using 'UTF-8' encoding to copy filtered resources.
[INFO] skip non existing resourceDirectory /home/jenkins/agent/workspace/MDHT-master/fhir/plugins/org.eclipse.mdht.uml.fhir.core/src/main/resources
[INFO] 
[INFO] --- tycho-compiler-plugin:1.4.0:compile (default-compile) @ org.eclipse.mdht.uml.fhir.core ---
[WARNING] Parameter 'useProjectSettings' is set to true, but preferences file '/home/jenkins/agent/workspace/MDHT-master/fhir/plugins/org.eclipse.mdht.uml.fhir.core/.settings/org.eclipse.jdt.core.prefs' could not be found!
[INFO] Compiling 1255 source files to /home/jenkins/agent/workspace/MDHT-master/fhir/plugins/org.eclipse.mdht.uml.fhir.core/target/classes
[WARNING] /home/jenkins/agent/workspace/MDHT-master/fhir/plugins/org.eclipse.mdht.uml.fhir.core/src/org/eclipse/mdht/uml/fhir/core/valueset/impl/FhirValuesetPackageImpl.java:[10842] 
	String source = "http://www.eclipse.org/uml2/2.0.0/UML";	
	       ^^^^^^
The value of the local variable source is not used
1 problem (1 warning)
[INFO] 
[INFO] --- maven-resources-plugin:2.6:testResources (default-testResources) @ org.eclipse.mdht.uml.fhir.core ---
[INFO] Using 'UTF-8' encoding to copy filtered resources.
[INFO] skip non existing resourceDirectory /home/jenkins/agent/workspace/MDHT-master/fhir/plugins/org.eclipse.mdht.uml.fhir.core/src/test/resources
[INFO] 
[INFO] --- tycho-source-plugin:1.4.0:plugin-source (plugin-source) @ org.eclipse.mdht.uml.fhir.core ---
[INFO] Building jar: /home/jenkins/agent/workspace/MDHT-master/fhir/plugins/org.eclipse.mdht.uml.fhir.core/target/org.eclipse.mdht.uml.fhir.core-0.5.0-SNAPSHOT-sources.jar
[INFO] 
[INFO] --- target-platform-configuration:1.4.0:target-platform (default-target-platform) @ org.eclipse.mdht.uml.fhir.core ---
[INFO] 
[INFO] --- tycho-packaging-plugin:1.4.0:package-plugin (default-package-plugin) @ org.eclipse.mdht.uml.fhir.core ---
[INFO] Building jar: /home/jenkins/agent/workspace/MDHT-master/fhir/plugins/org.eclipse.mdht.uml.fhir.core/target/org.eclipse.mdht.uml.fhir.core-0.5.0-SNAPSHOT.jar
[INFO] 
[INFO] --- tycho-p2-plugin:1.4.0:p2-metadata-default (default-p2-metadata-default) @ org.eclipse.mdht.uml.fhir.core ---
[INFO] 
[INFO] --- tycho-source-feature-plugin:1.4.0:source-feature (source-feature) @ org.eclipse.mdht.uml.fhir.core ---
[INFO] 
[INFO] --- tycho-pack200b-plugin:1.4.0:pack (pack200-pack) @ org.eclipse.mdht.uml.fhir.core ---
[INFO] Pack200 packing jar /home/jenkins/agent/workspace/MDHT-master/fhir/plugins/org.eclipse.mdht.uml.fhir.core/target/org.eclipse.mdht.uml.fhir.core-0.5.0-SNAPSHOT.jar
[INFO] 
[INFO] --- tycho-p2-plugin:1.4.0:p2-metadata (attach-p2-metadata) @ org.eclipse.mdht.uml.fhir.core ---
[INFO]                                                                         
[INFO] ------------------------------------------------------------------------
[INFO] Building org.eclipse.mdht.uml.fhir 0.5.0-SNAPSHOT
[INFO] ------------------------------------------------------------------------
[INFO] 
[INFO] --- maven-clean-plugin:2.6:clean (default-clean) @ org.eclipse.mdht.uml.fhir ---
[INFO] 
[INFO] --- tycho-packaging-plugin:1.4.0:build-qualifier (default-build-qualifier) @ org.eclipse.mdht.uml.fhir ---
[INFO] The project's OSGi version is 0.5.0.201912080601
[INFO] 
[INFO] --- tycho-packaging-plugin:1.4.0:validate-id (default-validate-id) @ org.eclipse.mdht.uml.fhir ---
[INFO] 
[INFO] --- tycho-packaging-plugin:1.4.0:validate-version (default-validate-version) @ org.eclipse.mdht.uml.fhir ---
[INFO] 
[INFO] --- maven-resources-plugin:2.6:resources (default-resources) @ org.eclipse.mdht.uml.fhir ---
[INFO] Using 'UTF-8' encoding to copy filtered resources.
[INFO] skip non existing resourceDirectory /home/jenkins/agent/workspace/MDHT-master/fhir/plugins/org.eclipse.mdht.uml.fhir/src/main/resources
[INFO] 
[INFO] --- tycho-compiler-plugin:1.4.0:compile (default-compile) @ org.eclipse.mdht.uml.fhir ---
[INFO] Compiling 67 source files to /home/jenkins/agent/workspace/MDHT-master/fhir/plugins/org.eclipse.mdht.uml.fhir/target/classes
[INFO] 
[INFO] --- maven-resources-plugin:2.6:testResources (default-testResources) @ org.eclipse.mdht.uml.fhir ---
[INFO] Using 'UTF-8' encoding to copy filtered resources.
[INFO] skip non existing resourceDirectory /home/jenkins/agent/workspace/MDHT-master/fhir/plugins/org.eclipse.mdht.uml.fhir/src/test/resources
[INFO] 
[INFO] --- tycho-source-plugin:1.4.0:plugin-source (plugin-source) @ org.eclipse.mdht.uml.fhir ---
[INFO] Building jar: /home/jenkins/agent/workspace/MDHT-master/fhir/plugins/org.eclipse.mdht.uml.fhir/target/org.eclipse.mdht.uml.fhir-0.5.0-SNAPSHOT-sources.jar
[INFO] 
[INFO] --- target-platform-configuration:1.4.0:target-platform (default-target-platform) @ org.eclipse.mdht.uml.fhir ---
[INFO] 
[INFO] --- tycho-packaging-plugin:1.4.0:package-plugin (default-package-plugin) @ org.eclipse.mdht.uml.fhir ---
[INFO] Building jar: /home/jenkins/agent/workspace/MDHT-master/fhir/plugins/org.eclipse.mdht.uml.fhir/target/org.eclipse.mdht.uml.fhir-0.5.0-SNAPSHOT.jar
[INFO] 
[INFO] --- tycho-p2-plugin:1.4.0:p2-metadata-default (default-p2-metadata-default) @ org.eclipse.mdht.uml.fhir ---
[INFO] 
[INFO] --- tycho-source-feature-plugin:1.4.0:source-feature (source-feature) @ org.eclipse.mdht.uml.fhir ---
[INFO] 
[INFO] --- tycho-pack200b-plugin:1.4.0:pack (pack200-pack) @ org.eclipse.mdht.uml.fhir ---
[INFO] Pack200 packing jar /home/jenkins/agent/workspace/MDHT-master/fhir/plugins/org.eclipse.mdht.uml.fhir/target/org.eclipse.mdht.uml.fhir-0.5.0-SNAPSHOT.jar
[INFO] 
[INFO] --- tycho-p2-plugin:1.4.0:p2-metadata (attach-p2-metadata) @ org.eclipse.mdht.uml.fhir ---
[INFO]                                                                         
[INFO] ------------------------------------------------------------------------
[INFO] Building org.eclipse.mdht.uml.fhir.common 0.5.0-SNAPSHOT
[INFO] ------------------------------------------------------------------------
[INFO] 
[INFO] --- maven-clean-plugin:2.6:clean (default-clean) @ org.eclipse.mdht.uml.fhir.common ---
[INFO] 
[INFO] --- tycho-packaging-plugin:1.4.0:build-qualifier (default-build-qualifier) @ org.eclipse.mdht.uml.fhir.common ---
[INFO] The project's OSGi version is 0.5.0.201912080601
[INFO] 
[INFO] --- tycho-packaging-plugin:1.4.0:validate-id (default-validate-id) @ org.eclipse.mdht.uml.fhir.common ---
[INFO] 
[INFO] --- tycho-packaging-plugin:1.4.0:validate-version (default-validate-version) @ org.eclipse.mdht.uml.fhir.common ---
[INFO] 
[INFO] --- maven-resources-plugin:2.6:resources (default-resources) @ org.eclipse.mdht.uml.fhir.common ---
[INFO] Using 'UTF-8' encoding to copy filtered resources.
[INFO] skip non existing resourceDirectory /home/jenkins/agent/workspace/MDHT-master/fhir/plugins/org.eclipse.mdht.uml.fhir.common/src/main/resources
[INFO] 
[INFO] --- tycho-compiler-plugin:1.4.0:compile (default-compile) @ org.eclipse.mdht.uml.fhir.common ---
[INFO] Compiling 10 source files to /home/jenkins/agent/workspace/MDHT-master/fhir/plugins/org.eclipse.mdht.uml.fhir.common/target/classes
[INFO] 
[INFO] --- maven-resources-plugin:2.6:testResources (default-testResources) @ org.eclipse.mdht.uml.fhir.common ---
[INFO] Using 'UTF-8' encoding to copy filtered resources.
[INFO] skip non existing resourceDirectory /home/jenkins/agent/workspace/MDHT-master/fhir/plugins/org.eclipse.mdht.uml.fhir.common/src/test/resources
[INFO] 
[INFO] --- tycho-source-plugin:1.4.0:plugin-source (plugin-source) @ org.eclipse.mdht.uml.fhir.common ---
[INFO] Building jar: /home/jenkins/agent/workspace/MDHT-master/fhir/plugins/org.eclipse.mdht.uml.fhir.common/target/org.eclipse.mdht.uml.fhir.common-0.5.0-SNAPSHOT-sources.jar
[INFO] 
[INFO] --- target-platform-configuration:1.4.0:target-platform (default-target-platform) @ org.eclipse.mdht.uml.fhir.common ---
[INFO] 
[INFO] --- tycho-packaging-plugin:1.4.0:package-plugin (default-package-plugin) @ org.eclipse.mdht.uml.fhir.common ---
[INFO] Building jar: /home/jenkins/agent/workspace/MDHT-master/fhir/plugins/org.eclipse.mdht.uml.fhir.common/target/org.eclipse.mdht.uml.fhir.common-0.5.0-SNAPSHOT.jar
[INFO] 
[INFO] --- tycho-p2-plugin:1.4.0:p2-metadata-default (default-p2-metadata-default) @ org.eclipse.mdht.uml.fhir.common ---
[INFO] 
[INFO] --- tycho-source-feature-plugin:1.4.0:source-feature (source-feature) @ org.eclipse.mdht.uml.fhir.common ---
[INFO] 
[INFO] --- tycho-pack200b-plugin:1.4.0:pack (pack200-pack) @ org.eclipse.mdht.uml.fhir.common ---
[INFO] Pack200 packing jar /home/jenkins/agent/workspace/MDHT-master/fhir/plugins/org.eclipse.mdht.uml.fhir.common/target/org.eclipse.mdht.uml.fhir.common-0.5.0-SNAPSHOT.jar
[INFO] 
[INFO] --- tycho-p2-plugin:1.4.0:p2-metadata (attach-p2-metadata) @ org.eclipse.mdht.uml.fhir.common ---
[INFO]                                                                         
[INFO] ------------------------------------------------------------------------
[INFO] Building org.eclipse.mdht.uml.fhir.edit 0.5.0-SNAPSHOT
[INFO] ------------------------------------------------------------------------
[INFO] 
[INFO] --- maven-clean-plugin:2.6:clean (default-clean) @ org.eclipse.mdht.uml.fhir.edit ---
[INFO] 
[INFO] --- tycho-packaging-plugin:1.4.0:build-qualifier (default-build-qualifier) @ org.eclipse.mdht.uml.fhir.edit ---
[INFO] The project's OSGi version is 0.5.0.201912080601
[INFO] 
[INFO] --- tycho-packaging-plugin:1.4.0:validate-id (default-validate-id) @ org.eclipse.mdht.uml.fhir.edit ---
[INFO] 
[INFO] --- tycho-packaging-plugin:1.4.0:validate-version (default-validate-version) @ org.eclipse.mdht.uml.fhir.edit ---
[INFO] 
[INFO] --- maven-resources-plugin:2.6:resources (default-resources) @ org.eclipse.mdht.uml.fhir.edit ---
[INFO] Using 'UTF-8' encoding to copy filtered resources.
[INFO] skip non existing resourceDirectory /home/jenkins/agent/workspace/MDHT-master/fhir/plugins/org.eclipse.mdht.uml.fhir.edit/src/main/resources
[INFO] 
[INFO] --- tycho-compiler-plugin:1.4.0:compile (default-compile) @ org.eclipse.mdht.uml.fhir.edit ---
[WARNING] Parameter 'useProjectSettings' is set to true, but preferences file '/home/jenkins/agent/workspace/MDHT-master/fhir/plugins/org.eclipse.mdht.uml.fhir.edit/.settings/org.eclipse.jdt.core.prefs' could not be found!
[INFO] Compiling 29 source files to /home/jenkins/agent/workspace/MDHT-master/fhir/plugins/org.eclipse.mdht.uml.fhir.edit/target/classes
[INFO] 
[INFO] --- maven-resources-plugin:2.6:testResources (default-testResources) @ org.eclipse.mdht.uml.fhir.edit ---
[INFO] Using 'UTF-8' encoding to copy filtered resources.
[INFO] skip non existing resourceDirectory /home/jenkins/agent/workspace/MDHT-master/fhir/plugins/org.eclipse.mdht.uml.fhir.edit/src/test/resources
[INFO] 
[INFO] --- tycho-source-plugin:1.4.0:plugin-source (plugin-source) @ org.eclipse.mdht.uml.fhir.edit ---
[INFO] Building jar: /home/jenkins/agent/workspace/MDHT-master/fhir/plugins/org.eclipse.mdht.uml.fhir.edit/target/org.eclipse.mdht.uml.fhir.edit-0.5.0-SNAPSHOT-sources.jar
[INFO] 
[INFO] --- target-platform-configuration:1.4.0:target-platform (default-target-platform) @ org.eclipse.mdht.uml.fhir.edit ---
[INFO] 
[INFO] --- tycho-packaging-plugin:1.4.0:package-plugin (default-package-plugin) @ org.eclipse.mdht.uml.fhir.edit ---
[INFO] Building jar: /home/jenkins/agent/workspace/MDHT-master/fhir/plugins/org.eclipse.mdht.uml.fhir.edit/target/org.eclipse.mdht.uml.fhir.edit-0.5.0-SNAPSHOT.jar
[INFO] 
[INFO] --- tycho-p2-plugin:1.4.0:p2-metadata-default (default-p2-metadata-default) @ org.eclipse.mdht.uml.fhir.edit ---
[INFO] 
[INFO] --- tycho-source-feature-plugin:1.4.0:source-feature (source-feature) @ org.eclipse.mdht.uml.fhir.edit ---
[INFO] 
[INFO] --- tycho-pack200b-plugin:1.4.0:pack (pack200-pack) @ org.eclipse.mdht.uml.fhir.edit ---
[INFO] Pack200 packing jar /home/jenkins/agent/workspace/MDHT-master/fhir/plugins/org.eclipse.mdht.uml.fhir.edit/target/org.eclipse.mdht.uml.fhir.edit-0.5.0-SNAPSHOT.jar
[INFO] 
[INFO] --- tycho-p2-plugin:1.4.0:p2-metadata (attach-p2-metadata) @ org.eclipse.mdht.uml.fhir.edit ---
[INFO]                                                                         
[INFO] ------------------------------------------------------------------------
[INFO] Building org.eclipse.mdht.uml.fhir.transform 0.5.0-SNAPSHOT
[INFO] ------------------------------------------------------------------------
[INFO] 
[INFO] --- maven-clean-plugin:2.6:clean (default-clean) @ org.eclipse.mdht.uml.fhir.transform ---
[INFO] 
[INFO] --- tycho-packaging-plugin:1.4.0:build-qualifier (default-build-qualifier) @ org.eclipse.mdht.uml.fhir.transform ---
[INFO] The project's OSGi version is 0.5.0.201912080601
[INFO] 
[INFO] --- tycho-packaging-plugin:1.4.0:validate-id (default-validate-id) @ org.eclipse.mdht.uml.fhir.transform ---
[INFO] 
[INFO] --- tycho-packaging-plugin:1.4.0:validate-version (default-validate-version) @ org.eclipse.mdht.uml.fhir.transform ---
[INFO] 
[INFO] --- maven-resources-plugin:2.6:resources (default-resources) @ org.eclipse.mdht.uml.fhir.transform ---
[INFO] Using 'UTF-8' encoding to copy filtered resources.
[INFO] skip non existing resourceDirectory /home/jenkins/agent/workspace/MDHT-master/fhir/plugins/org.eclipse.mdht.uml.fhir.transform/src/main/resources
[INFO] 
[INFO] --- tycho-compiler-plugin:1.4.0:compile (default-compile) @ org.eclipse.mdht.uml.fhir.transform ---
[INFO] Compiling 5 source files to /home/jenkins/agent/workspace/MDHT-master/fhir/plugins/org.eclipse.mdht.uml.fhir.transform/target/classes
[WARNING] /home/jenkins/agent/workspace/MDHT-master/fhir/plugins/org.eclipse.mdht.uml.fhir.transform/src/org/eclipse/mdht/uml/fhir/transform/ModelImporter.java:[84] 
	import org.hl7.fhir.ResourceType;
	       ^^^^^^^^^^^^^^^^^^^^^^^^^
The import org.hl7.fhir.ResourceType is never used
[WARNING] /home/jenkins/agent/workspace/MDHT-master/fhir/plugins/org.eclipse.mdht.uml.fhir.transform/src/org/eclipse/mdht/uml/fhir/transform/ModelExporter.java:[272] 
	Object contextType;
	       ^^^^^^^^^^^
The value of the local variable contextType is not used
[WARNING] /home/jenkins/agent/workspace/MDHT-master/fhir/plugins/org.eclipse.mdht.uml.fhir.transform/src/org/eclipse/mdht/uml/fhir/transform/ModelExporter.java:[275] 
	ExtensionContextTypeList foofoo;
	                         ^^^^^^
The value of the local variable foofoo is not used
[WARNING] /home/jenkins/agent/workspace/MDHT-master/fhir/plugins/org.eclipse.mdht.uml.fhir.transform/src/org/eclipse/mdht/uml/fhir/transform/ModelExporter.java:[814] 
	private org.hl7.fhir.Integer createFhirInteger(int value) {
	                             ^^^^^^^^^^^^^^^^^^^^^^^^^^^^
The method createFhirInteger(int) from the type ModelExporter is never used locally
[WARNING] /home/jenkins/agent/workspace/MDHT-master/fhir/plugins/org.eclipse.mdht.uml.fhir.transform/src/org/eclipse/mdht/uml/fhir/transform/ModelExporter.java:[826] 
	private org.hl7.fhir.Code createFhirCode(String value) {
	                          ^^^^^^^^^^^^^^^^^^^^^^^^^^^^
The method createFhirCode(String) from the type ModelExporter is never used locally
[WARNING] /home/jenkins/agent/workspace/MDHT-master/fhir/plugins/org.eclipse.mdht.uml.fhir.transform/src/org/eclipse/mdht/uml/fhir/transform/ModelExporter.java:[853] 
	private Reference createReference(Property property) {
	                  ^^^^^^^^^^^^^^^^^^^^^^^^^^^^^^^^^^
The method createReference(Property) from the type ModelExporter is never used locally
[WARNING] /home/jenkins/agent/workspace/MDHT-master/fhir/plugins/org.eclipse.mdht.uml.fhir.transform/src/org/eclipse/mdht/uml/fhir/transform/TerminologyCache.java:[372] 
	private static Reader getReader(String urlString) throws IOException {
	                      ^^^^^^^^^^^^^^^^^^^^^^^^^^^^^^^^^^^^^^^^^^^^^^
The method getReader(String) from the type TerminologyCache is never used locally
7 problems (7 warnings)
[INFO] 
[INFO] --- maven-resources-plugin:2.6:testResources (default-testResources) @ org.eclipse.mdht.uml.fhir.transform ---
[INFO] Using 'UTF-8' encoding to copy filtered resources.
[INFO] skip non existing resourceDirectory /home/jenkins/agent/workspace/MDHT-master/fhir/plugins/org.eclipse.mdht.uml.fhir.transform/src/test/resources
[INFO] 
[INFO] --- tycho-source-plugin:1.4.0:plugin-source (plugin-source) @ org.eclipse.mdht.uml.fhir.transform ---
[WARNING] Bundle-Vendor header not found in /home/jenkins/agent/workspace/MDHT-master/fhir/plugins/org.eclipse.mdht.uml.fhir.transform/META-INF/MANIFEST.MF, fallback to 'unknown' for source bundle
[INFO] Building jar: /home/jenkins/agent/workspace/MDHT-master/fhir/plugins/org.eclipse.mdht.uml.fhir.transform/target/org.eclipse.mdht.uml.fhir.transform-0.5.0-SNAPSHOT-sources.jar
[INFO] 
[INFO] --- target-platform-configuration:1.4.0:target-platform (default-target-platform) @ org.eclipse.mdht.uml.fhir.transform ---
[INFO] 
[INFO] --- tycho-packaging-plugin:1.4.0:package-plugin (default-package-plugin) @ org.eclipse.mdht.uml.fhir.transform ---
[INFO] Building jar: /home/jenkins/agent/workspace/MDHT-master/fhir/plugins/org.eclipse.mdht.uml.fhir.transform/target/org.eclipse.mdht.uml.fhir.transform-0.5.0-SNAPSHOT.jar
[INFO] 
[INFO] --- tycho-p2-plugin:1.4.0:p2-metadata-default (default-p2-metadata-default) @ org.eclipse.mdht.uml.fhir.transform ---
[INFO] 
[INFO] --- tycho-source-feature-plugin:1.4.0:source-feature (source-feature) @ org.eclipse.mdht.uml.fhir.transform ---
[INFO] 
[INFO] --- tycho-pack200b-plugin:1.4.0:pack (pack200-pack) @ org.eclipse.mdht.uml.fhir.transform ---
[INFO] Pack200 packing jar /home/jenkins/agent/workspace/MDHT-master/fhir/plugins/org.eclipse.mdht.uml.fhir.transform/target/org.eclipse.mdht.uml.fhir.transform-0.5.0-SNAPSHOT.jar
[INFO] 
[INFO] --- tycho-p2-plugin:1.4.0:p2-metadata (attach-p2-metadata) @ org.eclipse.mdht.uml.fhir.transform ---
[INFO]                                                                         
[INFO] ------------------------------------------------------------------------
[INFO] Building org.eclipse.mdht.uml.fhir.ui 0.5.0-SNAPSHOT
[INFO] ------------------------------------------------------------------------
[INFO] 
[INFO] --- maven-clean-plugin:2.6:clean (default-clean) @ org.eclipse.mdht.uml.fhir.ui ---
[INFO] 
[INFO] --- tycho-packaging-plugin:1.4.0:build-qualifier (default-build-qualifier) @ org.eclipse.mdht.uml.fhir.ui ---
[INFO] The project's OSGi version is 0.5.0.201912080601
[INFO] 
[INFO] --- tycho-packaging-plugin:1.4.0:validate-id (default-validate-id) @ org.eclipse.mdht.uml.fhir.ui ---
[INFO] 
[INFO] --- tycho-packaging-plugin:1.4.0:validate-version (default-validate-version) @ org.eclipse.mdht.uml.fhir.ui ---
[INFO] 
[INFO] --- maven-resources-plugin:2.6:resources (default-resources) @ org.eclipse.mdht.uml.fhir.ui ---
[INFO] Using 'UTF-8' encoding to copy filtered resources.
[INFO] skip non existing resourceDirectory /home/jenkins/agent/workspace/MDHT-master/fhir/plugins/org.eclipse.mdht.uml.fhir.ui/src/main/resources
[INFO] 
[INFO] --- tycho-compiler-plugin:1.4.0:compile (default-compile) @ org.eclipse.mdht.uml.fhir.ui ---
[INFO] Compiling 36 source files to /home/jenkins/agent/workspace/MDHT-master/fhir/plugins/org.eclipse.mdht.uml.fhir.ui/target/classes
[WARNING] /home/jenkins/agent/workspace/MDHT-master/fhir/plugins/org.eclipse.mdht.uml.fhir.ui/src/org/eclipse/mdht/uml/fhir/ui/handlers/ImportFhirHandler.java:[62] 
	private List<URI> selectProfileFiles(IWorkbenchPart activePart) {
	                  ^^^^^^^^^^^^^^^^^^^^^^^^^^^^^^^^^^^^^^^^^^^^^
The method selectProfileFiles(IWorkbenchPart) from the type ImportFhirHandler is never used locally
[WARNING] /home/jenkins/agent/workspace/MDHT-master/fhir/plugins/org.eclipse.mdht.uml.fhir.ui/src/org/eclipse/mdht/uml/fhir/ui/properties/ConformanceResourceSection.java:[43] 
	private ModifyListener modifyListener = new ModifyListener() {
	                       ^^^^^^^^^^^^^^
The value of the field ConformanceResourceSection.modifyListener is not used
[WARNING] /home/jenkins/agent/workspace/MDHT-master/fhir/plugins/org.eclipse.mdht.uml.fhir.ui/src/org/eclipse/mdht/uml/fhir/ui/properties/ConformanceResourceSection.java:[49] 
	private FocusListener focusListener = new FocusListener() {
	                      ^^^^^^^^^^^^^
The value of the field ConformanceResourceSection.focusListener is not used
[WARNING] /home/jenkins/agent/workspace/MDHT-master/fhir/plugins/org.eclipse.mdht.uml.fhir.ui/src/org/eclipse/mdht/uml/fhir/ui/properties/ConformanceResourceSection.java:[98] 
	getEObjectList().add(object);
	^^^^^^^^^^^^^^^^^^^^^^^^^^^^
Type safety: The method add(Object) belongs to the raw type List. References to generic type List<E> should be parameterized
[WARNING] /home/jenkins/agent/workspace/MDHT-master/fhir/plugins/org.eclipse.mdht.uml.fhir.ui/src/org/eclipse/mdht/uml/fhir/ui/notation/FHIRPropertyNotation.java:[106] 
	String fixedValue = getFixedValueAnnotation(property);
	       ^^^^^^^^^^
The value of the local variable fixedValue is not used
[WARNING] /home/jenkins/agent/workspace/MDHT-master/fhir/plugins/org.eclipse.mdht.uml.fhir.ui/src/org/eclipse/mdht/uml/fhir/ui/notation/FHIRPropertyNotation.java:[202] 
	private static boolean hasInvariant(Property property) {
	                       ^^^^^^^^^^^^^^^^^^^^^^^^^^^^^^^
The method hasInvariant(Property) from the type FHIRPropertyNotation is never used locally
[WARNING] /home/jenkins/agent/workspace/MDHT-master/fhir/plugins/org.eclipse.mdht.uml.fhir.ui/src/org/eclipse/mdht/uml/fhir/ui/properties/TypeChoiceSection.java:[188] 
	private ModifyListener modifyListener = new ModifyListener() {
	                       ^^^^^^^^^^^^^^
The value of the field TypeChoiceSection.modifyListener is not used
[WARNING] /home/jenkins/agent/workspace/MDHT-master/fhir/plugins/org.eclipse.mdht.uml.fhir.ui/src/org/eclipse/mdht/uml/fhir/ui/properties/TypeChoiceSection.java:[194] 
	private FocusListener focusListener = new FocusListener() {
	                      ^^^^^^^^^^^^^
The value of the field TypeChoiceSection.focusListener is not used
[WARNING] /home/jenkins/agent/workspace/MDHT-master/fhir/plugins/org.eclipse.mdht.uml.fhir.ui/src/org/eclipse/mdht/uml/fhir/ui/properties/TypeChoiceSection.java:[297] 
	TableViewerColumn classColumn = createTableViewerColumn(titles[0], bounds[0], 0);
	                  ^^^^^^^^^^^
The value of the local variable classColumn is not used
[WARNING] /home/jenkins/agent/workspace/MDHT-master/fhir/plugins/org.eclipse.mdht.uml.fhir.ui/src/org/eclipse/mdht/uml/fhir/ui/properties/TypeChoiceSection.java:[298] 
	TableViewerColumn baseTypeColumn = createTableViewerColumn(titles[1], bounds[1], 1);
	                  ^^^^^^^^^^^^^^
The value of the local variable baseTypeColumn is not used
[WARNING] /home/jenkins/agent/workspace/MDHT-master/fhir/plugins/org.eclipse.mdht.uml.fhir.ui/src/org/eclipse/mdht/uml/fhir/ui/properties/TypeChoiceSection.java:[299] 
	TableViewerColumn profileColumn = createTableViewerColumn(titles[2], bounds[2], 2);
	                  ^^^^^^^^^^^^^
The value of the local variable profileColumn is not used
[WARNING] /home/jenkins/agent/workspace/MDHT-master/fhir/plugins/org.eclipse.mdht.uml.fhir.ui/src/org/eclipse/mdht/uml/fhir/ui/properties/TypeChoiceSection.java:[300] 
	TableViewerColumn aggregationColumn = createTableViewerColumn(titles[3], bounds[3], 3);
	                  ^^^^^^^^^^^^^^^^^
The value of the local variable aggregationColumn is not used
[WARNING] /home/jenkins/agent/workspace/MDHT-master/fhir/plugins/org.eclipse.mdht.uml.fhir.ui/src/org/eclipse/mdht/uml/fhir/ui/properties/TypeChoiceSection.java:[332] 
	getEObjectList().add(object);
	^^^^^^^^^^^^^^^^^^^^^^^^^^^^
Type safety: The method add(Object) belongs to the raw type List. References to generic type List<E> should be parameterized
[WARNING] /home/jenkins/agent/workspace/MDHT-master/fhir/plugins/org.eclipse.mdht.uml.fhir.ui/src/org/eclipse/mdht/uml/fhir/ui/providers/ConceptLabelProvider.java:[112] 
	Description description = (Description) element;
	            ^^^^^^^^^^^
The value of the local variable description is not used
[WARNING] /home/jenkins/agent/workspace/MDHT-master/fhir/plugins/org.eclipse.mdht.uml.fhir.ui/src/org/eclipse/mdht/uml/fhir/ui/filter/ValueSetFilter.java:[19] 
	import org.eclipse.uml2.uml.EnumerationLiteral;
	       ^^^^^^^^^^^^^^^^^^^^^^^^^^^^^^^^^^^^^^^
The import org.eclipse.uml2.uml.EnumerationLiteral is never used
[WARNING] /home/jenkins/agent/workspace/MDHT-master/fhir/plugins/org.eclipse.mdht.uml.fhir.ui/src/org/eclipse/mdht/uml/fhir/ui/properties/FHIRTableViewer.java:[37] 
	private ICellModifier adapterFactoryCellModifier = null;
	                      ^^^^^^^^^^^^^^^^^^^^^^^^^^
The value of the field FHIRTableViewer.adapterFactoryCellModifier is not used
[WARNING] /home/jenkins/agent/workspace/MDHT-master/fhir/plugins/org.eclipse.mdht.uml.fhir.ui/src/org/eclipse/mdht/uml/fhir/ui/dialogs/ConceptListDialog.java:[26] 
	private String inputTitle;
	               ^^^^^^^^^^
The value of the field ConceptListDialog.inputTitle is not used
[WARNING] /home/jenkins/agent/workspace/MDHT-master/fhir/plugins/org.eclipse.mdht.uml.fhir.ui/src/org/eclipse/mdht/uml/fhir/ui/dialogs/ConceptListDialog.java:[27] 
	private String inputMessage;
	               ^^^^^^^^^^^^
The value of the field ConceptListDialog.inputMessage is not used
[WARNING] /home/jenkins/agent/workspace/MDHT-master/fhir/plugins/org.eclipse.mdht.uml.fhir.ui/src/org/eclipse/mdht/uml/fhir/ui/providers/ConceptItem.java:[51] 
	public Object getAdapter(Class key) {
	       ^^^^^^
Type safety: The return type Object for getAdapter(Class) from the type ConceptItem needs unchecked conversion to conform to T from the type IAdaptable
[WARNING] /home/jenkins/agent/workspace/MDHT-master/fhir/plugins/org.eclipse.mdht.uml.fhir.ui/src/org/eclipse/mdht/uml/fhir/ui/properties/ValueSetBindingSection.java:[616] 
	getEObjectList().add(object);
	^^^^^^^^^^^^^^^^^^^^^^^^^^^^
Type safety: The method add(Object) belongs to the raw type List. References to generic type List<E> should be parameterized
[WARNING] /home/jenkins/agent/workspace/MDHT-master/fhir/plugins/org.eclipse.mdht.uml.fhir.ui/src/org/eclipse/mdht/uml/fhir/ui/properties/ValueSetBindingSection.java:[677] 
	public int getFeatureID(java.lang.Class expectedClass) {
	                        ^^^^^^^^^^^^^^^
Class is a raw type. References to generic type Class<T> should be parameterized
[WARNING] /home/jenkins/agent/workspace/MDHT-master/fhir/plugins/org.eclipse.mdht.uml.fhir.ui/src/org/eclipse/mdht/uml/fhir/ui/properties/ElementDefinitionSection.java:[44] 
	private ModifyListener modifyListener = new ModifyListener() {
	                       ^^^^^^^^^^^^^^
The value of the field ElementDefinitionSection.modifyListener is not used
[WARNING] /home/jenkins/agent/workspace/MDHT-master/fhir/plugins/org.eclipse.mdht.uml.fhir.ui/src/org/eclipse/mdht/uml/fhir/ui/properties/ElementDefinitionSection.java:[50] 
	private FocusListener focusListener = new FocusListener() {
	                      ^^^^^^^^^^^^^
The value of the field ElementDefinitionSection.focusListener is not used
[WARNING] /home/jenkins/agent/workspace/MDHT-master/fhir/plugins/org.eclipse.mdht.uml.fhir.ui/src/org/eclipse/mdht/uml/fhir/ui/properties/ElementDefinitionSection.java:[99] 
	getEObjectList().add(object);
	^^^^^^^^^^^^^^^^^^^^^^^^^^^^
Type safety: The method add(Object) belongs to the raw type List. References to generic type List<E> should be parameterized
[WARNING] /home/jenkins/agent/workspace/MDHT-master/fhir/plugins/org.eclipse.mdht.uml.fhir.ui/src/org/eclipse/mdht/uml/fhir/ui/properties/ValueSetMemberSection.java:[183] 
	private ModifyListener modifyListener = new ModifyListener() {
	                       ^^^^^^^^^^^^^^
The value of the field ValueSetMemberSection.modifyListener is not used
[WARNING] /home/jenkins/agent/workspace/MDHT-master/fhir/plugins/org.eclipse.mdht.uml.fhir.ui/src/org/eclipse/mdht/uml/fhir/ui/properties/ValueSetMemberSection.java:[189] 
	private FocusListener focusListener = new FocusListener() {
	                      ^^^^^^^^^^^^^
The value of the field ValueSetMemberSection.focusListener is not used
[WARNING] /home/jenkins/agent/workspace/MDHT-master/fhir/plugins/org.eclipse.mdht.uml.fhir.ui/src/org/eclipse/mdht/uml/fhir/ui/properties/ValueSetMemberSection.java:[359] 
	TableViewerColumn codeColumn = createTableViewerColumn(titles[0], bounds[0], 0);
	                  ^^^^^^^^^^
The value of the local variable codeColumn is not used
[WARNING] /home/jenkins/agent/workspace/MDHT-master/fhir/plugins/org.eclipse.mdht.uml.fhir.ui/src/org/eclipse/mdht/uml/fhir/ui/properties/ValueSetMemberSection.java:[360] 
	TableViewerColumn displayColumn = createTableViewerColumn(titles[1], bounds[1], 1);
	                  ^^^^^^^^^^^^^
The value of the local variable displayColumn is not used
[WARNING] /home/jenkins/agent/workspace/MDHT-master/fhir/plugins/org.eclipse.mdht.uml.fhir.ui/src/org/eclipse/mdht/uml/fhir/ui/properties/ValueSetMemberSection.java:[361] 
	TableViewerColumn systemColumn = createTableViewerColumn(titles[2], bounds[2], 2);
	                  ^^^^^^^^^^^^
The value of the local variable systemColumn is not used
[WARNING] /home/jenkins/agent/workspace/MDHT-master/fhir/plugins/org.eclipse.mdht.uml.fhir.ui/src/org/eclipse/mdht/uml/fhir/ui/properties/ValueSetMemberSection.java:[362] 
	TableViewerColumn versionColumn = createTableViewerColumn(titles[3], bounds[3], 3);
	                  ^^^^^^^^^^^^^
The value of the local variable versionColumn is not used
[WARNING] /home/jenkins/agent/workspace/MDHT-master/fhir/plugins/org.eclipse.mdht.uml.fhir.ui/src/org/eclipse/mdht/uml/fhir/ui/properties/ValueSetMemberSection.java:[394] 
	getEObjectList().add(object);
	^^^^^^^^^^^^^^^^^^^^^^^^^^^^
Type safety: The method add(Object) belongs to the raw type List. References to generic type List<E> should be parameterized
[WARNING] /home/jenkins/agent/workspace/MDHT-master/fhir/plugins/org.eclipse.mdht.uml.fhir.ui/src/org/eclipse/mdht/uml/fhir/ui/views/ConceptTaxonomyView.java:[21] 
	import org.eclipse.jface.viewers.ViewerSorter;
	       ^^^^^^^^^^^^^^^^^^^^^^^^^^^^^^^^^^^^^^
The type ViewerSorter is deprecated
[WARNING] /home/jenkins/agent/workspace/MDHT-master/fhir/plugins/org.eclipse.mdht.uml.fhir.ui/src/org/eclipse/mdht/uml/fhir/ui/views/ConceptTaxonomyView.java:[65] 
	class NameSorter extends ViewerSorter {
	                         ^^^^^^^^^^^^
The type ViewerSorter is deprecated
[WARNING] /home/jenkins/agent/workspace/MDHT-master/fhir/plugins/org.eclipse.mdht.uml.fhir.ui/src/org/eclipse/mdht/uml/fhir/ui/views/ConceptTaxonomyView.java:[86] 
	public Object getAdapter(Class key) {
	       ^^^^^^
Type safety: The return type Object for getAdapter(Class) from the type ConceptTaxonomyView needs unchecked conversion to conform to T from the type WorkbenchPart
[WARNING] /home/jenkins/agent/workspace/MDHT-master/fhir/plugins/org.eclipse.mdht.uml.fhir.ui/src/org/eclipse/mdht/uml/fhir/ui/views/ConceptTaxonomyView.java:[92] 
	return super.getAdapter(key);
	       ^^^^^^^^^^^^^^^^^^^^^
Type safety: Unchecked invocation getAdapter(Class) of the generic method getAdapter(Class<T>) of type WorkbenchPart
[WARNING] /home/jenkins/agent/workspace/MDHT-master/fhir/plugins/org.eclipse.mdht.uml.fhir.ui/src/org/eclipse/mdht/uml/fhir/ui/views/ConceptTaxonomyView.java:[92] 
	return super.getAdapter(key);
	                        ^^^
Type safety: The expression of type Class needs unchecked conversion to conform to Class<Object>
[WARNING] /home/jenkins/agent/workspace/MDHT-master/fhir/plugins/org.eclipse.mdht.uml.fhir.ui/src/org/eclipse/mdht/uml/fhir/ui/views/ConceptTaxonomyView.java:[173] 
	viewer.setSorter(new NameSorter());
	       ^^^^^^^^^^^^^^^^^^^^^^^^^^^
The method setSorter(ViewerSorter) from the type StructuredViewer is deprecated
37 problems (37 warnings)
[INFO] 
[INFO] --- maven-resources-plugin:2.6:testResources (default-testResources) @ org.eclipse.mdht.uml.fhir.ui ---
[INFO] Using 'UTF-8' encoding to copy filtered resources.
[INFO] skip non existing resourceDirectory /home/jenkins/agent/workspace/MDHT-master/fhir/plugins/org.eclipse.mdht.uml.fhir.ui/src/test/resources
[INFO] 
[INFO] --- tycho-source-plugin:1.4.0:plugin-source (plugin-source) @ org.eclipse.mdht.uml.fhir.ui ---
[INFO] Building jar: /home/jenkins/agent/workspace/MDHT-master/fhir/plugins/org.eclipse.mdht.uml.fhir.ui/target/org.eclipse.mdht.uml.fhir.ui-0.5.0-SNAPSHOT-sources.jar
[INFO] 
[INFO] --- target-platform-configuration:1.4.0:target-platform (default-target-platform) @ org.eclipse.mdht.uml.fhir.ui ---
[INFO] 
[INFO] --- tycho-packaging-plugin:1.4.0:package-plugin (default-package-plugin) @ org.eclipse.mdht.uml.fhir.ui ---
[INFO] Building jar: /home/jenkins/agent/workspace/MDHT-master/fhir/plugins/org.eclipse.mdht.uml.fhir.ui/target/org.eclipse.mdht.uml.fhir.ui-0.5.0-SNAPSHOT.jar
[INFO] 
[INFO] --- tycho-p2-plugin:1.4.0:p2-metadata-default (default-p2-metadata-default) @ org.eclipse.mdht.uml.fhir.ui ---
[INFO] 
[INFO] --- tycho-source-feature-plugin:1.4.0:source-feature (source-feature) @ org.eclipse.mdht.uml.fhir.ui ---
[INFO] 
[INFO] --- tycho-pack200b-plugin:1.4.0:pack (pack200-pack) @ org.eclipse.mdht.uml.fhir.ui ---
[INFO] Pack200 packing jar /home/jenkins/agent/workspace/MDHT-master/fhir/plugins/org.eclipse.mdht.uml.fhir.ui/target/org.eclipse.mdht.uml.fhir.ui-0.5.0-SNAPSHOT.jar
[INFO] 
[INFO] --- tycho-p2-plugin:1.4.0:p2-metadata (attach-p2-metadata) @ org.eclipse.mdht.uml.fhir.ui ---
[INFO]                                                                         
[INFO] ------------------------------------------------------------------------
[INFO] Building org.eclipse.mdht.uml.fhir.feature 0.5.0-SNAPSHOT
[INFO] ------------------------------------------------------------------------
[INFO] 
[INFO] --- maven-clean-plugin:2.6:clean (default-clean) @ org.eclipse.mdht.uml.fhir.feature ---
[INFO] Deleting /home/jenkins/agent/workspace/MDHT-master/fhir/features/org.eclipse.mdht.uml.fhir.feature/target
[INFO] 
[INFO] --- tycho-packaging-plugin:1.4.0:build-qualifier-aggregator (default-build-qualifier-aggregator) @ org.eclipse.mdht.uml.fhir.feature ---
[INFO] The project's OSGi version is 0.5.0.201912080601
[INFO] 
[INFO] --- tycho-packaging-plugin:1.4.0:validate-id (default-validate-id) @ org.eclipse.mdht.uml.fhir.feature ---
[INFO] 
[INFO] --- tycho-packaging-plugin:1.4.0:validate-version (default-validate-version) @ org.eclipse.mdht.uml.fhir.feature ---
[INFO] 
[INFO] --- tycho-source-plugin:1.4.0:plugin-source (plugin-source) @ org.eclipse.mdht.uml.fhir.feature ---
[INFO] 
[INFO] --- target-platform-configuration:1.4.0:target-platform (default-target-platform) @ org.eclipse.mdht.uml.fhir.feature ---
[INFO] 
[INFO] --- tycho-packaging-plugin:1.4.0:package-feature (default-package-feature) @ org.eclipse.mdht.uml.fhir.feature ---
[INFO] Building jar: /home/jenkins/agent/workspace/MDHT-master/fhir/features/org.eclipse.mdht.uml.fhir.feature/target/org.eclipse.mdht.uml.fhir.feature-0.5.0-SNAPSHOT.jar
[INFO] 
[INFO] --- tycho-p2-plugin:1.4.0:p2-metadata-default (default-p2-metadata-default) @ org.eclipse.mdht.uml.fhir.feature ---
[INFO] 
[INFO] --- tycho-p2-plugin:1.4.0:feature-p2-metadata (default-feature-p2-metadata) @ org.eclipse.mdht.uml.fhir.feature ---
[INFO] 
[INFO] --- tycho-source-feature-plugin:1.4.0:source-feature (source-feature) @ org.eclipse.mdht.uml.fhir.feature ---
[INFO] Building jar: /home/jenkins/agent/workspace/MDHT-master/fhir/features/org.eclipse.mdht.uml.fhir.feature/target/org.eclipse.mdht.uml.fhir.feature-0.5.0-SNAPSHOT-sources-feature.jar
[INFO] 
[INFO] --- tycho-pack200b-plugin:1.4.0:pack (pack200-pack) @ org.eclipse.mdht.uml.fhir.feature ---
[INFO] 
[INFO] --- tycho-p2-plugin:1.4.0:p2-metadata (attach-p2-metadata) @ org.eclipse.mdht.uml.fhir.feature ---
[INFO]                                                                         
[INFO] ------------------------------------------------------------------------
[INFO] Building org.eclipse.mdht.uml.fhir.core.model 0.5.0-SNAPSHOT
[INFO] ------------------------------------------------------------------------
[INFO] 
[INFO] --- maven-clean-plugin:2.6:clean (default-clean) @ org.eclipse.mdht.uml.fhir.core.model ---
[INFO] 
[INFO] --- tycho-packaging-plugin:1.4.0:build-qualifier (default-build-qualifier) @ org.eclipse.mdht.uml.fhir.core.model ---
[INFO] The project's OSGi version is 0.5.0.201912080601
[INFO] 
[INFO] --- tycho-packaging-plugin:1.4.0:validate-id (default-validate-id) @ org.eclipse.mdht.uml.fhir.core.model ---
[INFO] 
[INFO] --- tycho-packaging-plugin:1.4.0:validate-version (default-validate-version) @ org.eclipse.mdht.uml.fhir.core.model ---
[INFO] 
[INFO] --- maven-resources-plugin:2.6:resources (default-resources) @ org.eclipse.mdht.uml.fhir.core.model ---
[INFO] Using 'UTF-8' encoding to copy filtered resources.
[INFO] skip non existing resourceDirectory /home/jenkins/agent/workspace/MDHT-master/fhir/models/org.eclipse.mdht.uml.fhir.core.model/src/main/resources
[INFO] 
[INFO] --- tycho-compiler-plugin:1.4.0:compile (default-compile) @ org.eclipse.mdht.uml.fhir.core.model ---
[INFO] 
[INFO] --- maven-resources-plugin:2.6:testResources (default-testResources) @ org.eclipse.mdht.uml.fhir.core.model ---
[INFO] Using 'UTF-8' encoding to copy filtered resources.
[INFO] skip non existing resourceDirectory /home/jenkins/agent/workspace/MDHT-master/fhir/models/org.eclipse.mdht.uml.fhir.core.model/src/test/resources
[INFO] 
[INFO] --- tycho-source-plugin:1.4.0:plugin-source (plugin-source) @ org.eclipse.mdht.uml.fhir.core.model ---
[INFO] 
[INFO] --- target-platform-configuration:1.4.0:target-platform (default-target-platform) @ org.eclipse.mdht.uml.fhir.core.model ---
[INFO] 
[INFO] --- tycho-packaging-plugin:1.4.0:package-plugin (default-package-plugin) @ org.eclipse.mdht.uml.fhir.core.model ---
[INFO] Building jar: /home/jenkins/agent/workspace/MDHT-master/fhir/models/org.eclipse.mdht.uml.fhir.core.model/target/org.eclipse.mdht.uml.fhir.core.model-0.5.0-SNAPSHOT.jar
[INFO] 
[INFO] --- tycho-p2-plugin:1.4.0:p2-metadata-default (default-p2-metadata-default) @ org.eclipse.mdht.uml.fhir.core.model ---
[INFO] 
[INFO] --- tycho-source-feature-plugin:1.4.0:source-feature (source-feature) @ org.eclipse.mdht.uml.fhir.core.model ---
[INFO] 
[INFO] --- tycho-pack200b-plugin:1.4.0:pack (pack200-pack) @ org.eclipse.mdht.uml.fhir.core.model ---
[INFO] Pack200 packing jar /home/jenkins/agent/workspace/MDHT-master/fhir/models/org.eclipse.mdht.uml.fhir.core.model/target/org.eclipse.mdht.uml.fhir.core.model-0.5.0-SNAPSHOT.jar
[INFO] 
[INFO] --- tycho-p2-plugin:1.4.0:p2-metadata (attach-p2-metadata) @ org.eclipse.mdht.uml.fhir.core.model ---
[INFO] ------------------------------------------------------------------------
[INFO] Reactor Summary:
[INFO] 
[INFO] root ............................................... SUCCESS [  0.424 s]
[INFO] core ............................................... SUCCESS [  0.194 s]
[INFO] org.eclipse.mdht.emf.runtime ....................... SUCCESS [  6.408 s]
[INFO] org.eclipse.mdht.transform.core .................... SUCCESS [  0.569 s]
[INFO] org.eclipse.mdht.uml.common ........................ SUCCESS [  1.522 s]
[INFO] org.eclipse.mdht.uml.transform ..................... SUCCESS [  1.080 s]
[INFO] org.eclipse.mdht.uml.edit .......................... SUCCESS [  1.218 s]
[INFO] org.eclipse.mdht.uml.common.ui ..................... SUCCESS [  1.040 s]
[INFO] org.eclipse.mdht.uml.transform.ui .................. SUCCESS [  0.357 s]
[INFO] org.eclipse.mdht.uml.validation .................... SUCCESS [  0.650 s]
[INFO] org.eclipse.mdht.uml.ui.navigator .................. SUCCESS [  0.903 s]
[INFO] org.eclipse.mdht.uml.ui ............................ SUCCESS [  1.007 s]
[INFO] org.eclipse.mdht.uml.ui.properties ................. SUCCESS [  1.118 s]
[INFO] org.eclipse.mdht.uml.ui.ide ........................ SUCCESS [  0.304 s]
[INFO] org.eclipse.mdht.transformation.ocl ................ SUCCESS [  0.329 s]
[INFO] org.eclipse.mdht.transformation.ocl2java ........... SUCCESS [  0.228 s]
[INFO] org.eclipse.mdht.transformation.ocl2xpath .......... SUCCESS [  0.227 s]
[INFO] org.eclipse.mdht.transformation.ocl2csharp ......... SUCCESS [  0.225 s]
[INFO] org.eclipse.mdht.validation.ocl2java ............... SUCCESS [  0.351 s]
[INFO] org.eclipse.mdht.metamodel.traceability ............ SUCCESS [  0.403 s]
[INFO] org.eclipse.mdht.metamodel.traceability.edit ....... SUCCESS [  0.355 s]
[INFO] org.eclipse.mdht.metamodel.traceability.editor ..... SUCCESS [  0.902 s]
[INFO] org.eclipse.mdht.uml ............................... SUCCESS [  1.361 s]
[INFO] dita ............................................... SUCCESS [  0.004 s]
[INFO] org.eclipse.mdht.dita.ui ........................... SUCCESS [  0.625 s]
[INFO] org.eclipse.mdht.dita .............................. SUCCESS [  0.186 s]
[INFO] cda ................................................ SUCCESS [  0.003 s]
[INFO] org.eclipse.mdht.uml.hl7.vocab ..................... SUCCESS [  0.878 s]
[INFO] org.eclipse.mdht.uml.hl7.datatypes ................. SUCCESS [  1.326 s]
[INFO] org.eclipse.mdht.uml.hl7.rim ....................... SUCCESS [  0.339 s]
[INFO] org.eclipse.mdht.uml.cda ........................... SUCCESS [  4.319 s]
[INFO] org.eclipse.mdht.uml.term.core ..................... SUCCESS [  0.651 s]
[INFO] org.eclipse.mdht.uml.cda.resources ................. SUCCESS [  0.179 s]
[INFO] org.eclipse.mdht.uml.cda.core ...................... SUCCESS [  1.087 s]
[INFO] org.eclipse.mdht.uml.term.ui ....................... SUCCESS [  1.731 s]
[INFO] org.eclipse.mdht.uml.cda.ui ........................ SUCCESS [ 24.508 s]
[INFO] org.eclipse.mdht.cda.xml.ui ........................ SUCCESS [  3.613 s]
[INFO] org.eclipse.mdht.uml.term.transform ................ SUCCESS [  0.333 s]
[INFO] org.eclipse.mdht.uml.cda.transform ................. SUCCESS [  0.511 s]
[INFO] org.eclipse.mdht.uml.cda.dita ...................... SUCCESS [  1.345 s]
[INFO] org.eclipse.mdht.uml.cda.ant ....................... SUCCESS [  1.107 s]
[INFO] org.eclipse.mdht.uml.cda.validation ................ SUCCESS [  0.338 s]
[INFO] org.eclipse.mdht.api ............................... SUCCESS [  0.644 s]
[INFO] org.eclipse.mdht.api.dotnet ........................ SUCCESS [  0.462 s]
[INFO] org.eclipse.mdht.api.java .......................... SUCCESS [  0.321 s]
[INFO] org.eclipse.mdht.api.schematron .................... SUCCESS [  0.378 s]
[INFO] org.eclipse.mdht.uml.cda.test ...................... SUCCESS [ 15.730 s]
[INFO] org.eclipse.mdht.uml.cda.basic ..................... SUCCESS [  0.388 s]
[INFO] org.eclipse.mdht.uml.cda.tooling ................... SUCCESS [  1.282 s]
[INFO] fhir ............................................... SUCCESS [  0.003 s]
[INFO] org.eclipse.mdht.fhir.xsd .......................... SUCCESS [ 24.942 s]
[INFO] org.eclipse.mdht.uml.fhir.core ..................... SUCCESS [  7.982 s]
[INFO] org.eclipse.mdht.uml.fhir .......................... SUCCESS [  0.643 s]
[INFO] org.eclipse.mdht.uml.fhir.common ................... SUCCESS [  0.268 s]
[INFO] org.eclipse.mdht.uml.fhir.edit ..................... SUCCESS [  0.361 s]
[INFO] org.eclipse.mdht.uml.fhir.transform ................ SUCCESS [  0.453 s]
[INFO] org.eclipse.mdht.uml.fhir.ui ....................... SUCCESS [  0.817 s]
[INFO] org.eclipse.mdht.uml.fhir.feature .................. SUCCESS [  0.694 s]
[INFO] org.eclipse.mdht.uml.fhir.core.model ............... SUCCESS [  0.740 s]
[INFO] ------------------------------------------------------------------------
[INFO] BUILD SUCCESS
[INFO] ------------------------------------------------------------------------
[INFO] Total time: 04:50 min
[INFO] Finished at: 2019-12-08T06:06:10+00:00
[INFO] Final Memory: 271M/1205M
[INFO] ------------------------------------------------------------------------
[MDHT-master] $ /bin/sh -xe /tmp/jenkins1066117100872483731.sh
+ scp target/my_artifact.jar genie.mdht@projects-storage.eclipse.org:/home/data/httpd/download.eclipse.org/mdht/
Build timed out (after 30 minutes). Marking the build as aborted.
Build was aborted
No mail will be sent out, as 'MDHT-master #1399' does not have a result yet. Please make sure you set a proper result in case of pipeline/build scripts.
Archiving artifacts
Finished: ABORTED