Console Output

Skipping 4,099 KB.. Full Log
[DEBUG] Original compiler output: 
[INFO] 
[INFO] --- maven-resources-plugin:2.4.1:testResources (default-testResources) @ org.eclipse.mat.tests ---
[DEBUG] Configuring mojo org.apache.maven.plugins:maven-resources-plugin:2.4.1:testResources from plugin realm ClassRealm[plugin>org.apache.maven.plugins:maven-resources-plugin:2.4.1, parent: jdk.internal.loader.ClassLoaders$AppClassLoader@277050dc]
[DEBUG] Configuring mojo 'org.apache.maven.plugins:maven-resources-plugin:2.4.1:testResources' with basic configurator -->
[DEBUG]   (f) buildFilters = []
[DEBUG]   (f) encoding = ISO-8859-1
[DEBUG]   (f) escapeWindowsPaths = true
[DEBUG]   (s) includeEmptyDirs = false
[DEBUG]   (s) outputDirectory = /home/jenkins/agent/workspace/tycho-mat-nightly/plugins/org.eclipse.mat.tests/target/test-classes
[DEBUG]   (s) overwrite = false
[DEBUG]   (f) project = MavenProject: org.eclipse.mat:org.eclipse.mat.tests:1.12.0-SNAPSHOT @ /home/jenkins/agent/workspace/tycho-mat-nightly/plugins/org.eclipse.mat.tests/pom.xml
[DEBUG]   (s) resources = [Resource {targetPath: null, filtering: false, FileSet {directory: /home/jenkins/agent/workspace/tycho-mat-nightly/plugins/org.eclipse.mat.tests/src/test/resources, PatternSet [includes: {}, excludes: {}]}}]
[DEBUG]   (f) session = org.apache.maven.execution.MavenSession@5600ed17
[DEBUG]   (f) useBuildFilters = true
[DEBUG]   (s) useDefaultDelimiters = true
[DEBUG] -- end configuration --
[DEBUG] properties used {java.specification.version=11, env.USER_NAME=jenkins, env.EXECUTOR_NUMBER=0, p2.mirrorsPrefix=/mat/1.12.0/update-site/, java.vendor.url=https://adoptopenjdk.net/, env.JENKINS_DISCOVERY_PORT_50000_TCP_PORT=50000, env.TARGET_DEF=mat-2021-06, sun.boot.library.path=/opt/tools/java/adoptopenjdk/hotspot-jdk-11/11.0.11+9/lib, sun.java.command=org.codehaus.plexus.classworlds.launcher.Launcher -V -Dorg.slf4j.simpleLogger.log.org.apache.maven.cli.transfer.Slf4jMavenTransferListener=warn --batch-mode -P build-server,build-snapshot -Dmat-target=mat-2021-06 -Dmaven.test.failure.ignore=false -Dmat-product= -X -e clean deploy spotbugs:spotbugs, jdk.debug=release, maven.version=3.6.3, java.specification.name=Java Platform API Specification, java.vm.specification.vendor=Oracle Corporation, cbi-releases-repo.url=https://repo.eclipse.org/content/repositories/cbi-releases/, macSigner.forceContinue=false, java.runtime.version=11.0.11+9, env.GIT_BRANCH=origin/master, env.JENKINS_UI_PORT_80_TCP_PORT=80, java.vendor.version=AdoptOpenJDK-11.0.11+9, java.io.tmpdir=/tmp, java.version=11.0.11, java.vm.specification.name=Java Virtual Machine Specification, env.JOB_NAME=tycho-mat-nightly, java.library.path=/usr/java/packages/lib:/usr/lib64:/lib64:/lib:/usr/lib, java.vendor=AdoptOpenJDK, env.HUDSON_HOME=/var/jenkins, maven.test.failure.ignore=false, env.XAUTHORITY=/home/jenkins/agent/workspace/tycho-mat-nightly/.Xauthority-12207828466524607439, env.CLEAN_MVN_CACHE=false, env.LANG=en_US.UTF-8, env.JENKINS_AGENT_WORKDIR=/home/jenkins/agent, env.GIT_FETCH_REFSPEC=master, user.timezone=, env.KUBERNETES_PORT_443_TCP=tcp://10.30.0.1:443, env.RUN_DISPLAY_URL=https://ci.eclipse.org/mat/job/tycho-mat-nightly/1226/display/redirect, java.vm.specification.version=11, p2.statsTrackedArtifacts=org.eclipse.mat.api,org.eclipse.mat.chart,org.eclipse.mat.rcp, user.home=/home/jenkins, env.JENKINS_DISCOVERY_PORT_50000_TCP_ADDR=10.30.45.8, env.GIT_PREVIOUS_COMMIT=790dfa6f0e0b9222c47530abd058c073f321ad3f, p2.mirrorsURL=https://www.eclipse.org/downloads/download.php?format=xml&file=/mat/1.12.0/update-site/, tycho.env.osgi.ws=gtk, env.JENKINS_UI_PORT_80_TCP=tcp://10.30.30.35:80, cbi-snapshots-repo.url=https://repo.eclipse.org/content/repositories/cbi-snapshots/, os.version=5.10.19-200.fc33.x86_64, env.NODE_NAME=centos-7-1002c, java.vm.name=OpenJDK 64-Bit Server VM, cbi-plugins.version=1.3.1, env.M2_HOME=/opt/tools/apache-maven/latest, env.JENKINS_DISCOVERY_PORT=tcp://10.30.45.8:50000, download-publish-path=/home/data/httpd/download.eclipse.org/mat/snapshots/update-site, os.arch=amd64, env.JENKINS_UI_PORT=tcp://10.30.30.35:80, env.JENKINS_DISCOVERY_SERVICE_HOST=10.30.45.8, awt.toolkit=sun.awt.X11.XToolkit, env.JENKINS_REMOTING_JAVA_OPTS=-showversion -XshowSettings:vm -Xmx256m -Dorg.jenkinsci.remoting.engine.JnlpProtocol3.disabled=true -Dorg.jenkinsci.plugins.gitclient.CliGitAPIImpl.useSETSID=true, env.HUDSON_URL=https://ci.eclipse.org/mat/, env.JAVA_HOME=/opt/tools/java/adoptopenjdk/hotspot-jdk-11/latest, java.vm.compressedOopsMode=32-bit, env.KUBERNETES_PORT_443_TCP_PROTO=tcp, env.BUILD_URL=https://ci.eclipse.org/mat/job/tycho-mat-nightly/1226/, env.JOB_URL=https://ci.eclipse.org/mat/job/tycho-mat-nightly/, env.NODE_LABELS=centos-7 centos-7-1002c jipp-migration migration, env.SSH_AUTH_SOCK=/tmp/ssh-qbbwXyzCqrIW/agent.58, sun.os.patch.level=unknown, signer-input-directory=/home/data/httpd/download-staging.priv/tools/mat, download-publish-rcp-path=/home/data/httpd/download.eclipse.org/mat/snapshots/rcp, library.jansi.path=/opt/tools/apache-maven/latest/lib/jansi-native, env.HUDSON_SERVER_COOKIE=8d37e17984695e37, env.GIT_PREVIOUS_SUCCESSFUL_COMMIT=77a8def9df2133f887d6e8bdb0beaf52b3b63799, tycho.env.osgi.arch=x86_64, maven.conf=/opt/tools/apache-maven/latest/conf, sun.java.launcher=SUN_STANDARD, user.country=US, mat-target=mat-2021-06, env.MAVEN_ARGS=-X -e, env.GIT_COMMIT=db82f0f8fdf4fc3137d7eaea5db6d29902855f60, java.runtime.name=OpenJDK Runtime Environment, mat-product=, env.BUILD_DISPLAY_NAME=#1226, env.JENKINS_UI_SERVICE_PORT_HTTP=80, env.MAVEN_CMD_LINE_ARGS= -V -Dorg.slf4j.simpleLogger.log.org.apache.maven.cli.transfer.Slf4jMavenTransferListener=warn --batch-mode -P build-server,build-snapshot -Dmat-target=mat-2021-06 -Dmaven.test.failure.ignore=false -Dmat-product= -X -e clean deploy spotbugs:spotbugs, env.WORKSPACE_TMP=/home/jenkins/agent/workspace/tycho-mat-nightly@tmp, tycho.env.osgi.os=linux, env.JOB_BASE_NAME=tycho-mat-nightly, env.TERM=xterm, sun.cpu.isalist=, env.mvnArguments=-P build-server,build-snapshot -Dmat-target=mat-2021-06 -Dmaven.test.failure.ignore=false -Dmat-product= -X -e, sun.arch.data.model=64, env.JENKINS_HOME=/var/jenkins, env.JOB_DISPLAY_URL=https://ci.eclipse.org/mat/job/tycho-mat-nightly/display/redirect, eclipse-repo.url=https://repo.eclipse.org/content/repositories/cbi/, java.specification.vendor=Oracle Corporation, java.version.date=2021-04-20, java.home=/opt/tools/java/adoptopenjdk/hotspot-jdk-11/11.0.11+9, env.JENKINS_SERVER_COOKIE=8d37e17984695e37, download-remote-publish-path=genie.mat@projects-storage.eclipse.org:/home/data/httpd/download.eclipse.org/mat/snapshots/update-site, env.GIT_URL=https://git.eclipse.org/r/mat/org.eclipse.mat.git, sun.management.compiler=HotSpot 64-Bit Tiered Compilers, env.RUN_ARTIFACTS_DISPLAY_URL=https://ci.eclipse.org/mat/job/tycho-mat-nightly/1226/display/redirect?page=artifacts, env.PATH=/opt/tools/java/adoptopenjdk/hotspot-jdk-11/latest/bin:/opt/tools/java/adoptopenjdk/hotspot-jdk-11/latest/bin:/usr/local/sbin:/usr/local/bin:/usr/sbin:/usr/bin:/sbin:/bin, file.encoding=UTF-8, env.HOSTNAME=centos-7-1002c, env.SHLVL=1, env.WORKSPACE=/home/jenkins/agent/workspace/tycho-mat-nightly, java.awt.printerjob=sun.print.PSPrinterJob, env.BUILD_ID=1226, classworlds.conf=/opt/tools/apache-maven/latest/bin/m2.conf, sun.io.unicode.encoding=UnicodeLittle, env.JENKINS_TUNNEL=jenkins-discovery.mat.svc.cluster.local:50000, env.RUN_TESTS_DISPLAY_URL=https://ci.eclipse.org/mat/job/tycho-mat-nightly/1226/display/redirect?page=tests, env.TEST_FAIL_IGNORE=false, env.JENKINS_UI_SERVICE_PORT=80, env.JENKINS_DISCOVERY_PORT_50000_TCP_PROTO=tcp, env.KUBERNETES_SERVICE_PORT_HTTPS=443, os.name=Linux, env.DISPLAY=:30, env.JENKINS_AGENT_NAME=centos-7-1002c, env.OPENJ9_JAVA_OPTIONS=-XX:+IgnoreUnrecognizedVMOptions -XX:+IdleTuningCompactOnIdle -XX:+IdleTuningGcOnIdle, env.HUDSON_COOKIE=a228bb95-b253-4b2b-bb68-73414c5dd6d9, java.awt.graphicsenv=sun.awt.X11GraphicsEnvironment, tycho-version=2.0.0, env.JENKINS_URL=https://ci.eclipse.org/mat/, cbi-repo-url=https://repo.eclipse.org/content/repositories/cbi-releases/, org.slf4j.simpleLogger.log.org.apache.maven.cli.transfer.Slf4jMavenTransferListener=warn, path.separator=:, env.JENKINS_DISCOVERY_PORT_50000_TCP=tcp://10.30.45.8:50000, env.KUBERNETES_SERVICE_HOST=10.30.0.1, maven.multiModuleProjectDirectory=/home/jenkins/agent/workspace/tycho-mat-nightly/parent, env.MAVEN_PROJECTBASEDIR=/home/jenkins/agent/workspace/tycho-mat-nightly/parent, java.vm.info=mixed mode, java.class.version=55.0, env.GITLAB_OBJECT_KIND=none, env.KUBERNETES_PORT_443_TCP_ADDR=10.30.0.1, env.BUILD_TAG=jenkins-tycho-mat-nightly-1226, sun.jnu.encoding=UTF-8, env.JENKINS_SECRET=355c64c1a2f32bc4fe551bd3510102b38f39db931bf27afc3881cd575fdf9a11, maven.build.version=Apache Maven 3.6.3 (cecedd343002696d0abb50b32b541b8a6ba2883f), maven.home=/opt/tools/apache-maven/latest, file.separator=/, env.JENKINS_UI_PORT_80_TCP_ADDR=10.30.30.35, line.separator=
, buildQualifier=202106170957, env.GIT_REF_TO_BUILD=master, user.name=jenkins, env.JENKINS_UI_PORT_80_TCP_PROTO=tcp, env.RUN_CHANGES_DISPLAY_URL=https://ci.eclipse.org/mat/job/tycho-mat-nightly/1226/display/redirect?page=changes, env.NSS_SDB_USE_CACHE=no, env.OLDPWD=/home/jenkins/agent/workspace/tycho-mat-nightly/parent, env.BUILD_NUMBER=1226, env.PWD=/home/jenkins/agent/workspace/tycho-mat-nightly/parent, java.class.path=/opt/tools/apache-maven/latest/boot/plexus-classworlds-2.6.0.jar, env.HOME=/home/jenkins, java.vm.vendor=AdoptOpenJDK, env.JENKINS_NAME=centos-7-1002c, env.KUBERNETES_PORT_443_TCP_PORT=443, env.JENKINS_DISCOVERY_SERVICE_PORT=50000, env.JENKINS_DISCOVERY_SERVICE_PORT_JNLP=50000, qualifiedVersion=1.12.0.202106170957, env.JENKINS_UI_SERVICE_HOST=10.30.30.35, sun.cpu.endian=little, user.language=en, p2.statsURI=https://download.eclipse.org/stats/mat, mat-release-repo-url=http://download.eclipse.org/mat/latest/update-site/, env.KUBERNETES_SERVICE_PORT=443, unqualifiedVersion=1.12.0, env.KUBERNETES_PORT=tcp://10.30.0.1:443, java.vendor.url.bug=https://github.com/AdoptOpenJDK/openjdk-support/issues, user.dir=/home/jenkins/agent/workspace/tycho-mat-nightly/parent, java.vm.version=11.0.11+9, download-remote-publish-rcp-path=genie.mat@projects-storage.eclipse.org:/home/data/httpd/download.eclipse.org/mat/snapshots/rcp}
[INFO] Using 'ISO-8859-1' encoding to copy filtered resources.
[DEBUG] resource with targetPath null
directory /home/jenkins/agent/workspace/tycho-mat-nightly/plugins/org.eclipse.mat.tests/src/test/resources
excludes []
includes []
[INFO] skip non existing resourceDirectory /home/jenkins/agent/workspace/tycho-mat-nightly/plugins/org.eclipse.mat.tests/src/test/resources
[INFO] 
[INFO] --- target-platform-configuration:2.0.0:target-platform (default-target-platform) @ org.eclipse.mat.tests ---
[DEBUG] Configuring mojo org.eclipse.tycho:target-platform-configuration:2.0.0:target-platform from plugin realm ClassRealm[plugin>org.eclipse.tycho:target-platform-configuration:2.0.0, parent: jdk.internal.loader.ClassLoaders$AppClassLoader@277050dc]
[DEBUG] Configuring mojo 'org.eclipse.tycho:target-platform-configuration:2.0.0:target-platform' with basic configurator -->
[DEBUG]   (f) project = MavenProject: org.eclipse.mat:org.eclipse.mat.tests:1.12.0-SNAPSHOT @ /home/jenkins/agent/workspace/tycho-mat-nightly/plugins/org.eclipse.mat.tests/pom.xml
[DEBUG] -- end configuration --
[DEBUG] Adding reactor project: MavenProject: org.eclipse.mat:org.eclipse.mat.ibmdumps:1.12.0-SNAPSHOT @ /home/jenkins/agent/workspace/tycho-mat-nightly/plugins/org.eclipse.mat.ibmdumps/pom.xml
[DEBUG] Adding reactor project: MavenProject: org.eclipse.mat:org.eclipse.mat.report:1.12.0-SNAPSHOT @ /home/jenkins/agent/workspace/tycho-mat-nightly/plugins/org.eclipse.mat.report/pom.xml
[DEBUG] Adding reactor project: MavenProject: org.eclipse.mat:org.eclipse.mat.api:1.12.0-SNAPSHOT @ /home/jenkins/agent/workspace/tycho-mat-nightly/plugins/org.eclipse.mat.api/pom.xml
[DEBUG] Adding reactor project: MavenProject: org.eclipse.mat:org.eclipse.mat.chart:1.12.0-SNAPSHOT @ /home/jenkins/agent/workspace/tycho-mat-nightly/plugins/org.eclipse.mat.chart/pom.xml
[DEBUG] Adding reactor project: MavenProject: org.eclipse.mat:org.eclipse.mat.dtfj:1.12.0-SNAPSHOT @ /home/jenkins/agent/workspace/tycho-mat-nightly/plugins/org.eclipse.mat.dtfj/pom.xml
[DEBUG] Adding reactor project: MavenProject: org.eclipse.mat:org.eclipse.mat.parser:1.12.0-SNAPSHOT @ /home/jenkins/agent/workspace/tycho-mat-nightly/plugins/org.eclipse.mat.parser/pom.xml
[DEBUG] Adding reactor project: MavenProject: org.eclipse.mat:org.eclipse.mat.ui:1.12.0-SNAPSHOT @ /home/jenkins/agent/workspace/tycho-mat-nightly/plugins/org.eclipse.mat.ui/pom.xml
[DEBUG] Adding reactor project: MavenProject: org.eclipse.mat:org.eclipse.mat.hprof:1.12.0-SNAPSHOT @ /home/jenkins/agent/workspace/tycho-mat-nightly/plugins/org.eclipse.mat.hprof/pom.xml
[INFO] 
[INFO] --- tycho-packaging-plugin:2.0.0:package-plugin (default-package-plugin) @ org.eclipse.mat.tests ---
[DEBUG] Configuring mojo org.eclipse.tycho:tycho-packaging-plugin:2.0.0:package-plugin from plugin realm ClassRealm[plugin>org.eclipse.tycho:tycho-packaging-plugin:2.0.0, parent: jdk.internal.loader.ClassLoaders$AppClassLoader@277050dc]
[DEBUG] Configuring mojo 'org.eclipse.tycho:tycho-packaging-plugin:2.0.0:package-plugin' with basic configurator -->
[DEBUG]   (f) buildDirectory = /home/jenkins/agent/workspace/tycho-mat-nightly/plugins/org.eclipse.mat.tests/target
[DEBUG]   (f) finalName = org.eclipse.mat.tests-1.12.0-SNAPSHOT
[DEBUG]   (f) project = MavenProject: org.eclipse.mat:org.eclipse.mat.tests:1.12.0-SNAPSHOT @ /home/jenkins/agent/workspace/tycho-mat-nightly/plugins/org.eclipse.mat.tests/pom.xml
[DEBUG]   (f) qualifier = 202106170957
[DEBUG]   (f) session = org.apache.maven.execution.MavenSession@5600ed17
[DEBUG]   (f) strictBinIncludes = true
[DEBUG]   (f) useDefaultExcludes = true
[DEBUG] -- end configuration --
[INFO] Building jar: /home/jenkins/agent/workspace/tycho-mat-nightly/plugins/org.eclipse.mat.tests/target/org.eclipse.mat.tests-1.12.0-SNAPSHOT.jar
[DEBUG] adding directory META-INF/
[DEBUG] adding entry META-INF/MANIFEST.MF
[DEBUG] adding directory org/
[DEBUG] adding directory org/eclipse/
[DEBUG] adding directory org/eclipse/mat/
[DEBUG] adding directory org/eclipse/mat/tests/
[DEBUG] adding directory org/eclipse/mat/tests/collect/
[DEBUG] adding directory org/eclipse/mat/tests/snapshot/
[DEBUG] adding directory org/eclipse/mat/tests/parser/
[DEBUG] adding directory org/eclipse/mat/tests/regression/
[DEBUG] adding directory org/eclipse/mat/tests/regression/comparator/
[DEBUG] adding directory org/eclipse/mat/tests/regression/query/
[DEBUG] adding directory org/eclipse/mat/tests/ui/
[DEBUG] adding directory org/eclipse/mat/tests/ui/snapshot/
[DEBUG] adding directory org/eclipse/mat/tests/ui/snapshot/panes/
[DEBUG] adding directory org/eclipse/mat/tests/ui/snapshot/panes/textPartitioning/
[DEBUG] adding directory org/eclipse/mat/tests/queries/
[DEBUG] adding directory org/eclipse/mat/tests/acquire/
[DEBUG] adding entry org/eclipse/mat/tests/collect/ExtractCollectionEntriesTest4.class
[DEBUG] adding entry org/eclipse/mat/tests/collect/ExtractCollectionEntriesTest3.class
[DEBUG] adding entry org/eclipse/mat/tests/collect/CompressedArraysTest.class
[DEBUG] adding entry org/eclipse/mat/tests/collect/PrimitiveArrayTests.class
[DEBUG] adding entry org/eclipse/mat/tests/collect/CommandTests.class
[DEBUG] adding entry org/eclipse/mat/tests/collect/SetIntTest.class
[DEBUG] adding entry org/eclipse/mat/tests/collect/ExtractCollectionEntriesTest.class
[DEBUG] adding entry org/eclipse/mat/tests/collect/PrimitiveMapTests$11.class
[DEBUG] adding entry org/eclipse/mat/tests/collect/PrimitiveMapTests$MapObjectLongBridge3.class
[DEBUG] adding entry org/eclipse/mat/tests/collect/PrimitiveMapTests.class
[DEBUG] adding entry org/eclipse/mat/tests/collect/PrimitiveMapTests$16.class
[DEBUG] adding entry org/eclipse/mat/tests/collect/PrimitiveMapTests$MapIntObjectBridge$1.class
[DEBUG] adding entry org/eclipse/mat/tests/collect/PrimitiveMapTests$MapIntLongBridge.class
[DEBUG] adding entry org/eclipse/mat/tests/collect/PrimitiveMapTests$MapObjectLongBridge2.class
[DEBUG] adding entry org/eclipse/mat/tests/collect/PrimitiveMapTests$MapLongObjectBridge$1.class
[DEBUG] adding entry org/eclipse/mat/tests/collect/PrimitiveMapTests$MapObjectLongBridge4.class
[DEBUG] adding entry org/eclipse/mat/tests/collect/PrimitiveMapTests$7.class
[DEBUG] adding entry org/eclipse/mat/tests/collect/PrimitiveMapTests$MapLongObjectBridge.class
[DEBUG] adding entry org/eclipse/mat/tests/collect/PrimitiveMapTests$5.class
[DEBUG] adding entry org/eclipse/mat/tests/collect/PrimitiveMapTests$MapObjectLongBridge$1.class
[DEBUG] adding entry org/eclipse/mat/tests/collect/PrimitiveMapTests$10.class
[DEBUG] adding entry org/eclipse/mat/tests/collect/PrimitiveMapTests$2.class
[DEBUG] adding entry org/eclipse/mat/tests/collect/PrimitiveMapTests$MapIntObjectBridge2.class
[DEBUG] adding entry org/eclipse/mat/tests/collect/PrimitiveMapTests$12.class
[DEBUG] adding entry org/eclipse/mat/tests/collect/PrimitiveMapTests$8.class
[DEBUG] adding entry org/eclipse/mat/tests/collect/PrimitiveMapTests$MapIntLongBridge$1.class
[DEBUG] adding entry org/eclipse/mat/tests/collect/PrimitiveMapTests$15.class
[DEBUG] adding entry org/eclipse/mat/tests/collect/PrimitiveMapTests$14.class
[DEBUG] adding entry org/eclipse/mat/tests/collect/PrimitiveMapTests$13.class
[DEBUG] adding entry org/eclipse/mat/tests/collect/PrimitiveMapTests$9.class
[DEBUG] adding entry org/eclipse/mat/tests/collect/PrimitiveMapTests$MapIntObjectBridge.class
[DEBUG] adding entry org/eclipse/mat/tests/collect/PrimitiveMapTests$1.class
[DEBUG] adding entry org/eclipse/mat/tests/collect/PrimitiveMapTests$TestStub.class
[DEBUG] adding entry org/eclipse/mat/tests/collect/PrimitiveMapTests$MapObjectLongBridge.class
[DEBUG] adding entry org/eclipse/mat/tests/collect/PrimitiveMapTests$4.class
[DEBUG] adding entry org/eclipse/mat/tests/collect/PrimitiveMapTests$3.class
[DEBUG] adding entry org/eclipse/mat/tests/collect/PrimitiveMapTests$MapLongObjectBridge3.class
[DEBUG] adding entry org/eclipse/mat/tests/collect/PrimitiveMapTests$MapIntLongBridge2.class
[DEBUG] adding entry org/eclipse/mat/tests/collect/PrimitiveMapTests$6.class
[DEBUG] adding entry org/eclipse/mat/tests/collect/PrimitiveMapTests$MapLongObjectBridge2.class
[DEBUG] adding entry org/eclipse/mat/tests/collect/PrimitiveMapTests$MapIntObjectBridge3.class
[DEBUG] adding entry org/eclipse/mat/tests/collect/ExtractCollectionEntriesBase$1.class
[DEBUG] adding entry org/eclipse/mat/tests/collect/ExtractCollectionEntriesBase.class
[DEBUG] adding entry org/eclipse/mat/tests/collect/SortTest.class
[DEBUG] adding entry org/eclipse/mat/tests/collect/SetLongTest.class
[DEBUG] adding entry org/eclipse/mat/tests/collect/ExtractCollectionEntriesTest2.class
[DEBUG] adding entry org/eclipse/mat/tests/snapshot/QueryLookupTest.class
[DEBUG] adding entry org/eclipse/mat/tests/snapshot/DominatorTreeTest.class
[DEBUG] adding entry org/eclipse/mat/tests/snapshot/QueriesTest.class
[DEBUG] adding entry org/eclipse/mat/tests/snapshot/QueriesTest$CheckedProgressListener.class
[DEBUG] adding entry org/eclipse/mat/tests/snapshot/QueriesTest$CheckedWorkProgressListener.class
[DEBUG] adding entry org/eclipse/mat/tests/snapshot/TestInstanceSizes.class
[DEBUG] adding entry org/eclipse/mat/tests/snapshot/MultipleSnapshots.class
[DEBUG] adding entry org/eclipse/mat/tests/snapshot/GeneralSnapshotTests$Methods.class
[DEBUG] adding entry org/eclipse/mat/tests/snapshot/GeneralSnapshotTests.class
[DEBUG] adding entry org/eclipse/mat/tests/snapshot/GeneralSnapshotTests$CheckedProgressListener.class
[DEBUG] adding entry org/eclipse/mat/tests/snapshot/GeneralSnapshotTests$Stacks.class
[DEBUG] adding entry org/eclipse/mat/tests/snapshot/OQLTest$CountListener.class
[DEBUG] adding entry org/eclipse/mat/tests/snapshot/OQLTest.class
[DEBUG] adding entry org/eclipse/mat/tests/snapshot/TestUnreachableObjects$Record.class
[DEBUG] adding entry org/eclipse/mat/tests/snapshot/TestUnreachableObjects.class
[DEBUG] adding entry org/eclipse/mat/tests/parser/TestIndex$1.class
[DEBUG] adding entry org/eclipse/mat/tests/parser/TestIndex.class
[DEBUG] adding entry org/eclipse/mat/tests/parser/TestIndex1to1.class
[DEBUG] adding entry org/eclipse/mat/tests/parser/TestIndex1to1$1.class
[DEBUG] adding entry org/eclipse/mat/tests/regression/ForceNewBaselineApplication.class
[DEBUG] adding entry org/eclipse/mat/tests/regression/comparator/BinaryComparator.class
[DEBUG] adding entry org/eclipse/mat/tests/regression/comparator/CSVComparator.class
[DEBUG] adding entry org/eclipse/mat/tests/regression/comparator/IComparator.class
[DEBUG] adding entry org/eclipse/mat/tests/regression/CleanAllApplication.class
[DEBUG] adding entry org/eclipse/mat/tests/regression/Application.class
[DEBUG] adding entry org/eclipse/mat/tests/regression/query/DomTreeRegTest.class
[DEBUG] adding entry org/eclipse/mat/tests/regression/query/MergedPathsRegTest.class
[DEBUG] adding entry org/eclipse/mat/tests/regression/query/RetainedSizeForHistogramQuery.class
[DEBUG] adding entry org/eclipse/mat/tests/regression/query/StringResult.class
[DEBUG] adding entry org/eclipse/mat/tests/regression/query/Paths2GCRootsRegTest.class
[DEBUG] adding entry org/eclipse/mat/tests/regression/TestParseApp$ClockedProgressListener.class
[DEBUG] adding entry org/eclipse/mat/tests/regression/TestParseApp.class
[DEBUG] adding entry org/eclipse/mat/tests/regression/TestSuiteResult.class
[DEBUG] adding entry org/eclipse/mat/tests/regression/SingleTestResult.class
[DEBUG] adding entry org/eclipse/mat/tests/regression/PerfData.class
[DEBUG] adding entry org/eclipse/mat/tests/regression/TestApplication$StreamGobbler.class
[DEBUG] adding entry org/eclipse/mat/tests/regression/TestApplication.class
[DEBUG] adding entry org/eclipse/mat/tests/regression/TestApplication$Parameter.class
[DEBUG] adding entry org/eclipse/mat/tests/regression/TestApplication$2.class
[DEBUG] adding entry org/eclipse/mat/tests/regression/TestApplication$1.class
[DEBUG] adding entry org/eclipse/mat/tests/regression/RegTestUtils$3.class
[DEBUG] adding entry org/eclipse/mat/tests/regression/RegTestUtils.class
[DEBUG] adding entry org/eclipse/mat/tests/regression/RegTestUtils$2.class
[DEBUG] adding entry org/eclipse/mat/tests/regression/RegTestUtils$1.class
[DEBUG] adding entry org/eclipse/mat/tests/regression/Difference.class
[DEBUG] adding entry org/eclipse/mat/tests/CreateCollectionDump$EmptyListCollectionTestData.class
[DEBUG] adding entry org/eclipse/mat/tests/CreateCollectionDump$CollectionTestData.class
[DEBUG] adding entry org/eclipse/mat/tests/CreateCollectionDump.class
[DEBUG] adding entry org/eclipse/mat/tests/CreateCollectionDump$NonListCollectionTestData.class
[DEBUG] adding entry org/eclipse/mat/tests/CreateCollectionDump$EmptyMapTestData.class
[DEBUG] adding entry org/eclipse/mat/tests/CreateCollectionDump$CollectionTestData$1.class
[DEBUG] adding entry org/eclipse/mat/tests/CreateCollectionDump$ExamplePrinterStateReason.class
[DEBUG] adding entry org/eclipse/mat/tests/CreateCollectionDump$ListCollectionTestData.class
[DEBUG] adding entry org/eclipse/mat/tests/CreateCollectionDump$MapTestData.class
[DEBUG] adding entry org/eclipse/mat/tests/CreateCollectionDump$EmptyNonListCollectionTestData.class
[DEBUG] adding entry org/eclipse/mat/tests/ui/snapshot/panes/textPartitioning/TestClassNameExtractor.class
[DEBUG] adding entry org/eclipse/mat/tests/ui/snapshot/panes/textPartitioning/TestClassNameExtractor$MockTextViewer.class
[DEBUG] adding entry org/eclipse/mat/tests/ui/snapshot/panes/textPartitioning/TestOQLPartitionScanner.class
[DEBUG] adding entry org/eclipse/mat/tests/CreatePerformanceDump.class
[DEBUG] adding entry org/eclipse/mat/tests/CreateSampleDump$DominatorTestData$H.class
[DEBUG] adding entry org/eclipse/mat/tests/CreateSampleDump$DominatorTestData$F.class
[DEBUG] adding entry org/eclipse/mat/tests/CreateSampleDump$DominatorTestData$A.class
[DEBUG] adding entry org/eclipse/mat/tests/CreateSampleDump$DominatorTestData$C.class
[DEBUG] adding entry org/eclipse/mat/tests/CreateSampleDump$DominatorTestData$K.class
[DEBUG] adding entry org/eclipse/mat/tests/CreateSampleDump$DominatorTestData$L.class
[DEBUG] adding entry org/eclipse/mat/tests/CreateSampleDump$DominatorTestData.class
[DEBUG] adding entry org/eclipse/mat/tests/CreateSampleDump$DominatorTestData$R.class
[DEBUG] adding entry org/eclipse/mat/tests/CreateSampleDump$DominatorTestData$G.class
[DEBUG] adding entry org/eclipse/mat/tests/CreateSampleDump$DominatorTestData$J.class
[DEBUG] adding entry org/eclipse/mat/tests/CreateSampleDump$DominatorTestData$E.class
[DEBUG] adding entry org/eclipse/mat/tests/CreateSampleDump.class
[DEBUG] adding entry org/eclipse/mat/tests/CreateSampleDump$DominatorTestData$D.class
[DEBUG] adding entry org/eclipse/mat/tests/CreateSampleDump$DominatorTestData$B.class
[DEBUG] adding entry org/eclipse/mat/tests/CreateSampleDump$DominatorTestData$I.class
[DEBUG] adding entry org/eclipse/mat/tests/CreateSampleDump$ReferenceTestData.class
[DEBUG] adding entry org/eclipse/mat/tests/queries/Context$StructuredResultQuery.class
[DEBUG] adding entry org/eclipse/mat/tests/queries/Context$OptionalObjectQuery.class
[DEBUG] adding entry org/eclipse/mat/tests/queries/Context$SecondarySnapshotQuery.class
[DEBUG] adding entry org/eclipse/mat/tests/queries/Context.class
[DEBUG] adding entry org/eclipse/mat/tests/queries/Context$StructuredResultsQuery.class
[DEBUG] adding entry org/eclipse/mat/tests/queries/Context$ResultTableQuery.class
[DEBUG] adding entry org/eclipse/mat/tests/queries/Context$ResultTreeQuery.class
[DEBUG] adding entry org/eclipse/mat/tests/queries/Context$StructuredResults2Query.class
[DEBUG] adding entry org/eclipse/mat/tests/queries/Context$SupplementTest.class
[DEBUG] adding entry org/eclipse/mat/tests/queries/Context$ContextObjectsQuery.class
[DEBUG] adding entry org/eclipse/mat/tests/queries/Context$ContextObjectQuery.class
[DEBUG] adding entry org/eclipse/mat/tests/queries/Context$ContextObjectSetsQuery.class
[DEBUG] adding entry org/eclipse/mat/tests/queries/Context$ContextObjectSetQuery.class
[DEBUG] adding entry org/eclipse/mat/tests/queries/Context$OptionalContextObjectQuery.class
[DEBUG] adding entry org/eclipse/mat/tests/queries/CompositeResultTest.class
[DEBUG] adding entry org/eclipse/mat/tests/JUnit4TestRunner.class
[DEBUG] adding entry org/eclipse/mat/tests/JUnit4TestRunner$1.class
[DEBUG] adding entry org/eclipse/mat/tests/acquire/AcquireDumpTest.class
[DEBUG] adding entry org/eclipse/mat/tests/TestSnapshots$DirDeleter.class
[DEBUG] adding entry org/eclipse/mat/tests/TestSnapshots.class
[DEBUG] adding entry org/eclipse/mat/tests/AllTests.class
[DEBUG] adding directory META-INF/tests/
[DEBUG] adding directory dumps/
[DEBUG] adding entry META-INF/tests/allqueries.xml
[DEBUG] adding entry META-INF/tests/performance.xml
[DEBUG] adding entry META-INF/tests/regression.xml
[DEBUG] adding entry dumps/core.20100112.141124.11580.0001.dmp.zip
[DEBUG] adding entry dumps/core.20100209.165717.4484.txt.sdff
[DEBUG] adding entry dumps/core.20130429.083124.14315.0001.dmp.zip
[DEBUG] adding entry dumps/core.20160404.083441.9480.0001.dmp.zip
[DEBUG] adding entry dumps/heapdump.20100112.141124.11580.0002.phd
[DEBUG] adding entry dumps/heapdump.20100209.165721.4484.phd
[DEBUG] adding entry dumps/heapdump.20130429.083110.14261.0001.phd
[DEBUG] adding entry dumps/heapdump.20160404.083909.9480.0002.phd
[DEBUG] adding entry dumps/histogram_sun_jdk5_13_x32.txt
[DEBUG] adding entry dumps/histogram_sun_jdk6_18_x32.txt
[DEBUG] adding entry dumps/histogram_sun_jdk6_18_x64.txt
[DEBUG] adding entry dumps/java_pid1884.0001.hprof.gz
[DEBUG] adding entry dumps/javacore.20100112.141124.11580.0003.txt
[DEBUG] adding entry dumps/javacore.20100209.165721.4484.txt
[DEBUG] adding entry dumps/javacore.20130429.083110.14261.0002.txt
[DEBUG] adding entry dumps/javacore.20160404.083909.9480.0003.txt
[DEBUG] adding entry dumps/openjdk_jdk11_04_x64.hprof.gz
[DEBUG] adding entry dumps/oracle_jdk7_21_hprofagent.hprof
[DEBUG] adding entry dumps/oracle_jdk7_21_x64.hprof
[DEBUG] adding entry dumps/oracle_jdk8_05_x64.hprof
[DEBUG] adding entry dumps/oracle_jdk9_01_x64.hprof
[DEBUG] adding entry dumps/sun_jdk5_13_x32.hprof
[DEBUG] adding entry dumps/sun_jdk5_64bit.hprof
[DEBUG] adding entry dumps/sun_jdk6_18_x32.hprof
[DEBUG] adding entry dumps/sun_jdk6_18_x64.hprof
[DEBUG] adding entry dumps/sun_jdk6_30_x64_compressedOops.hprof
[DEBUG] adding entry dumps/sun_jdk6_30_x64_compressedOops.notes.txt
[DEBUG] adding entry dumps/sun_jdk6_30_x64_nocompressedOops.hprof
[DEBUG] adding entry dumps/sun_jdk6_30_x64_nocompressedOops.notes.txt
[DEBUG] adding entry dumps/sun_jdk6_31_hprofagent_compressedOops.hprof
[DEBUG] adding entry dumps/sun_jdk6_31_hprofagent_compressedOops.txt
[DEBUG] adding entry dumps/sun_jdk6_31_hprofagent_nocompressedOops.hprof
[DEBUG] adding entry dumps/sun_jdk6_31_hprofagent_nocompressedOops.txt
[DEBUG] adding entry dumps/sun_jdk6_32bit.hprof
[DEBUG] adding entry plugin.xml
[DEBUG] adding directory META-INF/maven/
[DEBUG] adding directory META-INF/maven/org.eclipse.mat/
[DEBUG] adding directory META-INF/maven/org.eclipse.mat/org.eclipse.mat.tests/
[DEBUG] adding entry META-INF/maven/org.eclipse.mat/org.eclipse.mat.tests/pom.xml
[DEBUG] adding entry META-INF/maven/org.eclipse.mat/org.eclipse.mat.tests/pom.properties
[INFO] 
[INFO] --- tycho-p2-plugin:2.0.0:p2-metadata-default (default-p2-metadata-default) @ org.eclipse.mat.tests ---
[DEBUG] Configuring mojo org.eclipse.tycho:tycho-p2-plugin:2.0.0:p2-metadata-default from plugin realm ClassRealm[plugin>org.eclipse.tycho:tycho-p2-plugin:2.0.0, parent: jdk.internal.loader.ClassLoaders$AppClassLoader@277050dc]
[DEBUG] Configuring mojo 'org.eclipse.tycho:tycho-p2-plugin:2.0.0:p2-metadata-default' with basic configurator -->
[DEBUG]   (f) attachP2Metadata = true
[DEBUG]   (f) baselineMode = warn
[DEBUG]   (f) baselineReplace = all
[DEBUG]   (f) defaultP2Metadata = false
[DEBUG]   (f) execution = org.eclipse.tycho:tycho-p2-plugin:2.0.0:p2-metadata-default {execution: default-p2-metadata-default}
[DEBUG]   (f) generateDownloadStatsProperty = true
[DEBUG]   (f) project = MavenProject: org.eclipse.mat:org.eclipse.mat.tests:1.12.0-SNAPSHOT @ /home/jenkins/agent/workspace/tycho-mat-nightly/plugins/org.eclipse.mat.tests/pom.xml
[DEBUG] -- end configuration --
[INFO] 
[INFO] --- tycho-surefire-plugin:2.0.0:test (default-test) @ org.eclipse.mat.tests ---
[DEBUG] Configuring mojo org.eclipse.tycho:tycho-surefire-plugin:2.0.0:test from plugin realm ClassRealm[plugin>org.eclipse.tycho:tycho-surefire-plugin:2.0.0, parent: jdk.internal.loader.ClassLoaders$AppClassLoader@277050dc]
[DEBUG] Configuring mojo 'org.eclipse.tycho:tycho-surefire-plugin:2.0.0:test' with basic configurator -->
[DEBUG]   (f) argLine = -ea -Xmx1536m
[DEBUG]   (f) deleteOsgiDataDirectory = true
[DEBUG]   (f) enableAssertions = false
[DEBUG]   (f) failIfNoTests = true
[DEBUG]   (f) includes = [**/AllTests.class]
[DEBUG]   (f) osgiDataDirectory = /home/jenkins/agent/workspace/tycho-mat-nightly/plugins/org.eclipse.mat.tests/target/work/data
[DEBUG]   (f) perCoreThreadCount = true
[DEBUG]   (f) pluginArtifacts = [org.eclipse.tycho:tycho-surefire-plugin:maven-plugin:2.0.0:, org.apache.maven:maven-plugin-api:jar:3.6.3:compile, org.apache.maven:maven-model:jar:3.6.3:compile, org.apache.maven:maven-artifact:jar:3.6.3:compile, org.apache.commons:commons-lang3:jar:3.8.1:compile, org.eclipse.sisu:org.eclipse.sisu.inject:jar:0.3.4:compile, org.codehaus.plexus:plexus-classworlds:jar:2.6.0:compile, org.codehaus.plexus:plexus-utils:jar:3.3.0:compile, org.apache.maven:maven-core:jar:3.6.3:compile, org.apache.maven:maven-settings:jar:3.6.3:compile, org.apache.maven:maven-settings-builder:jar:3.6.3:compile, org.sonatype.plexus:plexus-sec-dispatcher:jar:1.4:compile, org.sonatype.plexus:plexus-cipher:jar:1.7:compile, org.apache.maven:maven-builder-support:jar:3.6.3:compile, org.apache.maven:maven-repository-metadata:jar:3.6.3:compile, org.apache.maven:maven-model-builder:jar:3.6.3:compile, org.apache.maven:maven-resolver-provider:jar:3.6.3:compile, org.slf4j:slf4j-api:jar:1.7.29:compile, org.apache.maven.resolver:maven-resolver-impl:jar:1.4.1:compile, org.apache.maven.resolver:maven-resolver-api:jar:1.4.1:compile, org.apache.maven.resolver:maven-resolver-spi:jar:1.4.1:compile, org.apache.maven.resolver:maven-resolver-util:jar:1.4.1:compile, org.apache.maven.shared:maven-shared-utils:jar:3.2.1:compile, commons-io:commons-io:jar:2.5:compile, com.google.inject:guice:jar:no_aop:4.2.1:compile, aopalliance:aopalliance:jar:1.0:compile, com.google.guava:guava:jar:25.1-android:compile, com.google.code.findbugs:jsr305:jar:3.0.2:compile, org.checkerframework:checker-compat-qual:jar:2.0.0:compile, com.google.errorprone:error_prone_annotations:jar:2.1.3:compile, com.google.j2objc:j2objc-annotations:jar:1.1:compile, org.codehaus.mojo:animal-sniffer-annotations:jar:1.14:compile, javax.inject:javax.inject:jar:1:compile, org.codehaus.plexus:plexus-archiver:jar:4.2.2:compile, org.codehaus.plexus:plexus-io:jar:3.2.0:compile, org.apache.commons:commons-compress:jar:1.20:compile, org.iq80.snappy:snappy:jar:0.4:compile, org.tukaani:xz:jar:1.8:runtime, org.eclipse.platform:org.eclipse.osgi.compatibility.state:jar:1.1.800:compile, org.eclipse.platform:org.eclipse.osgi:jar:3.15.300:compile, org.apache.maven:maven-compat:jar:3.6.3:compile, org.codehaus.plexus:plexus-interpolation:jar:1.25:compile, org.apache.maven.wagon:wagon-provider-api:jar:3.3.4:compile, org.eclipse.tycho:sisu-equinox-launching:jar:2.0.0:compile, org.apache.commons:commons-exec:jar:1.3:compile, org.eclipse.tycho:org.eclipse.tycho.surefire.osgibooter:jar:2.0.0:runtime, org.eclipse.tycho:org.eclipse.tycho.surefire.junit:jar:2.0.0:runtime, org.eclipse.tycho:org.eclipse.tycho.surefire.junit4:jar:2.0.0:runtime, org.eclipse.tycho:org.eclipse.tycho.surefire.junit47:jar:2.0.0:runtime, org.eclipse.tycho:org.eclipse.tycho.surefire.junit5:jar:2.0.0:runtime, org.eclipse.tycho:org.eclipse.tycho.surefire.junit54:jar:2.0.0:runtime, org.eclipse.tycho:org.eclipse.tycho.surefire.junit55:jar:2.0.0:runtime, org.eclipse.tycho:org.eclipse.tycho.surefire.junit56:jar:2.0.0:runtime, org.eclipse.tycho:org.eclipse.tycho.surefire.testng:jar:2.0.0:runtime, org.apache.maven.surefire:surefire-api:jar:2.22.2:compile, org.apache.maven.surefire:surefire-logger-api:jar:2.22.2:compile, org.codehaus.plexus:plexus-component-annotations:jar:2.1.0:compile, org.apache.maven.surefire:maven-surefire-common:jar:2.22.2:compile, org.apache.maven.surefire:surefire-booter:jar:2.22.2:compile, org.apache.maven:maven-plugin-descriptor:jar:2.2.1:compile, org.codehaus.plexus:plexus-container-default:jar:1.0-alpha-9-stable-1:compile, classworlds:classworlds:jar:1.1-alpha-2:compile, org.apache.maven:maven-project:jar:2.2.1:compile, org.apache.maven:maven-profile:jar:2.2.1:compile, org.apache.maven:maven-artifact-manager:jar:2.2.1:compile, backport-util-concurrent:backport-util-concurrent:jar:3.1:compile, org.apache.maven:maven-plugin-registry:jar:2.2.1:compile, org.apache.maven:maven-toolchain:jar:2.2.1:compile, org.codehaus.plexus:plexus-java:jar:0.9.10:compile, org.ow2.asm:asm:jar:6.2:compile, com.thoughtworks.qdox:qdox:jar:2.0-M8:compile]
[DEBUG]   (f) profileName = DefaultProfile
[DEBUG]   (f) project = MavenProject: org.eclipse.mat:org.eclipse.mat.tests:1.12.0-SNAPSHOT @ /home/jenkins/agent/workspace/tycho-mat-nightly/plugins/org.eclipse.mat.tests/pom.xml
[DEBUG]   (f) redirectTestOutputToFile = false
[DEBUG]   (f) reportsDirectory = /home/jenkins/agent/workspace/tycho-mat-nightly/plugins/org.eclipse.mat.tests/target/surefire-reports
[DEBUG]   (f) rerunFailingTestsCount = 0
[DEBUG]   (f) runOrder = filesystem
[DEBUG]   (f) session = org.apache.maven.execution.MavenSession@5600ed17
[DEBUG]   (f) showEclipseLog = false
[DEBUG]   (f) skipAfterFailureCount = 0
[DEBUG]   (f) surefireProperties = /home/jenkins/agent/workspace/tycho-mat-nightly/plugins/org.eclipse.mat.tests/target/surefire.properties
[DEBUG]   (f) testClassesDirectory = /home/jenkins/agent/workspace/tycho-mat-nightly/plugins/org.eclipse.mat.tests/target/classes
[DEBUG]   (f) testFailureIgnore = false
[DEBUG]   (f) testRuntime = default
[DEBUG]   (f) trimStackTrace = true
[DEBUG]   (f) useJDK = SYSTEM
[DEBUG]   (f) useUIHarness = false
[DEBUG]   (f) useUIThread = true
[DEBUG]   (f) useUnlimitedThreads = false
[DEBUG]   (f) work = /home/jenkins/agent/workspace/tycho-mat-nightly/plugins/org.eclipse.mat.tests/target/work
[DEBUG] -- end configuration --
[DEBUG] Using test framework provider org.eclipse.tycho.surefire.provider.impl.JUnit4Provider
[DEBUG] Expanding: /home/jenkins/.m2/repository/p2/osgi/bundle/org.apache.ant/1.10.10.v20210426-1926/org.apache.ant-1.10.10.v20210426-1926.jar into /home/jenkins/agent/workspace/tycho-mat-nightly/plugins/org.eclipse.mat.tests/target/work/plugins/org.apache.ant_1.10.10.v20210426-1926
[DEBUG] expand complete
[DEBUG] Installation OSGI bundles:
[DEBUG] 	reference:file:/home/jenkins/.m2/repository/p2/osgi/bundle/org.eclipse.core.contenttype/3.7.1000.v20210409-1722/org.eclipse.core.contenttype-3.7.1000.v20210409-1722.jar
[DEBUG] 	reference:file:/home/jenkins/.m2/repository/p2/osgi/bundle/com.ibm.dtfj.api/1.12.29003.202006111057/com.ibm.dtfj.api-1.12.29003.202006111057.jar
[DEBUG] 	reference:file:/home/jenkins/.m2/repository/p2/osgi/bundle/com.ibm.dtfj.j9/1.12.29003.202006111057/com.ibm.dtfj.j9-1.12.29003.202006111057.jar
[DEBUG] 	reference:file:/home/jenkins/.m2/repository/p2/osgi/bundle/com.ibm.icu/67.1.0.v20200706-1749/com.ibm.icu-67.1.0.v20200706-1749.jar
[DEBUG] 	reference:file:/home/jenkins/.m2/repository/p2/osgi/bundle/com.sun.jna/5.8.0.v20210503-0343/com.sun.jna-5.8.0.v20210503-0343.jar
[DEBUG] 	reference:file:/home/jenkins/.m2/repository/p2/osgi/bundle/com.sun.jna.platform/5.8.0.v20210406-1004/com.sun.jna.platform-5.8.0.v20210406-1004.jar
[DEBUG] 	reference:file:/home/jenkins/.m2/repository/p2/osgi/bundle/javax.annotation/1.3.5.v20200909-1856/javax.annotation-1.3.5.v20200909-1856.jar
[DEBUG] 	reference:file:/home/jenkins/agent/workspace/tycho-mat-nightly/plugins/org.eclipse.mat.tests/target/work/plugins/org.apache.ant_1.10.10.v20210426-1926
[DEBUG] 	reference:file:/home/jenkins/.m2/repository/p2/osgi/bundle/org.apache.batik.constants/1.14.0.v20210324-0332/org.apache.batik.constants-1.14.0.v20210324-0332.jar
[DEBUG] 	reference:file:/home/jenkins/.m2/repository/p2/osgi/bundle/org.apache.batik.css/1.14.0.v20210324-0332/org.apache.batik.css-1.14.0.v20210324-0332.jar
[DEBUG] 	reference:file:/home/jenkins/.m2/repository/p2/osgi/bundle/org.apache.batik.util/1.14.0.v20210324-0332/org.apache.batik.util-1.14.0.v20210324-0332.jar
[DEBUG] 	reference:file:/home/jenkins/.m2/repository/p2/osgi/bundle/org.apache.batik.i18n/1.14.0.v20210324-0332/org.apache.batik.i18n-1.14.0.v20210324-0332.jar
[DEBUG] 	reference:file:/home/jenkins/.m2/repository/p2/osgi/bundle/org.apache.xmlgraphics/2.6.0.v20210409-0748/org.apache.xmlgraphics-2.6.0.v20210409-0748.jar
[DEBUG] 	reference:file:/home/jenkins/.m2/repository/p2/osgi/bundle/org.w3c.dom.svg/1.1.0.v201011041433/org.w3c.dom.svg-1.1.0.v201011041433.jar
[DEBUG] 	reference:file:/home/jenkins/.m2/repository/p2/osgi/bundle/org.w3c.dom.events/3.0.0.draft20060413_v201105210656/org.w3c.dom.events-3.0.0.draft20060413_v201105210656.jar
[DEBUG] 	reference:file:/home/jenkins/.m2/repository/p2/osgi/bundle/org.w3c.css.sac/1.3.1.v200903091627/org.w3c.css.sac-1.3.1.v200903091627.jar
[DEBUG] 	reference:file:/home/jenkins/.m2/repository/p2/osgi/bundle/org.apache.commons.codec/1.14.0.v20200818-1422/org.apache.commons.codec-1.14.0.v20200818-1422.jar
[DEBUG] 	reference:file:/home/jenkins/.m2/repository/p2/osgi/bundle/org.apache.commons.io/2.8.0.v20210415-0900/org.apache.commons.io-2.8.0.v20210415-0900.jar
[DEBUG] 	reference:file:/home/jenkins/.m2/repository/p2/osgi/bundle/org.apache.commons.logging/1.2.0.v20180409-1502/org.apache.commons.logging-1.2.0.v20180409-1502.jar
[DEBUG] 	reference:file:/home/jenkins/.m2/repository/p2/osgi/bundle/org.apache.felix.scr/2.1.24.v20200924-1939/org.apache.felix.scr-2.1.24.v20200924-1939.jar@1:start
[DEBUG] 	reference:file:/home/jenkins/.m2/repository/p2/osgi/bundle/org.eclipse.osgi.services/3.10.100.v20210324-0936/org.eclipse.osgi.services-3.10.100.v20210324-0936.jar
[DEBUG] 	reference:file:/home/jenkins/.m2/repository/p2/osgi/bundle/org.eclipse.osgi.util/3.6.0.v20210212-1137/org.eclipse.osgi.util-3.6.0.v20210212-1137.jar
[DEBUG] 	reference:file:/home/jenkins/.m2/repository/p2/osgi/bundle/org.eclipse.birt.chart.device.extension/4.7.0.v201706222054/org.eclipse.birt.chart.device.extension-4.7.0.v201706222054.jar
[DEBUG] 	reference:file:/home/jenkins/.m2/repository/p2/osgi/bundle/org.eclipse.birt.chart.engine/4.7.0.v201706222054/org.eclipse.birt.chart.engine-4.7.0.v201706222054.jar
[DEBUG] 	reference:file:/home/jenkins/.m2/repository/p2/osgi/bundle/org.eclipse.emf.ecore/2.24.0.v20210405-0628/org.eclipse.emf.ecore-2.24.0.v20210405-0628.jar
[DEBUG] 	reference:file:/home/jenkins/.m2/repository/p2/osgi/bundle/org.eclipse.emf.ecore.xmi/2.16.0.v20190528-0725/org.eclipse.emf.ecore.xmi-2.16.0.v20190528-0725.jar
[DEBUG] 	reference:file:/home/jenkins/.m2/repository/p2/osgi/bundle/org.eclipse.birt.core/4.7.0.v201706222054/org.eclipse.birt.core-4.7.0.v201706222054.jar
[DEBUG] 	reference:file:/home/jenkins/.m2/repository/p2/osgi/bundle/org.eclipse.birt.chart.engine.extension/4.7.0.v201706222054/org.eclipse.birt.chart.engine.extension-4.7.0.v201706222054.jar
[DEBUG] 	reference:file:/home/jenkins/.m2/repository/p2/osgi/bundle/org.eclipse.core.runtime/3.22.0.v20210506-1025/org.eclipse.core.runtime-3.22.0.v20210506-1025.jar@4:start
[DEBUG] 	reference:file:/home/jenkins/.m2/repository/p2/osgi/bundle/org.mozilla.javascript/1.7.5.v201504281450/org.mozilla.javascript-1.7.5.v201504281450.jar
[DEBUG] 	reference:file:/home/jenkins/.m2/repository/p2/osgi/bundle/org.eclipse.compare/3.8.0.v20210415-0713/org.eclipse.compare-3.8.0.v20210415-0713.jar
[DEBUG] 	reference:file:/home/jenkins/.m2/repository/p2/osgi/bundle/org.eclipse.ui/3.119.0.v20210111-1350/org.eclipse.ui-3.119.0.v20210111-1350.jar
[DEBUG] 	reference:file:/home/jenkins/.m2/repository/p2/osgi/bundle/org.eclipse.core.resources/3.15.0.v20210521-0722/org.eclipse.core.resources-3.15.0.v20210521-0722.jar
[DEBUG] 	reference:file:/home/jenkins/.m2/repository/p2/osgi/bundle/org.eclipse.jface.text/3.18.0.v20210512-1640/org.eclipse.jface.text-3.18.0.v20210512-1640.jar
[DEBUG] 	reference:file:/home/jenkins/.m2/repository/p2/osgi/bundle/org.eclipse.ui.ide/3.18.200.v20210523-1724/org.eclipse.ui.ide-3.18.200.v20210523-1724.jar
[DEBUG] 	reference:file:/home/jenkins/.m2/repository/p2/osgi/bundle/org.eclipse.ui.views/3.11.0.v20210111-1351/org.eclipse.ui.views-3.11.0.v20210111-1351.jar
[DEBUG] 	reference:file:/home/jenkins/.m2/repository/p2/osgi/bundle/org.eclipse.ui.workbench.texteditor/3.16.100.v20210512-1009/org.eclipse.ui.workbench.texteditor-3.16.100.v20210512-1009.jar
[DEBUG] 	reference:file:/home/jenkins/.m2/repository/p2/osgi/bundle/org.eclipse.core.expressions/3.7.100.v20210203-1000/org.eclipse.core.expressions-3.7.100.v20210203-1000.jar
[DEBUG] 	reference:file:/home/jenkins/.m2/repository/p2/osgi/bundle/org.eclipse.ui.editors/3.14.100.v20210513-1110/org.eclipse.ui.editors-3.14.100.v20210513-1110.jar
[DEBUG] 	reference:file:/home/jenkins/.m2/repository/p2/osgi/bundle/org.eclipse.ui.forms/3.11.100.v20210108-1139/org.eclipse.ui.forms-3.11.100.v20210108-1139.jar
[DEBUG] 	reference:file:/home/jenkins/.m2/repository/p2/osgi/bundle/org.eclipse.compare.core/3.6.1000.v20201020-1107/org.eclipse.compare.core-3.6.1000.v20201020-1107.jar
[DEBUG] 	reference:file:/home/jenkins/.m2/repository/p2/osgi/bundle/org.eclipse.core.commands/3.10.0.v20210401-0744/org.eclipse.core.commands-3.10.0.v20210401-0744.jar
[DEBUG] 	reference:file:/home/jenkins/.m2/repository/p2/osgi/bundle/org.eclipse.equinox.common/3.15.0.v20210518-0604/org.eclipse.equinox.common-3.15.0.v20210518-0604.jar@2:start
[DEBUG] 	reference:file:/home/jenkins/.m2/repository/p2/osgi/bundle/org.eclipse.equinox.preferences/3.8.200.v20210212-1143/org.eclipse.equinox.preferences-3.8.200.v20210212-1143.jar
[DEBUG] 	reference:file:/home/jenkins/.m2/repository/p2/osgi/bundle/org.eclipse.equinox.registry/3.10.200.v20210503-1606/org.eclipse.equinox.registry-3.10.200.v20210503-1606.jar
[DEBUG] 	reference:file:/home/jenkins/.m2/repository/p2/osgi/bundle/org.eclipse.core.databinding/1.10.100.v20200926-1123/org.eclipse.core.databinding-1.10.100.v20200926-1123.jar
[DEBUG] 	reference:file:/home/jenkins/.m2/repository/p2/osgi/bundle/org.eclipse.core.databinding.observable/1.10.0.v20200730-0848/org.eclipse.core.databinding.observable-1.10.0.v20200730-0848.jar
[DEBUG] 	reference:file:/home/jenkins/.m2/repository/p2/osgi/bundle/org.eclipse.core.databinding.property/1.8.100.v20200619-0651/org.eclipse.core.databinding.property-1.8.100.v20200619-0651.jar
[DEBUG] 	reference:file:/home/jenkins/.m2/repository/p2/osgi/bundle/org.eclipse.core.filebuffers/3.7.0.v20210512-1543/org.eclipse.core.filebuffers-3.7.0.v20210512-1543.jar
[DEBUG] 	reference:file:/home/jenkins/.m2/repository/p2/osgi/bundle/org.eclipse.text/3.12.0.v20210512-1644/org.eclipse.text-3.12.0.v20210512-1644.jar
[DEBUG] 	reference:file:/home/jenkins/.m2/repository/p2/osgi/bundle/org.eclipse.core.filesystem/1.9.0.v20210419-1155/org.eclipse.core.filesystem-1.9.0.v20210419-1155.jar
[DEBUG] 	reference:file:/home/jenkins/.m2/repository/p2/osgi/bundle/org.eclipse.core.jobs/3.11.0.v20210420-1453/org.eclipse.core.jobs-3.11.0.v20210420-1453.jar
[DEBUG] 	reference:file:/home/jenkins/.m2/repository/p2/osgi/bundle/org.eclipse.core.net/1.3.1100.v20210424-0724/org.eclipse.core.net-1.3.1100.v20210424-0724.jar
[DEBUG] 	reference:file:/home/jenkins/.m2/repository/p2/osgi/bundle/org.eclipse.equinox.security/1.3.600.v20210126-1005/org.eclipse.equinox.security-1.3.600.v20210126-1005.jar
[DEBUG] 	reference:file:/home/jenkins/.m2/repository/p2/osgi/bundle/org.eclipse.equinox.app/1.5.100.v20210212-1143/org.eclipse.equinox.app-1.5.100.v20210212-1143.jar
[DEBUG] 	reference:file:/home/jenkins/.m2/repository/p2/osgi/bundle/org.eclipse.e4.core.commands/1.0.0.v20210507-1901/org.eclipse.e4.core.commands-1.0.0.v20210507-1901.jar
[DEBUG] 	reference:file:/home/jenkins/.m2/repository/p2/osgi/bundle/org.eclipse.e4.core.di/1.7.800.v20210526-1618/org.eclipse.e4.core.di-1.7.800.v20210526-1618.jar
[DEBUG] 	reference:file:/home/jenkins/.m2/repository/p2/osgi/bundle/javax.inject/1.0.0.v20091030/javax.inject-1.0.0.v20091030.jar
[DEBUG] 	reference:file:/home/jenkins/.m2/repository/p2/osgi/bundle/org.eclipse.e4.core.contexts/1.8.400.v20191217-1710/org.eclipse.e4.core.contexts-1.8.400.v20191217-1710.jar
[DEBUG] 	reference:file:/home/jenkins/.m2/repository/p2/osgi/bundle/org.eclipse.e4.core.services/2.2.600.v20210110-1654/org.eclipse.e4.core.services-2.2.600.v20210110-1654.jar
[DEBUG] 	reference:file:/home/jenkins/.m2/repository/p2/osgi/bundle/org.eclipse.e4.core.di.annotations/1.6.600.v20191216-2352/org.eclipse.e4.core.di.annotations-1.6.600.v20191216-2352.jar
[DEBUG] 	reference:file:/home/jenkins/.m2/repository/p2/osgi/bundle/org.eclipse.e4.core.di.extensions/0.16.0.v20200507-0938/org.eclipse.e4.core.di.extensions-0.16.0.v20200507-0938.jar
[DEBUG] 	reference:file:/home/jenkins/.m2/repository/p2/osgi/bundle/org.eclipse.e4.core.di.extensions.supplier/0.16.0.v20210412-1358/org.eclipse.e4.core.di.extensions.supplier-0.16.0.v20210412-1358.jar
[DEBUG] 	reference:file:/home/jenkins/.m2/repository/p2/osgi/bundle/org.eclipse.e4.emf.xpath/0.2.800.v20200609-0849/org.eclipse.e4.emf.xpath-0.2.800.v20200609-0849.jar
[DEBUG] 	reference:file:/home/jenkins/.m2/repository/p2/osgi/bundle/org.apache.commons.jxpath/1.3.0.v200911051830/org.apache.commons.jxpath-1.3.0.v200911051830.jar
[DEBUG] 	reference:file:/home/jenkins/.m2/repository/p2/osgi/bundle/org.eclipse.e4.ui.bindings/0.13.0.v20201119-1132/org.eclipse.e4.ui.bindings-0.13.0.v20201119-1132.jar
[DEBUG] 	reference:file:/home/jenkins/.m2/repository/p2/osgi/bundle/org.eclipse.swt/3.116.100.v20210602-2209/org.eclipse.swt-3.116.100.v20210602-2209.jar
[DEBUG] 	reference:file:/home/jenkins/.m2/repository/p2/osgi/bundle/org.eclipse.e4.ui.services/1.5.0.v20210115-1333/org.eclipse.e4.ui.services-1.5.0.v20210115-1333.jar
[DEBUG] 	reference:file:/home/jenkins/.m2/repository/p2/osgi/bundle/org.eclipse.jface/3.22.200.v20210401-0958/org.eclipse.jface-3.22.200.v20210401-0958.jar
[DEBUG] 	reference:file:/home/jenkins/.m2/repository/p2/osgi/bundle/org.eclipse.e4.ui.css.core/0.13.0.v20201015-0653/org.eclipse.e4.ui.css.core-0.13.0.v20201015-0653.jar
[DEBUG] 	reference:file:/home/jenkins/.m2/repository/p2/osgi/bundle/org.eclipse.e4.ui.css.swt/0.14.200.v20210401-1241/org.eclipse.e4.ui.css.swt-0.14.200.v20210401-1241.jar
[DEBUG] 	reference:file:/home/jenkins/.m2/repository/p2/osgi/bundle/org.eclipse.e4.ui.css.swt.theme/0.13.0.v20201026-1147/org.eclipse.e4.ui.css.swt.theme-0.13.0.v20201026-1147.jar
[DEBUG] 	reference:file:/home/jenkins/.m2/repository/p2/osgi/bundle/org.eclipse.e4.ui.di/1.3.0.v20210222-1018/org.eclipse.e4.ui.di-1.3.0.v20210222-1018.jar
[DEBUG] 	reference:file:/home/jenkins/.m2/repository/p2/osgi/bundle/org.eclipse.e4.ui.dialogs/1.2.100.v20201109-2317/org.eclipse.e4.ui.dialogs-1.2.100.v20201109-2317.jar
[DEBUG] 	reference:file:/home/jenkins/.m2/repository/p2/osgi/bundle/org.eclipse.e4.ui.ide/3.15.200.v20210108-1832/org.eclipse.e4.ui.ide-3.15.200.v20210108-1832.jar
[DEBUG] 	reference:file:/home/jenkins/.m2/repository/p2/osgi/bundle/org.eclipse.e4.ui.model.workbench/2.1.1000.v20210111-0958/org.eclipse.e4.ui.model.workbench-2.1.1000.v20210111-0958.jar
[DEBUG] 	reference:file:/home/jenkins/.m2/repository/p2/osgi/bundle/org.eclipse.equinox.event/1.6.0.v20210212-1143/org.eclipse.equinox.event-1.6.0.v20210212-1143.jar
[DEBUG] 	reference:file:/home/jenkins/.m2/repository/p2/osgi/bundle/org.eclipse.e4.ui.widgets/1.2.900.v20210412-0842/org.eclipse.e4.ui.widgets-1.2.900.v20210412-0842.jar
[DEBUG] 	reference:file:/home/jenkins/.m2/repository/p2/osgi/bundle/org.eclipse.e4.ui.workbench/1.13.0.v20210521-0741/org.eclipse.e4.ui.workbench-1.13.0.v20210521-0741.jar
[DEBUG] 	reference:file:/home/jenkins/.m2/repository/p2/osgi/bundle/org.eclipse.emf.ecore.change/2.14.0.v20190528-0725/org.eclipse.emf.ecore.change-2.14.0.v20190528-0725.jar
[DEBUG] 	reference:file:/home/jenkins/.m2/repository/p2/osgi/bundle/org.eclipse.e4.ui.workbench.addons.swt/1.4.200.v20210321-1910/org.eclipse.e4.ui.workbench.addons.swt-1.4.200.v20210321-1910.jar
[DEBUG] 	reference:file:/home/jenkins/.m2/repository/p2/osgi/bundle/org.eclipse.e4.ui.workbench.renderers.swt/0.15.100.v20210515-1815/org.eclipse.e4.ui.workbench.renderers.swt-0.15.100.v20210515-1815.jar
[DEBUG] 	reference:file:/home/jenkins/.m2/repository/p2/osgi/bundle/org.eclipse.e4.ui.workbench.swt/0.16.100.v20210315-1604/org.eclipse.e4.ui.workbench.swt-0.16.100.v20210315-1604.jar
[DEBUG] 	reference:file:/home/jenkins/.m2/repository/p2/osgi/bundle/org.eclipse.jface.databinding/1.12.200.v20210111-0911/org.eclipse.jface.databinding-1.12.200.v20210111-0911.jar
[DEBUG] 	reference:file:/home/jenkins/.m2/repository/p2/osgi/bundle/org.eclipse.e4.ui.workbench3/0.15.500.v20201021-1339/org.eclipse.e4.ui.workbench3-0.15.500.v20201021-1339.jar
[DEBUG] 	reference:file:/home/jenkins/.m2/repository/p2/osgi/bundle/org.eclipse.urischeme/1.1.400.v20210407-1558/org.eclipse.urischeme-1.1.400.v20210407-1558.jar
[DEBUG] 	reference:file:/home/jenkins/.m2/repository/p2/osgi/bundle/org.eclipse.emf.common/2.22.0.v20210319-0732/org.eclipse.emf.common-2.22.0.v20210319-0732.jar
[DEBUG] 	reference:file:/home/jenkins/.m2/repository/p2/osgi/bundle/org.eclipse.equinox.bidi/1.3.100.v20210212-1143/org.eclipse.equinox.bidi-1.3.100.v20210212-1143.jar
[DEBUG] 	reference:file:/home/jenkins/.m2/repository/p2/osgi/bundle/org.eclipse.equinox.launcher/1.6.200.v20210416-2027/org.eclipse.equinox.launcher-1.6.200.v20210416-2027.jar
[DEBUG] 	reference:file:/home/jenkins/.m2/repository/p2/osgi/bundle/org.eclipse.equinox.p2.core/2.7.0.v20210315-2042/org.eclipse.equinox.p2.core-2.7.0.v20210315-2042.jar
[DEBUG] 	reference:file:/home/jenkins/.m2/repository/p2/osgi/bundle/org.eclipse.equinox.p2.engine/2.7.0.v20210328-0514/org.eclipse.equinox.p2.engine-2.7.0.v20210328-0514.jar
[DEBUG] 	reference:file:/home/jenkins/.m2/repository/p2/osgi/bundle/org.eclipse.equinox.p2.metadata/2.6.0.v20210331-1610/org.eclipse.equinox.p2.metadata-2.6.0.v20210331-1610.jar
[DEBUG] 	reference:file:/home/jenkins/.m2/repository/p2/osgi/bundle/org.eclipse.equinox.p2.metadata.repository/1.4.0.v20210315-2228/org.eclipse.equinox.p2.metadata.repository-1.4.0.v20210315-2228.jar
[DEBUG] 	reference:file:/home/jenkins/.m2/repository/p2/osgi/bundle/org.eclipse.equinox.p2.repository/2.5.100.v20210329-1206/org.eclipse.equinox.p2.repository-2.5.100.v20210329-1206.jar
[DEBUG] 	reference:file:/home/jenkins/.m2/repository/p2/osgi/bundle/org.tukaani.xz/1.8.0.v20180207-1613/org.tukaani.xz-1.8.0.v20180207-1613.jar
[DEBUG] 	reference:file:/home/jenkins/.m2/repository/p2/osgi/bundle/org.eclipse.help/3.9.0.v20210507-0822/org.eclipse.help-3.9.0.v20210507-0822.jar
[DEBUG] 	reference:file:/home/jenkins/.m2/repository/p2/osgi/bundle/org.eclipse.jface.notifications/0.3.0.v20210218-1820/org.eclipse.jface.notifications-0.3.0.v20210218-1820.jar
[DEBUG] 	reference:file:/home/jenkins/.m2/repository/p2/osgi/bundle/org.eclipse.ltk.core.refactoring/3.11.400.v20210427-0555/org.eclipse.ltk.core.refactoring-3.11.400.v20210427-0555.jar
[DEBUG] 	reference:file:/home/jenkins/.m2/repository/p2/osgi/bundle/org.eclipse.ltk.ui.refactoring/3.11.400.v20210320-1132/org.eclipse.ltk.ui.refactoring-3.11.400.v20210320-1132.jar
[DEBUG] 	reference:file:/home/jenkins/.m2/repository/p2/osgi/bundle/org.eclipse.ui.navigator/3.10.100.v20210415-0924/org.eclipse.ui.navigator-3.10.100.v20210415-0924.jar
[DEBUG] 	reference:file:/home/jenkins/.m2/repository/p2/osgi/bundle/org.eclipse.team.core/3.9.0.v20210510-1748/org.eclipse.team.core-3.9.0.v20210510-1748.jar
[DEBUG] 	reference:file:/home/jenkins/.m2/repository/p2/osgi/bundle/org.eclipse.team.ui/3.9.0.v20210426-0837/org.eclipse.team.ui-3.9.0.v20210426-0837.jar
[DEBUG] 	reference:file:/home/jenkins/agent/workspace/tycho-mat-nightly/plugins/org.eclipse.mat.api/target/org.eclipse.mat.api-1.12.0-SNAPSHOT.jar
[DEBUG] 	reference:file:/home/jenkins/agent/workspace/tycho-mat-nightly/plugins/org.eclipse.mat.report/target/org.eclipse.mat.report-1.12.0-SNAPSHOT.jar
[DEBUG] 	reference:file:/home/jenkins/agent/workspace/tycho-mat-nightly/plugins/org.eclipse.mat.chart/target/org.eclipse.mat.chart-1.12.0-SNAPSHOT.jar
[DEBUG] 	reference:file:/home/jenkins/agent/workspace/tycho-mat-nightly/plugins/org.eclipse.mat.dtfj/target/org.eclipse.mat.dtfj-1.12.0-SNAPSHOT.jar
[DEBUG] 	reference:file:/home/jenkins/agent/workspace/tycho-mat-nightly/plugins/org.eclipse.mat.parser/target/org.eclipse.mat.parser-1.12.0-SNAPSHOT.jar
[DEBUG] 	reference:file:/home/jenkins/agent/workspace/tycho-mat-nightly/plugins/org.eclipse.mat.hprof/target/org.eclipse.mat.hprof-1.12.0-SNAPSHOT.jar
[DEBUG] 	reference:file:/home/jenkins/agent/workspace/tycho-mat-nightly/plugins/org.eclipse.mat.ibmdumps/target/org.eclipse.mat.ibmdumps-1.12.0-SNAPSHOT.jar
[DEBUG] 	reference:file:/home/jenkins/agent/workspace/tycho-mat-nightly/plugins/org.eclipse.mat.tests
[DEBUG] 	reference:file:/home/jenkins/agent/workspace/tycho-mat-nightly/plugins/org.eclipse.mat.ui/target/org.eclipse.mat.ui-1.12.0-SNAPSHOT.jar
[DEBUG] 	reference:file:/home/jenkins/.m2/repository/p2/osgi/bundle/org.hamcrest.core/1.3.0.v20180420-1519/org.hamcrest.core-1.3.0.v20180420-1519.jar
[DEBUG] 	reference:file:/home/jenkins/.m2/repository/p2/osgi/bundle/org.hamcrest.library/1.3.0.v20180524-2246/org.hamcrest.library-1.3.0.v20180524-2246.jar
[DEBUG] 	reference:file:/home/jenkins/.m2/repository/p2/osgi/bundle/org.junit/4.13.0.v20200204-1500/org.junit-4.13.0.v20200204-1500.jar
[DEBUG] 	reference:file:/home/jenkins/.m2/repository/p2/osgi/bundle/org.eclipse.swt.win32.win32.x86_64/3.116.100.v20210602-2209/org.eclipse.swt.win32.win32.x86_64-3.116.100.v20210602-2209.jar
[DEBUG] 	reference:file:/home/jenkins/.m2/repository/p2/osgi/bundle/org.eclipse.ui.workbench/3.122.200.v20210506-1640/org.eclipse.ui.workbench-3.122.200.v20210506-1640.jar
[DEBUG] 	reference:file:/home/jenkins/.m2/repository/p2/osgi/bundle/org.eclipse.ui.cheatsheets/3.7.300.v20210507-0822/org.eclipse.ui.cheatsheets-3.7.300.v20210507-0822.jar
[DEBUG] 	reference:file:/home/jenkins/.m2/repository/p2/osgi/bundle/org.eclipse.ui.intro/3.6.200.v20210409-1747/org.eclipse.ui.intro-3.6.200.v20210409-1747.jar
[DEBUG] 	reference:file:/home/jenkins/.m2/repository/p2/osgi/bundle/org.eclipse.ui.ide.application/1.4.100.v20210506-1050/org.eclipse.ui.ide.application-1.4.100.v20210506-1050.jar
[DEBUG] 	reference:file:/home/jenkins/.m2/repository/p2/osgi/bundle/org.eclipse.ui.navigator.resources/3.8.100.v20210319-0848/org.eclipse.ui.navigator.resources-3.8.100.v20210319-0848.jar
[DEBUG] 	reference:file:/home/jenkins/.m2/repository/p2/osgi/bundle/org.eclipse.ui.views.properties.tabbed/3.9.100.v20201223-1348/org.eclipse.ui.views.properties.tabbed-3.9.100.v20201223-1348.jar
[DEBUG] 	reference:file:/home/jenkins/.m2/repository/p2/osgi/bundle/org.w3c.dom.smil/1.0.1.v200903091627/org.w3c.dom.smil-1.0.1.v200903091627.jar
[DEBUG] 	reference:file:/home/jenkins/.m2/repository/p2/osgi/bundle/org.eclipse.swt.cocoa.macosx.x86_64/3.116.100.v20210602-2209/org.eclipse.swt.cocoa.macosx.x86_64-3.116.100.v20210602-2209.jar
[DEBUG] 	reference:file:/home/jenkins/.m2/repository/p2/osgi/bundle/org.eclipse.swt.gtk.linux.x86_64/3.116.100.v20210602-2209/org.eclipse.swt.gtk.linux.x86_64-3.116.100.v20210602-2209.jar
[DEBUG] 	reference:file:/home/jenkins/.m2/repository/p2/osgi/bundle/org.eclipse.swt.gtk.linux.ppc64le/3.116.100.v20210602-2209/org.eclipse.swt.gtk.linux.ppc64le-3.116.100.v20210602-2209.jar
[DEBUG] 	reference:file:/home/jenkins/.m2/repository/org/eclipse/tycho/org.eclipse.tycho.surefire.osgibooter/2.0.0/org.eclipse.tycho.surefire.osgibooter-2.0.0.jar
[DEBUG] 	reference:file:/home/jenkins/.m2/repository/org/eclipse/tycho/org.eclipse.tycho.surefire.junit4/2.0.0/org.eclipse.tycho.surefire.junit4-2.0.0.jar
[INFO] Executing Test Runtime with timeout 0, logs (if any) will be placed at: /home/jenkins/agent/workspace/tycho-mat-nightly/plugins/org.eclipse.mat.tests/target/work/data/.metadata/.log
[INFO] Command line:
	[/opt/tools/java/adoptopenjdk/hotspot-jdk-11/11.0.11+9/bin/java, -Dosgi.noShutdown=false, -Dosgi.os=linux, -Dosgi.ws=gtk, -Dosgi.arch=x86_64, -ea, -Xmx1536m, -Dosgi.clean=true, -jar, /home/jenkins/.m2/repository/p2/osgi/bundle/org.eclipse.equinox.launcher/1.6.200.v20210416-2027/org.eclipse.equinox.launcher-1.6.200.v20210416-2027.jar, -debug, -consolelog, -data, /home/jenkins/agent/workspace/tycho-mat-nightly/plugins/org.eclipse.mat.tests/target/work/data, -install, /home/jenkins/agent/workspace/tycho-mat-nightly/plugins/org.eclipse.mat.tests/target/work, -configuration, /home/jenkins/agent/workspace/tycho-mat-nightly/plugins/org.eclipse.mat.tests/target/work/configuration, -application, org.eclipse.tycho.surefire.osgibooter.headlesstest, -testproperties, /home/jenkins/agent/workspace/tycho-mat-nightly/plugins/org.eclipse.mat.tests/target/surefire.properties]
Configuration location:
    file:/home/jenkins/agent/workspace/tycho-mat-nightly/plugins/org.eclipse.mat.tests/target/work/configuration/
Configuration file:
    file:/home/jenkins/agent/workspace/tycho-mat-nightly/plugins/org.eclipse.mat.tests/target/work/configuration/config.ini loaded
Install location:
    file:/home/jenkins/agent/workspace/tycho-mat-nightly/plugins/org.eclipse.mat.tests/target/work/
Framework located:
    file:/home/jenkins/.m2/repository/p2/osgi/bundle/org.eclipse.osgi/3.16.300.v20210525-1715/org.eclipse.osgi-3.16.300.v20210525-1715.jar
Framework classpath:
    file:/home/jenkins/.m2/repository/p2/osgi/bundle/org.eclipse.osgi/3.16.300.v20210525-1715/org.eclipse.osgi-3.16.300.v20210525-1715.jar
Debug options:
    file:/home/jenkins/agent/workspace/tycho-mat-nightly/plugins/org.eclipse.mat.tests/.options not found
Time to load bundles: 414
Starting application: 1721
!SESSION 2021-06-17 10:02:42.340 -----------------------------------------------
eclipse.buildId=unknown
java.version=11.0.11
java.vendor=AdoptOpenJDK
BootLoader constants: OS=linux, ARCH=x86_64, WS=gtk, NL=en_US
Framework arguments:  -application org.eclipse.tycho.surefire.osgibooter.headlesstest -testproperties /home/jenkins/agent/workspace/tycho-mat-nightly/plugins/org.eclipse.mat.tests/target/surefire.properties
Command-line arguments:  -debug -consolelog -data /home/jenkins/agent/workspace/tycho-mat-nightly/plugins/org.eclipse.mat.tests/target/work/data -application org.eclipse.tycho.surefire.osgibooter.headlesstest -testproperties /home/jenkins/agent/workspace/tycho-mat-nightly/plugins/org.eclipse.mat.tests/target/surefire.properties

!ENTRY org.eclipse.swt.gtk.linux.ppc64le 2 0 2021-06-17 10:02:44.067
!MESSAGE Could not resolve module: org.eclipse.swt.gtk.linux.ppc64le [125]
  Unresolved requirement: Require-Capability: eclipse.platform; filter:="(& (osgi.ws=gtk) (osgi.os=linux) (osgi.arch=ppc64le))"
  Unresolved requirement: Require-Capability: eclipse.platform; filter:="(& (osgi.ws=gtk) (osgi.os=linux) (osgi.arch=ppc64le))"


!ENTRY org.eclipse.swt.win32.win32.x86_64 2 0 2021-06-17 10:02:44.068
!MESSAGE Could not resolve module: org.eclipse.swt.win32.win32.x86_64 [115]
  Unresolved requirement: Require-Capability: eclipse.platform; filter:="(& (osgi.ws=win32) (osgi.os=win32) (osgi.arch=x86_64))"
  Unresolved requirement: Require-Capability: eclipse.platform; filter:="(& (osgi.ws=win32) (osgi.os=win32) (osgi.arch=x86_64))"


!ENTRY org.eclipse.swt.cocoa.macosx.x86_64 2 0 2021-06-17 10:02:44.068
!MESSAGE Could not resolve module: org.eclipse.swt.cocoa.macosx.x86_64 [123]
  Unresolved requirement: Require-Capability: eclipse.platform; filter:="(& (osgi.ws=cocoa) (osgi.os=macosx) (osgi.arch=x86_64) )"
  Unresolved requirement: Require-Capability: eclipse.platform; filter:="(& (osgi.ws=cocoa) (osgi.os=macosx) (osgi.arch=x86_64) )"


!ENTRY org.eclipse.osgi 4 0 2021-06-17 10:02:44.068
!MESSAGE Application error
!STACK 1
org.eclipse.core.runtime.CoreException: Plug-in org.eclipse.tycho.surefire.osgibooter was unable to load class org.eclipse.tycho.surefire.osgibooter.HeadlessTestApplication.
	at org.eclipse.core.internal.registry.osgi.RegistryStrategyOSGI.throwException(RegistryStrategyOSGI.java:212)
	at org.eclipse.core.internal.registry.osgi.RegistryStrategyOSGI.createExecutableExtension(RegistryStrategyOSGI.java:198)
	at org.eclipse.core.internal.registry.ExtensionRegistry.createExecutableExtension(ExtensionRegistry.java:920)
	at org.eclipse.core.internal.registry.ConfigurationElement.createExecutableExtension(ConfigurationElement.java:246)
	at org.eclipse.core.internal.registry.ConfigurationElementHandle.createExecutableExtension(ConfigurationElementHandle.java:63)
	at org.eclipse.equinox.internal.app.EclipseAppHandle.run(EclipseAppHandle.java:198)
	at org.eclipse.core.runtime.internal.adaptor.EclipseAppLauncher.runApplication(EclipseAppLauncher.java:134)
	at org.eclipse.core.runtime.internal.adaptor.EclipseAppLauncher.start(EclipseAppLauncher.java:104)
	at org.eclipse.core.runtime.adaptor.EclipseStarter.run(EclipseStarter.java:401)
	at org.eclipse.core.runtime.adaptor.EclipseStarter.run(EclipseStarter.java:255)
	at java.base/jdk.internal.reflect.NativeMethodAccessorImpl.invoke0(Native Method)
	at java.base/jdk.internal.reflect.NativeMethodAccessorImpl.invoke(NativeMethodAccessorImpl.java:62)
	at java.base/jdk.internal.reflect.DelegatingMethodAccessorImpl.invoke(DelegatingMethodAccessorImpl.java:43)
	at java.base/java.lang.reflect.Method.invoke(Method.java:566)
	at org.eclipse.equinox.launcher.Main.invokeFramework(Main.java:654)
	at org.eclipse.equinox.launcher.Main.basicRun(Main.java:591)
	at org.eclipse.equinox.launcher.Main.run(Main.java:1462)
	at org.eclipse.equinox.launcher.Main.main(Main.java:1435)
Caused by: java.lang.NoClassDefFoundError: org/eclipse/core/runtime/IPlatformRunnable
	at java.base/java.lang.ClassLoader.defineClass1(Native Method)
	at java.base/java.lang.ClassLoader.defineClass(ClassLoader.java:1017)
	at org.eclipse.osgi.internal.loader.ModuleClassLoader.defineClass(ModuleClassLoader.java:293)
	at org.eclipse.osgi.internal.loader.classpath.ClasspathManager.defineClass(ClasspathManager.java:718)
	at org.eclipse.osgi.internal.loader.classpath.ClasspathManager.findClassImpl(ClasspathManager.java:641)
	at org.eclipse.osgi.internal.loader.classpath.ClasspathManager.findLocalClassImpl(ClasspathManager.java:609)
	at org.eclipse.osgi.internal.loader.classpath.ClasspathManager.findLocalClassImpl(ClasspathManager.java:589)
	at org.eclipse.osgi.internal.loader.classpath.ClasspathManager.findLocalClass(ClasspathManager.java:568)
	at org.eclipse.osgi.internal.loader.ModuleClassLoader.findLocalClass(ModuleClassLoader.java:345)
	at org.eclipse.osgi.internal.loader.BundleLoader.findLocalClass(BundleLoader.java:401)
	at org.eclipse.osgi.internal.loader.BundleLoader.findClass(BundleLoader.java:480)
	at org.eclipse.osgi.internal.loader.ModuleClassLoader.loadClass(ModuleClassLoader.java:170)
	at java.base/java.lang.ClassLoader.loadClass(ClassLoader.java:522)
	at org.eclipse.osgi.internal.framework.EquinoxBundle.loadClass(EquinoxBundle.java:622)
	at org.eclipse.core.internal.registry.osgi.RegistryStrategyOSGI.createExecutableExtension(RegistryStrategyOSGI.java:196)
	... 16 more
Caused by: java.lang.ClassNotFoundException: org.eclipse.core.runtime.IPlatformRunnable cannot be found by org.eclipse.tycho.surefire.osgibooter_2.0.0
	at org.eclipse.osgi.internal.loader.BundleLoader.findClass(BundleLoader.java:519)
	at org.eclipse.osgi.internal.loader.ModuleClassLoader.loadClass(ModuleClassLoader.java:170)
	at java.base/java.lang.ClassLoader.loadClass(ClassLoader.java:522)
	... 31 more
An error has occurred. See the log file
/home/jenkins/agent/workspace/tycho-mat-nightly/plugins/org.eclipse.mat.tests/target/work/configuration/1623924162531.log.
[INFO] ------------------------------------------------------------------------
[INFO] Reactor Summary for MAT Parent 1.12.0-SNAPSHOT:
[INFO] 
[INFO] MAT Parent ......................................... SUCCESS [ 56.234 s]
[INFO] org.eclipse.mat.targetdef .......................... SUCCESS [  0.240 s]
[INFO] org.eclipse.mat.report ............................. SUCCESS [ 21.744 s]
[INFO] org.eclipse.mat.api ................................ SUCCESS [ 19.816 s]
[INFO] org.eclipse.mat.chart .............................. SUCCESS [  5.439 s]
[INFO] org.eclipse.mat.ui ................................. SUCCESS [ 19.093 s]
[INFO] org.eclipse.mat.chart.ui ........................... SUCCESS [  6.087 s]
[INFO] org.eclipse.mat.parser ............................. SUCCESS [ 14.164 s]
[INFO] org.eclipse.mat.dtfj ............................... SUCCESS [ 10.897 s]
[INFO] org.eclipse.mat.hprof .............................. SUCCESS [ 11.748 s]
[INFO] org.eclipse.mat.jdt ................................ SUCCESS [  5.424 s]
[INFO] org.eclipse.mat.ibmdumps ........................... SUCCESS [  6.629 s]
[INFO] org.eclipse.mat.jruby.resolver ..................... SUCCESS [  4.649 s]
[INFO] org.eclipse.mat.tests .............................. FAILURE [  5.648 s]
[INFO] org.eclipse.mat.ui.help ............................ SKIPPED
[INFO] org.eclipse.mat.ui.rcp ............................. SKIPPED
[INFO] org.eclipse.mat.feature ............................ SKIPPED
[INFO] org.eclipse.mat.chart.feature ...................... SKIPPED
[INFO] org.eclipse.mat.ui.rcp.feature ..................... SKIPPED
[INFO] org.eclipse.mat.updatesite ......................... SKIPPED
[INFO] MAT RCP ............................................ SKIPPED
[INFO] org.eclipse.mat.ui.rcp.tests ....................... SKIPPED
[INFO] ------------------------------------------------------------------------
[INFO] BUILD FAILURE
[INFO] ------------------------------------------------------------------------
[INFO] Total time:  05:08 min
[INFO] Finished at: 2021-06-17T10:02:44Z
[INFO] ------------------------------------------------------------------------
[ERROR] Failed to execute goal org.eclipse.tycho:tycho-surefire-plugin:2.0.0:test (default-test) on project org.eclipse.mat.tests: An unexpected error occurred while launching the test runtime (process returned error code 13). Command-line used to launch the sub-process was null -Dosgi.noShutdown=false -Dosgi.os=linux -Dosgi.ws=gtk -Dosgi.arch=x86_64 -ea -Xmx1536m -Dosgi.clean=true -jar /home/jenkins/.m2/repository/p2/osgi/bundle/org.eclipse.equinox.launcher/1.6.200.v20210416-2027/org.eclipse.equinox.launcher-1.6.200.v20210416-2027.jar -debug -consolelog -data /home/jenkins/agent/workspace/tycho-mat-nightly/plugins/org.eclipse.mat.tests/target/work/data -install /home/jenkins/agent/workspace/tycho-mat-nightly/plugins/org.eclipse.mat.tests/target/work -configuration /home/jenkins/agent/workspace/tycho-mat-nightly/plugins/org.eclipse.mat.tests/target/work/configuration -application org.eclipse.tycho.surefire.osgibooter.headlesstest -testproperties /home/jenkins/agent/workspace/tycho-mat-nightly/plugins/org.eclipse.mat.tests/target/surefire.properties in working directory /home/jenkins/agent/workspace/tycho-mat-nightly/plugins/org.eclipse.mat.tests -> [Help 1]
org.apache.maven.lifecycle.LifecycleExecutionException: Failed to execute goal org.eclipse.tycho:tycho-surefire-plugin:2.0.0:test (default-test) on project org.eclipse.mat.tests: An unexpected error occurred while launching the test runtime (process returned error code 13). Command-line used to launch the sub-process was null -Dosgi.noShutdown=false -Dosgi.os=linux -Dosgi.ws=gtk -Dosgi.arch=x86_64 -ea -Xmx1536m -Dosgi.clean=true -jar /home/jenkins/.m2/repository/p2/osgi/bundle/org.eclipse.equinox.launcher/1.6.200.v20210416-2027/org.eclipse.equinox.launcher-1.6.200.v20210416-2027.jar -debug -consolelog -data /home/jenkins/agent/workspace/tycho-mat-nightly/plugins/org.eclipse.mat.tests/target/work/data -install /home/jenkins/agent/workspace/tycho-mat-nightly/plugins/org.eclipse.mat.tests/target/work -configuration /home/jenkins/agent/workspace/tycho-mat-nightly/plugins/org.eclipse.mat.tests/target/work/configuration -application org.eclipse.tycho.surefire.osgibooter.headlesstest -testproperties /home/jenkins/agent/workspace/tycho-mat-nightly/plugins/org.eclipse.mat.tests/target/surefire.properties in working directory /home/jenkins/agent/workspace/tycho-mat-nightly/plugins/org.eclipse.mat.tests
    at org.apache.maven.lifecycle.internal.MojoExecutor.execute (MojoExecutor.java:215)
    at org.apache.maven.lifecycle.internal.MojoExecutor.execute (MojoExecutor.java:156)
    at org.apache.maven.lifecycle.internal.MojoExecutor.execute (MojoExecutor.java:148)
    at org.apache.maven.lifecycle.internal.LifecycleModuleBuilder.buildProject (LifecycleModuleBuilder.java:117)
    at org.apache.maven.lifecycle.internal.LifecycleModuleBuilder.buildProject (LifecycleModuleBuilder.java:81)
    at org.apache.maven.lifecycle.internal.builder.singlethreaded.SingleThreadedBuilder.build (SingleThreadedBuilder.java:56)
    at org.apache.maven.lifecycle.internal.LifecycleStarter.execute (LifecycleStarter.java:128)
    at org.apache.maven.DefaultMaven.doExecute (DefaultMaven.java:305)
    at org.apache.maven.DefaultMaven.doExecute (DefaultMaven.java:192)
    at org.apache.maven.DefaultMaven.execute (DefaultMaven.java:105)
    at org.apache.maven.cli.MavenCli.execute (MavenCli.java:957)
    at org.apache.maven.cli.MavenCli.doMain (MavenCli.java:289)
    at org.apache.maven.cli.MavenCli.main (MavenCli.java:193)
    at jdk.internal.reflect.NativeMethodAccessorImpl.invoke0 (Native Method)
    at jdk.internal.reflect.NativeMethodAccessorImpl.invoke (NativeMethodAccessorImpl.java:62)
    at jdk.internal.reflect.DelegatingMethodAccessorImpl.invoke (DelegatingMethodAccessorImpl.java:43)
    at java.lang.reflect.Method.invoke (Method.java:566)
    at org.codehaus.plexus.classworlds.launcher.Launcher.launchEnhanced (Launcher.java:282)
    at org.codehaus.plexus.classworlds.launcher.Launcher.launch (Launcher.java:225)
    at org.codehaus.plexus.classworlds.launcher.Launcher.mainWithExitCode (Launcher.java:406)
    at org.codehaus.plexus.classworlds.launcher.Launcher.main (Launcher.java:347)
Caused by: org.apache.maven.plugin.MojoFailureException: An unexpected error occurred while launching the test runtime (process returned error code 13). Command-line used to launch the sub-process was null -Dosgi.noShutdown=false -Dosgi.os=linux -Dosgi.ws=gtk -Dosgi.arch=x86_64 -ea -Xmx1536m -Dosgi.clean=true -jar /home/jenkins/.m2/repository/p2/osgi/bundle/org.eclipse.equinox.launcher/1.6.200.v20210416-2027/org.eclipse.equinox.launcher-1.6.200.v20210416-2027.jar -debug -consolelog -data /home/jenkins/agent/workspace/tycho-mat-nightly/plugins/org.eclipse.mat.tests/target/work/data -install /home/jenkins/agent/workspace/tycho-mat-nightly/plugins/org.eclipse.mat.tests/target/work -configuration /home/jenkins/agent/workspace/tycho-mat-nightly/plugins/org.eclipse.mat.tests/target/work/configuration -application org.eclipse.tycho.surefire.osgibooter.headlesstest -testproperties /home/jenkins/agent/workspace/tycho-mat-nightly/plugins/org.eclipse.mat.tests/target/surefire.properties in working directory /home/jenkins/agent/workspace/tycho-mat-nightly/plugins/org.eclipse.mat.tests
    at org.eclipse.tycho.surefire.TestMojo.runTest (TestMojo.java:1093)
    at org.eclipse.tycho.surefire.TestMojo.execute (TestMojo.java:712)
    at org.apache.maven.plugin.DefaultBuildPluginManager.executeMojo (DefaultBuildPluginManager.java:137)
    at org.apache.maven.lifecycle.internal.MojoExecutor.execute (MojoExecutor.java:210)
    at org.apache.maven.lifecycle.internal.MojoExecutor.execute (MojoExecutor.java:156)
    at org.apache.maven.lifecycle.internal.MojoExecutor.execute (MojoExecutor.java:148)
    at org.apache.maven.lifecycle.internal.LifecycleModuleBuilder.buildProject (LifecycleModuleBuilder.java:117)
    at org.apache.maven.lifecycle.internal.LifecycleModuleBuilder.buildProject (LifecycleModuleBuilder.java:81)
    at org.apache.maven.lifecycle.internal.builder.singlethreaded.SingleThreadedBuilder.build (SingleThreadedBuilder.java:56)
    at org.apache.maven.lifecycle.internal.LifecycleStarter.execute (LifecycleStarter.java:128)
    at org.apache.maven.DefaultMaven.doExecute (DefaultMaven.java:305)
    at org.apache.maven.DefaultMaven.doExecute (DefaultMaven.java:192)
    at org.apache.maven.DefaultMaven.execute (DefaultMaven.java:105)
    at org.apache.maven.cli.MavenCli.execute (MavenCli.java:957)
    at org.apache.maven.cli.MavenCli.doMain (MavenCli.java:289)
    at org.apache.maven.cli.MavenCli.main (MavenCli.java:193)
    at jdk.internal.reflect.NativeMethodAccessorImpl.invoke0 (Native Method)
    at jdk.internal.reflect.NativeMethodAccessorImpl.invoke (NativeMethodAccessorImpl.java:62)
    at jdk.internal.reflect.DelegatingMethodAccessorImpl.invoke (DelegatingMethodAccessorImpl.java:43)
    at java.lang.reflect.Method.invoke (Method.java:566)
    at org.codehaus.plexus.classworlds.launcher.Launcher.launchEnhanced (Launcher.java:282)
    at org.codehaus.plexus.classworlds.launcher.Launcher.launch (Launcher.java:225)
    at org.codehaus.plexus.classworlds.launcher.Launcher.mainWithExitCode (Launcher.java:406)
    at org.codehaus.plexus.classworlds.launcher.Launcher.main (Launcher.java:347)
[ERROR] 
[ERROR] 
[ERROR] For more information about the errors and possible solutions, please read the following articles:
[ERROR] [Help 1] http://cwiki.apache.org/confluence/display/MAVEN/MojoFailureException
[ERROR] 
[ERROR] After correcting the problems, you can resume the build with the command
[ERROR]   mvn <args> -rf :org.eclipse.mat.tests
Build step 'Execute shell' marked build as failure
Terminating xvnc.
$ ssh-agent -k
unset SSH_AUTH_SOCK;
unset SSH_AGENT_PID;
echo Agent pid 60 killed;
[ssh-agent] Stopped.
[FINDBUGS] Skipping publisher since build result is FAILURE
Recording test results
ERROR: Step ‘Publish JUnit test result report’ failed: No test report files were found. Configuration error?
[SpotBugs] Skipping execution of recorder since overall result is 'FAILURE'
Finished: FAILURE