Console Output

Skipping 435 KB.. Full Log
	at org.eclipse.mat.tests.snapshot.GeneralSnapshotTests.checkHTMLFile(GeneralSnapshotTests.java:706)
	at org.eclipse.mat.tests.snapshot.GeneralSnapshotTests.checkHTMLResult(GeneralSnapshotTests.java:694)
	at org.eclipse.mat.tests.snapshot.GeneralSnapshotTests.testOverviewReportRename(GeneralSnapshotTests.java:534)

testLeakSuspectsReport[19: Snapshot=dumps/oracle_jdk9_01_x64.hprof options=FRAMES_AND_OBJECTS](org.eclipse.mat.tests.snapshot.GeneralSnapshotTests)  Time elapsed: 0.352 s  <<< ERROR!
java.lang.NullPointerException
	at org.eclipse.mat.tests.snapshot.GeneralSnapshotTests.checkHTMLFile(GeneralSnapshotTests.java:1018)
	at org.eclipse.mat.tests.snapshot.GeneralSnapshotTests.checkHTMLFile(GeneralSnapshotTests.java:997)
	at org.eclipse.mat.tests.snapshot.GeneralSnapshotTests.checkHTMLFile(GeneralSnapshotTests.java:997)
	at org.eclipse.mat.tests.snapshot.GeneralSnapshotTests.checkHTMLFile(GeneralSnapshotTests.java:997)
	at org.eclipse.mat.tests.snapshot.GeneralSnapshotTests.checkHTMLFile(GeneralSnapshotTests.java:720)
	at org.eclipse.mat.tests.snapshot.GeneralSnapshotTests.checkHTMLFile(GeneralSnapshotTests.java:706)
	at org.eclipse.mat.tests.snapshot.GeneralSnapshotTests.checkHTMLResult(GeneralSnapshotTests.java:694)
	at org.eclipse.mat.tests.snapshot.GeneralSnapshotTests.testLeakSuspectsReport(GeneralSnapshotTests.java:481)

testAllQueriesReportText[19: Snapshot=dumps/oracle_jdk9_01_x64.hprof options=FRAMES_AND_OBJECTS](org.eclipse.mat.tests.snapshot.GeneralSnapshotTests)  Time elapsed: 27.16 s  <<< ERROR!
java.lang.NullPointerException
	at org.eclipse.mat.tests.snapshot.GeneralSnapshotTests.checkHTMLFile(GeneralSnapshotTests.java:1018)
	at org.eclipse.mat.tests.snapshot.GeneralSnapshotTests.checkHTMLFile(GeneralSnapshotTests.java:720)
	at org.eclipse.mat.tests.snapshot.GeneralSnapshotTests.checkHTMLFile(GeneralSnapshotTests.java:706)
	at org.eclipse.mat.tests.snapshot.GeneralSnapshotTests.checkHTMLResult(GeneralSnapshotTests.java:694)
	at org.eclipse.mat.tests.snapshot.GeneralSnapshotTests.testAllQueriesReportText(GeneralSnapshotTests.java:1213)

stackFrameElementResolver[19: Snapshot=dumps/oracle_jdk9_01_x64.hprof options=FRAMES_AND_OBJECTS](org.eclipse.mat.tests.snapshot.GeneralSnapshotTests)  Time elapsed: 0.001 s
testOverviewReport[19: Snapshot=dumps/oracle_jdk9_01_x64.hprof options=FRAMES_AND_OBJECTS](org.eclipse.mat.tests.snapshot.GeneralSnapshotTests)  Time elapsed: 0.21 s  <<< ERROR!
java.lang.NullPointerException
	at org.eclipse.mat.tests.snapshot.GeneralSnapshotTests.checkHTMLFile(GeneralSnapshotTests.java:1018)
	at org.eclipse.mat.tests.snapshot.GeneralSnapshotTests.checkHTMLFile(GeneralSnapshotTests.java:997)
	at org.eclipse.mat.tests.snapshot.GeneralSnapshotTests.checkHTMLFile(GeneralSnapshotTests.java:997)
	at org.eclipse.mat.tests.snapshot.GeneralSnapshotTests.checkHTMLFile(GeneralSnapshotTests.java:720)
	at org.eclipse.mat.tests.snapshot.GeneralSnapshotTests.checkHTMLFile(GeneralSnapshotTests.java:706)
	at org.eclipse.mat.tests.snapshot.GeneralSnapshotTests.checkHTMLResult(GeneralSnapshotTests.java:694)
	at org.eclipse.mat.tests.snapshot.GeneralSnapshotTests.testOverviewReport(GeneralSnapshotTests.java:490)

exportHPROF[20: Snapshot=dumps/java_pid1884.0001.hprof.gz options=FRAMES_AND_OBJECTS](org.eclipse.mat.tests.snapshot.GeneralSnapshotTests)  Time elapsed: 14.603 s
exportHPROFredact[20: Snapshot=dumps/java_pid1884.0001.hprof.gz options=FRAMES_AND_OBJECTS](org.eclipse.mat.tests.snapshot.GeneralSnapshotTests)  Time elapsed: 0.866 s
topReferenceLeak[20: Snapshot=dumps/java_pid1884.0001.hprof.gz options=FRAMES_AND_OBJECTS](org.eclipse.mat.tests.snapshot.GeneralSnapshotTests)  Time elapsed: 0.001 s
stacks1[20: Snapshot=dumps/java_pid1884.0001.hprof.gz options=FRAMES_AND_OBJECTS](org.eclipse.mat.tests.snapshot.GeneralSnapshotTests)  Time elapsed: 0.001 s
testRegressionReport[20: Snapshot=dumps/java_pid1884.0001.hprof.gz options=FRAMES_AND_OBJECTS](org.eclipse.mat.tests.snapshot.GeneralSnapshotTests)  Time elapsed: 0.4 s  <<< ERROR!
java.lang.NullPointerException
	at org.eclipse.mat.tests.snapshot.GeneralSnapshotTests.checkHTMLFile(GeneralSnapshotTests.java:1018)
	at org.eclipse.mat.tests.snapshot.GeneralSnapshotTests.checkHTMLFile(GeneralSnapshotTests.java:997)
	at org.eclipse.mat.tests.snapshot.GeneralSnapshotTests.checkHTMLFile(GeneralSnapshotTests.java:997)
	at org.eclipse.mat.tests.snapshot.GeneralSnapshotTests.checkHTMLFile(GeneralSnapshotTests.java:720)
	at org.eclipse.mat.tests.snapshot.GeneralSnapshotTests.checkHTMLFile(GeneralSnapshotTests.java:706)
	at org.eclipse.mat.tests.snapshot.GeneralSnapshotTests.checkHTMLResult(GeneralSnapshotTests.java:694)
	at org.eclipse.mat.tests.snapshot.GeneralSnapshotTests.testRegressionReport(GeneralSnapshotTests.java:463)

exportHPROFCompressChunked[20: Snapshot=dumps/java_pid1884.0001.hprof.gz options=FRAMES_AND_OBJECTS](org.eclipse.mat.tests.snapshot.GeneralSnapshotTests)  Time elapsed: 0.481 s
stringBufferToString[20: Snapshot=dumps/java_pid1884.0001.hprof.gz options=FRAMES_AND_OBJECTS](org.eclipse.mat.tests.snapshot.GeneralSnapshotTests)  Time elapsed: 0 s
testTopComponentsReport[20: Snapshot=dumps/java_pid1884.0001.hprof.gz options=FRAMES_AND_OBJECTS](org.eclipse.mat.tests.snapshot.GeneralSnapshotTests)  Time elapsed: 4.667 s
objectSizes[20: Snapshot=dumps/java_pid1884.0001.hprof.gz options=FRAMES_AND_OBJECTS](org.eclipse.mat.tests.snapshot.GeneralSnapshotTests)  Time elapsed: 0.007 s
listEntries[20: Snapshot=dumps/java_pid1884.0001.hprof.gz options=FRAMES_AND_OBJECTS](org.eclipse.mat.tests.snapshot.GeneralSnapshotTests)  Time elapsed: 0.015 s
exportHPROFCompress[20: Snapshot=dumps/java_pid1884.0001.hprof.gz options=FRAMES_AND_OBJECTS](org.eclipse.mat.tests.snapshot.GeneralSnapshotTests)  Time elapsed: 0.477 s
totalObjects[20: Snapshot=dumps/java_pid1884.0001.hprof.gz options=FRAMES_AND_OBJECTS](org.eclipse.mat.tests.snapshot.GeneralSnapshotTests)  Time elapsed: 0 s
totalHeapSize[20: Snapshot=dumps/java_pid1884.0001.hprof.gz options=FRAMES_AND_OBJECTS](org.eclipse.mat.tests.snapshot.GeneralSnapshotTests)  Time elapsed: 0.001 s
stringBuilderToString[20: Snapshot=dumps/java_pid1884.0001.hprof.gz options=FRAMES_AND_OBJECTS](org.eclipse.mat.tests.snapshot.GeneralSnapshotTests)  Time elapsed: 0.001 s
testPerformanceReport[20: Snapshot=dumps/java_pid1884.0001.hprof.gz options=FRAMES_AND_OBJECTS](org.eclipse.mat.tests.snapshot.GeneralSnapshotTests)  Time elapsed: 0.458 s
topComponents[20: Snapshot=dumps/java_pid1884.0001.hprof.gz options=FRAMES_AND_OBJECTS](org.eclipse.mat.tests.snapshot.GeneralSnapshotTests)  Time elapsed: 0.252 s
groupByValue[20: Snapshot=dumps/java_pid1884.0001.hprof.gz options=FRAMES_AND_OBJECTS](org.eclipse.mat.tests.snapshot.GeneralSnapshotTests)  Time elapsed: 0.044 s
testBug572227[20: Snapshot=dumps/java_pid1884.0001.hprof.gz options=FRAMES_AND_OBJECTS](org.eclipse.mat.tests.snapshot.GeneralSnapshotTests)  Time elapsed: 0.031 s
testAllQueriesReport[20: Snapshot=dumps/java_pid1884.0001.hprof.gz options=FRAMES_AND_OBJECTS](org.eclipse.mat.tests.snapshot.GeneralSnapshotTests)  Time elapsed: 6.244 s  <<< ERROR!
java.lang.NullPointerException
	at org.eclipse.mat.tests.snapshot.GeneralSnapshotTests.checkHTMLFile(GeneralSnapshotTests.java:1018)
	at org.eclipse.mat.tests.snapshot.GeneralSnapshotTests.checkHTMLFile(GeneralSnapshotTests.java:720)
	at org.eclipse.mat.tests.snapshot.GeneralSnapshotTests.checkHTMLFile(GeneralSnapshotTests.java:706)
	at org.eclipse.mat.tests.snapshot.GeneralSnapshotTests.checkHTMLResult(GeneralSnapshotTests.java:694)
	at org.eclipse.mat.tests.snapshot.GeneralSnapshotTests.testAllQueriesReport(GeneralSnapshotTests.java:684)

exportHPROFSegments[20: Snapshot=dumps/java_pid1884.0001.hprof.gz options=FRAMES_AND_OBJECTS](org.eclipse.mat.tests.snapshot.GeneralSnapshotTests)  Time elapsed: 0.23 s
testMethods[20: Snapshot=dumps/java_pid1884.0001.hprof.gz options=FRAMES_AND_OBJECTS](org.eclipse.mat.tests.snapshot.GeneralSnapshotTests)  Time elapsed: 0 s
reload1[20: Snapshot=dumps/java_pid1884.0001.hprof.gz options=FRAMES_AND_OBJECTS](org.eclipse.mat.tests.snapshot.GeneralSnapshotTests)  Time elapsed: 0 s
reload2[20: Snapshot=dumps/java_pid1884.0001.hprof.gz options=FRAMES_AND_OBJECTS](org.eclipse.mat.tests.snapshot.GeneralSnapshotTests)  Time elapsed: 0.018 s
stringToString[20: Snapshot=dumps/java_pid1884.0001.hprof.gz options=FRAMES_AND_OBJECTS](org.eclipse.mat.tests.snapshot.GeneralSnapshotTests)  Time elapsed: 0.024 s
testAllQueriesReportCSV[20: Snapshot=dumps/java_pid1884.0001.hprof.gz options=FRAMES_AND_OBJECTS](org.eclipse.mat.tests.snapshot.GeneralSnapshotTests)  Time elapsed: 4.029 s  <<< ERROR!
java.lang.NullPointerException
	at org.eclipse.mat.tests.snapshot.GeneralSnapshotTests.checkHTMLFile(GeneralSnapshotTests.java:1018)
	at org.eclipse.mat.tests.snapshot.GeneralSnapshotTests.checkHTMLFile(GeneralSnapshotTests.java:720)
	at org.eclipse.mat.tests.snapshot.GeneralSnapshotTests.checkHTMLFile(GeneralSnapshotTests.java:706)
	at org.eclipse.mat.tests.snapshot.GeneralSnapshotTests.checkHTMLResult(GeneralSnapshotTests.java:694)
	at org.eclipse.mat.tests.snapshot.GeneralSnapshotTests.testAllQueriesReportCSV(GeneralSnapshotTests.java:1223)

testOverviewReportRename2[20: Snapshot=dumps/java_pid1884.0001.hprof.gz options=FRAMES_AND_OBJECTS](org.eclipse.mat.tests.snapshot.GeneralSnapshotTests)  Time elapsed: 0.264 s  <<< ERROR!
java.lang.NullPointerException
	at org.eclipse.mat.tests.snapshot.GeneralSnapshotTests.checkHTMLFile(GeneralSnapshotTests.java:1018)
	at org.eclipse.mat.tests.snapshot.GeneralSnapshotTests.checkHTMLFile(GeneralSnapshotTests.java:997)
	at org.eclipse.mat.tests.snapshot.GeneralSnapshotTests.checkHTMLFile(GeneralSnapshotTests.java:997)
	at org.eclipse.mat.tests.snapshot.GeneralSnapshotTests.checkHTMLFile(GeneralSnapshotTests.java:720)
	at org.eclipse.mat.tests.snapshot.GeneralSnapshotTests.checkHTMLFile(GeneralSnapshotTests.java:706)
	at org.eclipse.mat.tests.snapshot.GeneralSnapshotTests.checkHTMLResult(GeneralSnapshotTests.java:694)
	at org.eclipse.mat.tests.snapshot.GeneralSnapshotTests.testOverviewReportRename2(GeneralSnapshotTests.java:585)

testClassLoaders[20: Snapshot=dumps/java_pid1884.0001.hprof.gz options=FRAMES_AND_OBJECTS](org.eclipse.mat.tests.snapshot.GeneralSnapshotTests)  Time elapsed: 0 s
totalClasses[20: Snapshot=dumps/java_pid1884.0001.hprof.gz options=FRAMES_AND_OBJECTS](org.eclipse.mat.tests.snapshot.GeneralSnapshotTests)  Time elapsed: 0 s
testOverviewReportRename[20: Snapshot=dumps/java_pid1884.0001.hprof.gz options=FRAMES_AND_OBJECTS](org.eclipse.mat.tests.snapshot.GeneralSnapshotTests)  Time elapsed: 0.244 s  <<< ERROR!
java.lang.NullPointerException
	at org.eclipse.mat.tests.snapshot.GeneralSnapshotTests.checkHTMLFile(GeneralSnapshotTests.java:1018)
	at org.eclipse.mat.tests.snapshot.GeneralSnapshotTests.checkHTMLFile(GeneralSnapshotTests.java:997)
	at org.eclipse.mat.tests.snapshot.GeneralSnapshotTests.checkHTMLFile(GeneralSnapshotTests.java:997)
	at org.eclipse.mat.tests.snapshot.GeneralSnapshotTests.checkHTMLFile(GeneralSnapshotTests.java:720)
	at org.eclipse.mat.tests.snapshot.GeneralSnapshotTests.checkHTMLFile(GeneralSnapshotTests.java:706)
	at org.eclipse.mat.tests.snapshot.GeneralSnapshotTests.checkHTMLResult(GeneralSnapshotTests.java:694)
	at org.eclipse.mat.tests.snapshot.GeneralSnapshotTests.testOverviewReportRename(GeneralSnapshotTests.java:534)

testLeakSuspectsReport[20: Snapshot=dumps/java_pid1884.0001.hprof.gz options=FRAMES_AND_OBJECTS](org.eclipse.mat.tests.snapshot.GeneralSnapshotTests)  Time elapsed: 0.569 s  <<< ERROR!
java.lang.NullPointerException
	at org.eclipse.mat.tests.snapshot.GeneralSnapshotTests.checkHTMLFile(GeneralSnapshotTests.java:1018)
	at org.eclipse.mat.tests.snapshot.GeneralSnapshotTests.checkHTMLFile(GeneralSnapshotTests.java:997)
	at org.eclipse.mat.tests.snapshot.GeneralSnapshotTests.checkHTMLFile(GeneralSnapshotTests.java:997)
	at org.eclipse.mat.tests.snapshot.GeneralSnapshotTests.checkHTMLFile(GeneralSnapshotTests.java:997)
	at org.eclipse.mat.tests.snapshot.GeneralSnapshotTests.checkHTMLFile(GeneralSnapshotTests.java:720)
	at org.eclipse.mat.tests.snapshot.GeneralSnapshotTests.checkHTMLFile(GeneralSnapshotTests.java:706)
	at org.eclipse.mat.tests.snapshot.GeneralSnapshotTests.checkHTMLResult(GeneralSnapshotTests.java:694)
	at org.eclipse.mat.tests.snapshot.GeneralSnapshotTests.testLeakSuspectsReport(GeneralSnapshotTests.java:481)

testAllQueriesReportText[20: Snapshot=dumps/java_pid1884.0001.hprof.gz options=FRAMES_AND_OBJECTS](org.eclipse.mat.tests.snapshot.GeneralSnapshotTests)  Time elapsed: 4.776 s  <<< ERROR!
java.lang.NullPointerException
	at org.eclipse.mat.tests.snapshot.GeneralSnapshotTests.checkHTMLFile(GeneralSnapshotTests.java:1018)
	at org.eclipse.mat.tests.snapshot.GeneralSnapshotTests.checkHTMLFile(GeneralSnapshotTests.java:720)
	at org.eclipse.mat.tests.snapshot.GeneralSnapshotTests.checkHTMLFile(GeneralSnapshotTests.java:706)
	at org.eclipse.mat.tests.snapshot.GeneralSnapshotTests.checkHTMLResult(GeneralSnapshotTests.java:694)
	at org.eclipse.mat.tests.snapshot.GeneralSnapshotTests.testAllQueriesReportText(GeneralSnapshotTests.java:1213)

stackFrameElementResolver[20: Snapshot=dumps/java_pid1884.0001.hprof.gz options=FRAMES_AND_OBJECTS](org.eclipse.mat.tests.snapshot.GeneralSnapshotTests)  Time elapsed: 0 s
testOverviewReport[20: Snapshot=dumps/java_pid1884.0001.hprof.gz options=FRAMES_AND_OBJECTS](org.eclipse.mat.tests.snapshot.GeneralSnapshotTests)  Time elapsed: 0.27 s  <<< ERROR!
java.lang.NullPointerException
	at org.eclipse.mat.tests.snapshot.GeneralSnapshotTests.checkHTMLFile(GeneralSnapshotTests.java:1018)
	at org.eclipse.mat.tests.snapshot.GeneralSnapshotTests.checkHTMLFile(GeneralSnapshotTests.java:997)
	at org.eclipse.mat.tests.snapshot.GeneralSnapshotTests.checkHTMLFile(GeneralSnapshotTests.java:997)
	at org.eclipse.mat.tests.snapshot.GeneralSnapshotTests.checkHTMLFile(GeneralSnapshotTests.java:720)
	at org.eclipse.mat.tests.snapshot.GeneralSnapshotTests.checkHTMLFile(GeneralSnapshotTests.java:706)
	at org.eclipse.mat.tests.snapshot.GeneralSnapshotTests.checkHTMLResult(GeneralSnapshotTests.java:694)
	at org.eclipse.mat.tests.snapshot.GeneralSnapshotTests.testOverviewReport(GeneralSnapshotTests.java:490)

testHistogramSizes[0](org.eclipse.mat.tests.snapshot.TestInstanceSizes)  Time elapsed: 0.24 s
testHistogramSizes[1](org.eclipse.mat.tests.snapshot.TestInstanceSizes)  Time elapsed: 0.36 s
testHistogramSizes[2](org.eclipse.mat.tests.snapshot.TestInstanceSizes)  Time elapsed: 0.465 s
testHistogramSizes[3](org.eclipse.mat.tests.snapshot.TestInstanceSizes)  Time elapsed: 0.207 s
testHistogramSizes[4](org.eclipse.mat.tests.snapshot.TestInstanceSizes)  Time elapsed: 0.174 s
testCompareDiffRatioFirst(org.eclipse.mat.tests.snapshot.QueryLookupTest)  Time elapsed: 0.043 s
testSubjectsAnnotation1(org.eclipse.mat.tests.snapshot.QueryLookupTest)  Time elapsed: 0.001 s
testSubjectsAnnotation2(org.eclipse.mat.tests.snapshot.QueryLookupTest)  Time elapsed: 0 s
testSubjectsAnnotation3(org.eclipse.mat.tests.snapshot.QueryLookupTest)  Time elapsed: 0 s
testSubjectsAnnotation4(org.eclipse.mat.tests.snapshot.QueryLookupTest)  Time elapsed: 0.001 s
testCompareDuplicateRecords1(org.eclipse.mat.tests.snapshot.QueryLookupTest)  Time elapsed: 2.784 s
testCompareDuplicateRecords2(org.eclipse.mat.tests.snapshot.QueryLookupTest)  Time elapsed: 0.515 s
testCompareDuplicateRecords3(org.eclipse.mat.tests.snapshot.QueryLookupTest)  Time elapsed: 14.134 s
testCompareOQL(org.eclipse.mat.tests.snapshot.QueryLookupTest)  Time elapsed: 8.458 s
testParse(org.eclipse.mat.tests.snapshot.QueryLookupTest)  Time elapsed: 0 s
testCompareDiffRatioPreviousRetained1(org.eclipse.mat.tests.snapshot.QueryLookupTest)  Time elapsed: 14.54 s
testCompareDiffRatioPreviousRetained2(org.eclipse.mat.tests.snapshot.QueryLookupTest)  Time elapsed: 16.057 s
testCompareSetOperationsSymDiff(org.eclipse.mat.tests.snapshot.QueryLookupTest)  Time elapsed: 0.047 s
testCompareSetOperationsIntersection(org.eclipse.mat.tests.snapshot.QueryLookupTest)  Time elapsed: 0.003 s
testCompareSetOperationsDiff1(org.eclipse.mat.tests.snapshot.QueryLookupTest)  Time elapsed: 0.003 s
testCompareSetOperationsDiff2(org.eclipse.mat.tests.snapshot.QueryLookupTest)  Time elapsed: 0.004 s
testCompareSetOperationsDiff3(org.eclipse.mat.tests.snapshot.QueryLookupTest)  Time elapsed: 0.002 s
testCompareSetOperationsDiff4(org.eclipse.mat.tests.snapshot.QueryLookupTest)  Time elapsed: 0.005 s
testCompareSetOperationsDiff5(org.eclipse.mat.tests.snapshot.QueryLookupTest)  Time elapsed: 0.004 s
testCompareSetOperationsDiff6(org.eclipse.mat.tests.snapshot.QueryLookupTest)  Time elapsed: 0.004 s
testCompareSetOperationsUnion(org.eclipse.mat.tests.snapshot.QueryLookupTest)  Time elapsed: 0.003 s
testCompare(org.eclipse.mat.tests.snapshot.QueryLookupTest)  Time elapsed: 0.005 s
testLookup(org.eclipse.mat.tests.snapshot.QueryLookupTest)  Time elapsed: 0.001 s
testCompareDiffPrevious(org.eclipse.mat.tests.snapshot.QueryLookupTest)  Time elapsed: 0.011 s
testOQLFiltering2(org.eclipse.mat.tests.snapshot.QueriesTest)  Time elapsed: 0.005 s
testOQLFiltering3(org.eclipse.mat.tests.snapshot.QueriesTest)  Time elapsed: 0.001 s
testOQLFiltering4(org.eclipse.mat.tests.snapshot.QueriesTest)  Time elapsed: 0.002 s
testOQLFiltering5(org.eclipse.mat.tests.snapshot.QueriesTest)  Time elapsed: 0.001 s
testOQLFiltering6(org.eclipse.mat.tests.snapshot.QueriesTest)  Time elapsed: 0.001 s
testOQLFiltering7(org.eclipse.mat.tests.snapshot.QueriesTest)  Time elapsed: 0.001 s
testOQLFiltering8(org.eclipse.mat.tests.snapshot.QueriesTest)  Time elapsed: 0.002 s
testOQLFiltering9(org.eclipse.mat.tests.snapshot.QueriesTest)  Time elapsed: 0.001 s
testFindStrings(org.eclipse.mat.tests.snapshot.QueriesTest)  Time elapsed: 0.027 s
testCompareThreads1(org.eclipse.mat.tests.snapshot.QueriesTest)  Time elapsed: 0.003 s  <<< ERROR!
java.lang.NullPointerException
	at org.eclipse.mat.tests.snapshot.QueriesTest.testCompareThreads1(QueriesTest.java:1455)

testFiltering10(org.eclipse.mat.tests.snapshot.QueriesTest)  Time elapsed: 0.005 s
testLeakHunter2ReportJDK11none(org.eclipse.mat.tests.snapshot.QueriesTest)  Time elapsed: 2.157 s
testFiltering11ne2(org.eclipse.mat.tests.snapshot.QueriesTest)  Time elapsed: 0.005 s
testFindStrings2(org.eclipse.mat.tests.snapshot.QueriesTest)  Time elapsed: 0.06 s
testFindStrings3(org.eclipse.mat.tests.snapshot.QueriesTest)  Time elapsed: 0.081 s
testFiltering12percentAsNumNoFr(org.eclipse.mat.tests.snapshot.QueriesTest)  Time elapsed: 0.039 s
testExportHprofReportFile(org.eclipse.mat.tests.snapshot.QueriesTest)  Time elapsed: 0.412 s
testDominatorByLoader(org.eclipse.mat.tests.snapshot.QueriesTest)  Time elapsed: 0.013 s
testQueryReport1(org.eclipse.mat.tests.snapshot.QueriesTest)  Time elapsed: 0.08 s
testQueryReport2(org.eclipse.mat.tests.snapshot.QueriesTest)  Time elapsed: 0.062 s
testQueryReport3(org.eclipse.mat.tests.snapshot.QueriesTest)  Time elapsed: 0.054 s
testFiltering11urangea(org.eclipse.mat.tests.snapshot.QueriesTest)  Time elapsed: 0.006 s
testFiltering11urangeb(org.eclipse.mat.tests.snapshot.QueriesTest)  Time elapsed: 0.003 s
testLeakHunter2ReportJDK6none(org.eclipse.mat.tests.snapshot.QueriesTest)  Time elapsed: 0.497 s
testOQLFiltering11urangeabnan(org.eclipse.mat.tests.snapshot.QueriesTest)  Time elapsed: 0.064 s
testCompareHistogram1(org.eclipse.mat.tests.snapshot.QueriesTest)  Time elapsed: 0.111 s
testSuspects2Report(org.eclipse.mat.tests.snapshot.QueriesTest)  Time elapsed: 1.326 s
testOQLFormatting(org.eclipse.mat.tests.snapshot.QueriesTest)  Time elapsed: 0.049 s
testOQLFiltering11notrangeabnan(org.eclipse.mat.tests.snapshot.QueriesTest)  Time elapsed: 0.015 s
testOverview2Report(org.eclipse.mat.tests.snapshot.QueriesTest)  Time elapsed: 0.094 s
testLeakHunter2ReportJDK6(org.eclipse.mat.tests.snapshot.QueriesTest)  Time elapsed: 0.895 s
testFiltering11rangeab(org.eclipse.mat.tests.snapshot.QueriesTest)  Time elapsed: 0.002 s
testFiltering12percent(org.eclipse.mat.tests.snapshot.QueriesTest)  Time elapsed: 0.001 s
testCompareReport(org.eclipse.mat.tests.snapshot.QueriesTest)  Time elapsed: 0.043 s
testFiltering12percentNumPercent(org.eclipse.mat.tests.snapshot.QueriesTest)  Time elapsed: 0.002 s
testCustomRetainedSet(org.eclipse.mat.tests.snapshot.QueriesTest)  Time elapsed: 0.005 s
testLeakHunter2ReportIBM8_7(org.eclipse.mat.tests.snapshot.QueriesTest)  Time elapsed: 16.398 s
testCompareQuery(org.eclipse.mat.tests.snapshot.QueriesTest)  Time elapsed: 0.007 s
testFiltering12percentFr(org.eclipse.mat.tests.snapshot.QueriesTest)  Time elapsed: 0.002 s
testFiltering11urangeab(org.eclipse.mat.tests.snapshot.QueriesTest)  Time elapsed: 0.005 s
testFiltering11eq(org.eclipse.mat.tests.snapshot.QueriesTest)  Time elapsed: 0.001 s
testFiltering11ge(org.eclipse.mat.tests.snapshot.QueriesTest)  Time elapsed: 0.002 s
testFiltering11gt(org.eclipse.mat.tests.snapshot.QueriesTest)  Time elapsed: 0.002 s
testFiltering11le(org.eclipse.mat.tests.snapshot.QueriesTest)  Time elapsed: 0.002 s
testFiltering11lt(org.eclipse.mat.tests.snapshot.QueriesTest)  Time elapsed: 0.003 s
testFiltering11ne(org.eclipse.mat.tests.snapshot.QueriesTest)  Time elapsed: 0.002 s
testFiltering11regex(org.eclipse.mat.tests.snapshot.QueriesTest)  Time elapsed: 0.004 s
testFiltering11rangea(org.eclipse.mat.tests.snapshot.QueriesTest)  Time elapsed: 0.002 s
testFiltering11rangeb(org.eclipse.mat.tests.snapshot.QueriesTest)  Time elapsed: 0.002 s
testLeakHunter2ReportJDK11(org.eclipse.mat.tests.snapshot.QueriesTest)  Time elapsed: 4.553 s  <<< FAILURE!
java.lang.AssertionError: 
Expected subqueries with commands
Expected: <25>
     but: was <24>
	at org.eclipse.mat.tests.snapshot.QueriesTest.testLeakHunter2Report(QueriesTest.java:1448)
	at org.eclipse.mat.tests.snapshot.QueriesTest.testLeakHunter2ReportJDK11(QueriesTest.java:1378)

testHeapArguments1(org.eclipse.mat.tests.snapshot.QueriesTest)  Time elapsed: 0.005 s
testHeapArguments2(org.eclipse.mat.tests.snapshot.QueriesTest)  Time elapsed: 0.009 s
testFiltering12percentAsNum(org.eclipse.mat.tests.snapshot.QueriesTest)  Time elapsed: 0.005 s
testOQLSorting(org.eclipse.mat.tests.snapshot.QueriesTest)  Time elapsed: 0.111 s
testExportHprofReport(org.eclipse.mat.tests.snapshot.QueriesTest)  Time elapsed: 0.431 s
testOQLFiltering(org.eclipse.mat.tests.snapshot.QueriesTest)  Time elapsed: 0.012 s
testFiltering12percentAsNumFr(org.eclipse.mat.tests.snapshot.QueriesTest)  Time elapsed: 0.004 s
testSelectFromObjectsClasses(org.eclipse.mat.tests.snapshot.OQLTest)  Time elapsed: 0.013 s
testObjectArray(org.eclipse.mat.tests.snapshot.OQLTest)  Time elapsed: 0.002 s
testLeftJoin(org.eclipse.mat.tests.snapshot.OQLTest)  Time elapsed: 1.087 s
testMethodCallSecurityManager(org.eclipse.mat.tests.snapshot.OQLTest)  Time elapsed: 0.005 s
testFromAddress(org.eclipse.mat.tests.snapshot.OQLTest)  Time elapsed: 0.001 s
testConcatentation(org.eclipse.mat.tests.snapshot.OQLTest)  Time elapsed: 0.001 s
testImplements(org.eclipse.mat.tests.snapshot.OQLTest)  Time elapsed: 0.001 s
testSelectFromObjectsClasses2(org.eclipse.mat.tests.snapshot.OQLTest)  Time elapsed: 0.013 s
testSelectFromAbstract(org.eclipse.mat.tests.snapshot.OQLTest)  Time elapsed: 0.001 s
testMethodArrayInfo(org.eclipse.mat.tests.snapshot.OQLTest)  Time elapsed: 0.002 s
testWhereRelationalOperators(org.eclipse.mat.tests.snapshot.OQLTest)  Time elapsed: 0.085 s
testWhereRelationalOperatorsOnStaticAttributes(org.eclipse.mat.tests.snapshot.OQLTest)  Time elapsed: 0.02 s
testUnindexed11(org.eclipse.mat.tests.snapshot.OQLTest)  Time elapsed: 0.092 s
testUnindexed12(org.eclipse.mat.tests.snapshot.OQLTest)  Time elapsed: 0.065 s
testUnindexed13(org.eclipse.mat.tests.snapshot.OQLTest)  Time elapsed: 0.025 s
testUnindexed14(org.eclipse.mat.tests.snapshot.OQLTest)  Time elapsed: 0.01 s
testUnindexed15(org.eclipse.mat.tests.snapshot.OQLTest)  Time elapsed: 0.009 s
testUnindexed16(org.eclipse.mat.tests.snapshot.OQLTest)  Time elapsed: 0.053 s
testUnindexed17(org.eclipse.mat.tests.snapshot.OQLTest)  Time elapsed: 0.009 s
testUnindexed18(org.eclipse.mat.tests.snapshot.OQLTest)  Time elapsed: 0.187 s
testUnindexed19(org.eclipse.mat.tests.snapshot.OQLTest)  Time elapsed: 0.217 s
testFromPattern(org.eclipse.mat.tests.snapshot.OQLTest)  Time elapsed: 0 s
testWhereRelationalOperatorsOnAttributes(org.eclipse.mat.tests.snapshot.OQLTest)  Time elapsed: 0.001 s
testMethodCallVarArgs1(org.eclipse.mat.tests.snapshot.OQLTest)  Time elapsed: 0.002 s
testMethodCallVarArgs5(org.eclipse.mat.tests.snapshot.OQLTest)  Time elapsed: 0 s
testUnion(org.eclipse.mat.tests.snapshot.OQLTest)  Time elapsed: 0.001 s
testEval(org.eclipse.mat.tests.snapshot.OQLTest)  Time elapsed: 0.001 s
testAsEmpty(org.eclipse.mat.tests.snapshot.OQLTest)  Time elapsed: 0.001 s
testOperations1long(org.eclipse.mat.tests.snapshot.OQLTest)  Time elapsed: 0 s
testOperations2date(org.eclipse.mat.tests.snapshot.OQLTest)  Time elapsed: 0.01 s
testOperations2long(org.eclipse.mat.tests.snapshot.OQLTest)  Time elapsed: 0 s
testPrimitiveArrayRange(org.eclipse.mat.tests.snapshot.OQLTest)  Time elapsed: 0.002 s
testWhereArithmeticInt(org.eclipse.mat.tests.snapshot.OQLTest)  Time elapsed: 0.003 s
testJavaArrayRange(org.eclipse.mat.tests.snapshot.OQLTest)  Time elapsed: 0.001 s
testFullOuterJoin(org.eclipse.mat.tests.snapshot.OQLTest)  Time elapsed: 1.068 s
testRightJoin(org.eclipse.mat.tests.snapshot.OQLTest)  Time elapsed: 0.817 s
testMethodCallNulls1(org.eclipse.mat.tests.snapshot.OQLTest)  Time elapsed: 0 s
testWhereLiterals(org.eclipse.mat.tests.snapshot.OQLTest)  Time elapsed: 0.078 s
emptyColumnName(org.eclipse.mat.tests.snapshot.OQLTest)  Time elapsed: 0.003 s
testOQLunion1(org.eclipse.mat.tests.snapshot.OQLTest)  Time elapsed: 0 s
testOQLunion2(org.eclipse.mat.tests.snapshot.OQLTest)  Time elapsed: 0 s
testOQLunion3(org.eclipse.mat.tests.snapshot.OQLTest)  Time elapsed: 0.101 s
testOQLunion4(org.eclipse.mat.tests.snapshot.OQLTest)  Time elapsed: 36.136 s
testOQLunion5(org.eclipse.mat.tests.snapshot.OQLTest)  Time elapsed: 0 s
testOQLunion6(org.eclipse.mat.tests.snapshot.OQLTest)  Time elapsed: 0 s
testOQLunion7(org.eclipse.mat.tests.snapshot.OQLTest)  Time elapsed: 0.004 s
testArrayList(org.eclipse.mat.tests.snapshot.OQLTest)  Time elapsed: 0.004 s
testMethodCallSystem(org.eclipse.mat.tests.snapshot.OQLTest)  Time elapsed: 0.002 s
testMethodCallThread(org.eclipse.mat.tests.snapshot.OQLTest)  Time elapsed: 0.002 s
testComplex10(org.eclipse.mat.tests.snapshot.OQLTest)  Time elapsed: 0.016 s
testComplex11(org.eclipse.mat.tests.snapshot.OQLTest)  Time elapsed: 0.003 s
testComplex12(org.eclipse.mat.tests.snapshot.OQLTest)  Time elapsed: 0.001 s
testComplex13(org.eclipse.mat.tests.snapshot.OQLTest)  Time elapsed: 0.002 s
testComplex14(org.eclipse.mat.tests.snapshot.OQLTest)  Time elapsed: 0.002 s
testComplex15(org.eclipse.mat.tests.snapshot.OQLTest)  Time elapsed: 0.159 s
testComplex16(org.eclipse.mat.tests.snapshot.OQLTest)  Time elapsed: 0.316 s
testComplex17(org.eclipse.mat.tests.snapshot.OQLTest)  Time elapsed: 0.695 s
testComplex18(org.eclipse.mat.tests.snapshot.OQLTest)  Time elapsed: 0.001 s
testComplex19(org.eclipse.mat.tests.snapshot.OQLTest)  Time elapsed: 0.001 s
testComplex20(org.eclipse.mat.tests.snapshot.OQLTest)  Time elapsed: 0 s
testComplex21(org.eclipse.mat.tests.snapshot.OQLTest)  Time elapsed: 0 s
testComplex22(org.eclipse.mat.tests.snapshot.OQLTest)  Time elapsed: 0.001 s
testComplex23(org.eclipse.mat.tests.snapshot.OQLTest)  Time elapsed: 0.001 s
testComplex24(org.eclipse.mat.tests.snapshot.OQLTest)  Time elapsed: 0 s
testComplex25(org.eclipse.mat.tests.snapshot.OQLTest)  Time elapsed: 0.001 s
testComplex26(org.eclipse.mat.tests.snapshot.OQLTest)  Time elapsed: 0.001 s
testComplex27(org.eclipse.mat.tests.snapshot.OQLTest)  Time elapsed: 0 s
testComplex29(org.eclipse.mat.tests.snapshot.OQLTest)  Time elapsed: 0.001 s
testComplex30(org.eclipse.mat.tests.snapshot.OQLTest)  Time elapsed: 0.001 s
testComplex31(org.eclipse.mat.tests.snapshot.OQLTest)  Time elapsed: 0.002 s
testComplex32(org.eclipse.mat.tests.snapshot.OQLTest)  Time elapsed: 0.001 s
testComplex33(org.eclipse.mat.tests.snapshot.OQLTest)  Time elapsed: 0.001 s
testComplex34(org.eclipse.mat.tests.snapshot.OQLTest)  Time elapsed: 0 s
testComplex35(org.eclipse.mat.tests.snapshot.OQLTest)  Time elapsed: 0.001 s
testComplex36(org.eclipse.mat.tests.snapshot.OQLTest)  Time elapsed: 0.001 s
testComplex37(org.eclipse.mat.tests.snapshot.OQLTest)  Time elapsed: 0.001 s
testComplex38(org.eclipse.mat.tests.snapshot.OQLTest)  Time elapsed: 0 s
testComplex39(org.eclipse.mat.tests.snapshot.OQLTest)  Time elapsed: 0.001 s
testComplex40(org.eclipse.mat.tests.snapshot.OQLTest)  Time elapsed: 0.001 s
testComplex41(org.eclipse.mat.tests.snapshot.OQLTest)  Time elapsed: 0.03 s
testComplex42(org.eclipse.mat.tests.snapshot.OQLTest)  Time elapsed: 0 s
testComplex43(org.eclipse.mat.tests.snapshot.OQLTest)  Time elapsed: 0.001 s
testComplex44(org.eclipse.mat.tests.snapshot.OQLTest)  Time elapsed: 0 s
testComplex5a(org.eclipse.mat.tests.snapshot.OQLTest)  Time elapsed: 0.004 s
testComplex5b(org.eclipse.mat.tests.snapshot.OQLTest)  Time elapsed: 0.004 s
testComplex5c(org.eclipse.mat.tests.snapshot.OQLTest)  Time elapsed: 0.008 s
testComplex5d(org.eclipse.mat.tests.snapshot.OQLTest)  Time elapsed: 0.016 s
testFromSubSelect(org.eclipse.mat.tests.snapshot.OQLTest)  Time elapsed: 0.002 s
testMethodCallCompiler(org.eclipse.mat.tests.snapshot.OQLTest)  Time elapsed: 0.002 s
testAsSpaces(org.eclipse.mat.tests.snapshot.OQLTest)  Time elapsed: 0.004 s
testFromClauseWithNullObjects(org.eclipse.mat.tests.snapshot.OQLTest)  Time elapsed: 0.002 s
testMethodCallProcess(org.eclipse.mat.tests.snapshot.OQLTest)  Time elapsed: 0.002 s
testSelectAttributes(org.eclipse.mat.tests.snapshot.OQLTest)  Time elapsed: 0.472 s
testFromByName1(org.eclipse.mat.tests.snapshot.OQLTest)  Time elapsed: 0.029 s
testFromByName2(org.eclipse.mat.tests.snapshot.OQLTest)  Time elapsed: 1.192 s
testFromByName3(org.eclipse.mat.tests.snapshot.OQLTest)  Time elapsed: 0.865 s
testFromByName4(org.eclipse.mat.tests.snapshot.OQLTest)  Time elapsed: 0.139 s
testFromByName5(org.eclipse.mat.tests.snapshot.OQLTest)  Time elapsed: 0.238 s
testFromByName6(org.eclipse.mat.tests.snapshot.OQLTest)  Time elapsed: 0.25 s
testFromByName7(org.eclipse.mat.tests.snapshot.OQLTest)  Time elapsed: 0.603 s
testOverloadedMethod1(org.eclipse.mat.tests.snapshot.OQLTest)  Time elapsed: 0 s
testOverloadedMethod2(org.eclipse.mat.tests.snapshot.OQLTest)  Time elapsed: 0.153 s
testOverloadedMethod3(org.eclipse.mat.tests.snapshot.OQLTest)  Time elapsed: 0.183 s
testOverloadedMethod4(org.eclipse.mat.tests.snapshot.OQLTest)  Time elapsed: 0.261 s
nonEmptyColumnName(org.eclipse.mat.tests.snapshot.OQLTest)  Time elapsed: 0.004 s
testPrimitiveArrayRange2(org.eclipse.mat.tests.snapshot.OQLTest)  Time elapsed: 0.003 s
testArrayListGet(org.eclipse.mat.tests.snapshot.OQLTest)  Time elapsed: 0.001 s
testJavaArray(org.eclipse.mat.tests.snapshot.OQLTest)  Time elapsed: 0 s
testInnerJoin1(org.eclipse.mat.tests.snapshot.OQLTest)  Time elapsed: 0.766 s
testInnerJoin2(org.eclipse.mat.tests.snapshot.OQLTest)  Time elapsed: 0.737 s
testComplex1(org.eclipse.mat.tests.snapshot.OQLTest)  Time elapsed: 0.076 s
testComplex2(org.eclipse.mat.tests.snapshot.OQLTest)  Time elapsed: 0.049 s
testComplex3(org.eclipse.mat.tests.snapshot.OQLTest)  Time elapsed: 0.004 s
testComplex4(org.eclipse.mat.tests.snapshot.OQLTest)  Time elapsed: 0.012 s
testComplex5(org.eclipse.mat.tests.snapshot.OQLTest)  Time elapsed: 0.004 s
testComplex6(org.eclipse.mat.tests.snapshot.OQLTest)  Time elapsed: 0.005 s
testComplex7(org.eclipse.mat.tests.snapshot.OQLTest)  Time elapsed: 0.003 s
testComplex8(org.eclipse.mat.tests.snapshot.OQLTest)  Time elapsed: 0.007 s
testComplex9(org.eclipse.mat.tests.snapshot.OQLTest)  Time elapsed: 0.121 s
testJavaList(org.eclipse.mat.tests.snapshot.OQLTest)  Time elapsed: 0 s
testAsPunctution(org.eclipse.mat.tests.snapshot.OQLTest)  Time elapsed: 0.004 s
testMethodCallClassLoader(org.eclipse.mat.tests.snapshot.OQLTest)  Time elapsed: 0.001 s
testUnreservedKeywords(org.eclipse.mat.tests.snapshot.OQLTest)  Time elapsed: 0.001 s
testInstanceOf10(org.eclipse.mat.tests.snapshot.OQLTest)  Time elapsed: 0.001 s
testErrorRuntimeException(org.eclipse.mat.tests.snapshot.OQLTest)  Time elapsed: 0 s
testWhereArithmetic(org.eclipse.mat.tests.snapshot.OQLTest)  Time elapsed: 0.101 s
testAndClause(org.eclipse.mat.tests.snapshot.OQLTest)  Time elapsed: 0.001 s
testConversionsLong(org.eclipse.mat.tests.snapshot.OQLTest)  Time elapsed: 0.034 s
testJavaArrayRange2(org.eclipse.mat.tests.snapshot.OQLTest)  Time elapsed: 0.001 s
testJavaArrayRange3(org.eclipse.mat.tests.snapshot.OQLTest)  Time elapsed: 0 s
testObjectArrayRange(org.eclipse.mat.tests.snapshot.OQLTest)  Time elapsed: 0.001 s
testOperations1double(org.eclipse.mat.tests.snapshot.OQLTest)  Time elapsed: 0 s
testUnindexed1(org.eclipse.mat.tests.snapshot.OQLTest)  Time elapsed: 0.002 s
testUnindexed2(org.eclipse.mat.tests.snapshot.OQLTest)  Time elapsed: 0.003 s
testUnindexed3(org.eclipse.mat.tests.snapshot.OQLTest)  Time elapsed: 0.002 s
testUnindexed4(org.eclipse.mat.tests.snapshot.OQLTest)  Time elapsed: 0.006 s
testUnindexed5(org.eclipse.mat.tests.snapshot.OQLTest)  Time elapsed: 0.009 s
testUnindexed6(org.eclipse.mat.tests.snapshot.OQLTest)  Time elapsed: 0.01 s
testUnindexed7(org.eclipse.mat.tests.snapshot.OQLTest)  Time elapsed: 0.008 s
testUnindexed8(org.eclipse.mat.tests.snapshot.OQLTest)  Time elapsed: 0.01 s
testUnindexed9(org.eclipse.mat.tests.snapshot.OQLTest)  Time elapsed: 0.071 s
testUnionCommand10(org.eclipse.mat.tests.snapshot.OQLTest)  Time elapsed: 0.393 s
testUnionCommand11(org.eclipse.mat.tests.snapshot.OQLTest)  Time elapsed: 0.405 s
testUnionCommand12(org.eclipse.mat.tests.snapshot.OQLTest)  Time elapsed: 0 s
testUnionCommand13(org.eclipse.mat.tests.snapshot.OQLTest)  Time elapsed: 0.001 s
testUnionCommand14(org.eclipse.mat.tests.snapshot.OQLTest)  Time elapsed: 0.002 s
testUnionCommand15(org.eclipse.mat.tests.snapshot.OQLTest)  Time elapsed: 0.003 s
testUnionCommand16(org.eclipse.mat.tests.snapshot.OQLTest)  Time elapsed: 0.002 s
testUnionCommand17(org.eclipse.mat.tests.snapshot.OQLTest)  Time elapsed: 0.003 s
testUnionCommand1a(org.eclipse.mat.tests.snapshot.OQLTest)  Time elapsed: 0 s
testUnionCommand2a(org.eclipse.mat.tests.snapshot.OQLTest)  Time elapsed: 0.002 s
testUnionCommand3a(org.eclipse.mat.tests.snapshot.OQLTest)  Time elapsed: 0 s
testUnionCommand4a(org.eclipse.mat.tests.snapshot.OQLTest)  Time elapsed: 0.002 s
testUnionCommand5a(org.eclipse.mat.tests.snapshot.OQLTest)  Time elapsed: 0 s
testUnionCommand6a(org.eclipse.mat.tests.snapshot.OQLTest)  Time elapsed: 0.001 s
testSelectObjects(org.eclipse.mat.tests.snapshot.OQLTest)  Time elapsed: 0.004 s
testFromSubSelect2(org.eclipse.mat.tests.snapshot.OQLTest)  Time elapsed: 0.167 s
testFromSubSelect3(org.eclipse.mat.tests.snapshot.OQLTest)  Time elapsed: 0.029 s
testFromSubSelect4(org.eclipse.mat.tests.snapshot.OQLTest)  Time elapsed: 0.001 s
testFromSubSelect5(org.eclipse.mat.tests.snapshot.OQLTest)  Time elapsed: 0.002 s
testFromSubSelect6(org.eclipse.mat.tests.snapshot.OQLTest)  Time elapsed: 0.002 s
testDistinct1(org.eclipse.mat.tests.snapshot.OQLTest)  Time elapsed: 0.002 s
testDistinct2(org.eclipse.mat.tests.snapshot.OQLTest)  Time elapsed: 0.004 s
testDistinct3(org.eclipse.mat.tests.snapshot.OQLTest)  Time elapsed: 0.005 s
testBuildInFunctions(org.eclipse.mat.tests.snapshot.OQLTest)  Time elapsed: 0.002 s
testFromObject(org.eclipse.mat.tests.snapshot.OQLTest)  Time elapsed: 0.001 s
testFromInstanceOf(org.eclipse.mat.tests.snapshot.OQLTest)  Time elapsed: 0.003 s
testUnionCommand1(org.eclipse.mat.tests.snapshot.OQLTest)  Time elapsed: 0 s
testUnionCommand2(org.eclipse.mat.tests.snapshot.OQLTest)  Time elapsed: 0.001 s
testUnionCommand3(org.eclipse.mat.tests.snapshot.OQLTest)  Time elapsed: 0.04 s
testUnionCommand4(org.eclipse.mat.tests.snapshot.OQLTest)  Time elapsed: 0 s
testUnionCommand5(org.eclipse.mat.tests.snapshot.OQLTest)  Time elapsed: 0.001 s
testUnionCommand6(org.eclipse.mat.tests.snapshot.OQLTest)  Time elapsed: 0 s
testUnionCommand7(org.eclipse.mat.tests.snapshot.OQLTest)  Time elapsed: 0 s
testUnionCommand8(org.eclipse.mat.tests.snapshot.OQLTest)  Time elapsed: 0.001 s
testUnionCommand9(org.eclipse.mat.tests.snapshot.OQLTest)  Time elapsed: 0 s
testPrimitiveArray(org.eclipse.mat.tests.snapshot.OQLTest)  Time elapsed: 0.001 s
testInstanceOf1(org.eclipse.mat.tests.snapshot.OQLTest)  Time elapsed: 0.001 s
testInstanceOf2(org.eclipse.mat.tests.snapshot.OQLTest)  Time elapsed: 0 s
testInstanceOf3(org.eclipse.mat.tests.snapshot.OQLTest)  Time elapsed: 0.001 s
testInstanceOf4(org.eclipse.mat.tests.snapshot.OQLTest)  Time elapsed: 0 s
testInstanceOf5(org.eclipse.mat.tests.snapshot.OQLTest)  Time elapsed: 0 s
testInstanceOf6(org.eclipse.mat.tests.snapshot.OQLTest)  Time elapsed: 0 s
testInstanceOf7(org.eclipse.mat.tests.snapshot.OQLTest)  Time elapsed: 0.001 s
testInstanceOf8(org.eclipse.mat.tests.snapshot.OQLTest)  Time elapsed: 0 s
testInstanceOf9(org.eclipse.mat.tests.snapshot.OQLTest)  Time elapsed: 0.001 s
testMethodCallRuntime(org.eclipse.mat.tests.snapshot.OQLTest)  Time elapsed: 0.001 s
testOperations1int(org.eclipse.mat.tests.snapshot.OQLTest)  Time elapsed: 0 s
testOperations2int(org.eclipse.mat.tests.snapshot.OQLTest)  Time elapsed: 0.001 s
testConversionsLong1(org.eclipse.mat.tests.snapshot.OQLTest)  Time elapsed: 0 s
testStatic(org.eclipse.mat.tests.snapshot.OQLTest)  Time elapsed: 0.001 s
testOperations2double(org.eclipse.mat.tests.snapshot.OQLTest)  Time elapsed: 0.001 s
testSelectStar(org.eclipse.mat.tests.snapshot.OQLTest)  Time elapsed: 0 s
testMethodCallInteger(org.eclipse.mat.tests.snapshot.OQLTest)  Time elapsed: 0.001 s
testErrorParseException(org.eclipse.mat.tests.snapshot.OQLTest)  Time elapsed: 0.001 s
testCrossJoin(org.eclipse.mat.tests.snapshot.OQLTest)  Time elapsed: 0.277 s
testSelectRetained1(org.eclipse.mat.tests.snapshot.OQLTest)  Time elapsed: 0.002 s
testSelectRetained2(org.eclipse.mat.tests.snapshot.OQLTest)  Time elapsed: 0.001 s
testSelectRetained3(org.eclipse.mat.tests.snapshot.OQLTest)  Time elapsed: 0.003 s
testSelectRetained4(org.eclipse.mat.tests.snapshot.OQLTest)  Time elapsed: 0.422 s
testSelectRetained5(org.eclipse.mat.tests.snapshot.OQLTest)  Time elapsed: 0.002 s
testSelectRetained6(org.eclipse.mat.tests.snapshot.OQLTest)  Time elapsed: 0 s
testSelectRetained7(org.eclipse.mat.tests.snapshot.OQLTest)  Time elapsed: 0 s
testJavaListRange(org.eclipse.mat.tests.snapshot.OQLTest)  Time elapsed: 0 s
testDirectIObject(org.eclipse.mat.tests.snapshot.OQLTest)  Time elapsed: 0.001 s
testGetClasses1(org.eclipse.mat.tests.snapshot.OQLTest)  Time elapsed: 0.003 s
testGetClasses2(org.eclipse.mat.tests.snapshot.OQLTest)  Time elapsed: 0.002 s
testGetClasses3(org.eclipse.mat.tests.snapshot.OQLTest)  Time elapsed: 0.012 s
testGetClasses4(org.eclipse.mat.tests.snapshot.OQLTest)  Time elapsed: 0.065 s
testAndClauseSpaces(org.eclipse.mat.tests.snapshot.OQLTest)  Time elapsed: 0.001 s
testException(org.eclipse.mat.tests.snapshot.MultipleSnapshots)  Time elapsed: 0.045 s
testDump1(org.eclipse.mat.tests.snapshot.MultipleSnapshots)  Time elapsed: 0.391 s
testAcquireDumpCompressed[HPROF jmap dump provider](org.eclipse.mat.tests.acquire.AcquireDumpTest)  Time elapsed: 102.41 s
test[HPROF jmap dump provider](org.eclipse.mat.tests.acquire.AcquireDumpTest)  Time elapsed: 0.001 s
test2[HPROF jmap dump provider](org.eclipse.mat.tests.acquire.AcquireDumpTest)  Time elapsed: 0 s
testAcquireDumpUncompressed[HPROF jmap dump provider](org.eclipse.mat.tests.acquire.AcquireDumpTest)  Time elapsed: 34.951 s
testAcquireDumpCompressedChunked[HPROF jmap dump provider](org.eclipse.mat.tests.acquire.AcquireDumpTest)  Time elapsed: 65.282 s
testAcquireDumpCompressed[Attach API](org.eclipse.mat.tests.acquire.AcquireDumpTest) skipped
test[Attach API](org.eclipse.mat.tests.acquire.AcquireDumpTest)  Time elapsed: 0 s
test2[Attach API](org.eclipse.mat.tests.acquire.AcquireDumpTest)  Time elapsed: 0 s
testAcquireDumpUncompressed[Attach API](org.eclipse.mat.tests.acquire.AcquireDumpTest)  Time elapsed: 0.035 s
testAcquireDumpCompressedChunked[Attach API](org.eclipse.mat.tests.acquire.AcquireDumpTest) skipped
testAcquireDumpCompressed[Attach API using a helper JVM](org.eclipse.mat.tests.acquire.AcquireDumpTest) skipped
test[Attach API using a helper JVM](org.eclipse.mat.tests.acquire.AcquireDumpTest)  Time elapsed: 0 s
test2[Attach API using a helper JVM](org.eclipse.mat.tests.acquire.AcquireDumpTest)  Time elapsed: 0 s
testAcquireDumpUncompressed[Attach API using a helper JVM](org.eclipse.mat.tests.acquire.AcquireDumpTest)  Time elapsed: 41.088 s
testAcquireDumpCompressedChunked[Attach API using a helper JVM](org.eclipse.mat.tests.acquire.AcquireDumpTest) skipped
testCollections[org.eclipse.mat.hprof.acquire.JMapHeapDumpProvider acquire_collection_dump_1.hprof 1 java.util.ArrayList](org.eclipse.mat.tests.collect.ExtractCollectionEntriesTest3)  Time elapsed: 3.016 s
testCollections[org.eclipse.mat.hprof.acquire.JMapHeapDumpProvider acquire_collection_dump_1.hprof 1 java.util.Arrays$ArrayList](org.eclipse.mat.tests.collect.ExtractCollectionEntriesTest3)  Time elapsed: 0.013 s
testCollections[org.eclipse.mat.hprof.acquire.JMapHeapDumpProvider acquire_collection_dump_1.hprof 1 javax.management.AttributeList](org.eclipse.mat.tests.collect.ExtractCollectionEntriesTest3)  Time elapsed: 0.059 s
testCollections[org.eclipse.mat.hprof.acquire.JMapHeapDumpProvider acquire_collection_dump_1.hprof 1 java.util.concurrent.CopyOnWriteArrayList](org.eclipse.mat.tests.collect.ExtractCollectionEntriesTest3)  Time elapsed: 0.046 s
testCollections[org.eclipse.mat.hprof.acquire.JMapHeapDumpProvider acquire_collection_dump_1.hprof 1 java.util.Collections$CheckedRandomAccessList](org.eclipse.mat.tests.collect.ExtractCollectionEntriesTest3)  Time elapsed: 0.008 s
testCollections[org.eclipse.mat.hprof.acquire.JMapHeapDumpProvider acquire_collection_dump_1.hprof 1 java.util.Collections$CopiesList](org.eclipse.mat.tests.collect.ExtractCollectionEntriesTest3)  Time elapsed: 0.004 s
testCollections[org.eclipse.mat.hprof.acquire.JMapHeapDumpProvider acquire_collection_dump_1.hprof 1 java.util.Collections$SingletonList](org.eclipse.mat.tests.collect.ExtractCollectionEntriesTest3)  Time elapsed: 0.001 s
testCollections[org.eclipse.mat.hprof.acquire.JMapHeapDumpProvider acquire_collection_dump_1.hprof 1 java.util.Collections$SynchronizedRandomAccessList](org.eclipse.mat.tests.collect.ExtractCollectionEntriesTest3)  Time elapsed: 0.008 s
testCollections[org.eclipse.mat.hprof.acquire.JMapHeapDumpProvider acquire_collection_dump_1.hprof 1 java.util.Collections$UnmodifiableRandomAccessList](org.eclipse.mat.tests.collect.ExtractCollectionEntriesTest3)  Time elapsed: 0.01 s
testCollections[org.eclipse.mat.hprof.acquire.JMapHeapDumpProvider acquire_collection_dump_1.hprof 1 java.util.LinkedList](org.eclipse.mat.tests.collect.ExtractCollectionEntriesTest3)  Time elapsed: 0.072 s
testCollections[org.eclipse.mat.hprof.acquire.JMapHeapDumpProvider acquire_collection_dump_1.hprof 1 java.util.ImmutableCollections$ListN](org.eclipse.mat.tests.collect.ExtractCollectionEntriesTest3)  Time elapsed: 0.048 s
testCollections[org.eclipse.mat.hprof.acquire.JMapHeapDumpProvider acquire_collection_dump_1.hprof 1 java.util.ImmutableCollections$List12](org.eclipse.mat.tests.collect.ExtractCollectionEntriesTest3)  Time elapsed: 0.001 s
testCollections[org.eclipse.mat.hprof.acquire.JMapHeapDumpProvider acquire_collection_dump_1.hprof 1 javax.management.relation.RoleList](org.eclipse.mat.tests.collect.ExtractCollectionEntriesTest3)  Time elapsed: 0.036 s
testCollections[org.eclipse.mat.hprof.acquire.JMapHeapDumpProvider acquire_collection_dump_1.hprof 1 javax.management.relation.RoleUnresolvedList](org.eclipse.mat.tests.collect.ExtractCollectionEntriesTest3)  Time elapsed: 0.037 s
testCollections[org.eclipse.mat.hprof.acquire.JMapHeapDumpProvider acquire_collection_dump_1.hprof 1 java.util.Stack](org.eclipse.mat.tests.collect.ExtractCollectionEntriesTest3)  Time elapsed: 0.014 s
testCollections[org.eclipse.mat.hprof.acquire.JMapHeapDumpProvider acquire_collection_dump_1.hprof 1 java.util.Vector](org.eclipse.mat.tests.collect.ExtractCollectionEntriesTest3)  Time elapsed: 0.075 s
testCollections[org.eclipse.mat.hprof.acquire.JMapHeapDumpProvider acquire_collection_dump_1.hprof 1 java.util.LinkedHashMap$LinkedValues](org.eclipse.mat.tests.collect.ExtractCollectionEntriesTest3)  Time elapsed: 0.132 s
testCollections[org.eclipse.mat.hprof.acquire.JMapHeapDumpProvider acquire_collection_dump_1.hprof 1 java.util.TreeMap$Values](org.eclipse.mat.tests.collect.ExtractCollectionEntriesTest3)  Time elapsed: 0.117 s
testCollections[org.eclipse.mat.hprof.acquire.JMapHeapDumpProvider acquire_collection_dump_1.hprof 1 java.util.Collections$SynchronizedCollection](org.eclipse.mat.tests.collect.ExtractCollectionEntriesTest3)  Time elapsed: 0.204 s
testCollections[org.eclipse.mat.hprof.acquire.JMapHeapDumpProvider acquire_collection_dump_1.hprof 1 java.util.Collections$UnmodifiableCollection](org.eclipse.mat.tests.collect.ExtractCollectionEntriesTest3)  Time elapsed: 0.051 s
testCollections[org.eclipse.mat.hprof.acquire.JMapHeapDumpProvider acquire_collection_dump_1.hprof 1 java.util.concurrent.ConcurrentHashMap$ValuesView](org.eclipse.mat.tests.collect.ExtractCollectionEntriesTest3)  Time elapsed: 0.11 s
testCollections[org.eclipse.mat.hprof.acquire.JMapHeapDumpProvider acquire_collection_dump_1.hprof 1 java.util.concurrent.ConcurrentSkipListMap$Values](org.eclipse.mat.tests.collect.ExtractCollectionEntriesTest3)  Time elapsed: 0.082 s
testCollections[org.eclipse.mat.hprof.acquire.JMapHeapDumpProvider acquire_collection_dump_1.hprof 1 java.util.HashMap$Values](org.eclipse.mat.tests.collect.ExtractCollectionEntriesTest3)  Time elapsed: 0.185 s
testCollections[org.eclipse.mat.hprof.acquire.JMapHeapDumpProvider acquire_collection_dump_1.hprof 1 java.util.IdentityHashMap$Values](org.eclipse.mat.tests.collect.ExtractCollectionEntriesTest3)  Time elapsed: 0.039 s
testCollections[org.eclipse.mat.hprof.acquire.JMapHeapDumpProvider acquire_collection_dump_1.hprof 1 java.util.AbstractMap$2](org.eclipse.mat.tests.collect.ExtractCollectionEntriesTest3)  Time elapsed: 0.02 s
testCollections[org.eclipse.mat.hprof.acquire.JMapHeapDumpProvider acquire_collection_dump_1.hprof 1 java.lang.ProcessEnvironment$StringValues](org.eclipse.mat.tests.collect.ExtractCollectionEntriesTest3)  Time elapsed: 0.012 s
testCollections[org.eclipse.mat.hprof.acquire.JMapHeapDumpProvider acquire_collection_dump_1.hprof 1 java.util.WeakHashMap$Values](org.eclipse.mat.tests.collect.ExtractCollectionEntriesTest3)  Time elapsed: 0.055 s
testCollections[org.eclipse.mat.hprof.acquire.JMapHeapDumpProvider acquire_collection_dump_1.hprof 2 java.util.concurrent.ArrayBlockingQueue](org.eclipse.mat.tests.collect.ExtractCollectionEntriesTest3)  Time elapsed: 0.014 s
testCollections[org.eclipse.mat.hprof.acquire.JMapHeapDumpProvider acquire_collection_dump_1.hprof 2 java.util.ArrayDeque](org.eclipse.mat.tests.collect.ExtractCollectionEntriesTest3)  Time elapsed: 0.047 s
testCollections[org.eclipse.mat.hprof.acquire.JMapHeapDumpProvider acquire_collection_dump_1.hprof 2 java.beans.beancontext.BeanContextServicesSupport](org.eclipse.mat.tests.collect.ExtractCollectionEntriesTest3)  Time elapsed: 0.025 s
testCollections[org.eclipse.mat.hprof.acquire.JMapHeapDumpProvider acquire_collection_dump_1.hprof 2 java.beans.beancontext.BeanContextSupport](org.eclipse.mat.tests.collect.ExtractCollectionEntriesTest3)  Time elapsed: 0.023 s
testCollections[org.eclipse.mat.hprof.acquire.JMapHeapDumpProvider acquire_collection_dump_1.hprof 2 java.util.concurrent.ConcurrentLinkedDeque](org.eclipse.mat.tests.collect.ExtractCollectionEntriesTest3)  Time elapsed: 0.059 s
testCollections[org.eclipse.mat.hprof.acquire.JMapHeapDumpProvider acquire_collection_dump_1.hprof 2 java.util.concurrent.ConcurrentLinkedQueue](org.eclipse.mat.tests.collect.ExtractCollectionEntriesTest3)  Time elapsed: 0.058 s
testCollections[org.eclipse.mat.hprof.acquire.JMapHeapDumpProvider acquire_collection_dump_1.hprof 2 java.util.concurrent.ConcurrentSkipListSet](org.eclipse.mat.tests.collect.ExtractCollectionEntriesTest3)  Time elapsed: 0.126 s
testCollections[org.eclipse.mat.hprof.acquire.JMapHeapDumpProvider acquire_collection_dump_1.hprof 2 java.util.concurrent.CopyOnWriteArraySet](org.eclipse.mat.tests.collect.ExtractCollectionEntriesTest3)  Time elapsed: 0.032 s
testCollections[org.eclipse.mat.hprof.acquire.JMapHeapDumpProvider acquire_collection_dump_1.hprof 2 java.util.Collections$CheckedCollection](org.eclipse.mat.tests.collect.ExtractCollectionEntriesTest3)  Time elapsed: 0.007 s
testCollections[org.eclipse.mat.hprof.acquire.JMapHeapDumpProvider acquire_collection_dump_1.hprof 2 java.util.Collections$CheckedQueue](org.eclipse.mat.tests.collect.ExtractCollectionEntriesTest3)  Time elapsed: 0.007 s
testCollections[org.eclipse.mat.hprof.acquire.JMapHeapDumpProvider acquire_collection_dump_1.hprof 2 java.util.Collections$CheckedSet](org.eclipse.mat.tests.collect.ExtractCollectionEntriesTest3)  Time elapsed: 0.022 s
testCollections[org.eclipse.mat.hprof.acquire.JMapHeapDumpProvider acquire_collection_dump_1.hprof 2 java.util.Collections$CheckedSortedSet](org.eclipse.mat.tests.collect.ExtractCollectionEntriesTest3)  Time elapsed: 0.021 s
testCollections[org.eclipse.mat.hprof.acquire.JMapHeapDumpProvider acquire_collection_dump_1.hprof 2 java.util.Collections$CheckedNavigableSet](org.eclipse.mat.tests.collect.ExtractCollectionEntriesTest3)  Time elapsed: 0.043 s
testCollections[org.eclipse.mat.hprof.acquire.JMapHeapDumpProvider acquire_collection_dump_1.hprof 2 java.util.Collections$SetFromMap](org.eclipse.mat.tests.collect.ExtractCollectionEntriesTest3)  Time elapsed: 0.023 s
testCollections[org.eclipse.mat.hprof.acquire.JMapHeapDumpProvider acquire_collection_dump_1.hprof 2 java.util.Collections$SingletonSet](org.eclipse.mat.tests.collect.ExtractCollectionEntriesTest3)  Time elapsed: 0.003 s
testCollections[org.eclipse.mat.hprof.acquire.JMapHeapDumpProvider acquire_collection_dump_1.hprof 2 java.util.Collections$SynchronizedCollection](org.eclipse.mat.tests.collect.ExtractCollectionEntriesTest3)  Time elapsed: 0.03 s
testCollections[org.eclipse.mat.hprof.acquire.JMapHeapDumpProvider acquire_collection_dump_1.hprof 2 java.util.Collections$SynchronizedSet](org.eclipse.mat.tests.collect.ExtractCollectionEntriesTest3)  Time elapsed: 0.343 s
testCollections[org.eclipse.mat.hprof.acquire.JMapHeapDumpProvider acquire_collection_dump_1.hprof 2 java.util.Collections$SynchronizedSortedSet](org.eclipse.mat.tests.collect.ExtractCollectionEntriesTest3)  Time elapsed: 0.022 s
testCollections[org.eclipse.mat.hprof.acquire.JMapHeapDumpProvider acquire_collection_dump_1.hprof 2 java.util.Collections$SynchronizedNavigableSet](org.eclipse.mat.tests.collect.ExtractCollectionEntriesTest3)  Time elapsed: 0.042 s
testCollections[org.eclipse.mat.hprof.acquire.JMapHeapDumpProvider acquire_collection_dump_1.hprof 2 java.util.Collections$UnmodifiableCollection](org.eclipse.mat.tests.collect.ExtractCollectionEntriesTest3)  Time elapsed: 0.03 s
testCollections[org.eclipse.mat.hprof.acquire.JMapHeapDumpProvider acquire_collection_dump_1.hprof 2 java.util.Collections$UnmodifiableSet](org.eclipse.mat.tests.collect.ExtractCollectionEntriesTest3)  Time elapsed: 0.167 s
testCollections[org.eclipse.mat.hprof.acquire.JMapHeapDumpProvider acquire_collection_dump_1.hprof 2 java.util.Collections$UnmodifiableSortedSet](org.eclipse.mat.tests.collect.ExtractCollectionEntriesTest3)  Time elapsed: 0.025 s
testCollections[org.eclipse.mat.hprof.acquire.JMapHeapDumpProvider acquire_collection_dump_1.hprof 2 java.util.Collections$UnmodifiableNavigableSet](org.eclipse.mat.tests.collect.ExtractCollectionEntriesTest3)  Time elapsed: 0.025 s
testCollections[org.eclipse.mat.hprof.acquire.JMapHeapDumpProvider acquire_collection_dump_1.hprof 2 java.util.HashSet](org.eclipse.mat.tests.collect.ExtractCollectionEntriesTest3)  Time elapsed: 0.257 s
testCollections[org.eclipse.mat.hprof.acquire.JMapHeapDumpProvider acquire_collection_dump_1.hprof 2 javax.print.attribute.standard.JobStateReasons](org.eclipse.mat.tests.collect.ExtractCollectionEntriesTest3)  Time elapsed: 0.001 s
testCollections[org.eclipse.mat.hprof.acquire.JMapHeapDumpProvider acquire_collection_dump_1.hprof 2 java.util.concurrent.LinkedBlockingDeque](org.eclipse.mat.tests.collect.ExtractCollectionEntriesTest3)  Time elapsed: 0.092 s
testCollections[org.eclipse.mat.hprof.acquire.JMapHeapDumpProvider acquire_collection_dump_1.hprof 2 java.util.concurrent.LinkedBlockingQueue](org.eclipse.mat.tests.collect.ExtractCollectionEntriesTest3)  Time elapsed: 0.091 s
testCollections[org.eclipse.mat.hprof.acquire.JMapHeapDumpProvider acquire_collection_dump_1.hprof 2 java.util.LinkedHashSet](org.eclipse.mat.tests.collect.ExtractCollectionEntriesTest3)  Time elapsed: 0.238 s
testCollections[org.eclipse.mat.hprof.acquire.JMapHeapDumpProvider acquire_collection_dump_1.hprof 2 java.util.concurrent.LinkedTransferQueue](org.eclipse.mat.tests.collect.ExtractCollectionEntriesTest3)  Time elapsed: 0.05 s
testCollections[org.eclipse.mat.hprof.acquire.JMapHeapDumpProvider acquire_collection_dump_1.hprof 2 java.util.concurrent.PriorityBlockingQueue](org.eclipse.mat.tests.collect.ExtractCollectionEntriesTest3)  Time elapsed: 0.04 s
testCollections[org.eclipse.mat.hprof.acquire.JMapHeapDumpProvider acquire_collection_dump_1.hprof 2 java.util.PriorityQueue](org.eclipse.mat.tests.collect.ExtractCollectionEntriesTest3)  Time elapsed: 0.043 s
testCollections[org.eclipse.mat.hprof.acquire.JMapHeapDumpProvider acquire_collection_dump_1.hprof 2 java.util.ImmutableCollections$SetN](org.eclipse.mat.tests.collect.ExtractCollectionEntriesTest3)  Time elapsed: 0.084 s
testCollections[org.eclipse.mat.hprof.acquire.JMapHeapDumpProvider acquire_collection_dump_1.hprof 2 java.util.ImmutableCollections$Set12](org.eclipse.mat.tests.collect.ExtractCollectionEntriesTest3)  Time elapsed: 0.002 s
testCollections[org.eclipse.mat.hprof.acquire.JMapHeapDumpProvider acquire_collection_dump_1.hprof 2 java.util.TreeSet](org.eclipse.mat.tests.collect.ExtractCollectionEntriesTest3)  Time elapsed: 0.12 s
testCollections[org.eclipse.mat.hprof.acquire.JMapHeapDumpProvider acquire_collection_dump_1.hprof 2 java.util.TreeMap$KeySet](org.eclipse.mat.tests.collect.ExtractCollectionEntriesTest3)  Time elapsed: 0.165 s
testCollections[org.eclipse.mat.hprof.acquire.JMapHeapDumpProvider acquire_collection_dump_1.hprof 2 java.util.Collections$CheckedMap$CheckedEntrySet](org.eclipse.mat.tests.collect.ExtractCollectionEntriesTest3)  Time elapsed: 0.037 s
testCollections[org.eclipse.mat.hprof.acquire.JMapHeapDumpProvider acquire_collection_dump_1.hprof 2 java.util.Collections$UnmodifiableMap$UnmodifiableEntrySet](org.eclipse.mat.tests.collect.ExtractCollectionEntriesTest3)  Time elapsed: 0.073 s
testCollections[org.eclipse.mat.hprof.acquire.JMapHeapDumpProvider acquire_collection_dump_1.hprof 2 java.util.concurrent.ConcurrentHashMap$KeySetView](org.eclipse.mat.tests.collect.ExtractCollectionEntriesTest3)  Time elapsed: 0.172 s
testCollections[org.eclipse.mat.hprof.acquire.JMapHeapDumpProvider acquire_collection_dump_1.hprof 2 java.util.concurrent.ConcurrentHashMap$EntrySetView](org.eclipse.mat.tests.collect.ExtractCollectionEntriesTest3)  Time elapsed: 0.148 s
testCollections[org.eclipse.mat.hprof.acquire.JMapHeapDumpProvider acquire_collection_dump_1.hprof 2 java.util.concurrent.ConcurrentSkipListMap$KeySet](org.eclipse.mat.tests.collect.ExtractCollectionEntriesTest3)  Time elapsed: 0.095 s
testCollections[org.eclipse.mat.hprof.acquire.JMapHeapDumpProvider acquire_collection_dump_1.hprof 2 java.util.concurrent.ConcurrentSkipListMap$EntrySet](org.eclipse.mat.tests.collect.ExtractCollectionEntriesTest3)  Time elapsed: 0.062 s
testCollections[org.eclipse.mat.hprof.acquire.JMapHeapDumpProvider acquire_collection_dump_1.hprof 2 java.util.HashMap$KeySet](org.eclipse.mat.tests.collect.ExtractCollectionEntriesTest3)  Time elapsed: 0.214 s
testCollections[org.eclipse.mat.hprof.acquire.JMapHeapDumpProvider acquire_collection_dump_1.hprof 2 java.util.HashMap$EntrySet](org.eclipse.mat.tests.collect.ExtractCollectionEntriesTest3)  Time elapsed: 0.106 s
testCollections[org.eclipse.mat.hprof.acquire.JMapHeapDumpProvider acquire_collection_dump_1.hprof 2 java.util.IdentityHashMap$KeySet](org.eclipse.mat.tests.collect.ExtractCollectionEntriesTest3)  Time elapsed: 0.121 s
testCollections[org.eclipse.mat.hprof.acquire.JMapHeapDumpProvider acquire_collection_dump_1.hprof 2 java.util.IdentityHashMap$EntrySet](org.eclipse.mat.tests.collect.ExtractCollectionEntriesTest3)  Time elapsed: 0.071 s
testCollections[org.eclipse.mat.hprof.acquire.JMapHeapDumpProvider acquire_collection_dump_1.hprof 2 java.util.LinkedHashMap$LinkedKeySet](org.eclipse.mat.tests.collect.ExtractCollectionEntriesTest3)  Time elapsed: 0.135 s
testCollections[org.eclipse.mat.hprof.acquire.JMapHeapDumpProvider acquire_collection_dump_1.hprof 2 java.util.LinkedHashMap$LinkedEntrySet](org.eclipse.mat.tests.collect.ExtractCollectionEntriesTest3)  Time elapsed: 0.084 s
testCollections[org.eclipse.mat.hprof.acquire.JMapHeapDumpProvider acquire_collection_dump_1.hprof 2 java.util.AbstractMap$1](org.eclipse.mat.tests.collect.ExtractCollectionEntriesTest3)  Time elapsed: 0.046 s
testCollections[org.eclipse.mat.hprof.acquire.JMapHeapDumpProvider acquire_collection_dump_1.hprof 2 java.lang.ProcessEnvironment$StringKeySet](org.eclipse.mat.tests.collect.ExtractCollectionEntriesTest3)  Time elapsed: 0.027 s
testCollections[org.eclipse.mat.hprof.acquire.JMapHeapDumpProvider acquire_collection_dump_1.hprof 2 java.lang.ProcessEnvironment$StringEntrySet](org.eclipse.mat.tests.collect.ExtractCollectionEntriesTest3)  Time elapsed: 0.016 s
testCollections[org.eclipse.mat.hprof.acquire.JMapHeapDumpProvider acquire_collection_dump_1.hprof 2 java.util.TreeMap$EntrySet](org.eclipse.mat.tests.collect.ExtractCollectionEntriesTest3)  Time elapsed: 0.073 s
testCollections[org.eclipse.mat.hprof.acquire.JMapHeapDumpProvider acquire_collection_dump_1.hprof 2 java.util.WeakHashMap$KeySet](org.eclipse.mat.tests.collect.ExtractCollectionEntriesTest3)  Time elapsed: 0.137 s
testCollections[org.eclipse.mat.hprof.acquire.JMapHeapDumpProvider acquire_collection_dump_1.hprof 2 java.util.WeakHashMap$EntrySet](org.eclipse.mat.tests.collect.ExtractCollectionEntriesTest3)  Time elapsed: 0.117 s
testCollections[org.eclipse.mat.hprof.acquire.JMapHeapDumpProvider acquire_collection_dump_1.hprof 3 java.util.ArrayList](org.eclipse.mat.tests.collect.ExtractCollectionEntriesTest3)  Time elapsed: 0.003 s
testCollections[org.eclipse.mat.hprof.acquire.JMapHeapDumpProvider acquire_collection_dump_1.hprof 3 javax.management.AttributeList](org.eclipse.mat.tests.collect.ExtractCollectionEntriesTest3)  Time elapsed: 0.001 s
testCollections[org.eclipse.mat.hprof.acquire.JMapHeapDumpProvider acquire_collection_dump_1.hprof 3 java.util.concurrent.CopyOnWriteArrayList](org.eclipse.mat.tests.collect.ExtractCollectionEntriesTest3)  Time elapsed: 0.002 s
testCollections[org.eclipse.mat.hprof.acquire.JMapHeapDumpProvider acquire_collection_dump_1.hprof 3 java.util.Collections$CheckedRandomAccessList](org.eclipse.mat.tests.collect.ExtractCollectionEntriesTest3)  Time elapsed: 0 s
testCollections[org.eclipse.mat.hprof.acquire.JMapHeapDumpProvider acquire_collection_dump_1.hprof 3 java.util.Collections$EmptyList](org.eclipse.mat.tests.collect.ExtractCollectionEntriesTest3)  Time elapsed: 0.001 s
testCollections[org.eclipse.mat.hprof.acquire.JMapHeapDumpProvider acquire_collection_dump_1.hprof 3 java.util.Collections$SynchronizedRandomAccessList](org.eclipse.mat.tests.collect.ExtractCollectionEntriesTest3)  Time elapsed: 0.001 s
testCollections[org.eclipse.mat.hprof.acquire.JMapHeapDumpProvider acquire_collection_dump_1.hprof 3 java.util.LinkedList](org.eclipse.mat.tests.collect.ExtractCollectionEntriesTest3)  Time elapsed: 0.001 s
testCollections[org.eclipse.mat.hprof.acquire.JMapHeapDumpProvider acquire_collection_dump_1.hprof 3 java.util.ImmutableCollections$ListN](org.eclipse.mat.tests.collect.ExtractCollectionEntriesTest3)  Time elapsed: 0.001 s
testCollections[org.eclipse.mat.hprof.acquire.JMapHeapDumpProvider acquire_collection_dump_1.hprof 3 javax.management.relation.RoleList](org.eclipse.mat.tests.collect.ExtractCollectionEntriesTest3)  Time elapsed: 0.001 s
testCollections[org.eclipse.mat.hprof.acquire.JMapHeapDumpProvider acquire_collection_dump_1.hprof 3 javax.management.relation.RoleUnresolvedList](org.eclipse.mat.tests.collect.ExtractCollectionEntriesTest3)  Time elapsed: 0.001 s
testCollections[org.eclipse.mat.hprof.acquire.JMapHeapDumpProvider acquire_collection_dump_1.hprof 3 java.util.Stack](org.eclipse.mat.tests.collect.ExtractCollectionEntriesTest3)  Time elapsed: 0 s
testCollections[org.eclipse.mat.hprof.acquire.JMapHeapDumpProvider acquire_collection_dump_1.hprof 3 java.util.Vector](org.eclipse.mat.tests.collect.ExtractCollectionEntriesTest3)  Time elapsed: 0.002 s
testCollections[org.eclipse.mat.hprof.acquire.JMapHeapDumpProvider acquire_collection_dump_1.hprof 3 java.util.LinkedHashMap$LinkedValues](org.eclipse.mat.tests.collect.ExtractCollectionEntriesTest3)  Time elapsed: 0.002 s
testCollections[org.eclipse.mat.hprof.acquire.JMapHeapDumpProvider acquire_collection_dump_1.hprof 3 java.util.TreeMap$Values](org.eclipse.mat.tests.collect.ExtractCollectionEntriesTest3)  Time elapsed: 0.002 s
testCollections[org.eclipse.mat.hprof.acquire.JMapHeapDumpProvider acquire_collection_dump_1.hprof 3 java.util.Collections$EmptySet](org.eclipse.mat.tests.collect.ExtractCollectionEntriesTest3)  Time elapsed: 0.001 s
testCollections[org.eclipse.mat.hprof.acquire.JMapHeapDumpProvider acquire_collection_dump_1.hprof 3 java.util.Collections$UnmodifiableCollection](org.eclipse.mat.tests.collect.ExtractCollectionEntriesTest3)  Time elapsed: 0.001 s
testCollections[org.eclipse.mat.hprof.acquire.JMapHeapDumpProvider acquire_collection_dump_1.hprof 3 java.util.Collections$SynchronizedCollection](org.eclipse.mat.tests.collect.ExtractCollectionEntriesTest3)  Time elapsed: 0.004 s
testCollections[org.eclipse.mat.hprof.acquire.JMapHeapDumpProvider acquire_collection_dump_1.hprof 3 java.util.concurrent.ConcurrentHashMap$ValuesView](org.eclipse.mat.tests.collect.ExtractCollectionEntriesTest3)  Time elapsed: 0.001 s
testCollections[org.eclipse.mat.hprof.acquire.JMapHeapDumpProvider acquire_collection_dump_1.hprof 3 java.util.concurrent.ConcurrentSkipListMap$Values](org.eclipse.mat.tests.collect.ExtractCollectionEntriesTest3)  Time elapsed: 0.002 s
testCollections[org.eclipse.mat.hprof.acquire.JMapHeapDumpProvider acquire_collection_dump_1.hprof 3 java.util.HashMap$Values](org.eclipse.mat.tests.collect.ExtractCollectionEntriesTest3)  Time elapsed: 0.003 s
testCollections[org.eclipse.mat.hprof.acquire.JMapHeapDumpProvider acquire_collection_dump_1.hprof 3 java.util.IdentityHashMap$Values](org.eclipse.mat.tests.collect.ExtractCollectionEntriesTest3)  Time elapsed: 0.003 s
testCollections[org.eclipse.mat.hprof.acquire.JMapHeapDumpProvider acquire_collection_dump_1.hprof 3 java.util.AbstractMap$2](org.eclipse.mat.tests.collect.ExtractCollectionEntriesTest3)  Time elapsed: 0.001 s
testCollections[org.eclipse.mat.hprof.acquire.JMapHeapDumpProvider acquire_collection_dump_1.hprof 3 java.lang.ProcessEnvironment$StringValues](org.eclipse.mat.tests.collect.ExtractCollectionEntriesTest3)  Time elapsed: 0.001 s
testCollections[org.eclipse.mat.hprof.acquire.JMapHeapDumpProvider acquire_collection_dump_1.hprof 3 java.util.WeakHashMap$Values](org.eclipse.mat.tests.collect.ExtractCollectionEntriesTest3)  Time elapsed: 0.001 s
testCollections[org.eclipse.mat.hprof.acquire.JMapHeapDumpProvider acquire_collection_dump_1.hprof 4 java.util.concurrent.ArrayBlockingQueue](org.eclipse.mat.tests.collect.ExtractCollectionEntriesTest3)  Time elapsed: 0.004 s
testCollections[org.eclipse.mat.hprof.acquire.JMapHeapDumpProvider acquire_collection_dump_1.hprof 4 java.util.ArrayDeque](org.eclipse.mat.tests.collect.ExtractCollectionEntriesTest3)  Time elapsed: 0.004 s
testCollections[org.eclipse.mat.hprof.acquire.JMapHeapDumpProvider acquire_collection_dump_1.hprof 4 java.beans.beancontext.BeanContextServicesSupport](org.eclipse.mat.tests.collect.ExtractCollectionEntriesTest3)  Time elapsed: 0.002 s
testCollections[org.eclipse.mat.hprof.acquire.JMapHeapDumpProvider acquire_collection_dump_1.hprof 4 java.beans.beancontext.BeanContextSupport](org.eclipse.mat.tests.collect.ExtractCollectionEntriesTest3)  Time elapsed: 0.001 s
testCollections[org.eclipse.mat.hprof.acquire.JMapHeapDumpProvider acquire_collection_dump_1.hprof 4 java.util.concurrent.ConcurrentLinkedDeque](org.eclipse.mat.tests.collect.ExtractCollectionEntriesTest3)  Time elapsed: 0.003 s
testCollections[org.eclipse.mat.hprof.acquire.JMapHeapDumpProvider acquire_collection_dump_1.hprof 4 java.util.concurrent.ConcurrentLinkedQueue](org.eclipse.mat.tests.collect.ExtractCollectionEntriesTest3)  Time elapsed: 0.003 s
testCollections[org.eclipse.mat.hprof.acquire.JMapHeapDumpProvider acquire_collection_dump_1.hprof 4 java.util.concurrent.ConcurrentSkipListSet](org.eclipse.mat.tests.collect.ExtractCollectionEntriesTest3)  Time elapsed: 0.005 s
testCollections[org.eclipse.mat.hprof.acquire.JMapHeapDumpProvider acquire_collection_dump_1.hprof 4 java.util.concurrent.CopyOnWriteArraySet](org.eclipse.mat.tests.collect.ExtractCollectionEntriesTest3)  Time elapsed: 0.003 s
testCollections[org.eclipse.mat.hprof.acquire.JMapHeapDumpProvider acquire_collection_dump_1.hprof 4 java.util.concurrent.DelayQueue](org.eclipse.mat.tests.collect.ExtractCollectionEntriesTest3)  Time elapsed: 0.001 s
testCollections[org.eclipse.mat.hprof.acquire.JMapHeapDumpProvider acquire_collection_dump_1.hprof 4 java.util.Collections$CheckedCollection](org.eclipse.mat.tests.collect.ExtractCollectionEntriesTest3)  Time elapsed: 0.001 s
testCollections[org.eclipse.mat.hprof.acquire.JMapHeapDumpProvider acquire_collection_dump_1.hprof 4 java.util.Collections$CheckedQueue](org.eclipse.mat.tests.collect.ExtractCollectionEntriesTest3)  Time elapsed: 0.001 s
testCollections[org.eclipse.mat.hprof.acquire.JMapHeapDumpProvider acquire_collection_dump_1.hprof 4 java.util.Collections$CheckedSet](org.eclipse.mat.tests.collect.ExtractCollectionEntriesTest3)  Time elapsed: 0.002 s
testCollections[org.eclipse.mat.hprof.acquire.JMapHeapDumpProvider acquire_collection_dump_1.hprof 4 java.util.Collections$CheckedSortedSet](org.eclipse.mat.tests.collect.ExtractCollectionEntriesTest3)  Time elapsed: 0.001 s
testCollections[org.eclipse.mat.hprof.acquire.JMapHeapDumpProvider acquire_collection_dump_1.hprof 4 java.util.Collections$CheckedNavigableSet](org.eclipse.mat.tests.collect.ExtractCollectionEntriesTest3)  Time elapsed: 0.002 s
testCollections[org.eclipse.mat.hprof.acquire.JMapHeapDumpProvider acquire_collection_dump_1.hprof 4 java.util.Collections$EmptySet](org.eclipse.mat.tests.collect.ExtractCollectionEntriesTest3)  Time elapsed: 0.002 s
testCollections[org.eclipse.mat.hprof.acquire.JMapHeapDumpProvider acquire_collection_dump_1.hprof 4 java.util.Collections$UnmodifiableNavigableSet$EmptyNavigableSet](org.eclipse.mat.tests.collect.ExtractCollectionEntriesTest3)  Time elapsed: 0.002 s
testCollections[org.eclipse.mat.hprof.acquire.JMapHeapDumpProvider acquire_collection_dump_1.hprof 4 java.util.Collections$SetFromMap](org.eclipse.mat.tests.collect.ExtractCollectionEntriesTest3)  Time elapsed: 0.002 s
testCollections[org.eclipse.mat.hprof.acquire.JMapHeapDumpProvider acquire_collection_dump_1.hprof 4 java.util.Collections$SynchronizedCollection](org.eclipse.mat.tests.collect.ExtractCollectionEntriesTest3)  Time elapsed: 0.003 s
testCollections[org.eclipse.mat.hprof.acquire.JMapHeapDumpProvider acquire_collection_dump_1.hprof 4 java.util.Collections$SynchronizedSet](org.eclipse.mat.tests.collect.ExtractCollectionEntriesTest3)  Time elapsed: 0.036 s
testCollections[org.eclipse.mat.hprof.acquire.JMapHeapDumpProvider acquire_collection_dump_1.hprof 4 java.util.Collections$SynchronizedSortedSet](org.eclipse.mat.tests.collect.ExtractCollectionEntriesTest3)  Time elapsed: 0.002 s
testCollections[org.eclipse.mat.hprof.acquire.JMapHeapDumpProvider acquire_collection_dump_1.hprof 4 java.util.Collections$SynchronizedNavigableSet](org.eclipse.mat.tests.collect.ExtractCollectionEntriesTest3)  Time elapsed: 0.001 s
testCollections[org.eclipse.mat.hprof.acquire.JMapHeapDumpProvider acquire_collection_dump_1.hprof 4 java.util.Collections$UnmodifiableSet](org.eclipse.mat.tests.collect.ExtractCollectionEntriesTest3)  Time elapsed: 0.003 s
testCollections[org.eclipse.mat.hprof.acquire.JMapHeapDumpProvider acquire_collection_dump_1.hprof 4 java.util.RegularEnumSet](org.eclipse.mat.tests.collect.ExtractCollectionEntriesTest3)  Time elapsed: 0.002 s
testCollections[org.eclipse.mat.hprof.acquire.JMapHeapDumpProvider acquire_collection_dump_1.hprof 4 java.util.HashSet](org.eclipse.mat.tests.collect.ExtractCollectionEntriesTest3)  Time elapsed: 0.007 s
testCollections[org.eclipse.mat.hprof.acquire.JMapHeapDumpProvider acquire_collection_dump_1.hprof 4 javax.print.attribute.standard.JobStateReasons](org.eclipse.mat.tests.collect.ExtractCollectionEntriesTest3)  Time elapsed: 0.004 s
testCollections[org.eclipse.mat.hprof.acquire.JMapHeapDumpProvider acquire_collection_dump_1.hprof 4 java.util.concurrent.LinkedBlockingDeque](org.eclipse.mat.tests.collect.ExtractCollectionEntriesTest3)  Time elapsed: 0.003 s
testCollections[org.eclipse.mat.hprof.acquire.JMapHeapDumpProvider acquire_collection_dump_1.hprof 4 java.util.concurrent.LinkedBlockingQueue](org.eclipse.mat.tests.collect.ExtractCollectionEntriesTest3)  Time elapsed: 0.003 s
testCollections[org.eclipse.mat.hprof.acquire.JMapHeapDumpProvider acquire_collection_dump_1.hprof 4 java.util.LinkedHashSet](org.eclipse.mat.tests.collect.ExtractCollectionEntriesTest3)  Time elapsed: 0.008 s
testCollections[org.eclipse.mat.hprof.acquire.JMapHeapDumpProvider acquire_collection_dump_1.hprof 4 java.util.concurrent.LinkedTransferQueue](org.eclipse.mat.tests.collect.ExtractCollectionEntriesTest3)  Time elapsed: 0.002 s
testCollections[org.eclipse.mat.hprof.acquire.JMapHeapDumpProvider acquire_collection_dump_1.hprof 4 java.util.concurrent.PriorityBlockingQueue](org.eclipse.mat.tests.collect.ExtractCollectionEntriesTest3)  Time elapsed: 0.005 s
testCollections[org.eclipse.mat.hprof.acquire.JMapHeapDumpProvider acquire_collection_dump_1.hprof 4 java.util.PriorityQueue](org.eclipse.mat.tests.collect.ExtractCollectionEntriesTest3)  Time elapsed: 0.004 s
testCollections[org.eclipse.mat.hprof.acquire.JMapHeapDumpProvider acquire_collection_dump_1.hprof 4 java.util.ImmutableCollections$SetN](org.eclipse.mat.tests.collect.ExtractCollectionEntriesTest3)  Time elapsed: 0.002 s
testCollections[org.eclipse.mat.hprof.acquire.JMapHeapDumpProvider acquire_collection_dump_1.hprof 4 java.util.concurrent.SynchronousQueue](org.eclipse.mat.tests.collect.ExtractCollectionEntriesTest3)  Time elapsed: 0.001 s
testCollections[org.eclipse.mat.hprof.acquire.JMapHeapDumpProvider acquire_collection_dump_1.hprof 4 java.util.TreeSet](org.eclipse.mat.tests.collect.ExtractCollectionEntriesTest3)  Time elapsed: 0.004 s
testCollections[org.eclipse.mat.hprof.acquire.JMapHeapDumpProvider acquire_collection_dump_1.hprof 4 java.util.LinkedHashMap$LinkedKeySet](org.eclipse.mat.tests.collect.ExtractCollectionEntriesTest3)  Time elapsed: 0.049 s
testCollections[org.eclipse.mat.hprof.acquire.JMapHeapDumpProvider acquire_collection_dump_1.hprof 4 java.util.LinkedHashMap$LinkedEntrySet](org.eclipse.mat.tests.collect.ExtractCollectionEntriesTest3)  Time elapsed: 0.008 s
testCollections[org.eclipse.mat.hprof.acquire.JMapHeapDumpProvider acquire_collection_dump_1.hprof 4 java.util.TreeMap$KeySet](org.eclipse.mat.tests.collect.ExtractCollectionEntriesTest3)  Time elapsed: 0.006 s
testCollections[org.eclipse.mat.hprof.acquire.JMapHeapDumpProvider acquire_collection_dump_1.hprof 4 java.util.Collections$CheckedMap$CheckedEntrySet](org.eclipse.mat.tests.collect.ExtractCollectionEntriesTest3)  Time elapsed: 0.002 s
testCollections[org.eclipse.mat.hprof.acquire.JMapHeapDumpProvider acquire_collection_dump_1.hprof 4 java.util.Collections$UnmodifiableMap$UnmodifiableEntrySet](org.eclipse.mat.tests.collect.ExtractCollectionEntriesTest3)  Time elapsed: 0.005 s
testCollections[org.eclipse.mat.hprof.acquire.JMapHeapDumpProvider acquire_collection_dump_1.hprof 4 java.util.concurrent.ConcurrentHashMap$KeySetView](org.eclipse.mat.tests.collect.ExtractCollectionEntriesTest3)  Time elapsed: 0.006 s
testCollections[org.eclipse.mat.hprof.acquire.JMapHeapDumpProvider acquire_collection_dump_1.hprof 4 java.util.concurrent.ConcurrentHashMap$EntrySetView](org.eclipse.mat.tests.collect.ExtractCollectionEntriesTest3)  Time elapsed: 0.006 s
testCollections[org.eclipse.mat.hprof.acquire.JMapHeapDumpProvider acquire_collection_dump_1.hprof 4 java.util.concurrent.ConcurrentSkipListMap$KeySet](org.eclipse.mat.tests.collect.ExtractCollectionEntriesTest3)  Time elapsed: 0.004 s
testCollections[org.eclipse.mat.hprof.acquire.JMapHeapDumpProvider acquire_collection_dump_1.hprof 4 java.util.concurrent.ConcurrentSkipListMap$EntrySet](org.eclipse.mat.tests.collect.ExtractCollectionEntriesTest3)  Time elapsed: 0.004 s
testCollections[org.eclipse.mat.hprof.acquire.JMapHeapDumpProvider acquire_collection_dump_1.hprof 4 java.util.HashMap$KeySet](org.eclipse.mat.tests.collect.ExtractCollectionEntriesTest3)  Time elapsed: 0.012 s
testCollections[org.eclipse.mat.hprof.acquire.JMapHeapDumpProvider acquire_collection_dump_1.hprof 4 java.util.HashMap$EntrySet](org.eclipse.mat.tests.collect.ExtractCollectionEntriesTest3)  Time elapsed: 0.05 s
testCollections[org.eclipse.mat.hprof.acquire.JMapHeapDumpProvider acquire_collection_dump_1.hprof 4 java.util.IdentityHashMap$KeySet](org.eclipse.mat.tests.collect.ExtractCollectionEntriesTest3)  Time elapsed: 0.009 s
testCollections[org.eclipse.mat.hprof.acquire.JMapHeapDumpProvider acquire_collection_dump_1.hprof 4 java.util.IdentityHashMap$EntrySet](org.eclipse.mat.tests.collect.ExtractCollectionEntriesTest3)  Time elapsed: 0.009 s
testCollections[org.eclipse.mat.hprof.acquire.JMapHeapDumpProvider acquire_collection_dump_1.hprof 4 java.util.AbstractMap$1](org.eclipse.mat.tests.collect.ExtractCollectionEntriesTest3)  Time elapsed: 0.001 s
testCollections[org.eclipse.mat.hprof.acquire.JMapHeapDumpProvider acquire_collection_dump_1.hprof 4 java.lang.ProcessEnvironment$StringKeySet](org.eclipse.mat.tests.collect.ExtractCollectionEntriesTest3)  Time elapsed: 0.001 s
testCollections[org.eclipse.mat.hprof.acquire.JMapHeapDumpProvider acquire_collection_dump_1.hprof 4 java.lang.ProcessEnvironment$StringEntrySet](org.eclipse.mat.tests.collect.ExtractCollectionEntriesTest3)  Time elapsed: 0.002 s
testCollections[org.eclipse.mat.hprof.acquire.JMapHeapDumpProvider acquire_collection_dump_1.hprof 4 java.util.TreeMap$EntrySet](org.eclipse.mat.tests.collect.ExtractCollectionEntriesTest3)  Time elapsed: 0.004 s
testCollections[org.eclipse.mat.hprof.acquire.JMapHeapDumpProvider acquire_collection_dump_1.hprof 4 java.util.WeakHashMap$KeySet](org.eclipse.mat.tests.collect.ExtractCollectionEntriesTest3)  Time elapsed: 0.006 s
testCollections[org.eclipse.mat.hprof.acquire.JMapHeapDumpProvider acquire_collection_dump_1.hprof 4 java.util.WeakHashMap$EntrySet](org.eclipse.mat.tests.collect.ExtractCollectionEntriesTest3)  Time elapsed: 0.005 s
testCollections[org.eclipse.mat.hprof.acquire.JMapHeapDumpProvider acquire_collection_dump_1.hprof 5 java.util.jar.Attributes](org.eclipse.mat.tests.collect.ExtractCollectionEntriesTest3)  Time elapsed: 0.003 s
testCollections[org.eclipse.mat.hprof.acquire.JMapHeapDumpProvider acquire_collection_dump_1.hprof 5 java.util.Collections$CheckedMap](org.eclipse.mat.tests.collect.ExtractCollectionEntriesTest3)  Time elapsed: 0.015 s
testCollections[org.eclipse.mat.hprof.acquire.JMapHeapDumpProvider acquire_collection_dump_1.hprof 5 java.util.Collections$CheckedSortedMap](org.eclipse.mat.tests.collect.ExtractCollectionEntriesTest3)  Time elapsed: 0.048 s
testCollections[org.eclipse.mat.hprof.acquire.JMapHeapDumpProvider acquire_collection_dump_1.hprof 5 java.util.Collections$CheckedNavigableMap](org.eclipse.mat.tests.collect.ExtractCollectionEntriesTest3)  Time elapsed: 0.015 s
testCollections[org.eclipse.mat.hprof.acquire.JMapHeapDumpProvider acquire_collection_dump_1.hprof 5 java.util.Collections$SingletonMap](org.eclipse.mat.tests.collect.ExtractCollectionEntriesTest3)  Time elapsed: 0.001 s
testCollections[org.eclipse.mat.hprof.acquire.JMapHeapDumpProvider acquire_collection_dump_1.hprof 5 java.util.Collections$SynchronizedMap](org.eclipse.mat.tests.collect.ExtractCollectionEntriesTest3)  Time elapsed: 0.077 s
testCollections[org.eclipse.mat.hprof.acquire.JMapHeapDumpProvider acquire_collection_dump_1.hprof 5 java.util.Collections$SynchronizedSortedMap](org.eclipse.mat.tests.collect.ExtractCollectionEntriesTest3)  Time elapsed: 0.015 s
testCollections[org.eclipse.mat.hprof.acquire.JMapHeapDumpProvider acquire_collection_dump_1.hprof 5 java.util.Collections$SynchronizedNavigableMap](org.eclipse.mat.tests.collect.ExtractCollectionEntriesTest3)  Time elapsed: 0.015 s
testCollections[org.eclipse.mat.hprof.acquire.JMapHeapDumpProvider acquire_collection_dump_1.hprof 5 java.util.Collections$UnmodifiableMap](org.eclipse.mat.tests.collect.ExtractCollectionEntriesTest3)  Time elapsed: 0.074 s
testCollections[org.eclipse.mat.hprof.acquire.JMapHeapDumpProvider acquire_collection_dump_1.hprof 5 java.util.Collections$UnmodifiableSortedMap](org.eclipse.mat.tests.collect.ExtractCollectionEntriesTest3)  Time elapsed: 0.015 s
testCollections[org.eclipse.mat.hprof.acquire.JMapHeapDumpProvider acquire_collection_dump_1.hprof 5 java.util.Collections$UnmodifiableNavigableMap](org.eclipse.mat.tests.collect.ExtractCollectionEntriesTest3)  Time elapsed: 0.014 s
testCollections[org.eclipse.mat.hprof.acquire.JMapHeapDumpProvider acquire_collection_dump_1.hprof 5 java.util.concurrent.ConcurrentHashMap](org.eclipse.mat.tests.collect.ExtractCollectionEntriesTest3)  Time elapsed: 0.21 s
testCollections[org.eclipse.mat.hprof.acquire.JMapHeapDumpProvider acquire_collection_dump_1.hprof 5 java.util.concurrent.ConcurrentSkipListMap](org.eclipse.mat.tests.collect.ExtractCollectionEntriesTest3)  Time elapsed: 0.095 s
testCollections[org.eclipse.mat.hprof.acquire.JMapHeapDumpProvider acquire_collection_dump_1.hprof 5 java.util.HashMap](org.eclipse.mat.tests.collect.ExtractCollectionEntriesTest3)  Time elapsed: 0.119 s
testCollections[org.eclipse.mat.hprof.acquire.JMapHeapDumpProvider acquire_collection_dump_1.hprof 5 java.util.Hashtable](org.eclipse.mat.tests.collect.ExtractCollectionEntriesTest3)  Time elapsed: 0.147 s
testCollections[org.eclipse.mat.hprof.acquire.JMapHeapDumpProvider acquire_collection_dump_1.hprof 5 java.util.IdentityHashMap](org.eclipse.mat.tests.collect.ExtractCollectionEntriesTest3)  Time elapsed: 0.107 s
testCollections[org.eclipse.mat.hprof.acquire.JMapHeapDumpProvider acquire_collection_dump_1.hprof 5 java.util.LinkedHashMap](org.eclipse.mat.tests.collect.ExtractCollectionEntriesTest3)  Time elapsed: 0.085 s
testCollections[org.eclipse.mat.hprof.acquire.JMapHeapDumpProvider acquire_collection_dump_1.hprof 5 java.util.ImmutableCollections$MapN](org.eclipse.mat.tests.collect.ExtractCollectionEntriesTest3)  Time elapsed: 0.032 s
testCollections[org.eclipse.mat.hprof.acquire.JMapHeapDumpProvider acquire_collection_dump_1.hprof 5 java.lang.ProcessEnvironment$StringEnvironment](org.eclipse.mat.tests.collect.ExtractCollectionEntriesTest3)  Time elapsed: 0.016 s
testCollections[org.eclipse.mat.hprof.acquire.JMapHeapDumpProvider acquire_collection_dump_1.hprof 5 javax.print.attribute.standard.PrinterStateReasons](org.eclipse.mat.tests.collect.ExtractCollectionEntriesTest3)  Time elapsed: 0.002 s
testCollections[org.eclipse.mat.hprof.acquire.JMapHeapDumpProvider acquire_collection_dump_1.hprof 5 java.util.Properties](org.eclipse.mat.tests.collect.ExtractCollectionEntriesTest3)  Time elapsed: 0.051 s
testCollections[org.eclipse.mat.hprof.acquire.JMapHeapDumpProvider acquire_collection_dump_1.hprof 5 java.awt.RenderingHints](org.eclipse.mat.tests.collect.ExtractCollectionEntriesTest3)  Time elapsed: 0.025 s
testCollections[org.eclipse.mat.hprof.acquire.JMapHeapDumpProvider acquire_collection_dump_1.hprof 5 javax.script.SimpleBindings](org.eclipse.mat.tests.collect.ExtractCollectionEntriesTest3)  Time elapsed: 0.037 s
testCollections[org.eclipse.mat.hprof.acquire.JMapHeapDumpProvider acquire_collection_dump_1.hprof 5 java.util.TreeMap](org.eclipse.mat.tests.collect.ExtractCollectionEntriesTest3)  Time elapsed: 0.061 s
testCollections[org.eclipse.mat.hprof.acquire.JMapHeapDumpProvider acquire_collection_dump_1.hprof 5 javax.swing.UIDefaults](org.eclipse.mat.tests.collect.ExtractCollectionEntriesTest3)  Time elapsed: 0.012 s
testCollections[org.eclipse.mat.hprof.acquire.JMapHeapDumpProvider acquire_collection_dump_1.hprof 5 java.util.WeakHashMap](org.eclipse.mat.tests.collect.ExtractCollectionEntriesTest3)  Time elapsed: 0.085 s
testCollections[org.eclipse.mat.hprof.acquire.JMapHeapDumpProvider acquire_collection_dump_1.hprof 6 java.util.jar.Attributes](org.eclipse.mat.tests.collect.ExtractCollectionEntriesTest3)  Time elapsed: 0.002 s
testCollections[org.eclipse.mat.hprof.acquire.JMapHeapDumpProvider acquire_collection_dump_1.hprof 6 java.util.Collections$CheckedMap](org.eclipse.mat.tests.collect.ExtractCollectionEntriesTest3)  Time elapsed: 0 s
testCollections[org.eclipse.mat.hprof.acquire.JMapHeapDumpProvider acquire_collection_dump_1.hprof 6 java.util.Collections$CheckedSortedMap](org.eclipse.mat.tests.collect.ExtractCollectionEntriesTest3)  Time elapsed: 0.001 s
testCollections[org.eclipse.mat.hprof.acquire.JMapHeapDumpProvider acquire_collection_dump_1.hprof 6 java.util.Collections$CheckedNavigableMap](org.eclipse.mat.tests.collect.ExtractCollectionEntriesTest3)  Time elapsed: 0.001 s
testCollections[org.eclipse.mat.hprof.acquire.JMapHeapDumpProvider acquire_collection_dump_1.hprof 6 java.util.Collections$EmptyMap](org.eclipse.mat.tests.collect.ExtractCollectionEntriesTest3)  Time elapsed: 0 s
testCollections[org.eclipse.mat.hprof.acquire.JMapHeapDumpProvider acquire_collection_dump_1.hprof 6 java.util.Collections$UnmodifiableNavigableMap$EmptyNavigableMap](org.eclipse.mat.tests.collect.ExtractCollectionEntriesTest3)  Time elapsed: 0.001 s
testCollections[org.eclipse.mat.hprof.acquire.JMapHeapDumpProvider acquire_collection_dump_1.hprof 6 java.util.Collections$SynchronizedMap](org.eclipse.mat.tests.collect.ExtractCollectionEntriesTest3)  Time elapsed: 0.002 s
testCollections[org.eclipse.mat.hprof.acquire.JMapHeapDumpProvider acquire_collection_dump_1.hprof 6 java.util.Collections$SynchronizedSortedMap](org.eclipse.mat.tests.collect.ExtractCollectionEntriesTest3)  Time elapsed: 0.001 s
testCollections[org.eclipse.mat.hprof.acquire.JMapHeapDumpProvider acquire_collection_dump_1.hprof 6 java.util.Collections$SynchronizedNavigableMap](org.eclipse.mat.tests.collect.ExtractCollectionEntriesTest3)  Time elapsed: 0 s
testCollections[org.eclipse.mat.hprof.acquire.JMapHeapDumpProvider acquire_collection_dump_1.hprof 6 java.util.Collections$UnmodifiableMap](org.eclipse.mat.tests.collect.ExtractCollectionEntriesTest3)  Time elapsed: 0.001 s
testCollections[org.eclipse.mat.hprof.acquire.JMapHeapDumpProvider acquire_collection_dump_1.hprof 6 java.util.concurrent.ConcurrentHashMap](org.eclipse.mat.tests.collect.ExtractCollectionEntriesTest3)  Time elapsed: 0.003 s
testCollections[org.eclipse.mat.hprof.acquire.JMapHeapDumpProvider acquire_collection_dump_1.hprof 6 java.util.concurrent.ConcurrentSkipListMap](org.eclipse.mat.tests.collect.ExtractCollectionEntriesTest3)  Time elapsed: 0.002 s
testCollections[org.eclipse.mat.hprof.acquire.JMapHeapDumpProvider acquire_collection_dump_1.hprof 6 java.util.HashMap](org.eclipse.mat.tests.collect.ExtractCollectionEntriesTest3)  Time elapsed: 0.003 s
testCollections[org.eclipse.mat.hprof.acquire.JMapHeapDumpProvider acquire_collection_dump_1.hprof 6 java.util.Hashtable](org.eclipse.mat.tests.collect.ExtractCollectionEntriesTest3)  Time elapsed: 0.003 s
testCollections[org.eclipse.mat.hprof.acquire.JMapHeapDumpProvider acquire_collection_dump_1.hprof 6 java.util.IdentityHashMap](org.eclipse.mat.tests.collect.ExtractCollectionEntriesTest3)  Time elapsed: 0.005 s
testCollections[org.eclipse.mat.hprof.acquire.JMapHeapDumpProvider acquire_collection_dump_1.hprof 6 java.util.LinkedHashMap](org.eclipse.mat.tests.collect.ExtractCollectionEntriesTest3)  Time elapsed: 0.002 s
testCollections[org.eclipse.mat.hprof.acquire.JMapHeapDumpProvider acquire_collection_dump_1.hprof 6 java.util.ImmutableCollections$MapN](org.eclipse.mat.tests.collect.ExtractCollectionEntriesTest3)  Time elapsed: 0.001 s
testCollections[org.eclipse.mat.hprof.acquire.JMapHeapDumpProvider acquire_collection_dump_1.hprof 6 java.lang.ProcessEnvironment$StringEnvironment](org.eclipse.mat.tests.collect.ExtractCollectionEntriesTest3)  Time elapsed: 0.001 s
testCollections[org.eclipse.mat.hprof.acquire.JMapHeapDumpProvider acquire_collection_dump_1.hprof 6 javax.print.attribute.standard.PrinterStateReasons](org.eclipse.mat.tests.collect.ExtractCollectionEntriesTest3)  Time elapsed: 0.002 s
testCollections[org.eclipse.mat.hprof.acquire.JMapHeapDumpProvider acquire_collection_dump_1.hprof 6 java.util.Properties](org.eclipse.mat.tests.collect.ExtractCollectionEntriesTest3)  Time elapsed: 0.002 s
testCollections[org.eclipse.mat.hprof.acquire.JMapHeapDumpProvider acquire_collection_dump_1.hprof 6 java.awt.RenderingHints](org.eclipse.mat.tests.collect.ExtractCollectionEntriesTest3)  Time elapsed: 0.001 s
testCollections[org.eclipse.mat.hprof.acquire.JMapHeapDumpProvider acquire_collection_dump_1.hprof 6 javax.script.SimpleBindings](org.eclipse.mat.tests.collect.ExtractCollectionEntriesTest3)  Time elapsed: 0.002 s
testCollections[org.eclipse.mat.hprof.acquire.JMapHeapDumpProvider acquire_collection_dump_1.hprof 6 java.util.TreeMap](org.eclipse.mat.tests.collect.ExtractCollectionEntriesTest3)  Time elapsed: 0.002 s
testCollections[org.eclipse.mat.hprof.acquire.JMapHeapDumpProvider acquire_collection_dump_1.hprof 6 javax.swing.UIDefaults](org.eclipse.mat.tests.collect.ExtractCollectionEntriesTest3)  Time elapsed: 0.001 s
testCollections[org.eclipse.mat.hprof.acquire.JMapHeapDumpProvider acquire_collection_dump_1.hprof 6 java.util.WeakHashMap](org.eclipse.mat.tests.collect.ExtractCollectionEntriesTest3)  Time elapsed: 0.003 s
testCollections[org.eclipse.mat.hprof.acquire.JMapHeapDumpProvider acquire_collection_dump_1.hprof 7 null](org.eclipse.mat.tests.collect.ExtractCollectionEntriesTest3)  Time elapsed: 0 s
testCollections[org.eclipse.mat.ibmvm.acquire.IBMExecDumpProvider acquire_collection_dump_3.hprof 1 java.util.ArrayList](org.eclipse.mat.tests.collect.ExtractCollectionEntriesTest3)  Time elapsed: 4.141 s
testCollections[org.eclipse.mat.ibmvm.acquire.IBMExecDumpProvider acquire_collection_dump_3.hprof 1 java.util.Arrays$ArrayList](org.eclipse.mat.tests.collect.ExtractCollectionEntriesTest3)  Time elapsed: 0.009 s
testCollections[org.eclipse.mat.ibmvm.acquire.IBMExecDumpProvider acquire_collection_dump_3.hprof 1 javax.management.AttributeList](org.eclipse.mat.tests.collect.ExtractCollectionEntriesTest3)  Time elapsed: 0.027 s
testCollections[org.eclipse.mat.ibmvm.acquire.IBMExecDumpProvider acquire_collection_dump_3.hprof 1 java.util.concurrent.CopyOnWriteArrayList](org.eclipse.mat.tests.collect.ExtractCollectionEntriesTest3)  Time elapsed: 0.064 s
testCollections[org.eclipse.mat.ibmvm.acquire.IBMExecDumpProvider acquire_collection_dump_3.hprof 1 java.util.Collections$CheckedRandomAccessList](org.eclipse.mat.tests.collect.ExtractCollectionEntriesTest3)  Time elapsed: 0.007 s
testCollections[org.eclipse.mat.ibmvm.acquire.IBMExecDumpProvider acquire_collection_dump_3.hprof 1 java.util.Collections$CopiesList](org.eclipse.mat.tests.collect.ExtractCollectionEntriesTest3)  Time elapsed: 0.003 s
testCollections[org.eclipse.mat.ibmvm.acquire.IBMExecDumpProvider acquire_collection_dump_3.hprof 1 java.util.Collections$SingletonList](org.eclipse.mat.tests.collect.ExtractCollectionEntriesTest3)  Time elapsed: 0.001 s
testCollections[org.eclipse.mat.ibmvm.acquire.IBMExecDumpProvider acquire_collection_dump_3.hprof 1 java.util.Collections$SynchronizedRandomAccessList](org.eclipse.mat.tests.collect.ExtractCollectionEntriesTest3)  Time elapsed: 0.006 s
testCollections[org.eclipse.mat.ibmvm.acquire.IBMExecDumpProvider acquire_collection_dump_3.hprof 1 java.util.Collections$UnmodifiableRandomAccessList](org.eclipse.mat.tests.collect.ExtractCollectionEntriesTest3)  Time elapsed: 0.007 s
testCollections[org.eclipse.mat.ibmvm.acquire.IBMExecDumpProvider acquire_collection_dump_3.hprof 1 java.util.LinkedList](org.eclipse.mat.tests.collect.ExtractCollectionEntriesTest3)  Time elapsed: 0.033 s
testCollections[org.eclipse.mat.ibmvm.acquire.IBMExecDumpProvider acquire_collection_dump_3.hprof 1 java.util.ImmutableCollections$ListN](org.eclipse.mat.tests.collect.ExtractCollectionEntriesTest3)  Time elapsed: 0.058 s
testCollections[org.eclipse.mat.ibmvm.acquire.IBMExecDumpProvider acquire_collection_dump_3.hprof 1 java.util.ImmutableCollections$List12](org.eclipse.mat.tests.collect.ExtractCollectionEntriesTest3)  Time elapsed: 0.001 s
testCollections[org.eclipse.mat.ibmvm.acquire.IBMExecDumpProvider acquire_collection_dump_3.hprof 1 javax.management.relation.RoleList](org.eclipse.mat.tests.collect.ExtractCollectionEntriesTest3)  Time elapsed: 0.022 s
testCollections[org.eclipse.mat.ibmvm.acquire.IBMExecDumpProvider acquire_collection_dump_3.hprof 1 javax.management.relation.RoleUnresolvedList](org.eclipse.mat.tests.collect.ExtractCollectionEntriesTest3)  Time elapsed: 0.056 s
testCollections[org.eclipse.mat.ibmvm.acquire.IBMExecDumpProvider acquire_collection_dump_3.hprof 1 java.util.Stack](org.eclipse.mat.tests.collect.ExtractCollectionEntriesTest3)  Time elapsed: 0.007 s
testCollections[org.eclipse.mat.ibmvm.acquire.IBMExecDumpProvider acquire_collection_dump_3.hprof 1 java.util.Vector](org.eclipse.mat.tests.collect.ExtractCollectionEntriesTest3)  Time elapsed: 0.042 s
testCollections[org.eclipse.mat.ibmvm.acquire.IBMExecDumpProvider acquire_collection_dump_3.hprof 1 java.util.LinkedHashMap$LinkedValues](org.eclipse.mat.tests.collect.ExtractCollectionEntriesTest3)  Time elapsed: 0.104 s
testCollections[org.eclipse.mat.ibmvm.acquire.IBMExecDumpProvider acquire_collection_dump_3.hprof 1 java.util.TreeMap$Values](org.eclipse.mat.tests.collect.ExtractCollectionEntriesTest3)  Time elapsed: 0.074 s
testCollections[org.eclipse.mat.ibmvm.acquire.IBMExecDumpProvider acquire_collection_dump_3.hprof 1 java.util.Collections$SynchronizedCollection](org.eclipse.mat.tests.collect.ExtractCollectionEntriesTest3)  Time elapsed: 0.124 s
testCollections[org.eclipse.mat.ibmvm.acquire.IBMExecDumpProvider acquire_collection_dump_3.hprof 1 java.util.Collections$UnmodifiableCollection](org.eclipse.mat.tests.collect.ExtractCollectionEntriesTest3)  Time elapsed: 0.037 s
testCollections[org.eclipse.mat.ibmvm.acquire.IBMExecDumpProvider acquire_collection_dump_3.hprof 1 java.util.concurrent.ConcurrentHashMap$ValuesView](org.eclipse.mat.tests.collect.ExtractCollectionEntriesTest3)  Time elapsed: 0.058 s
testCollections[org.eclipse.mat.ibmvm.acquire.IBMExecDumpProvider acquire_collection_dump_3.hprof 1 java.util.concurrent.ConcurrentSkipListMap$Values](org.eclipse.mat.tests.collect.ExtractCollectionEntriesTest3)  Time elapsed: 0.042 s
testCollections[org.eclipse.mat.ibmvm.acquire.IBMExecDumpProvider acquire_collection_dump_3.hprof 1 java.util.HashMap$Values](org.eclipse.mat.tests.collect.ExtractCollectionEntriesTest3)  Time elapsed: 0.088 s
testCollections[org.eclipse.mat.ibmvm.acquire.IBMExecDumpProvider acquire_collection_dump_3.hprof 1 java.util.IdentityHashMap$Values](org.eclipse.mat.tests.collect.ExtractCollectionEntriesTest3)  Time elapsed: 0.038 s
testCollections[org.eclipse.mat.ibmvm.acquire.IBMExecDumpProvider acquire_collection_dump_3.hprof 1 java.util.AbstractMap$2](org.eclipse.mat.tests.collect.ExtractCollectionEntriesTest3)  Time elapsed: 0.02 s
testCollections[org.eclipse.mat.ibmvm.acquire.IBMExecDumpProvider acquire_collection_dump_3.hprof 1 java.lang.ProcessEnvironment$StringValues](org.eclipse.mat.tests.collect.ExtractCollectionEntriesTest3)  Time elapsed: 0.012 s
testCollections[org.eclipse.mat.ibmvm.acquire.IBMExecDumpProvider acquire_collection_dump_3.hprof 1 java.util.WeakHashMap$Values](org.eclipse.mat.tests.collect.ExtractCollectionEntriesTest3)  Time elapsed: 0.055 s
testCollections[org.eclipse.mat.ibmvm.acquire.IBMExecDumpProvider acquire_collection_dump_3.hprof 2 java.util.concurrent.ArrayBlockingQueue](org.eclipse.mat.tests.collect.ExtractCollectionEntriesTest3)  Time elapsed: 0.014 s
testCollections[org.eclipse.mat.ibmvm.acquire.IBMExecDumpProvider acquire_collection_dump_3.hprof 2 java.util.ArrayDeque](org.eclipse.mat.tests.collect.ExtractCollectionEntriesTest3)  Time elapsed: 0.045 s
testCollections[org.eclipse.mat.ibmvm.acquire.IBMExecDumpProvider acquire_collection_dump_3.hprof 2 java.beans.beancontext.BeanContextServicesSupport](org.eclipse.mat.tests.collect.ExtractCollectionEntriesTest3)  Time elapsed: 0.021 s
testCollections[org.eclipse.mat.ibmvm.acquire.IBMExecDumpProvider acquire_collection_dump_3.hprof 2 java.beans.beancontext.BeanContextSupport](org.eclipse.mat.tests.collect.ExtractCollectionEntriesTest3)  Time elapsed: 0.021 s
testCollections[org.eclipse.mat.ibmvm.acquire.IBMExecDumpProvider acquire_collection_dump_3.hprof 2 java.util.concurrent.ConcurrentLinkedDeque](org.eclipse.mat.tests.collect.ExtractCollectionEntriesTest3)  Time elapsed: 0.078 s
testCollections[org.eclipse.mat.ibmvm.acquire.IBMExecDumpProvider acquire_collection_dump_3.hprof 2 java.util.concurrent.ConcurrentLinkedQueue](org.eclipse.mat.tests.collect.ExtractCollectionEntriesTest3)  Time elapsed: 0.044 s
testCollections[org.eclipse.mat.ibmvm.acquire.IBMExecDumpProvider acquire_collection_dump_3.hprof 2 java.util.concurrent.ConcurrentSkipListSet](org.eclipse.mat.tests.collect.ExtractCollectionEntriesTest3)  Time elapsed: 0.116 s
testCollections[org.eclipse.mat.ibmvm.acquire.IBMExecDumpProvider acquire_collection_dump_3.hprof 2 java.util.concurrent.CopyOnWriteArraySet](org.eclipse.mat.tests.collect.ExtractCollectionEntriesTest3)  Time elapsed: 0.025 s
testCollections[org.eclipse.mat.ibmvm.acquire.IBMExecDumpProvider acquire_collection_dump_3.hprof 2 java.util.Collections$CheckedCollection](org.eclipse.mat.tests.collect.ExtractCollectionEntriesTest3)  Time elapsed: 0.006 s
testCollections[org.eclipse.mat.ibmvm.acquire.IBMExecDumpProvider acquire_collection_dump_3.hprof 2 java.util.Collections$CheckedQueue](org.eclipse.mat.tests.collect.ExtractCollectionEntriesTest3)  Time elapsed: 0.006 s
testCollections[org.eclipse.mat.ibmvm.acquire.IBMExecDumpProvider acquire_collection_dump_3.hprof 2 java.util.Collections$CheckedSet](org.eclipse.mat.tests.collect.ExtractCollectionEntriesTest3)  Time elapsed: 0.02 s
testCollections[org.eclipse.mat.ibmvm.acquire.IBMExecDumpProvider acquire_collection_dump_3.hprof 2 java.util.Collections$CheckedSortedSet](org.eclipse.mat.tests.collect.ExtractCollectionEntriesTest3)  Time elapsed: 0.019 s
testCollections[org.eclipse.mat.ibmvm.acquire.IBMExecDumpProvider acquire_collection_dump_3.hprof 2 java.util.Collections$CheckedNavigableSet](org.eclipse.mat.tests.collect.ExtractCollectionEntriesTest3)  Time elapsed: 0.039 s
testCollections[org.eclipse.mat.ibmvm.acquire.IBMExecDumpProvider acquire_collection_dump_3.hprof 2 java.util.Collections$SetFromMap](org.eclipse.mat.tests.collect.ExtractCollectionEntriesTest3)  Time elapsed: 0.02 s
testCollections[org.eclipse.mat.ibmvm.acquire.IBMExecDumpProvider acquire_collection_dump_3.hprof 2 java.util.Collections$SingletonSet](org.eclipse.mat.tests.collect.ExtractCollectionEntriesTest3)  Time elapsed: 0.002 s
testCollections[org.eclipse.mat.ibmvm.acquire.IBMExecDumpProvider acquire_collection_dump_3.hprof 2 java.util.Collections$SynchronizedCollection](org.eclipse.mat.tests.collect.ExtractCollectionEntriesTest3)  Time elapsed: 0.026 s
testCollections[org.eclipse.mat.ibmvm.acquire.IBMExecDumpProvider acquire_collection_dump_3.hprof 2 java.util.Collections$SynchronizedSet](org.eclipse.mat.tests.collect.ExtractCollectionEntriesTest3)  Time elapsed: 0.417 s
testCollections[org.eclipse.mat.ibmvm.acquire.IBMExecDumpProvider acquire_collection_dump_3.hprof 2 java.util.Collections$SynchronizedSortedSet](org.eclipse.mat.tests.collect.ExtractCollectionEntriesTest3)  Time elapsed: 0.023 s
testCollections[org.eclipse.mat.ibmvm.acquire.IBMExecDumpProvider acquire_collection_dump_3.hprof 2 java.util.Collections$SynchronizedNavigableSet](org.eclipse.mat.tests.collect.ExtractCollectionEntriesTest3)  Time elapsed: 0.077 s
testCollections[org.eclipse.mat.ibmvm.acquire.IBMExecDumpProvider acquire_collection_dump_3.hprof 2 java.util.Collections$UnmodifiableCollection](org.eclipse.mat.tests.collect.ExtractCollectionEntriesTest3)  Time elapsed: 0.03 s
testCollections[org.eclipse.mat.ibmvm.acquire.IBMExecDumpProvider acquire_collection_dump_3.hprof 2 java.util.Collections$UnmodifiableSet](org.eclipse.mat.tests.collect.ExtractCollectionEntriesTest3)  Time elapsed: 0.203 s
testCollections[org.eclipse.mat.ibmvm.acquire.IBMExecDumpProvider acquire_collection_dump_3.hprof 2 java.util.Collections$UnmodifiableSortedSet](org.eclipse.mat.tests.collect.ExtractCollectionEntriesTest3)  Time elapsed: 0.055 s
testCollections[org.eclipse.mat.ibmvm.acquire.IBMExecDumpProvider acquire_collection_dump_3.hprof 2 java.util.Collections$UnmodifiableNavigableSet](org.eclipse.mat.tests.collect.ExtractCollectionEntriesTest3)  Time elapsed: 0.022 s
testCollections[org.eclipse.mat.ibmvm.acquire.IBMExecDumpProvider acquire_collection_dump_3.hprof 2 java.util.HashSet](org.eclipse.mat.tests.collect.ExtractCollectionEntriesTest3)  Time elapsed: 0.369 s
testCollections[org.eclipse.mat.ibmvm.acquire.IBMExecDumpProvider acquire_collection_dump_3.hprof 2 javax.print.attribute.standard.JobStateReasons](org.eclipse.mat.tests.collect.ExtractCollectionEntriesTest3)  Time elapsed: 0.001 s
testCollections[org.eclipse.mat.ibmvm.acquire.IBMExecDumpProvider acquire_collection_dump_3.hprof 2 java.util.concurrent.LinkedBlockingDeque](org.eclipse.mat.tests.collect.ExtractCollectionEntriesTest3)  Time elapsed: 0.042 s
testCollections[org.eclipse.mat.ibmvm.acquire.IBMExecDumpProvider acquire_collection_dump_3.hprof 2 java.util.concurrent.LinkedBlockingQueue](org.eclipse.mat.tests.collect.ExtractCollectionEntriesTest3)  Time elapsed: 0.074 s
testCollections[org.eclipse.mat.ibmvm.acquire.IBMExecDumpProvider acquire_collection_dump_3.hprof 2 java.util.LinkedHashSet](org.eclipse.mat.tests.collect.ExtractCollectionEntriesTest3)  Time elapsed: 0.286 s
testCollections[org.eclipse.mat.ibmvm.acquire.IBMExecDumpProvider acquire_collection_dump_3.hprof 2 java.util.concurrent.LinkedTransferQueue](org.eclipse.mat.tests.collect.ExtractCollectionEntriesTest3)  Time elapsed: 0.063 s
testCollections[org.eclipse.mat.ibmvm.acquire.IBMExecDumpProvider acquire_collection_dump_3.hprof 2 java.util.concurrent.PriorityBlockingQueue](org.eclipse.mat.tests.collect.ExtractCollectionEntriesTest3)  Time elapsed: 0.052 s
testCollections[org.eclipse.mat.ibmvm.acquire.IBMExecDumpProvider acquire_collection_dump_3.hprof 2 java.util.PriorityQueue](org.eclipse.mat.tests.collect.ExtractCollectionEntriesTest3)  Time elapsed: 0.056 s
testCollections[org.eclipse.mat.ibmvm.acquire.IBMExecDumpProvider acquire_collection_dump_3.hprof 2 java.util.ImmutableCollections$SetN](org.eclipse.mat.tests.collect.ExtractCollectionEntriesTest3)  Time elapsed: 0.111 s
testCollections[org.eclipse.mat.ibmvm.acquire.IBMExecDumpProvider acquire_collection_dump_3.hprof 2 java.util.ImmutableCollections$Set12](org.eclipse.mat.tests.collect.ExtractCollectionEntriesTest3)  Time elapsed: 0.002 s
testCollections[org.eclipse.mat.ibmvm.acquire.IBMExecDumpProvider acquire_collection_dump_3.hprof 2 java.util.TreeSet](org.eclipse.mat.tests.collect.ExtractCollectionEntriesTest3)  Time elapsed: 0.173 s
testCollections[org.eclipse.mat.ibmvm.acquire.IBMExecDumpProvider acquire_collection_dump_3.hprof 2 java.util.TreeMap$KeySet](org.eclipse.mat.tests.collect.ExtractCollectionEntriesTest3)  Time elapsed: 0.228 s
testCollections[org.eclipse.mat.ibmvm.acquire.IBMExecDumpProvider acquire_collection_dump_3.hprof 2 java.util.Collections$CheckedMap$CheckedEntrySet](org.eclipse.mat.tests.collect.ExtractCollectionEntriesTest3)  Time elapsed: 0.058 s
testCollections[org.eclipse.mat.ibmvm.acquire.IBMExecDumpProvider acquire_collection_dump_3.hprof 2 java.util.Collections$UnmodifiableMap$UnmodifiableEntrySet](org.eclipse.mat.tests.collect.ExtractCollectionEntriesTest3)  Time elapsed: 0.155 s
testCollections[org.eclipse.mat.ibmvm.acquire.IBMExecDumpProvider acquire_collection_dump_3.hprof 2 java.util.concurrent.ConcurrentHashMap$KeySetView](org.eclipse.mat.tests.collect.ExtractCollectionEntriesTest3)  Time elapsed: 0.13 s
testCollections[org.eclipse.mat.ibmvm.acquire.IBMExecDumpProvider acquire_collection_dump_3.hprof 2 java.util.concurrent.ConcurrentHashMap$EntrySetView](org.eclipse.mat.tests.collect.ExtractCollectionEntriesTest3)  Time elapsed: 0.082 s
testCollections[org.eclipse.mat.ibmvm.acquire.IBMExecDumpProvider acquire_collection_dump_3.hprof 2 java.util.concurrent.ConcurrentSkipListMap$KeySet](org.eclipse.mat.tests.collect.ExtractCollectionEntriesTest3)  Time elapsed: 0.095 s
testCollections[org.eclipse.mat.ibmvm.acquire.IBMExecDumpProvider acquire_collection_dump_3.hprof 2 java.util.concurrent.ConcurrentSkipListMap$EntrySet](org.eclipse.mat.tests.collect.ExtractCollectionEntriesTest3)  Time elapsed: 0.061 s
testCollections[org.eclipse.mat.ibmvm.acquire.IBMExecDumpProvider acquire_collection_dump_3.hprof 2 java.util.HashMap$KeySet](org.eclipse.mat.tests.collect.ExtractCollectionEntriesTest3)  Time elapsed: 0.206 s
testCollections[org.eclipse.mat.ibmvm.acquire.IBMExecDumpProvider acquire_collection_dump_3.hprof 2 java.util.HashMap$EntrySet](org.eclipse.mat.tests.collect.ExtractCollectionEntriesTest3)  Time elapsed: 0.107 s
testCollections[org.eclipse.mat.ibmvm.acquire.IBMExecDumpProvider acquire_collection_dump_3.hprof 2 java.util.IdentityHashMap$KeySet](org.eclipse.mat.tests.collect.ExtractCollectionEntriesTest3)  Time elapsed: 0.097 s
testCollections[org.eclipse.mat.ibmvm.acquire.IBMExecDumpProvider acquire_collection_dump_3.hprof 2 java.util.IdentityHashMap$EntrySet](org.eclipse.mat.tests.collect.ExtractCollectionEntriesTest3)  Time elapsed: 0.059 s
testCollections[org.eclipse.mat.ibmvm.acquire.IBMExecDumpProvider acquire_collection_dump_3.hprof 2 java.util.LinkedHashMap$LinkedKeySet](org.eclipse.mat.tests.collect.ExtractCollectionEntriesTest3)  Time elapsed: 0.164 s
testCollections[org.eclipse.mat.ibmvm.acquire.IBMExecDumpProvider acquire_collection_dump_3.hprof 2 java.util.LinkedHashMap$LinkedEntrySet](org.eclipse.mat.tests.collect.ExtractCollectionEntriesTest3)  Time elapsed: 0.119 s
testCollections[org.eclipse.mat.ibmvm.acquire.IBMExecDumpProvider acquire_collection_dump_3.hprof 2 java.util.AbstractMap$1](org.eclipse.mat.tests.collect.ExtractCollectionEntriesTest3)  Time elapsed: 0.08 s
testCollections[org.eclipse.mat.ibmvm.acquire.IBMExecDumpProvider acquire_collection_dump_3.hprof 2 java.lang.ProcessEnvironment$StringKeySet](org.eclipse.mat.tests.collect.ExtractCollectionEntriesTest3)  Time elapsed: 0.025 s
testCollections[org.eclipse.mat.ibmvm.acquire.IBMExecDumpProvider acquire_collection_dump_3.hprof 2 java.lang.ProcessEnvironment$StringEntrySet](org.eclipse.mat.tests.collect.ExtractCollectionEntriesTest3)  Time elapsed: 0.015 s
testCollections[org.eclipse.mat.ibmvm.acquire.IBMExecDumpProvider acquire_collection_dump_3.hprof 2 java.util.TreeMap$EntrySet](org.eclipse.mat.tests.collect.ExtractCollectionEntriesTest3)  Time elapsed: 0.103 s
testCollections[org.eclipse.mat.ibmvm.acquire.IBMExecDumpProvider acquire_collection_dump_3.hprof 2 java.util.WeakHashMap$KeySet](org.eclipse.mat.tests.collect.ExtractCollectionEntriesTest3)  Time elapsed: 0.202 s
testCollections[org.eclipse.mat.ibmvm.acquire.IBMExecDumpProvider acquire_collection_dump_3.hprof 2 java.util.WeakHashMap$EntrySet](org.eclipse.mat.tests.collect.ExtractCollectionEntriesTest3)  Time elapsed: 0.188 s
testCollections[org.eclipse.mat.ibmvm.acquire.IBMExecDumpProvider acquire_collection_dump_3.hprof 3 java.util.ArrayList](org.eclipse.mat.tests.collect.ExtractCollectionEntriesTest3)  Time elapsed: 0.003 s
testCollections[org.eclipse.mat.ibmvm.acquire.IBMExecDumpProvider acquire_collection_dump_3.hprof 3 javax.management.AttributeList](org.eclipse.mat.tests.collect.ExtractCollectionEntriesTest3)  Time elapsed: 0.001 s
testCollections[org.eclipse.mat.ibmvm.acquire.IBMExecDumpProvider acquire_collection_dump_3.hprof 3 java.util.concurrent.CopyOnWriteArrayList](org.eclipse.mat.tests.collect.ExtractCollectionEntriesTest3)  Time elapsed: 0.002 s
testCollections[org.eclipse.mat.ibmvm.acquire.IBMExecDumpProvider acquire_collection_dump_3.hprof 3 java.util.Collections$CheckedRandomAccessList](org.eclipse.mat.tests.collect.ExtractCollectionEntriesTest3)  Time elapsed: 0 s
testCollections[org.eclipse.mat.ibmvm.acquire.IBMExecDumpProvider acquire_collection_dump_3.hprof 3 java.util.Collections$EmptyList](org.eclipse.mat.tests.collect.ExtractCollectionEntriesTest3)  Time elapsed: 0.001 s
testCollections[org.eclipse.mat.ibmvm.acquire.IBMExecDumpProvider acquire_collection_dump_3.hprof 3 java.util.Collections$SynchronizedRandomAccessList](org.eclipse.mat.tests.collect.ExtractCollectionEntriesTest3)  Time elapsed: 0 s
testCollections[org.eclipse.mat.ibmvm.acquire.IBMExecDumpProvider acquire_collection_dump_3.hprof 3 java.util.LinkedList](org.eclipse.mat.tests.collect.ExtractCollectionEntriesTest3)  Time elapsed: 0.001 s
testCollections[org.eclipse.mat.ibmvm.acquire.IBMExecDumpProvider acquire_collection_dump_3.hprof 3 java.util.ImmutableCollections$ListN](org.eclipse.mat.tests.collect.ExtractCollectionEntriesTest3)  Time elapsed: 0 s
testCollections[org.eclipse.mat.ibmvm.acquire.IBMExecDumpProvider acquire_collection_dump_3.hprof 3 javax.management.relation.RoleList](org.eclipse.mat.tests.collect.ExtractCollectionEntriesTest3)  Time elapsed: 0.001 s
testCollections[org.eclipse.mat.ibmvm.acquire.IBMExecDumpProvider acquire_collection_dump_3.hprof 3 javax.management.relation.RoleUnresolvedList](org.eclipse.mat.tests.collect.ExtractCollectionEntriesTest3)  Time elapsed: 0.001 s
testCollections[org.eclipse.mat.ibmvm.acquire.IBMExecDumpProvider acquire_collection_dump_3.hprof 3 java.util.Stack](org.eclipse.mat.tests.collect.ExtractCollectionEntriesTest3)  Time elapsed: 0.001 s
testCollections[org.eclipse.mat.ibmvm.acquire.IBMExecDumpProvider acquire_collection_dump_3.hprof 3 java.util.Vector](org.eclipse.mat.tests.collect.ExtractCollectionEntriesTest3)  Time elapsed: 0.002 s
testCollections[org.eclipse.mat.ibmvm.acquire.IBMExecDumpProvider acquire_collection_dump_3.hprof 3 java.util.LinkedHashMap$LinkedValues](org.eclipse.mat.tests.collect.ExtractCollectionEntriesTest3)  Time elapsed: 0.002 s
testCollections[org.eclipse.mat.ibmvm.acquire.IBMExecDumpProvider acquire_collection_dump_3.hprof 3 java.util.TreeMap$Values](org.eclipse.mat.tests.collect.ExtractCollectionEntriesTest3)  Time elapsed: 0.002 s
testCollections[org.eclipse.mat.ibmvm.acquire.IBMExecDumpProvider acquire_collection_dump_3.hprof 3 java.util.Collections$EmptySet](org.eclipse.mat.tests.collect.ExtractCollectionEntriesTest3)  Time elapsed: 0 s
testCollections[org.eclipse.mat.ibmvm.acquire.IBMExecDumpProvider acquire_collection_dump_3.hprof 3 java.util.Collections$UnmodifiableCollection](org.eclipse.mat.tests.collect.ExtractCollectionEntriesTest3)  Time elapsed: 0.001 s
testCollections[org.eclipse.mat.ibmvm.acquire.IBMExecDumpProvider acquire_collection_dump_3.hprof 3 java.util.Collections$SynchronizedCollection](org.eclipse.mat.tests.collect.ExtractCollectionEntriesTest3)  Time elapsed: 0.004 s
testCollections[org.eclipse.mat.ibmvm.acquire.IBMExecDumpProvider acquire_collection_dump_3.hprof 3 java.util.concurrent.ConcurrentHashMap$ValuesView](org.eclipse.mat.tests.collect.ExtractCollectionEntriesTest3)  Time elapsed: 0.002 s
testCollections[org.eclipse.mat.ibmvm.acquire.IBMExecDumpProvider acquire_collection_dump_3.hprof 3 java.util.concurrent.ConcurrentSkipListMap$Values](org.eclipse.mat.tests.collect.ExtractCollectionEntriesTest3)  Time elapsed: 0.001 s
testCollections[org.eclipse.mat.ibmvm.acquire.IBMExecDumpProvider acquire_collection_dump_3.hprof 3 java.util.HashMap$Values](org.eclipse.mat.tests.collect.ExtractCollectionEntriesTest3)  Time elapsed: 0.037 s
testCollections[org.eclipse.mat.ibmvm.acquire.IBMExecDumpProvider acquire_collection_dump_3.hprof 3 java.util.IdentityHashMap$Values](org.eclipse.mat.tests.collect.ExtractCollectionEntriesTest3)  Time elapsed: 0.003 s
testCollections[org.eclipse.mat.ibmvm.acquire.IBMExecDumpProvider acquire_collection_dump_3.hprof 3 java.util.AbstractMap$2](org.eclipse.mat.tests.collect.ExtractCollectionEntriesTest3)  Time elapsed: 0 s
testCollections[org.eclipse.mat.ibmvm.acquire.IBMExecDumpProvider acquire_collection_dump_3.hprof 3 java.lang.ProcessEnvironment$StringValues](org.eclipse.mat.tests.collect.ExtractCollectionEntriesTest3)  Time elapsed: 0.001 s
testCollections[org.eclipse.mat.ibmvm.acquire.IBMExecDumpProvider acquire_collection_dump_3.hprof 3 java.util.WeakHashMap$Values](org.eclipse.mat.tests.collect.ExtractCollectionEntriesTest3)  Time elapsed: 0.002 s
testCollections[org.eclipse.mat.ibmvm.acquire.IBMExecDumpProvider acquire_collection_dump_3.hprof 4 java.util.concurrent.ArrayBlockingQueue](org.eclipse.mat.tests.collect.ExtractCollectionEntriesTest3)  Time elapsed: 0.001 s
testCollections[org.eclipse.mat.ibmvm.acquire.IBMExecDumpProvider acquire_collection_dump_3.hprof 4 java.util.ArrayDeque](org.eclipse.mat.tests.collect.ExtractCollectionEntriesTest3)  Time elapsed: 0.003 s
testCollections[org.eclipse.mat.ibmvm.acquire.IBMExecDumpProvider acquire_collection_dump_3.hprof 4 java.beans.beancontext.BeanContextServicesSupport](org.eclipse.mat.tests.collect.ExtractCollectionEntriesTest3)  Time elapsed: 0.001 s
testCollections[org.eclipse.mat.ibmvm.acquire.IBMExecDumpProvider acquire_collection_dump_3.hprof 4 java.beans.beancontext.BeanContextSupport](org.eclipse.mat.tests.collect.ExtractCollectionEntriesTest3)  Time elapsed: 0.001 s
testCollections[org.eclipse.mat.ibmvm.acquire.IBMExecDumpProvider acquire_collection_dump_3.hprof 4 java.util.concurrent.ConcurrentLinkedDeque](org.eclipse.mat.tests.collect.ExtractCollectionEntriesTest3)  Time elapsed: 0.003 s
testCollections[org.eclipse.mat.ibmvm.acquire.IBMExecDumpProvider acquire_collection_dump_3.hprof 4 java.util.concurrent.ConcurrentLinkedQueue](org.eclipse.mat.tests.collect.ExtractCollectionEntriesTest3)  Time elapsed: 0.002 s
testCollections[org.eclipse.mat.ibmvm.acquire.IBMExecDumpProvider acquire_collection_dump_3.hprof 4 java.util.concurrent.ConcurrentSkipListSet](org.eclipse.mat.tests.collect.ExtractCollectionEntriesTest3)  Time elapsed: 0.004 s
testCollections[org.eclipse.mat.ibmvm.acquire.IBMExecDumpProvider acquire_collection_dump_3.hprof 4 java.util.concurrent.CopyOnWriteArraySet](org.eclipse.mat.tests.collect.ExtractCollectionEntriesTest3)  Time elapsed: 0.003 s
testCollections[org.eclipse.mat.ibmvm.acquire.IBMExecDumpProvider acquire_collection_dump_3.hprof 4 java.util.concurrent.DelayQueue](org.eclipse.mat.tests.collect.ExtractCollectionEntriesTest3)  Time elapsed: 0.001 s
testCollections[org.eclipse.mat.ibmvm.acquire.IBMExecDumpProvider acquire_collection_dump_3.hprof 4 java.util.Collections$CheckedCollection](org.eclipse.mat.tests.collect.ExtractCollectionEntriesTest3)  Time elapsed: 0.001 s
testCollections[org.eclipse.mat.ibmvm.acquire.IBMExecDumpProvider acquire_collection_dump_3.hprof 4 java.util.Collections$CheckedQueue](org.eclipse.mat.tests.collect.ExtractCollectionEntriesTest3)  Time elapsed: 0.001 s
testCollections[org.eclipse.mat.ibmvm.acquire.IBMExecDumpProvider acquire_collection_dump_3.hprof 4 java.util.Collections$CheckedSet](org.eclipse.mat.tests.collect.ExtractCollectionEntriesTest3)  Time elapsed: 0.001 s
testCollections[org.eclipse.mat.ibmvm.acquire.IBMExecDumpProvider acquire_collection_dump_3.hprof 4 java.util.Collections$CheckedSortedSet](org.eclipse.mat.tests.collect.ExtractCollectionEntriesTest3)  Time elapsed: 0.001 s
testCollections[org.eclipse.mat.ibmvm.acquire.IBMExecDumpProvider acquire_collection_dump_3.hprof 4 java.util.Collections$CheckedNavigableSet](org.eclipse.mat.tests.collect.ExtractCollectionEntriesTest3)  Time elapsed: 0.001 s
testCollections[org.eclipse.mat.ibmvm.acquire.IBMExecDumpProvider acquire_collection_dump_3.hprof 4 java.util.Collections$EmptySet](org.eclipse.mat.tests.collect.ExtractCollectionEntriesTest3)  Time elapsed: 0.002 s
testCollections[org.eclipse.mat.ibmvm.acquire.IBMExecDumpProvider acquire_collection_dump_3.hprof 4 java.util.Collections$UnmodifiableNavigableSet$EmptyNavigableSet](org.eclipse.mat.tests.collect.ExtractCollectionEntriesTest3)  Time elapsed: 0.002 s
testCollections[org.eclipse.mat.ibmvm.acquire.IBMExecDumpProvider acquire_collection_dump_3.hprof 4 java.util.Collections$SetFromMap](org.eclipse.mat.tests.collect.ExtractCollectionEntriesTest3)  Time elapsed: 0.001 s
testCollections[org.eclipse.mat.ibmvm.acquire.IBMExecDumpProvider acquire_collection_dump_3.hprof 4 java.util.Collections$SynchronizedCollection](org.eclipse.mat.tests.collect.ExtractCollectionEntriesTest3)  Time elapsed: 0.002 s
testCollections[org.eclipse.mat.ibmvm.acquire.IBMExecDumpProvider acquire_collection_dump_3.hprof 4 java.util.Collections$SynchronizedSet](org.eclipse.mat.tests.collect.ExtractCollectionEntriesTest3)  Time elapsed: 0.012 s
testCollections[org.eclipse.mat.ibmvm.acquire.IBMExecDumpProvider acquire_collection_dump_3.hprof 4 java.util.Collections$SynchronizedSortedSet](org.eclipse.mat.tests.collect.ExtractCollectionEntriesTest3)  Time elapsed: 0.002 s
testCollections[org.eclipse.mat.ibmvm.acquire.IBMExecDumpProvider acquire_collection_dump_3.hprof 4 java.util.Collections$SynchronizedNavigableSet](org.eclipse.mat.tests.collect.ExtractCollectionEntriesTest3)  Time elapsed: 0.001 s
testCollections[org.eclipse.mat.ibmvm.acquire.IBMExecDumpProvider acquire_collection_dump_3.hprof 4 java.util.Collections$UnmodifiableSet](org.eclipse.mat.tests.collect.ExtractCollectionEntriesTest3)  Time elapsed: 0.002 s
testCollections[org.eclipse.mat.ibmvm.acquire.IBMExecDumpProvider acquire_collection_dump_3.hprof 4 java.util.RegularEnumSet](org.eclipse.mat.tests.collect.ExtractCollectionEntriesTest3)  Time elapsed: 0.002 s
testCollections[org.eclipse.mat.ibmvm.acquire.IBMExecDumpProvider acquire_collection_dump_3.hprof 4 java.util.HashSet](org.eclipse.mat.tests.collect.ExtractCollectionEntriesTest3)  Time elapsed: 0.041 s
testCollections[org.eclipse.mat.ibmvm.acquire.IBMExecDumpProvider acquire_collection_dump_3.hprof 4 javax.print.attribute.standard.JobStateReasons](org.eclipse.mat.tests.collect.ExtractCollectionEntriesTest3)  Time elapsed: 0.003 s
testCollections[org.eclipse.mat.ibmvm.acquire.IBMExecDumpProvider acquire_collection_dump_3.hprof 4 java.util.concurrent.LinkedBlockingDeque](org.eclipse.mat.tests.collect.ExtractCollectionEntriesTest3)  Time elapsed: 0.002 s
testCollections[org.eclipse.mat.ibmvm.acquire.IBMExecDumpProvider acquire_collection_dump_3.hprof 4 java.util.concurrent.LinkedBlockingQueue](org.eclipse.mat.tests.collect.ExtractCollectionEntriesTest3)  Time elapsed: 0.003 s
testCollections[org.eclipse.mat.ibmvm.acquire.IBMExecDumpProvider acquire_collection_dump_3.hprof 4 java.util.LinkedHashSet](org.eclipse.mat.tests.collect.ExtractCollectionEntriesTest3)  Time elapsed: 0.006 s
testCollections[org.eclipse.mat.ibmvm.acquire.IBMExecDumpProvider acquire_collection_dump_3.hprof 4 java.util.concurrent.LinkedTransferQueue](org.eclipse.mat.tests.collect.ExtractCollectionEntriesTest3)  Time elapsed: 0.002 s
testCollections[org.eclipse.mat.ibmvm.acquire.IBMExecDumpProvider acquire_collection_dump_3.hprof 4 java.util.concurrent.PriorityBlockingQueue](org.eclipse.mat.tests.collect.ExtractCollectionEntriesTest3)  Time elapsed: 0.004 s
testCollections[org.eclipse.mat.ibmvm.acquire.IBMExecDumpProvider acquire_collection_dump_3.hprof 4 java.util.PriorityQueue](org.eclipse.mat.tests.collect.ExtractCollectionEntriesTest3)  Time elapsed: 0.004 s
testCollections[org.eclipse.mat.ibmvm.acquire.IBMExecDumpProvider acquire_collection_dump_3.hprof 4 java.util.ImmutableCollections$SetN](org.eclipse.mat.tests.collect.ExtractCollectionEntriesTest3)  Time elapsed: 0.001 s
testCollections[org.eclipse.mat.ibmvm.acquire.IBMExecDumpProvider acquire_collection_dump_3.hprof 4 java.util.concurrent.SynchronousQueue](org.eclipse.mat.tests.collect.ExtractCollectionEntriesTest3)  Time elapsed: 0.001 s
testCollections[org.eclipse.mat.ibmvm.acquire.IBMExecDumpProvider acquire_collection_dump_3.hprof 4 java.util.TreeSet](org.eclipse.mat.tests.collect.ExtractCollectionEntriesTest3)  Time elapsed: 0.004 s
testCollections[org.eclipse.mat.ibmvm.acquire.IBMExecDumpProvider acquire_collection_dump_3.hprof 4 java.util.LinkedHashMap$LinkedKeySet](org.eclipse.mat.tests.collect.ExtractCollectionEntriesTest3)  Time elapsed: 0.007 s
testCollections[org.eclipse.mat.ibmvm.acquire.IBMExecDumpProvider acquire_collection_dump_3.hprof 4 java.util.LinkedHashMap$LinkedEntrySet](org.eclipse.mat.tests.collect.ExtractCollectionEntriesTest3)  Time elapsed: 0.006 s
testCollections[org.eclipse.mat.ibmvm.acquire.IBMExecDumpProvider acquire_collection_dump_3.hprof 4 java.util.TreeMap$KeySet](org.eclipse.mat.tests.collect.ExtractCollectionEntriesTest3)  Time elapsed: 0.005 s
testCollections[org.eclipse.mat.ibmvm.acquire.IBMExecDumpProvider acquire_collection_dump_3.hprof 4 java.util.Collections$CheckedMap$CheckedEntrySet](org.eclipse.mat.tests.collect.ExtractCollectionEntriesTest3)  Time elapsed: 0.002 s
testCollections[org.eclipse.mat.ibmvm.acquire.IBMExecDumpProvider acquire_collection_dump_3.hprof 4 java.util.Collections$UnmodifiableMap$UnmodifiableEntrySet](org.eclipse.mat.tests.collect.ExtractCollectionEntriesTest3)  Time elapsed: 0.005 s
testCollections[org.eclipse.mat.ibmvm.acquire.IBMExecDumpProvider acquire_collection_dump_3.hprof 4 java.util.concurrent.ConcurrentHashMap$KeySetView](org.eclipse.mat.tests.collect.ExtractCollectionEntriesTest3)  Time elapsed: 0.004 s
testCollections[org.eclipse.mat.ibmvm.acquire.IBMExecDumpProvider acquire_collection_dump_3.hprof 4 java.util.concurrent.ConcurrentHashMap$EntrySetView](org.eclipse.mat.tests.collect.ExtractCollectionEntriesTest3)  Time elapsed: 0.039 s
testCollections[org.eclipse.mat.ibmvm.acquire.IBMExecDumpProvider acquire_collection_dump_3.hprof 4 java.util.concurrent.ConcurrentSkipListMap$KeySet](org.eclipse.mat.tests.collect.ExtractCollectionEntriesTest3)  Time elapsed: 0.003 s
testCollections[org.eclipse.mat.ibmvm.acquire.IBMExecDumpProvider acquire_collection_dump_3.hprof 4 java.util.concurrent.ConcurrentSkipListMap$EntrySet](org.eclipse.mat.tests.collect.ExtractCollectionEntriesTest3)  Time elapsed: 0.003 s
testCollections[org.eclipse.mat.ibmvm.acquire.IBMExecDumpProvider acquire_collection_dump_3.hprof 4 java.util.HashMap$KeySet](org.eclipse.mat.tests.collect.ExtractCollectionEntriesTest3)  Time elapsed: 0.01 s
testCollections[org.eclipse.mat.ibmvm.acquire.IBMExecDumpProvider acquire_collection_dump_3.hprof 4 java.util.HashMap$EntrySet](org.eclipse.mat.tests.collect.ExtractCollectionEntriesTest3)  Time elapsed: 0.009 s
testCollections[org.eclipse.mat.ibmvm.acquire.IBMExecDumpProvider acquire_collection_dump_3.hprof 4 java.util.IdentityHashMap$KeySet](org.eclipse.mat.tests.collect.ExtractCollectionEntriesTest3)  Time elapsed: 0.007 s
testCollections[org.eclipse.mat.ibmvm.acquire.IBMExecDumpProvider acquire_collection_dump_3.hprof 4 java.util.IdentityHashMap$EntrySet](org.eclipse.mat.tests.collect.ExtractCollectionEntriesTest3)  Time elapsed: 0.008 s
testCollections[org.eclipse.mat.ibmvm.acquire.IBMExecDumpProvider acquire_collection_dump_3.hprof 4 java.util.AbstractMap$1](org.eclipse.mat.tests.collect.ExtractCollectionEntriesTest3)  Time elapsed: 0.001 s
testCollections[org.eclipse.mat.ibmvm.acquire.IBMExecDumpProvider acquire_collection_dump_3.hprof 4 java.lang.ProcessEnvironment$StringKeySet](org.eclipse.mat.tests.collect.ExtractCollectionEntriesTest3)  Time elapsed: 0.001 s
testCollections[org.eclipse.mat.ibmvm.acquire.IBMExecDumpProvider acquire_collection_dump_3.hprof 4 java.lang.ProcessEnvironment$StringEntrySet](org.eclipse.mat.tests.collect.ExtractCollectionEntriesTest3)  Time elapsed: 0.001 s
testCollections[org.eclipse.mat.ibmvm.acquire.IBMExecDumpProvider acquire_collection_dump_3.hprof 4 java.util.TreeMap$EntrySet](org.eclipse.mat.tests.collect.ExtractCollectionEntriesTest3)  Time elapsed: 0.004 s
testCollections[org.eclipse.mat.ibmvm.acquire.IBMExecDumpProvider acquire_collection_dump_3.hprof 4 java.util.WeakHashMap$KeySet](org.eclipse.mat.tests.collect.ExtractCollectionEntriesTest3)  Time elapsed: 0.005 s
testCollections[org.eclipse.mat.ibmvm.acquire.IBMExecDumpProvider acquire_collection_dump_3.hprof 4 java.util.WeakHashMap$EntrySet](org.eclipse.mat.tests.collect.ExtractCollectionEntriesTest3)  Time elapsed: 0.005 s
testCollections[org.eclipse.mat.ibmvm.acquire.IBMExecDumpProvider acquire_collection_dump_3.hprof 5 java.util.jar.Attributes](org.eclipse.mat.tests.collect.ExtractCollectionEntriesTest3)  Time elapsed: 0.002 s
testCollections[org.eclipse.mat.ibmvm.acquire.IBMExecDumpProvider acquire_collection_dump_3.hprof 5 java.util.Collections$CheckedMap](org.eclipse.mat.tests.collect.ExtractCollectionEntriesTest3)  Time elapsed: 0.046 s
testCollections[org.eclipse.mat.ibmvm.acquire.IBMExecDumpProvider acquire_collection_dump_3.hprof 5 java.util.Collections$CheckedSortedMap](org.eclipse.mat.tests.collect.ExtractCollectionEntriesTest3)  Time elapsed: 0.011 s
testCollections[org.eclipse.mat.ibmvm.acquire.IBMExecDumpProvider acquire_collection_dump_3.hprof 5 java.util.Collections$CheckedNavigableMap](org.eclipse.mat.tests.collect.ExtractCollectionEntriesTest3)  Time elapsed: 0.011 s
testCollections[org.eclipse.mat.ibmvm.acquire.IBMExecDumpProvider acquire_collection_dump_3.hprof 5 java.util.Collections$SingletonMap](org.eclipse.mat.tests.collect.ExtractCollectionEntriesTest3)  Time elapsed: 0.001 s
testCollections[org.eclipse.mat.ibmvm.acquire.IBMExecDumpProvider acquire_collection_dump_3.hprof 5 java.util.Collections$SynchronizedMap](org.eclipse.mat.tests.collect.ExtractCollectionEntriesTest3)  Time elapsed: 0.023 s
testCollections[org.eclipse.mat.ibmvm.acquire.IBMExecDumpProvider acquire_collection_dump_3.hprof 5 java.util.Collections$SynchronizedSortedMap](org.eclipse.mat.tests.collect.ExtractCollectionEntriesTest3)  Time elapsed: 0.011 s
testCollections[org.eclipse.mat.ibmvm.acquire.IBMExecDumpProvider acquire_collection_dump_3.hprof 5 java.util.Collections$SynchronizedNavigableMap](org.eclipse.mat.tests.collect.ExtractCollectionEntriesTest3)  Time elapsed: 0.011 s
testCollections[org.eclipse.mat.ibmvm.acquire.IBMExecDumpProvider acquire_collection_dump_3.hprof 5 java.util.Collections$UnmodifiableMap](org.eclipse.mat.tests.collect.ExtractCollectionEntriesTest3)  Time elapsed: 0.044 s
testCollections[org.eclipse.mat.ibmvm.acquire.IBMExecDumpProvider acquire_collection_dump_3.hprof 5 java.util.Collections$UnmodifiableSortedMap](org.eclipse.mat.tests.collect.ExtractCollectionEntriesTest3)  Time elapsed: 0.011 s
testCollections[org.eclipse.mat.ibmvm.acquire.IBMExecDumpProvider acquire_collection_dump_3.hprof 5 java.util.Collections$UnmodifiableNavigableMap](org.eclipse.mat.tests.collect.ExtractCollectionEntriesTest3)  Time elapsed: 0.011 s
testCollections[org.eclipse.mat.ibmvm.acquire.IBMExecDumpProvider acquire_collection_dump_3.hprof 5 java.util.concurrent.ConcurrentHashMap](org.eclipse.mat.tests.collect.ExtractCollectionEntriesTest3)  Time elapsed: 0.076 s
testCollections[org.eclipse.mat.ibmvm.acquire.IBMExecDumpProvider acquire_collection_dump_3.hprof 5 java.util.concurrent.ConcurrentSkipListMap](org.eclipse.mat.tests.collect.ExtractCollectionEntriesTest3)  Time elapsed: 0.054 s
testCollections[org.eclipse.mat.ibmvm.acquire.IBMExecDumpProvider acquire_collection_dump_3.hprof 5 java.util.HashMap](org.eclipse.mat.tests.collect.ExtractCollectionEntriesTest3)  Time elapsed: 0.072 s
testCollections[org.eclipse.mat.ibmvm.acquire.IBMExecDumpProvider acquire_collection_dump_3.hprof 5 java.util.Hashtable](org.eclipse.mat.tests.collect.ExtractCollectionEntriesTest3)  Time elapsed: 0.069 s
testCollections[org.eclipse.mat.ibmvm.acquire.IBMExecDumpProvider acquire_collection_dump_3.hprof 5 java.util.IdentityHashMap](org.eclipse.mat.tests.collect.ExtractCollectionEntriesTest3)  Time elapsed: 0.061 s
testCollections[org.eclipse.mat.ibmvm.acquire.IBMExecDumpProvider acquire_collection_dump_3.hprof 5 java.util.LinkedHashMap](org.eclipse.mat.tests.collect.ExtractCollectionEntriesTest3)  Time elapsed: 0.073 s
testCollections[org.eclipse.mat.ibmvm.acquire.IBMExecDumpProvider acquire_collection_dump_3.hprof 5 java.util.ImmutableCollections$MapN](org.eclipse.mat.tests.collect.ExtractCollectionEntriesTest3)  Time elapsed: 0.026 s
testCollections[org.eclipse.mat.ibmvm.acquire.IBMExecDumpProvider acquire_collection_dump_3.hprof 5 java.lang.ProcessEnvironment$StringEnvironment](org.eclipse.mat.tests.collect.ExtractCollectionEntriesTest3)  Time elapsed: 0.013 s
testCollections[org.eclipse.mat.ibmvm.acquire.IBMExecDumpProvider acquire_collection_dump_3.hprof 5 javax.print.attribute.standard.PrinterStateReasons](org.eclipse.mat.tests.collect.ExtractCollectionEntriesTest3)  Time elapsed: 0.003 s
testCollections[org.eclipse.mat.ibmvm.acquire.IBMExecDumpProvider acquire_collection_dump_3.hprof 5 java.util.Properties](org.eclipse.mat.tests.collect.ExtractCollectionEntriesTest3)  Time elapsed: 0.046 s
testCollections[org.eclipse.mat.ibmvm.acquire.IBMExecDumpProvider acquire_collection_dump_3.hprof 5 java.awt.RenderingHints](org.eclipse.mat.tests.collect.ExtractCollectionEntriesTest3)  Time elapsed: 0.021 s
testCollections[org.eclipse.mat.ibmvm.acquire.IBMExecDumpProvider acquire_collection_dump_3.hprof 5 javax.script.SimpleBindings](org.eclipse.mat.tests.collect.ExtractCollectionEntriesTest3)  Time elapsed: 0.07 s
testCollections[org.eclipse.mat.ibmvm.acquire.IBMExecDumpProvider acquire_collection_dump_3.hprof 5 java.util.TreeMap](org.eclipse.mat.tests.collect.ExtractCollectionEntriesTest3)  Time elapsed: 0.074 s
testCollections[org.eclipse.mat.ibmvm.acquire.IBMExecDumpProvider acquire_collection_dump_3.hprof 5 javax.swing.UIDefaults](org.eclipse.mat.tests.collect.ExtractCollectionEntriesTest3)  Time elapsed: 0.015 s
testCollections[org.eclipse.mat.ibmvm.acquire.IBMExecDumpProvider acquire_collection_dump_3.hprof 5 java.util.WeakHashMap](org.eclipse.mat.tests.collect.ExtractCollectionEntriesTest3)  Time elapsed: 0.105 s
testCollections[org.eclipse.mat.ibmvm.acquire.IBMExecDumpProvider acquire_collection_dump_3.hprof 6 java.util.jar.Attributes](org.eclipse.mat.tests.collect.ExtractCollectionEntriesTest3)  Time elapsed: 0.002 s
testCollections[org.eclipse.mat.ibmvm.acquire.IBMExecDumpProvider acquire_collection_dump_3.hprof 6 java.util.Collections$CheckedMap](org.eclipse.mat.tests.collect.ExtractCollectionEntriesTest3)  Time elapsed: 0.001 s
testCollections[org.eclipse.mat.ibmvm.acquire.IBMExecDumpProvider acquire_collection_dump_3.hprof 6 java.util.Collections$CheckedSortedMap](org.eclipse.mat.tests.collect.ExtractCollectionEntriesTest3)  Time elapsed: 0 s
testCollections[org.eclipse.mat.ibmvm.acquire.IBMExecDumpProvider acquire_collection_dump_3.hprof 6 java.util.Collections$CheckedNavigableMap](org.eclipse.mat.tests.collect.ExtractCollectionEntriesTest3)  Time elapsed: 0.001 s
testCollections[org.eclipse.mat.ibmvm.acquire.IBMExecDumpProvider acquire_collection_dump_3.hprof 6 java.util.Collections$EmptyMap](org.eclipse.mat.tests.collect.ExtractCollectionEntriesTest3)  Time elapsed: 0.001 s
testCollections[org.eclipse.mat.ibmvm.acquire.IBMExecDumpProvider acquire_collection_dump_3.hprof 6 java.util.Collections$UnmodifiableNavigableMap$EmptyNavigableMap](org.eclipse.mat.tests.collect.ExtractCollectionEntriesTest3)  Time elapsed: 0.001 s
testCollections[org.eclipse.mat.ibmvm.acquire.IBMExecDumpProvider acquire_collection_dump_3.hprof 6 java.util.Collections$SynchronizedMap](org.eclipse.mat.tests.collect.ExtractCollectionEntriesTest3)  Time elapsed: 0.001 s
testCollections[org.eclipse.mat.ibmvm.acquire.IBMExecDumpProvider acquire_collection_dump_3.hprof 6 java.util.Collections$SynchronizedSortedMap](org.eclipse.mat.tests.collect.ExtractCollectionEntriesTest3)  Time elapsed: 0.001 s
testCollections[org.eclipse.mat.ibmvm.acquire.IBMExecDumpProvider acquire_collection_dump_3.hprof 6 java.util.Collections$SynchronizedNavigableMap](org.eclipse.mat.tests.collect.ExtractCollectionEntriesTest3)  Time elapsed: 0 s
testCollections[org.eclipse.mat.ibmvm.acquire.IBMExecDumpProvider acquire_collection_dump_3.hprof 6 java.util.Collections$UnmodifiableMap](org.eclipse.mat.tests.collect.ExtractCollectionEntriesTest3)  Time elapsed: 0.001 s
testCollections[org.eclipse.mat.ibmvm.acquire.IBMExecDumpProvider acquire_collection_dump_3.hprof 6 java.util.concurrent.ConcurrentHashMap](org.eclipse.mat.tests.collect.ExtractCollectionEntriesTest3)  Time elapsed: 0.003 s
testCollections[org.eclipse.mat.ibmvm.acquire.IBMExecDumpProvider acquire_collection_dump_3.hprof 6 java.util.concurrent.ConcurrentSkipListMap](org.eclipse.mat.tests.collect.ExtractCollectionEntriesTest3)  Time elapsed: 0.002 s
testCollections[org.eclipse.mat.ibmvm.acquire.IBMExecDumpProvider acquire_collection_dump_3.hprof 6 java.util.HashMap](org.eclipse.mat.tests.collect.ExtractCollectionEntriesTest3)  Time elapsed: 0.003 s
testCollections[org.eclipse.mat.ibmvm.acquire.IBMExecDumpProvider acquire_collection_dump_3.hprof 6 java.util.Hashtable](org.eclipse.mat.tests.collect.ExtractCollectionEntriesTest3)  Time elapsed: 0.004 s
testCollections[org.eclipse.mat.ibmvm.acquire.IBMExecDumpProvider acquire_collection_dump_3.hprof 6 java.util.IdentityHashMap](org.eclipse.mat.tests.collect.ExtractCollectionEntriesTest3)  Time elapsed: 0.004 s
testCollections[org.eclipse.mat.ibmvm.acquire.IBMExecDumpProvider acquire_collection_dump_3.hprof 6 java.util.LinkedHashMap](org.eclipse.mat.tests.collect.ExtractCollectionEntriesTest3)  Time elapsed: 0.003 s
testCollections[org.eclipse.mat.ibmvm.acquire.IBMExecDumpProvider acquire_collection_dump_3.hprof 6 java.util.ImmutableCollections$MapN](org.eclipse.mat.tests.collect.ExtractCollectionEntriesTest3)  Time elapsed: 0.001 s
testCollections[org.eclipse.mat.ibmvm.acquire.IBMExecDumpProvider acquire_collection_dump_3.hprof 6 java.lang.ProcessEnvironment$StringEnvironment](org.eclipse.mat.tests.collect.ExtractCollectionEntriesTest3)  Time elapsed: 0.001 s
testCollections[org.eclipse.mat.ibmvm.acquire.IBMExecDumpProvider acquire_collection_dump_3.hprof 6 javax.print.attribute.standard.PrinterStateReasons](org.eclipse.mat.tests.collect.ExtractCollectionEntriesTest3)  Time elapsed: 0.002 s
testCollections[org.eclipse.mat.ibmvm.acquire.IBMExecDumpProvider acquire_collection_dump_3.hprof 6 java.util.Properties](org.eclipse.mat.tests.collect.ExtractCollectionEntriesTest3)  Time elapsed: 0.002 s
testCollections[org.eclipse.mat.ibmvm.acquire.IBMExecDumpProvider acquire_collection_dump_3.hprof 6 java.awt.RenderingHints](org.eclipse.mat.tests.collect.ExtractCollectionEntriesTest3)  Time elapsed: 0.001 s
testCollections[org.eclipse.mat.ibmvm.acquire.IBMExecDumpProvider acquire_collection_dump_3.hprof 6 javax.script.SimpleBindings](org.eclipse.mat.tests.collect.ExtractCollectionEntriesTest3)  Time elapsed: 0.002 s
testCollections[org.eclipse.mat.ibmvm.acquire.IBMExecDumpProvider acquire_collection_dump_3.hprof 6 java.util.TreeMap](org.eclipse.mat.tests.collect.ExtractCollectionEntriesTest3)  Time elapsed: 0.002 s
testCollections[org.eclipse.mat.ibmvm.acquire.IBMExecDumpProvider acquire_collection_dump_3.hprof 6 javax.swing.UIDefaults](org.eclipse.mat.tests.collect.ExtractCollectionEntriesTest3)  Time elapsed: 0.001 s
testCollections[org.eclipse.mat.ibmvm.acquire.IBMExecDumpProvider acquire_collection_dump_3.hprof 6 java.util.WeakHashMap](org.eclipse.mat.tests.collect.ExtractCollectionEntriesTest3)  Time elapsed: 0.003 s
testCollections[org.eclipse.mat.ibmvm.acquire.IBMExecDumpProvider acquire_collection_dump_3.hprof 7 null](org.eclipse.mat.tests.collect.ExtractCollectionEntriesTest3)  Time elapsed: 0 s
testCollections1[0](org.eclipse.mat.tests.collect.ExtractCollectionEntriesTest4)  Time elapsed: 0.005 s
testCollections2[0](org.eclipse.mat.tests.collect.ExtractCollectionEntriesTest4)  Time elapsed: 0.014 s
testCollections3[0](org.eclipse.mat.tests.collect.ExtractCollectionEntriesTest4)  Time elapsed: 0.001 s
testCollections4[0](org.eclipse.mat.tests.collect.ExtractCollectionEntriesTest4)  Time elapsed: 0.001 s
testCollections5[0](org.eclipse.mat.tests.collect.ExtractCollectionEntriesTest4)  Time elapsed: 0.013 s
testCollections6[0](org.eclipse.mat.tests.collect.ExtractCollectionEntriesTest4)  Time elapsed: 0.001 s
testCollections1[1](org.eclipse.mat.tests.collect.ExtractCollectionEntriesTest4)  Time elapsed: 0.481 s
testCollections2[1](org.eclipse.mat.tests.collect.ExtractCollectionEntriesTest4)  Time elapsed: 1.328 s
testCollections3[1](org.eclipse.mat.tests.collect.ExtractCollectionEntriesTest4)  Time elapsed: 0.001 s
testCollections4[1](org.eclipse.mat.tests.collect.ExtractCollectionEntriesTest4)  Time elapsed: 0 s
testCollections5[1](org.eclipse.mat.tests.collect.ExtractCollectionEntriesTest4)  Time elapsed: 1.141 s
testCollections6[1](org.eclipse.mat.tests.collect.ExtractCollectionEntriesTest4)  Time elapsed: 0.007 s
testCollections1[2](org.eclipse.mat.tests.collect.ExtractCollectionEntriesTest4)  Time elapsed: 0.004 s
testCollections2[2](org.eclipse.mat.tests.collect.ExtractCollectionEntriesTest4)  Time elapsed: 0.042 s
testCollections3[2](org.eclipse.mat.tests.collect.ExtractCollectionEntriesTest4)  Time elapsed: 0 s
testCollections4[2](org.eclipse.mat.tests.collect.ExtractCollectionEntriesTest4)  Time elapsed: 0.003 s
testCollections5[2](org.eclipse.mat.tests.collect.ExtractCollectionEntriesTest4)  Time elapsed: 0.009 s
testCollections6[2](org.eclipse.mat.tests.collect.ExtractCollectionEntriesTest4)  Time elapsed: 0.001 s
testCollections1[3](org.eclipse.mat.tests.collect.ExtractCollectionEntriesTest4)  Time elapsed: 5.039 s
testCollections2[3](org.eclipse.mat.tests.collect.ExtractCollectionEntriesTest4)  Time elapsed: 6.863 s
testCollections3[3](org.eclipse.mat.tests.collect.ExtractCollectionEntriesTest4)  Time elapsed: 0.148 s
testCollections4[3](org.eclipse.mat.tests.collect.ExtractCollectionEntriesTest4)  Time elapsed: 0.21 s
testCollections5[3](org.eclipse.mat.tests.collect.ExtractCollectionEntriesTest4)  Time elapsed: 1.289 s
testCollections6[3](org.eclipse.mat.tests.collect.ExtractCollectionEntriesTest4)  Time elapsed: 0.066 s
testClassNameExtractor(org.eclipse.mat.tests.ui.snapshot.panes.textPartitioning.TestClassNameExtractor)  Time elapsed: 0.027 s
testComplexQueryPartitions(org.eclipse.mat.tests.ui.snapshot.panes.textPartitioning.TestOQLPartitionScanner)  Time elapsed: 0.047 s
testComplexPartitions1(org.eclipse.mat.tests.ui.snapshot.panes.textPartitioning.TestOQLPartitionScanner)  Time elapsed: 0.061 s
testComplexPartitions2(org.eclipse.mat.tests.ui.snapshot.panes.textPartitioning.TestOQLPartitionScanner)  Time elapsed: 0.001 s
testComplexPartitions3(org.eclipse.mat.tests.ui.snapshot.panes.textPartitioning.TestOQLPartitionScanner)  Time elapsed: 0.001 s
testBaseQueryPartitions(org.eclipse.mat.tests.ui.snapshot.panes.textPartitioning.TestOQLPartitionScanner)  Time elapsed: 0 s
testCRInPartitions(org.eclipse.mat.tests.ui.snapshot.panes.textPartitioning.TestOQLPartitionScanner)  Time elapsed: 0.001 s
testCommentPartitions(org.eclipse.mat.tests.ui.snapshot.panes.textPartitioning.TestOQLPartitionScanner)  Time elapsed: 0 s
testIncompletePartitions(org.eclipse.mat.tests.ui.snapshot.panes.textPartitioning.TestOQLPartitionScanner)  Time elapsed: 0 s

Results:

Failures: 
  QueriesTest.testLeakHunter2ReportJDK11:1378->testLeakHunter2Report:1448 Expected subqueries with commands
Expected: <25>
     but: was <24>
Errors: 
  GeneralSnapshotTests.testAllQueriesReportCSV:1223->checkHTMLResult:694->checkHTMLFile:706->checkHTMLFile:720->checkHTMLFile:1018 » NullPointer
  GeneralSnapshotTests.testAllQueriesReportCSV:1223->checkHTMLResult:694->checkHTMLFile:706->checkHTMLFile:720->checkHTMLFile:1018 » NullPointer
  GeneralSnapshotTests.testAllQueriesReportCSV:1223->checkHTMLResult:694->checkHTMLFile:706->checkHTMLFile:720->checkHTMLFile:1018 » NullPointer
  GeneralSnapshotTests.testAllQueriesReportCSV:1223->checkHTMLResult:694->checkHTMLFile:706->checkHTMLFile:720->checkHTMLFile:1018 » NullPointer
  GeneralSnapshotTests.testAllQueriesReportCSV:1223->checkHTMLResult:694->checkHTMLFile:706->checkHTMLFile:720->checkHTMLFile:1018 » NullPointer
  GeneralSnapshotTests.testAllQueriesReportCSV:1223->checkHTMLResult:694->checkHTMLFile:706->checkHTMLFile:720->checkHTMLFile:1018 » NullPointer
  GeneralSnapshotTests.testAllQueriesReportCSV:1223->checkHTMLResult:694->checkHTMLFile:706->checkHTMLFile:720->checkHTMLFile:1018 » NullPointer
  GeneralSnapshotTests.testAllQueriesReportCSV:1223->checkHTMLResult:694->checkHTMLFile:706->checkHTMLFile:720->checkHTMLFile:1018 » NullPointer
  GeneralSnapshotTests.testAllQueriesReportCSV:1223->checkHTMLResult:694->checkHTMLFile:706->checkHTMLFile:720->checkHTMLFile:1018 » NullPointer
  GeneralSnapshotTests.testAllQueriesReportText:1213->checkHTMLResult:694->checkHTMLFile:706->checkHTMLFile:720->checkHTMLFile:1018 » NullPointer
  GeneralSnapshotTests.testAllQueriesReportText:1213->checkHTMLResult:694->checkHTMLFile:706->checkHTMLFile:720->checkHTMLFile:1018 » NullPointer
  GeneralSnapshotTests.testAllQueriesReportText:1213->checkHTMLResult:694->checkHTMLFile:706->checkHTMLFile:720->checkHTMLFile:1018 » NullPointer
  GeneralSnapshotTests.testAllQueriesReportText:1213->checkHTMLResult:694->checkHTMLFile:706->checkHTMLFile:720->checkHTMLFile:1018 » NullPointer
  GeneralSnapshotTests.testAllQueriesReportText:1213->checkHTMLResult:694->checkHTMLFile:706->checkHTMLFile:720->checkHTMLFile:1018 » NullPointer
  GeneralSnapshotTests.testAllQueriesReportText:1213->checkHTMLResult:694->checkHTMLFile:706->checkHTMLFile:720->checkHTMLFile:1018 » NullPointer
  GeneralSnapshotTests.testAllQueriesReportText:1213->checkHTMLResult:694->checkHTMLFile:706->checkHTMLFile:720->checkHTMLFile:1018 » NullPointer
  GeneralSnapshotTests.testAllQueriesReportText:1213->checkHTMLResult:694->checkHTMLFile:706->checkHTMLFile:720->checkHTMLFile:1018 » NullPointer
  GeneralSnapshotTests.testAllQueriesReportText:1213->checkHTMLResult:694->checkHTMLFile:706->checkHTMLFile:720->checkHTMLFile:1018 » NullPointer
  GeneralSnapshotTests.testAllQueriesReport:684->checkHTMLResult:694->checkHTMLFile:706->checkHTMLFile:720->checkHTMLFile:1018 » NullPointer
  GeneralSnapshotTests.testAllQueriesReport:684->checkHTMLResult:694->checkHTMLFile:706->checkHTMLFile:720->checkHTMLFile:1018 » NullPointer
  GeneralSnapshotTests.testAllQueriesReport:684->checkHTMLResult:694->checkHTMLFile:706->checkHTMLFile:720->checkHTMLFile:1018 » NullPointer
  GeneralSnapshotTests.testAllQueriesReport:684->checkHTMLResult:694->checkHTMLFile:706->checkHTMLFile:720->checkHTMLFile:1018 » NullPointer
  GeneralSnapshotTests.testAllQueriesReport:684->checkHTMLResult:694->checkHTMLFile:706->checkHTMLFile:720->checkHTMLFile:1018 » NullPointer
  GeneralSnapshotTests.testAllQueriesReport:684->checkHTMLResult:694->checkHTMLFile:706->checkHTMLFile:720->checkHTMLFile:1018 » NullPointer
  GeneralSnapshotTests.testAllQueriesReport:684->checkHTMLResult:694->checkHTMLFile:706->checkHTMLFile:720->checkHTMLFile:1018 » NullPointer
  GeneralSnapshotTests.testAllQueriesReport:684->checkHTMLResult:694->checkHTMLFile:706->checkHTMLFile:720->checkHTMLFile:1018 » NullPointer
  GeneralSnapshotTests.testAllQueriesReport:684->checkHTMLResult:694->checkHTMLFile:706->checkHTMLFile:720->checkHTMLFile:1018 » NullPointer
  GeneralSnapshotTests.testLeakSuspectsReport:481->checkHTMLResult:694->checkHTMLFile:706->checkHTMLFile:720->checkHTMLFile:997->checkHTMLFile:997->checkHTMLFile:997->checkHTMLFile:1018 » NullPointer
  GeneralSnapshotTests.testLeakSuspectsReport:481->checkHTMLResult:694->checkHTMLFile:706->checkHTMLFile:720->checkHTMLFile:997->checkHTMLFile:997->checkHTMLFile:997->checkHTMLFile:1018 » NullPointer
  GeneralSnapshotTests.testLeakSuspectsReport:481->checkHTMLResult:694->checkHTMLFile:706->checkHTMLFile:720->checkHTMLFile:997->checkHTMLFile:997->checkHTMLFile:997->checkHTMLFile:1018 » NullPointer
  GeneralSnapshotTests.testLeakSuspectsReport:481->checkHTMLResult:694->checkHTMLFile:706->checkHTMLFile:720->checkHTMLFile:997->checkHTMLFile:997->checkHTMLFile:997->checkHTMLFile:1018 » NullPointer
  GeneralSnapshotTests.testLeakSuspectsReport:481->checkHTMLResult:694->checkHTMLFile:706->checkHTMLFile:720->checkHTMLFile:997->checkHTMLFile:997->checkHTMLFile:997->checkHTMLFile:1018 » NullPointer
  GeneralSnapshotTests.testLeakSuspectsReport:481->checkHTMLResult:694->checkHTMLFile:706->checkHTMLFile:720->checkHTMLFile:997->checkHTMLFile:997->checkHTMLFile:997->checkHTMLFile:1018 » NullPointer
  GeneralSnapshotTests.testLeakSuspectsReport:481->checkHTMLResult:694->checkHTMLFile:706->checkHTMLFile:720->checkHTMLFile:997->checkHTMLFile:997->checkHTMLFile:997->checkHTMLFile:1018 » NullPointer
  GeneralSnapshotTests.testLeakSuspectsReport:481->checkHTMLResult:694->checkHTMLFile:706->checkHTMLFile:720->checkHTMLFile:997->checkHTMLFile:997->checkHTMLFile:997->checkHTMLFile:1018 » NullPointer
  GeneralSnapshotTests.testLeakSuspectsReport:481->checkHTMLResult:694->checkHTMLFile:706->checkHTMLFile:720->checkHTMLFile:997->checkHTMLFile:997->checkHTMLFile:997->checkHTMLFile:1018 » NullPointer
  GeneralSnapshotTests.testOverviewReportRename2:585->checkHTMLResult:694->checkHTMLFile:706->checkHTMLFile:720->checkHTMLFile:997->checkHTMLFile:997->checkHTMLFile:1018 » NullPointer
  GeneralSnapshotTests.testOverviewReportRename2:585->checkHTMLResult:694->checkHTMLFile:706->checkHTMLFile:720->checkHTMLFile:997->checkHTMLFile:997->checkHTMLFile:1018 » NullPointer
  GeneralSnapshotTests.testOverviewReportRename2:585->checkHTMLResult:694->checkHTMLFile:706->checkHTMLFile:720->checkHTMLFile:997->checkHTMLFile:997->checkHTMLFile:1018 » NullPointer
  GeneralSnapshotTests.testOverviewReportRename2:585->checkHTMLResult:694->checkHTMLFile:706->checkHTMLFile:720->checkHTMLFile:997->checkHTMLFile:997->checkHTMLFile:1018 » NullPointer
  GeneralSnapshotTests.testOverviewReportRename2:585->checkHTMLResult:694->checkHTMLFile:706->checkHTMLFile:720->checkHTMLFile:997->checkHTMLFile:997->checkHTMLFile:1018 » NullPointer
  GeneralSnapshotTests.testOverviewReportRename2:585->checkHTMLResult:694->checkHTMLFile:706->checkHTMLFile:720->checkHTMLFile:997->checkHTMLFile:997->checkHTMLFile:1018 » NullPointer
  GeneralSnapshotTests.testOverviewReportRename2:585->checkHTMLResult:694->checkHTMLFile:706->checkHTMLFile:720->checkHTMLFile:997->checkHTMLFile:997->checkHTMLFile:1018 » NullPointer
  GeneralSnapshotTests.testOverviewReportRename2:585->checkHTMLResult:694->checkHTMLFile:706->checkHTMLFile:720->checkHTMLFile:997->checkHTMLFile:997->checkHTMLFile:1018 » NullPointer
  GeneralSnapshotTests.testOverviewReportRename2:585->checkHTMLResult:694->checkHTMLFile:706->checkHTMLFile:720->checkHTMLFile:997->checkHTMLFile:997->checkHTMLFile:1018 » NullPointer
  GeneralSnapshotTests.testOverviewReportRename:534->checkHTMLResult:694->checkHTMLFile:706->checkHTMLFile:720->checkHTMLFile:997->checkHTMLFile:997->checkHTMLFile:1018 » NullPointer
  GeneralSnapshotTests.testOverviewReportRename:534->checkHTMLResult:694->checkHTMLFile:706->checkHTMLFile:720->checkHTMLFile:997->checkHTMLFile:997->checkHTMLFile:1018 » NullPointer
  GeneralSnapshotTests.testOverviewReportRename:534->checkHTMLResult:694->checkHTMLFile:706->checkHTMLFile:720->checkHTMLFile:997->checkHTMLFile:997->checkHTMLFile:1018 » NullPointer
  GeneralSnapshotTests.testOverviewReportRename:534->checkHTMLResult:694->checkHTMLFile:706->checkHTMLFile:720->checkHTMLFile:997->checkHTMLFile:997->checkHTMLFile:1018 » NullPointer
  GeneralSnapshotTests.testOverviewReportRename:534->checkHTMLResult:694->checkHTMLFile:706->checkHTMLFile:720->checkHTMLFile:997->checkHTMLFile:997->checkHTMLFile:1018 » NullPointer
  GeneralSnapshotTests.testOverviewReportRename:534->checkHTMLResult:694->checkHTMLFile:706->checkHTMLFile:720->checkHTMLFile:997->checkHTMLFile:997->checkHTMLFile:1018 » NullPointer
  GeneralSnapshotTests.testOverviewReportRename:534->checkHTMLResult:694->checkHTMLFile:706->checkHTMLFile:720->checkHTMLFile:997->checkHTMLFile:997->checkHTMLFile:1018 » NullPointer
  GeneralSnapshotTests.testOverviewReportRename:534->checkHTMLResult:694->checkHTMLFile:706->checkHTMLFile:720->checkHTMLFile:997->checkHTMLFile:997->checkHTMLFile:1018 » NullPointer
  GeneralSnapshotTests.testOverviewReportRename:534->checkHTMLResult:694->checkHTMLFile:706->checkHTMLFile:720->checkHTMLFile:997->checkHTMLFile:997->checkHTMLFile:1018 » NullPointer
  GeneralSnapshotTests.testOverviewReport:490->checkHTMLResult:694->checkHTMLFile:706->checkHTMLFile:720->checkHTMLFile:997->checkHTMLFile:997->checkHTMLFile:1018 » NullPointer
  GeneralSnapshotTests.testOverviewReport:490->checkHTMLResult:694->checkHTMLFile:706->checkHTMLFile:720->checkHTMLFile:997->checkHTMLFile:997->checkHTMLFile:1018 » NullPointer
  GeneralSnapshotTests.testOverviewReport:490->checkHTMLResult:694->checkHTMLFile:706->checkHTMLFile:720->checkHTMLFile:997->checkHTMLFile:997->checkHTMLFile:1018 » NullPointer
  GeneralSnapshotTests.testOverviewReport:490->checkHTMLResult:694->checkHTMLFile:706->checkHTMLFile:720->checkHTMLFile:997->checkHTMLFile:997->checkHTMLFile:1018 » NullPointer
  GeneralSnapshotTests.testOverviewReport:490->checkHTMLResult:694->checkHTMLFile:706->checkHTMLFile:720->checkHTMLFile:997->checkHTMLFile:997->checkHTMLFile:1018 » NullPointer
  GeneralSnapshotTests.testOverviewReport:490->checkHTMLResult:694->checkHTMLFile:706->checkHTMLFile:720->checkHTMLFile:997->checkHTMLFile:997->checkHTMLFile:1018 » NullPointer
  GeneralSnapshotTests.testOverviewReport:490->checkHTMLResult:694->checkHTMLFile:706->checkHTMLFile:720->checkHTMLFile:997->checkHTMLFile:997->checkHTMLFile:1018 » NullPointer
  GeneralSnapshotTests.testOverviewReport:490->checkHTMLResult:694->checkHTMLFile:706->checkHTMLFile:720->checkHTMLFile:997->checkHTMLFile:997->checkHTMLFile:1018 » NullPointer
  GeneralSnapshotTests.testOverviewReport:490->checkHTMLResult:694->checkHTMLFile:706->checkHTMLFile:720->checkHTMLFile:997->checkHTMLFile:997->checkHTMLFile:1018 » NullPointer
  GeneralSnapshotTests.testRegressionReport:463->checkHTMLResult:694->checkHTMLFile:706->checkHTMLFile:720->checkHTMLFile:997->checkHTMLFile:997->checkHTMLFile:1018 » NullPointer
  GeneralSnapshotTests.testRegressionReport:463->checkHTMLResult:694->checkHTMLFile:706->checkHTMLFile:720->checkHTMLFile:997->checkHTMLFile:997->checkHTMLFile:1018 » NullPointer
  GeneralSnapshotTests.testRegressionReport:463->checkHTMLResult:694->checkHTMLFile:706->checkHTMLFile:720->checkHTMLFile:997->checkHTMLFile:997->checkHTMLFile:1018 » NullPointer
  GeneralSnapshotTests.testRegressionReport:463->checkHTMLResult:694->checkHTMLFile:706->checkHTMLFile:720->checkHTMLFile:997->checkHTMLFile:997->checkHTMLFile:1018 » NullPointer
  GeneralSnapshotTests.testRegressionReport:463->checkHTMLResult:694->checkHTMLFile:706->checkHTMLFile:720->checkHTMLFile:997->checkHTMLFile:997->checkHTMLFile:1018 » NullPointer
  GeneralSnapshotTests.testRegressionReport:463->checkHTMLResult:694->checkHTMLFile:706->checkHTMLFile:720->checkHTMLFile:997->checkHTMLFile:997->checkHTMLFile:1018 » NullPointer
  GeneralSnapshotTests.testRegressionReport:463->checkHTMLResult:694->checkHTMLFile:706->checkHTMLFile:720->checkHTMLFile:997->checkHTMLFile:997->checkHTMLFile:1018 » NullPointer
  GeneralSnapshotTests.testRegressionReport:463->checkHTMLResult:694->checkHTMLFile:706->checkHTMLFile:720->checkHTMLFile:997->checkHTMLFile:997->checkHTMLFile:1018 » NullPointer
  GeneralSnapshotTests.testRegressionReport:463->checkHTMLResult:694->checkHTMLFile:706->checkHTMLFile:720->checkHTMLFile:997->checkHTMLFile:997->checkHTMLFile:1018 » NullPointer
  QueriesTest.testCompareThreads1:1455 » NullPointer

Tests run: 1780, Failures: 1, Errors: 73, Skipped: 167

snapshot /tmp/junit878879432980806074/openjdk_jdk11_04_x64.hprof.gz hasn't been disposed at the factory
snapshot /tmp/junit17271476468030640998/core.20130429.083124.14315.0001.dmp.zip hasn't been disposed at the factory
snapshot /tmp/junit11488738159711975784/sun_jdk6_18_x32.hprof hasn't been disposed at the factory
snapshot /tmp/junit13945047577811169185/java_pid1884.0001.hprof.gz hasn't been disposed at the factory
[INFO] ------------------------------------------------------------------------
[INFO] Reactor Summary for MAT Parent 1.12.0-SNAPSHOT:
[INFO] 
[INFO] MAT Parent ......................................... SUCCESS [01:13 min]
[INFO] org.eclipse.mat.targetdef .......................... SUCCESS [  0.687 s]
[INFO] org.eclipse.mat.report ............................. SUCCESS [ 49.539 s]
[INFO] org.eclipse.mat.api ................................ SUCCESS [ 52.542 s]
[INFO] org.eclipse.mat.chart .............................. SUCCESS [ 12.912 s]
[INFO] org.eclipse.mat.ui ................................. SUCCESS [ 53.576 s]
[INFO] org.eclipse.mat.chart.ui ........................... SUCCESS [ 19.624 s]
[INFO] org.eclipse.mat.parser ............................. SUCCESS [ 39.013 s]
[INFO] org.eclipse.mat.dtfj ............................... SUCCESS [ 29.574 s]
[INFO] org.eclipse.mat.hprof .............................. SUCCESS [ 30.869 s]
[INFO] org.eclipse.mat.jdt ................................ SUCCESS [ 12.095 s]
[INFO] org.eclipse.mat.ibmdumps ........................... SUCCESS [ 17.583 s]
[INFO] org.eclipse.mat.jruby.resolver ..................... SUCCESS [  9.995 s]
[INFO] org.eclipse.mat.tests .............................. FAILURE [20:51 min]
[INFO] org.eclipse.mat.ui.help ............................ SKIPPED
[INFO] org.eclipse.mat.ui.rcp ............................. SKIPPED
[INFO] org.eclipse.mat.feature ............................ SKIPPED
[INFO] org.eclipse.mat.chart.feature ...................... SKIPPED
[INFO] org.eclipse.mat.ui.rcp.feature ..................... SKIPPED
[INFO] org.eclipse.mat.updatesite ......................... SKIPPED
[INFO] MAT RCP ............................................ SKIPPED
[INFO] org.eclipse.mat.ui.rcp.tests ....................... SKIPPED
[INFO] ------------------------------------------------------------------------
[INFO] BUILD FAILURE
[INFO] ------------------------------------------------------------------------
[INFO] Total time:  30:41 min
[INFO] Finished at: 2021-06-02T06:58:03Z
[INFO] ------------------------------------------------------------------------
[ERROR] Failed to execute goal org.eclipse.tycho:tycho-surefire-plugin:1.7.0:test (default-test) on project org.eclipse.mat.tests: There are test failures.
[ERROR] 
[ERROR] Please refer to /home/jenkins/agent/workspace/tycho-mat-nightly/plugins/org.eclipse.mat.tests/target/surefire-reports for the individual test results.
[ERROR] -> [Help 1]
[ERROR] 
[ERROR] To see the full stack trace of the errors, re-run Maven with the -e switch.
[ERROR] Re-run Maven using the -X switch to enable full debug logging.
[ERROR] 
[ERROR] For more information about the errors and possible solutions, please read the following articles:
[ERROR] [Help 1] http://cwiki.apache.org/confluence/display/MAVEN/MojoFailureException
[ERROR] 
[ERROR] After correcting the problems, you can resume the build with the command
[ERROR]   mvn <args> -rf :org.eclipse.mat.tests
Build step 'Execute shell' marked build as failure
Terminating xvnc.
$ ssh-agent -k
unset SSH_AUTH_SOCK;
unset SSH_AGENT_PID;
echo Agent pid 61 killed;
[ssh-agent] Stopped.
[FINDBUGS] Skipping publisher since build result is FAILURE
Recording test results
[Checks API] No suitable checks publisher found.
[SpotBugs] Skipping execution of recorder since overall result is 'FAILURE'
Finished: FAILURE