FailedConsole Output

Skipping 465 KB.. Full Log
2.jar (145 kB at 299 kB/s)
Downloading from RSO-public-group: http://repository.sonatype.org/content/groups/sonatype-public-grid/javax/annotation/jsr250-api/1.0/jsr250-api-1.0.jar
Progress (4): 134 kB | 134 kB | 184/197 kB | 45 kB
Progress (4): 134 kB | 134 kB | 188/197 kB | 45 kB
Progress (4): 134 kB | 134 kB | 192/197 kB | 45 kB
Progress (4): 134 kB | 134 kB | 196/197 kB | 45 kB
Progress (4): 134 kB | 134 kB | 197 kB | 45 kB    
                                              
Downloaded from RSO-public-group: http://repository.sonatype.org/content/groups/sonatype-public-grid/javax/enterprise/cdi-api/1.0/cdi-api-1.0.jar (45 kB at 86 kB/s)
Downloading from RSO-public-group: http://repository.sonatype.org/content/groups/sonatype-public-grid/javax/inject/javax.inject/1/javax.inject-1.jar
Downloaded from RSO-public-group: http://repository.sonatype.org/content/groups/sonatype-public-grid/org/eclipse/aether/aether-api/0.9.0.M2/aether-api-0.9.0.M2.jar (134 kB at 253 kB/s)
Downloading from RSO-public-group: http://repository.sonatype.org/content/groups/sonatype-public-grid/org/sonatype/sisu/sisu-guice/3.1.0/sisu-guice-3.1.0-no_aop.jar
Downloaded from RSO-public-group: http://repository.sonatype.org/content/groups/sonatype-public-grid/org/eclipse/aether/aether-util/0.9.0.M2/aether-util-0.9.0.M2.jar (134 kB at 249 kB/s)
Downloading from RSO-public-group: http://repository.sonatype.org/content/groups/sonatype-public-grid/aopalliance/aopalliance/1.0/aopalliance-1.0.jar
Progress (2): 197 kB | 4.1/5.8 kB
Progress (2): 197 kB | 5.8 kB    
                             
Downloaded from RSO-public-group: http://repository.sonatype.org/content/groups/sonatype-public-grid/org/eclipse/sisu/org.eclipse.sisu.plexus/0.0.0.M5/org.eclipse.sisu.plexus-0.0.0.M5.jar (197 kB at 335 kB/s)
Downloading from RSO-public-group: http://repository.sonatype.org/content/groups/sonatype-public-grid/org/eclipse/sisu/org.eclipse.sisu.inject/0.0.0.M5/org.eclipse.sisu.inject-0.0.0.M5.jar
Progress (2): 5.8 kB | 2.5 kB
Progress (3): 5.8 kB | 2.5 kB | 4.1/357 kB
Progress (3): 5.8 kB | 2.5 kB | 7.8/357 kB
Progress (3): 5.8 kB | 2.5 kB | 12/357 kB 
Progress (3): 5.8 kB | 2.5 kB | 16/357 kB
Progress (3): 5.8 kB | 2.5 kB | 20/357 kB
Progress (3): 5.8 kB | 2.5 kB | 24/357 kB
Progress (3): 5.8 kB | 2.5 kB | 28/357 kB
Progress (3): 5.8 kB | 2.5 kB | 32/357 kB
Progress (3): 5.8 kB | 2.5 kB | 37/357 kB
Progress (3): 5.8 kB | 2.5 kB | 41/357 kB
Progress (3): 5.8 kB | 2.5 kB | 45/357 kB
Progress (3): 5.8 kB | 2.5 kB | 49/357 kB
Progress (3): 5.8 kB | 2.5 kB | 53/357 kB
Progress (3): 5.8 kB | 2.5 kB | 57/357 kB
Progress (3): 5.8 kB | 2.5 kB | 61/357 kB
Progress (3): 5.8 kB | 2.5 kB | 65/357 kB
Progress (3): 5.8 kB | 2.5 kB | 69/357 kB
Progress (3): 5.8 kB | 2.5 kB | 73/357 kB
Progress (3): 5.8 kB | 2.5 kB | 76/357 kB
Progress (4): 5.8 kB | 2.5 kB | 76/357 kB | 4.1/4.5 kB
Progress (4): 5.8 kB | 2.5 kB | 76/357 kB | 4.5 kB    
                                                  
Downloaded from RSO-public-group: http://repository.sonatype.org/content/groups/sonatype-public-grid/javax/annotation/jsr250-api/1.0/jsr250-api-1.0.jar (5.8 kB at 9.3 kB/s)
Downloading from RSO-public-group: http://repository.sonatype.org/content/groups/sonatype-public-grid/org/codehaus/plexus/plexus-interpolation/1.19/plexus-interpolation-1.19.jar
Progress (3): 2.5 kB | 80/357 kB | 4.5 kB
Progress (3): 2.5 kB | 84/357 kB | 4.5 kB
Progress (3): 2.5 kB | 88/357 kB | 4.5 kB
Progress (3): 2.5 kB | 92/357 kB | 4.5 kB
Progress (3): 2.5 kB | 96/357 kB | 4.5 kB
Progress (3): 2.5 kB | 101/357 kB | 4.5 kB
Progress (3): 2.5 kB | 105/357 kB | 4.5 kB
Progress (3): 2.5 kB | 109/357 kB | 4.5 kB
Progress (3): 2.5 kB | 113/357 kB | 4.5 kB
Progress (3): 2.5 kB | 117/357 kB | 4.5 kB
Progress (3): 2.5 kB | 121/357 kB | 4.5 kB
Progress (3): 2.5 kB | 125/357 kB | 4.5 kB
Progress (3): 2.5 kB | 129/357 kB | 4.5 kB
Progress (3): 2.5 kB | 133/357 kB | 4.5 kB
Progress (3): 2.5 kB | 137/357 kB | 4.5 kB
Progress (3): 2.5 kB | 142/357 kB | 4.5 kB
Progress (3): 2.5 kB | 146/357 kB | 4.5 kB
Progress (3): 2.5 kB | 150/357 kB | 4.5 kB
Progress (3): 2.5 kB | 154/357 kB | 4.5 kB
Progress (3): 2.5 kB | 158/357 kB | 4.5 kB
Progress (4): 2.5 kB | 158/357 kB | 4.5 kB | 4.1/291 kB
Progress (4): 2.5 kB | 158/357 kB | 4.5 kB | 7.8/291 kB
Progress (4): 2.5 kB | 158/357 kB | 4.5 kB | 12/291 kB 
Progress (4): 2.5 kB | 158/357 kB | 4.5 kB | 16/291 kB
Progress (4): 2.5 kB | 158/357 kB | 4.5 kB | 20/291 kB
Progress (4): 2.5 kB | 158/357 kB | 4.5 kB | 24/291 kB
Progress (4): 2.5 kB | 158/357 kB | 4.5 kB | 28/291 kB
Progress (4): 2.5 kB | 158/357 kB | 4.5 kB | 32/291 kB
Progress (4): 2.5 kB | 158/357 kB | 4.5 kB | 37/291 kB
Progress (4): 2.5 kB | 158/357 kB | 4.5 kB | 41/291 kB
Progress (4): 2.5 kB | 158/357 kB | 4.5 kB | 45/291 kB
Progress (4): 2.5 kB | 158/357 kB | 4.5 kB | 49/291 kB
Progress (4): 2.5 kB | 158/357 kB | 4.5 kB | 53/291 kB
Progress (4): 2.5 kB | 158/357 kB | 4.5 kB | 57/291 kB
                                                      
Downloaded from RSO-public-group: http://repository.sonatype.org/content/groups/sonatype-public-grid/javax/inject/javax.inject/1/javax.inject-1.jar (2.5 kB at 3.8 kB/s)
Downloading from RSO-public-group: http://repository.sonatype.org/content/groups/sonatype-public-grid/org/codehaus/plexus/plexus-utils/3.0.15/plexus-utils-3.0.15.jar
Progress (3): 162/357 kB | 4.5 kB | 57/291 kB
Progress (3): 166/357 kB | 4.5 kB | 57/291 kB
Progress (3): 170/357 kB | 4.5 kB | 57/291 kB
Progress (3): 174/357 kB | 4.5 kB | 57/291 kB
Progress (3): 178/357 kB | 4.5 kB | 57/291 kB
Progress (3): 182/357 kB | 4.5 kB | 57/291 kB
Progress (3): 187/357 kB | 4.5 kB | 57/291 kB
Progress (3): 191/357 kB | 4.5 kB | 57/291 kB
Progress (3): 195/357 kB | 4.5 kB | 57/291 kB
Progress (3): 199/357 kB | 4.5 kB | 57/291 kB
Progress (3): 203/357 kB | 4.5 kB | 57/291 kB
Progress (3): 207/357 kB | 4.5 kB | 57/291 kB
Progress (3): 211/357 kB | 4.5 kB | 57/291 kB
Progress (3): 215/357 kB | 4.5 kB | 57/291 kB
Progress (3): 219/357 kB | 4.5 kB | 57/291 kB
Progress (3): 223/357 kB | 4.5 kB | 57/291 kB
Progress (3): 228/357 kB | 4.5 kB | 57/291 kB
Progress (3): 232/357 kB | 4.5 kB | 57/291 kB
                                             
Downloaded from RSO-public-group: http://repository.sonatype.org/content/groups/sonatype-public-grid/aopalliance/aopalliance/1.0/aopalliance-1.0.jar (4.5 kB at 6.6 kB/s)
Downloading from RSO-public-group: http://repository.sonatype.org/content/groups/sonatype-public-grid/org/codehaus/plexus/plexus-classworlds/2.5.1/plexus-classworlds-2.5.1.jar
Progress (2): 232/357 kB | 61/291 kB
Progress (2): 232/357 kB | 65/291 kB
Progress (2): 232/357 kB | 69/291 kB
Progress (2): 232/357 kB | 73/291 kB
Progress (2): 232/357 kB | 77/291 kB
Progress (2): 232/357 kB | 82/291 kB
Progress (2): 232/357 kB | 84/291 kB
Progress (2): 232/357 kB | 88/291 kB
Progress (2): 232/357 kB | 92/291 kB
Progress (2): 232/357 kB | 96/291 kB
Progress (2): 232/357 kB | 101/291 kB
Progress (2): 232/357 kB | 105/291 kB
Progress (2): 232/357 kB | 109/291 kB
Progress (2): 232/357 kB | 113/291 kB
Progress (2): 232/357 kB | 117/291 kB
Progress (2): 232/357 kB | 121/291 kB
Progress (2): 232/357 kB | 125/291 kB
Progress (2): 232/357 kB | 129/291 kB
Progress (2): 232/357 kB | 133/291 kB
Progress (3): 232/357 kB | 133/291 kB | 4.1/62 kB
Progress (3): 232/357 kB | 133/291 kB | 7.8/62 kB
Progress (3): 232/357 kB | 133/291 kB | 12/62 kB 
Progress (3): 232/357 kB | 133/291 kB | 16/62 kB
Progress (3): 232/357 kB | 133/291 kB | 20/62 kB
Progress (3): 232/357 kB | 133/291 kB | 24/62 kB
Progress (3): 232/357 kB | 133/291 kB | 28/62 kB
Progress (3): 232/357 kB | 133/291 kB | 32/62 kB
Progress (3): 232/357 kB | 133/291 kB | 37/62 kB
Progress (3): 232/357 kB | 133/291 kB | 41/62 kB
Progress (3): 232/357 kB | 133/291 kB | 45/62 kB
Progress (3): 236/357 kB | 133/291 kB | 45/62 kB
Progress (3): 236/357 kB | 133/291 kB | 49/62 kB
Progress (3): 240/357 kB | 133/291 kB | 49/62 kB
Progress (3): 240/357 kB | 133/291 kB | 53/62 kB
Progress (3): 244/357 kB | 133/291 kB | 53/62 kB
Progress (3): 244/357 kB | 133/291 kB | 57/62 kB
Progress (3): 246/357 kB | 133/291 kB | 57/62 kB
Progress (3): 246/357 kB | 133/291 kB | 61/62 kB
Progress (3): 246/357 kB | 133/291 kB | 62 kB   
Progress (3): 250/357 kB | 133/291 kB | 62 kB
Progress (3): 254/357 kB | 133/291 kB | 62 kB
Progress (3): 258/357 kB | 133/291 kB | 62 kB
Progress (3): 262/357 kB | 133/291 kB | 62 kB
Progress (3): 266/357 kB | 133/291 kB | 62 kB
Progress (3): 270/357 kB | 133/291 kB | 62 kB
Progress (3): 274/357 kB | 133/291 kB | 62 kB
Progress (3): 279/357 kB | 133/291 kB | 62 kB
Progress (3): 283/357 kB | 133/291 kB | 62 kB
Progress (3): 287/357 kB | 133/291 kB | 62 kB
Progress (3): 290/357 kB | 133/291 kB | 62 kB
Progress (3): 294/357 kB | 133/291 kB | 62 kB
Progress (3): 298/357 kB | 133/291 kB | 62 kB
Progress (3): 303/357 kB | 133/291 kB | 62 kB
Progress (3): 307/357 kB | 133/291 kB | 62 kB
Progress (3): 311/357 kB | 133/291 kB | 62 kB
Progress (3): 315/357 kB | 133/291 kB | 62 kB
Progress (3): 319/357 kB | 133/291 kB | 62 kB
Progress (3): 319/357 kB | 137/291 kB | 62 kB
Progress (3): 319/357 kB | 142/291 kB | 62 kB
Progress (3): 319/357 kB | 146/291 kB | 62 kB
Progress (3): 319/357 kB | 150/291 kB | 62 kB
Progress (3): 319/357 kB | 154/291 kB | 62 kB
Progress (3): 319/357 kB | 158/291 kB | 62 kB
Progress (3): 319/357 kB | 162/291 kB | 62 kB
Progress (3): 319/357 kB | 165/291 kB | 62 kB
Progress (3): 319/357 kB | 169/291 kB | 62 kB
Progress (3): 319/357 kB | 174/291 kB | 62 kB
Progress (3): 319/357 kB | 178/291 kB | 62 kB
Progress (3): 319/357 kB | 182/291 kB | 62 kB
Progress (3): 319/357 kB | 186/291 kB | 62 kB
Progress (3): 319/357 kB | 190/291 kB | 62 kB
Progress (3): 319/357 kB | 192/291 kB | 62 kB
Progress (3): 319/357 kB | 196/291 kB | 62 kB
Progress (3): 319/357 kB | 200/291 kB | 62 kB
Progress (3): 319/357 kB | 205/291 kB | 62 kB
Progress (3): 319/357 kB | 209/291 kB | 62 kB
Progress (3): 323/357 kB | 209/291 kB | 62 kB
Progress (3): 327/357 kB | 209/291 kB | 62 kB
Progress (3): 331/357 kB | 209/291 kB | 62 kB
Progress (3): 335/357 kB | 209/291 kB | 62 kB
Progress (4): 335/357 kB | 209/291 kB | 62 kB | 4.1/239 kB
Progress (4): 335/357 kB | 209/291 kB | 62 kB | 7.8/239 kB
Progress (4): 335/357 kB | 209/291 kB | 62 kB | 12/239 kB 
Progress (4): 339/357 kB | 209/291 kB | 62 kB | 12/239 kB
Progress (4): 344/357 kB | 209/291 kB | 62 kB | 12/239 kB
Progress (4): 348/357 kB | 209/291 kB | 62 kB | 12/239 kB
Progress (4): 348/357 kB | 209/291 kB | 62 kB | 16/239 kB
Progress (4): 352/357 kB | 209/291 kB | 62 kB | 16/239 kB
Progress (4): 352/357 kB | 209/291 kB | 62 kB | 20/239 kB
Progress (4): 352/357 kB | 209/291 kB | 62 kB | 24/239 kB
Progress (4): 356/357 kB | 209/291 kB | 62 kB | 24/239 kB
Progress (4): 356/357 kB | 209/291 kB | 62 kB | 28/239 kB
Progress (4): 357 kB | 209/291 kB | 62 kB | 28/239 kB    
Progress (4): 357 kB | 209/291 kB | 62 kB | 32/239 kB
Progress (4): 357 kB | 209/291 kB | 62 kB | 37/239 kB
Progress (4): 357 kB | 209/291 kB | 62 kB | 41/239 kB
Progress (4): 357 kB | 209/291 kB | 62 kB | 45/239 kB
Progress (4): 357 kB | 209/291 kB | 62 kB | 49/239 kB
Progress (4): 357 kB | 209/291 kB | 62 kB | 53/239 kB
Progress (4): 357 kB | 209/291 kB | 62 kB | 57/239 kB
Progress (4): 357 kB | 209/291 kB | 62 kB | 61/239 kB
Progress (4): 357 kB | 209/291 kB | 62 kB | 65/239 kB
Progress (4): 357 kB | 209/291 kB | 62 kB | 69/239 kB
Progress (4): 357 kB | 209/291 kB | 62 kB | 73/239 kB
Progress (4): 357 kB | 209/291 kB | 62 kB | 77/239 kB
Progress (4): 357 kB | 209/291 kB | 62 kB | 82/239 kB
Progress (5): 357 kB | 209/291 kB | 62 kB | 82/239 kB | 4.1/50 kB
Progress (5): 357 kB | 209/291 kB | 62 kB | 82/239 kB | 7.8/50 kB
Progress (5): 357 kB | 209/291 kB | 62 kB | 82/239 kB | 12/50 kB 
Progress (5): 357 kB | 209/291 kB | 62 kB | 82/239 kB | 16/50 kB
Progress (5): 357 kB | 209/291 kB | 62 kB | 82/239 kB | 20/50 kB
Progress (5): 357 kB | 209/291 kB | 62 kB | 82/239 kB | 24/50 kB
Progress (5): 357 kB | 209/291 kB | 62 kB | 82/239 kB | 28/50 kB
Progress (5): 357 kB | 209/291 kB | 62 kB | 82/239 kB | 32/50 kB
Progress (5): 357 kB | 209/291 kB | 62 kB | 82/239 kB | 37/50 kB
Progress (5): 357 kB | 209/291 kB | 62 kB | 82/239 kB | 41/50 kB
Progress (5): 357 kB | 209/291 kB | 62 kB | 82/239 kB | 45/50 kB
Progress (5): 357 kB | 209/291 kB | 62 kB | 82/239 kB | 49/50 kB
Progress (5): 357 kB | 209/291 kB | 62 kB | 82/239 kB | 50 kB   
Progress (5): 357 kB | 213/291 kB | 62 kB | 82/239 kB | 50 kB
Progress (5): 357 kB | 217/291 kB | 62 kB | 82/239 kB | 50 kB
Progress (5): 357 kB | 221/291 kB | 62 kB | 82/239 kB | 50 kB
Progress (5): 357 kB | 225/291 kB | 62 kB | 82/239 kB | 50 kB
Progress (5): 357 kB | 229/291 kB | 62 kB | 82/239 kB | 50 kB
Progress (5): 357 kB | 233/291 kB | 62 kB | 82/239 kB | 50 kB
Progress (5): 357 kB | 237/291 kB | 62 kB | 82/239 kB | 50 kB
Progress (5): 357 kB | 241/291 kB | 62 kB | 82/239 kB | 50 kB
Progress (5): 357 kB | 245/291 kB | 62 kB | 82/239 kB | 50 kB
Progress (5): 357 kB | 250/291 kB | 62 kB | 82/239 kB | 50 kB
Progress (5): 357 kB | 254/291 kB | 62 kB | 82/239 kB | 50 kB
Progress (5): 357 kB | 258/291 kB | 62 kB | 82/239 kB | 50 kB
Progress (5): 357 kB | 260/291 kB | 62 kB | 82/239 kB | 50 kB
Progress (5): 357 kB | 264/291 kB | 62 kB | 82/239 kB | 50 kB
Progress (5): 357 kB | 268/291 kB | 62 kB | 82/239 kB | 50 kB
Progress (5): 357 kB | 272/291 kB | 62 kB | 82/239 kB | 50 kB
Progress (5): 357 kB | 276/291 kB | 62 kB | 82/239 kB | 50 kB
Progress (5): 357 kB | 280/291 kB | 62 kB | 82/239 kB | 50 kB
Progress (5): 357 kB | 284/291 kB | 62 kB | 82/239 kB | 50 kB
Progress (5): 357 kB | 289/291 kB | 62 kB | 82/239 kB | 50 kB
Progress (5): 357 kB | 291 kB | 62 kB | 82/239 kB | 50 kB    
Progress (5): 357 kB | 291 kB | 62 kB | 86/239 kB | 50 kB
Progress (5): 357 kB | 291 kB | 62 kB | 90/239 kB | 50 kB
Progress (5): 357 kB | 291 kB | 62 kB | 94/239 kB | 50 kB
Progress (5): 357 kB | 291 kB | 62 kB | 98/239 kB | 50 kB
Progress (5): 357 kB | 291 kB | 62 kB | 102/239 kB | 50 kB
Progress (5): 357 kB | 291 kB | 62 kB | 106/239 kB | 50 kB
Progress (5): 357 kB | 291 kB | 62 kB | 110/239 kB | 50 kB
Progress (5): 357 kB | 291 kB | 62 kB | 114/239 kB | 50 kB
Progress (5): 357 kB | 291 kB | 62 kB | 118/239 kB | 50 kB
Progress (5): 357 kB | 291 kB | 62 kB | 123/239 kB | 50 kB
Progress (5): 357 kB | 291 kB | 62 kB | 127/239 kB | 50 kB
Progress (5): 357 kB | 291 kB | 62 kB | 131/239 kB | 50 kB
Progress (5): 357 kB | 291 kB | 62 kB | 135/239 kB | 50 kB
Progress (5): 357 kB | 291 kB | 62 kB | 139/239 kB | 50 kB
Progress (5): 357 kB | 291 kB | 62 kB | 143/239 kB | 50 kB
Progress (5): 357 kB | 291 kB | 62 kB | 147/239 kB | 50 kB
Progress (5): 357 kB | 291 kB | 62 kB | 151/239 kB | 50 kB
Progress (5): 357 kB | 291 kB | 62 kB | 155/239 kB | 50 kB
Progress (5): 357 kB | 291 kB | 62 kB | 159/239 kB | 50 kB
Progress (5): 357 kB | 291 kB | 62 kB | 163/239 kB | 50 kB
                                                          
Downloaded from RSO-public-group: http://repository.sonatype.org/content/groups/sonatype-public-grid/org/codehaus/plexus/plexus-interpolation/1.19/plexus-interpolation-1.19.jar (62 kB at 79 kB/s)
Progress (4): 357 kB | 291 kB | 168/239 kB | 50 kB
                                                  
Downloading from RSO-public-group: http://repository.sonatype.org/content/groups/sonatype-public-grid/org/sonatype/plexus/plexus-cipher/1.4/plexus-cipher-1.4.jar
Progress (4): 357 kB | 291 kB | 172/239 kB | 50 kB
Progress (4): 357 kB | 291 kB | 176/239 kB | 50 kB
Progress (4): 357 kB | 291 kB | 180/239 kB | 50 kB
Progress (4): 357 kB | 291 kB | 184/239 kB | 50 kB
Progress (4): 357 kB | 291 kB | 188/239 kB | 50 kB
Progress (4): 357 kB | 291 kB | 192/239 kB | 50 kB
Progress (4): 357 kB | 291 kB | 196/239 kB | 50 kB
Progress (4): 357 kB | 291 kB | 200/239 kB | 50 kB
Progress (4): 357 kB | 291 kB | 204/239 kB | 50 kB
Progress (4): 357 kB | 291 kB | 209/239 kB | 50 kB
Progress (4): 357 kB | 291 kB | 213/239 kB | 50 kB
Progress (4): 357 kB | 291 kB | 217/239 kB | 50 kB
Progress (4): 357 kB | 291 kB | 221/239 kB | 50 kB
Progress (4): 357 kB | 291 kB | 225/239 kB | 50 kB
Progress (4): 357 kB | 291 kB | 229/239 kB | 50 kB
Progress (4): 357 kB | 291 kB | 233/239 kB | 50 kB
Progress (4): 357 kB | 291 kB | 237/239 kB | 50 kB
Progress (4): 357 kB | 291 kB | 239 kB | 50 kB    
                                              
Downloaded from RSO-public-group: http://repository.sonatype.org/content/groups/sonatype-public-grid/org/sonatype/sisu/sisu-guice/3.1.0/sisu-guice-3.1.0-no_aop.jar (357 kB at 437 kB/s)
Downloading from RSO-public-group: http://repository.sonatype.org/content/groups/sonatype-public-grid/org/apache/maven/maven-plugin-api/3.1.1/maven-plugin-api-3.1.1.jar
Downloaded from RSO-public-group: http://repository.sonatype.org/content/groups/sonatype-public-grid/org/codehaus/plexus/plexus-classworlds/2.5.1/plexus-classworlds-2.5.1.jar (50 kB at 60 kB/s)
Downloading from RSO-public-group: http://repository.sonatype.org/content/groups/sonatype-public-grid/org/apache/commons/commons-compress/1.10/commons-compress-1.10.jar
Downloaded from RSO-public-group: http://repository.sonatype.org/content/groups/sonatype-public-grid/org/eclipse/sisu/org.eclipse.sisu.inject/0.0.0.M5/org.eclipse.sisu.inject-0.0.0.M5.jar (291 kB at 347 kB/s)
Downloading from RSO-public-group: http://repository.sonatype.org/content/groups/sonatype-public-grid/com/google/guava/guava/19.0/guava-19.0.jar
Progress (2): 239 kB | 4.1/13 kB
Progress (2): 239 kB | 7.8/13 kB
Progress (2): 239 kB | 12/13 kB 
Progress (2): 239 kB | 13 kB   
                            
Downloaded from RSO-public-group: http://repository.sonatype.org/content/groups/sonatype-public-grid/org/codehaus/plexus/plexus-utils/3.0.15/plexus-utils-3.0.15.jar (239 kB at 270 kB/s)
Downloading from RSO-public-group: http://repository.sonatype.org/content/groups/sonatype-public-grid/org/apache/httpcomponents/httpclient/4.5.1/httpclient-4.5.1.jar
Progress (2): 13 kB | 4.1/45 kB
Progress (2): 13 kB | 7.8/45 kB
Progress (2): 13 kB | 12/45 kB 
Progress (2): 13 kB | 16/45 kB
Progress (2): 13 kB | 20/45 kB
Progress (2): 13 kB | 24/45 kB
Progress (2): 13 kB | 28/45 kB
Progress (2): 13 kB | 32/45 kB
Progress (2): 13 kB | 37/45 kB
Progress (2): 13 kB | 41/45 kB
Progress (2): 13 kB | 45/45 kB
Progress (2): 13 kB | 45 kB   
Progress (3): 13 kB | 45 kB | 4.1/409 kB
Progress (3): 13 kB | 45 kB | 7.8/409 kB
Progress (3): 13 kB | 45 kB | 12/409 kB 
Progress (3): 13 kB | 45 kB | 16/409 kB
Progress (3): 13 kB | 45 kB | 20/409 kB
Progress (3): 13 kB | 45 kB | 24/409 kB
Progress (3): 13 kB | 45 kB | 28/409 kB
Progress (3): 13 kB | 45 kB | 32/409 kB
Progress (3): 13 kB | 45 kB | 37/409 kB
Progress (3): 13 kB | 45 kB | 41/409 kB
Progress (3): 13 kB | 45 kB | 45/409 kB
Progress (3): 13 kB | 45 kB | 49/409 kB
Progress (3): 13 kB | 45 kB | 53/409 kB
Progress (3): 13 kB | 45 kB | 57/409 kB
Progress (3): 13 kB | 45 kB | 61/409 kB
Progress (3): 13 kB | 45 kB | 65/409 kB
Progress (3): 13 kB | 45 kB | 69/409 kB
Progress (4): 13 kB | 45 kB | 69/409 kB | 0/2.3 MB
Progress (4): 13 kB | 45 kB | 69/409 kB | 0/2.3 MB
Progress (4): 13 kB | 45 kB | 69/409 kB | 0/2.3 MB
Progress (4): 13 kB | 45 kB | 69/409 kB | 0.1/2.3 MB
Progress (4): 13 kB | 45 kB | 69/409 kB | 0.1/2.3 MB
                                                    
Downloaded from RSO-public-group: http://repository.sonatype.org/content/groups/sonatype-public-grid/org/sonatype/plexus/plexus-cipher/1.4/plexus-cipher-1.4.jar (13 kB at 15 kB/s)
Downloading from RSO-public-group: http://repository.sonatype.org/content/groups/sonatype-public-grid/org/apache/httpcomponents/httpcore/4.4.3/httpcore-4.4.3.jar
Progress (3): 45 kB | 73/409 kB | 0.1/2.3 MB
Progress (3): 45 kB | 77/409 kB | 0.1/2.3 MB
Progress (3): 45 kB | 82/409 kB | 0.1/2.3 MB
Progress (3): 45 kB | 86/409 kB | 0.1/2.3 MB
Progress (3): 45 kB | 90/409 kB | 0.1/2.3 MB
Progress (3): 45 kB | 94/409 kB | 0.1/2.3 MB
Progress (3): 45 kB | 98/409 kB | 0.1/2.3 MB
Progress (3): 45 kB | 102/409 kB | 0.1/2.3 MB
Progress (3): 45 kB | 106/409 kB | 0.1/2.3 MB
Progress (3): 45 kB | 110/409 kB | 0.1/2.3 MB
Progress (3): 45 kB | 114/409 kB | 0.1/2.3 MB
Progress (3): 45 kB | 118/409 kB | 0.1/2.3 MB
Progress (3): 45 kB | 123/409 kB | 0.1/2.3 MB
Progress (3): 45 kB | 127/409 kB | 0.1/2.3 MB
Progress (3): 45 kB | 131/409 kB | 0.1/2.3 MB
Progress (3): 45 kB | 135/409 kB | 0.1/2.3 MB
Progress (3): 45 kB | 139/409 kB | 0.1/2.3 MB
Progress (3): 45 kB | 143/409 kB | 0.1/2.3 MB
Progress (3): 45 kB | 147/409 kB | 0.1/2.3 MB
Progress (3): 45 kB | 151/409 kB | 0.1/2.3 MB
Progress (3): 45 kB | 151/409 kB | 0.1/2.3 MB
Progress (3): 45 kB | 151/409 kB | 0.1/2.3 MB
Progress (3): 45 kB | 151/409 kB | 0.1/2.3 MB
Progress (3): 45 kB | 151/409 kB | 0.1/2.3 MB
Progress (3): 45 kB | 151/409 kB | 0.2/2.3 MB
Progress (3): 45 kB | 151/409 kB | 0.2/2.3 MB
Progress (3): 45 kB | 151/409 kB | 0.2/2.3 MB
Progress (4): 45 kB | 151/409 kB | 0.2/2.3 MB | 4.1/733 kB
Progress (4): 45 kB | 151/409 kB | 0.2/2.3 MB | 7.8/733 kB
Progress (4): 45 kB | 151/409 kB | 0.2/2.3 MB | 12/733 kB 
Progress (4): 45 kB | 151/409 kB | 0.2/2.3 MB | 16/733 kB
Progress (4): 45 kB | 151/409 kB | 0.2/2.3 MB | 20/733 kB
Progress (4): 45 kB | 151/409 kB | 0.2/2.3 MB | 24/733 kB
Progress (4): 45 kB | 151/409 kB | 0.2/2.3 MB | 28/733 kB
Progress (4): 45 kB | 151/409 kB | 0.2/2.3 MB | 32/733 kB
Progress (4): 45 kB | 151/409 kB | 0.2/2.3 MB | 37/733 kB
Progress (4): 45 kB | 151/409 kB | 0.2/2.3 MB | 41/733 kB
Progress (4): 45 kB | 151/409 kB | 0.2/2.3 MB | 45/733 kB
Progress (4): 45 kB | 151/409 kB | 0.2/2.3 MB | 49/733 kB
Progress (4): 45 kB | 151/409 kB | 0.2/2.3 MB | 53/733 kB
Progress (4): 45 kB | 151/409 kB | 0.2/2.3 MB | 57/733 kB
                                                         
Downloaded from RSO-public-group: http://repository.sonatype.org/content/groups/sonatype-public-grid/org/apache/maven/maven-plugin-api/3.1.1/maven-plugin-api-3.1.1.jar (45 kB at 46 kB/s)
Downloading from RSO-public-group: http://repository.sonatype.org/content/groups/sonatype-public-grid/commons-logging/commons-logging/1.2/commons-logging-1.2.jar
Progress (3): 155/409 kB | 0.2/2.3 MB | 57/733 kB
Progress (3): 159/409 kB | 0.2/2.3 MB | 57/733 kB
Progress (3): 163/409 kB | 0.2/2.3 MB | 57/733 kB
Progress (3): 168/409 kB | 0.2/2.3 MB | 57/733 kB
Progress (3): 172/409 kB | 0.2/2.3 MB | 57/733 kB
Progress (3): 176/409 kB | 0.2/2.3 MB | 57/733 kB
Progress (3): 180/409 kB | 0.2/2.3 MB | 57/733 kB
Progress (3): 184/409 kB | 0.2/2.3 MB | 57/733 kB
Progress (3): 188/409 kB | 0.2/2.3 MB | 57/733 kB
Progress (3): 192/409 kB | 0.2/2.3 MB | 57/733 kB
Progress (3): 196/409 kB | 0.2/2.3 MB | 57/733 kB
Progress (3): 200/409 kB | 0.2/2.3 MB | 57/733 kB
Progress (3): 204/409 kB | 0.2/2.3 MB | 57/733 kB
Progress (3): 209/409 kB | 0.2/2.3 MB | 57/733 kB
Progress (3): 213/409 kB | 0.2/2.3 MB | 57/733 kB
Progress (3): 217/409 kB | 0.2/2.3 MB | 57/733 kB
Progress (3): 221/409 kB | 0.2/2.3 MB | 57/733 kB
Progress (3): 225/409 kB | 0.2/2.3 MB | 57/733 kB
Progress (3): 229/409 kB | 0.2/2.3 MB | 57/733 kB
Progress (3): 229/409 kB | 0.2/2.3 MB | 57/733 kB
Progress (3): 229/409 kB | 0.2/2.3 MB | 57/733 kB
Progress (3): 229/409 kB | 0.2/2.3 MB | 57/733 kB
Progress (3): 229/409 kB | 0.3/2.3 MB | 57/733 kB
Progress (3): 229/409 kB | 0.3/2.3 MB | 57/733 kB
Progress (3): 229/409 kB | 0.3/2.3 MB | 57/733 kB
Progress (3): 229/409 kB | 0.3/2.3 MB | 61/733 kB
Progress (3): 229/409 kB | 0.3/2.3 MB | 65/733 kB
Progress (3): 229/409 kB | 0.3/2.3 MB | 69/733 kB
Progress (3): 229/409 kB | 0.3/2.3 MB | 73/733 kB
Progress (3): 229/409 kB | 0.3/2.3 MB | 77/733 kB
Progress (3): 229/409 kB | 0.3/2.3 MB | 82/733 kB
Progress (3): 229/409 kB | 0.3/2.3 MB | 86/733 kB
Progress (3): 229/409 kB | 0.3/2.3 MB | 90/733 kB
Progress (3): 229/409 kB | 0.3/2.3 MB | 94/733 kB
Progress (3): 229/409 kB | 0.3/2.3 MB | 98/733 kB
Progress (3): 229/409 kB | 0.3/2.3 MB | 102/733 kB
Progress (3): 229/409 kB | 0.3/2.3 MB | 106/733 kB
Progress (3): 229/409 kB | 0.3/2.3 MB | 110/733 kB
Progress (3): 229/409 kB | 0.3/2.3 MB | 114/733 kB
Progress (3): 229/409 kB | 0.3/2.3 MB | 118/733 kB
Progress (3): 229/409 kB | 0.3/2.3 MB | 123/733 kB
Progress (4): 229/409 kB | 0.3/2.3 MB | 123/733 kB | 4.1/327 kB
Progress (4): 229/409 kB | 0.3/2.3 MB | 123/733 kB | 7.8/327 kB
Progress (4): 229/409 kB | 0.3/2.3 MB | 123/733 kB | 12/327 kB 
Progress (4): 229/409 kB | 0.3/2.3 MB | 123/733 kB | 16/327 kB
Progress (4): 229/409 kB | 0.3/2.3 MB | 123/733 kB | 20/327 kB
Progress (4): 229/409 kB | 0.3/2.3 MB | 123/733 kB | 24/327 kB
Progress (4): 229/409 kB | 0.3/2.3 MB | 123/733 kB | 28/327 kB
Progress (4): 229/409 kB | 0.3/2.3 MB | 123/733 kB | 32/327 kB
Progress (4): 229/409 kB | 0.3/2.3 MB | 123/733 kB | 37/327 kB
Progress (4): 229/409 kB | 0.3/2.3 MB | 123/733 kB | 41/327 kB
Progress (4): 229/409 kB | 0.3/2.3 MB | 123/733 kB | 45/327 kB
Progress (4): 229/409 kB | 0.3/2.3 MB | 123/733 kB | 49/327 kB
Progress (4): 229/409 kB | 0.3/2.3 MB | 123/733 kB | 53/327 kB
Progress (4): 229/409 kB | 0.3/2.3 MB | 123/733 kB | 57/327 kB
Progress (4): 229/409 kB | 0.3/2.3 MB | 123/733 kB | 61/327 kB
Progress (4): 229/409 kB | 0.3/2.3 MB | 123/733 kB | 65/327 kB
Progress (4): 233/409 kB | 0.3/2.3 MB | 123/733 kB | 65/327 kB
Progress (4): 233/409 kB | 0.3/2.3 MB | 123/733 kB | 69/327 kB
Progress (4): 237/409 kB | 0.3/2.3 MB | 123/733 kB | 69/327 kB
Progress (4): 237/409 kB | 0.3/2.3 MB | 123/733 kB | 72/327 kB
Progress (4): 241/409 kB | 0.3/2.3 MB | 123/733 kB | 72/327 kB
Progress (4): 245/409 kB | 0.3/2.3 MB | 123/733 kB | 72/327 kB
Progress (4): 250/409 kB | 0.3/2.3 MB | 123/733 kB | 72/327 kB
Progress (4): 254/409 kB | 0.3/2.3 MB | 123/733 kB | 72/327 kB
Progress (4): 258/409 kB | 0.3/2.3 MB | 123/733 kB | 72/327 kB
Progress (4): 262/409 kB | 0.3/2.3 MB | 123/733 kB | 72/327 kB
Progress (4): 266/409 kB | 0.3/2.3 MB | 123/733 kB | 72/327 kB
Progress (4): 270/409 kB | 0.3/2.3 MB | 123/733 kB | 72/327 kB
Progress (4): 274/409 kB | 0.3/2.3 MB | 123/733 kB | 72/327 kB
Progress (4): 278/409 kB | 0.3/2.3 MB | 123/733 kB | 72/327 kB
Progress (4): 282/409 kB | 0.3/2.3 MB | 123/733 kB | 72/327 kB
Progress (4): 286/409 kB | 0.3/2.3 MB | 123/733 kB | 72/327 kB
Progress (4): 290/409 kB | 0.3/2.3 MB | 123/733 kB | 72/327 kB
Progress (4): 295/409 kB | 0.3/2.3 MB | 123/733 kB | 72/327 kB
Progress (4): 299/409 kB | 0.3/2.3 MB | 123/733 kB | 72/327 kB
Progress (4): 303/409 kB | 0.3/2.3 MB | 123/733 kB | 72/327 kB
Progress (4): 307/409 kB | 0.3/2.3 MB | 123/733 kB | 72/327 kB
Progress (4): 307/409 kB | 0.3/2.3 MB | 123/733 kB | 72/327 kB
Progress (4): 307/409 kB | 0.3/2.3 MB | 123/733 kB | 72/327 kB
Progress (4): 307/409 kB | 0.3/2.3 MB | 123/733 kB | 72/327 kB
Progress (4): 307/409 kB | 0.4/2.3 MB | 123/733 kB | 72/327 kB
Progress (4): 307/409 kB | 0.4/2.3 MB | 123/733 kB | 72/327 kB
Progress (4): 307/409 kB | 0.4/2.3 MB | 123/733 kB | 72/327 kB
Progress (4): 307/409 kB | 0.4/2.3 MB | 127/733 kB | 72/327 kB
Progress (4): 307/409 kB | 0.4/2.3 MB | 131/733 kB | 72/327 kB
Progress (4): 307/409 kB | 0.4/2.3 MB | 135/733 kB | 72/327 kB
Progress (4): 307/409 kB | 0.4/2.3 MB | 139/733 kB | 72/327 kB
Progress (4): 307/409 kB | 0.4/2.3 MB | 143/733 kB | 72/327 kB
Progress (4): 307/409 kB | 0.4/2.3 MB | 147/733 kB | 72/327 kB
Progress (4): 307/409 kB | 0.4/2.3 MB | 151/733 kB | 72/327 kB
Progress (4): 307/409 kB | 0.4/2.3 MB | 155/733 kB | 72/327 kB
Progress (4): 307/409 kB | 0.4/2.3 MB | 159/733 kB | 72/327 kB
Progress (4): 307/409 kB | 0.4/2.3 MB | 163/733 kB | 72/327 kB
Progress (4): 307/409 kB | 0.4/2.3 MB | 168/733 kB | 72/327 kB
Progress (4): 307/409 kB | 0.4/2.3 MB | 172/733 kB | 72/327 kB
Progress (4): 307/409 kB | 0.4/2.3 MB | 176/733 kB | 72/327 kB
Progress (4): 307/409 kB | 0.4/2.3 MB | 180/733 kB | 72/327 kB
Progress (4): 307/409 kB | 0.4/2.3 MB | 184/733 kB | 72/327 kB
Progress (4): 307/409 kB | 0.4/2.3 MB | 188/733 kB | 72/327 kB
Progress (4): 307/409 kB | 0.4/2.3 MB | 188/733 kB | 76/327 kB
Progress (4): 307/409 kB | 0.4/2.3 MB | 188/733 kB | 80/327 kB
Progress (4): 307/409 kB | 0.4/2.3 MB | 188/733 kB | 84/327 kB
Progress (4): 307/409 kB | 0.4/2.3 MB | 188/733 kB | 88/327 kB
Progress (4): 307/409 kB | 0.4/2.3 MB | 188/733 kB | 92/327 kB
Progress (4): 307/409 kB | 0.4/2.3 MB | 188/733 kB | 96/327 kB
Progress (4): 307/409 kB | 0.4/2.3 MB | 188/733 kB | 101/327 kB
Progress (4): 307/409 kB | 0.4/2.3 MB | 188/733 kB | 105/327 kB
Progress (4): 307/409 kB | 0.4/2.3 MB | 188/733 kB | 109/327 kB
Progress (4): 307/409 kB | 0.4/2.3 MB | 188/733 kB | 113/327 kB
Progress (4): 307/409 kB | 0.4/2.3 MB | 188/733 kB | 117/327 kB
Progress (4): 307/409 kB | 0.4/2.3 MB | 188/733 kB | 121/327 kB
Progress (4): 307/409 kB | 0.4/2.3 MB | 188/733 kB | 125/327 kB
Progress (4): 307/409 kB | 0.4/2.3 MB | 188/733 kB | 129/327 kB
Progress (4): 307/409 kB | 0.4/2.3 MB | 188/733 kB | 133/327 kB
Progress (4): 307/409 kB | 0.4/2.3 MB | 188/733 kB | 137/327 kB
Progress (4): 307/409 kB | 0.4/2.3 MB | 188/733 kB | 142/327 kB
Progress (4): 307/409 kB | 0.4/2.3 MB | 188/733 kB | 146/327 kB
Progress (4): 307/409 kB | 0.4/2.3 MB | 188/733 kB | 150/327 kB
Progress (5): 307/409 kB | 0.4/2.3 MB | 188/733 kB | 150/327 kB | 4.1/62 kB
Progress (5): 307/409 kB | 0.4/2.3 MB | 188/733 kB | 150/327 kB | 7.8/62 kB
Progress (5): 311/409 kB | 0.4/2.3 MB | 188/733 kB | 150/327 kB | 7.8/62 kB
Progress (5): 315/409 kB | 0.4/2.3 MB | 188/733 kB | 150/327 kB | 7.8/62 kB
Progress (5): 315/409 kB | 0.4/2.3 MB | 188/733 kB | 150/327 kB | 12/62 kB 
Progress (5): 319/409 kB | 0.4/2.3 MB | 188/733 kB | 150/327 kB | 12/62 kB
Progress (5): 319/409 kB | 0.4/2.3 MB | 188/733 kB | 150/327 kB | 16/62 kB
Progress (5): 323/409 kB | 0.4/2.3 MB | 188/733 kB | 150/327 kB | 16/62 kB
Progress (5): 323/409 kB | 0.4/2.3 MB | 188/733 kB | 150/327 kB | 20/62 kB
Progress (5): 323/409 kB | 0.4/2.3 MB | 188/733 kB | 150/327 kB | 24/62 kB
Progress (5): 327/409 kB | 0.4/2.3 MB | 188/733 kB | 150/327 kB | 24/62 kB
Progress (5): 327/409 kB | 0.4/2.3 MB | 188/733 kB | 150/327 kB | 28/62 kB
Progress (5): 331/409 kB | 0.4/2.3 MB | 188/733 kB | 150/327 kB | 28/62 kB
Progress (5): 331/409 kB | 0.4/2.3 MB | 188/733 kB | 150/327 kB | 32/62 kB
Progress (5): 336/409 kB | 0.4/2.3 MB | 188/733 kB | 150/327 kB | 32/62 kB
Progress (5): 336/409 kB | 0.4/2.3 MB | 188/733 kB | 150/327 kB | 37/62 kB
Progress (5): 340/409 kB | 0.4/2.3 MB | 188/733 kB | 150/327 kB | 37/62 kB
Progress (5): 340/409 kB | 0.4/2.3 MB | 188/733 kB | 150/327 kB | 41/62 kB
Progress (5): 344/409 kB | 0.4/2.3 MB | 188/733 kB | 150/327 kB | 41/62 kB
Progress (5): 344/409 kB | 0.4/2.3 MB | 188/733 kB | 150/327 kB | 45/62 kB
Progress (5): 348/409 kB | 0.4/2.3 MB | 188/733 kB | 150/327 kB | 45/62 kB
Progress (5): 348/409 kB | 0.4/2.3 MB | 188/733 kB | 150/327 kB | 49/62 kB
Progress (5): 352/409 kB | 0.4/2.3 MB | 188/733 kB | 150/327 kB | 49/62 kB
Progress (5): 352/409 kB | 0.4/2.3 MB | 188/733 kB | 150/327 kB | 53/62 kB
Progress (5): 356/409 kB | 0.4/2.3 MB | 188/733 kB | 150/327 kB | 53/62 kB
Progress (5): 356/409 kB | 0.4/2.3 MB | 188/733 kB | 150/327 kB | 57/62 kB
Progress (5): 356/409 kB | 0.4/2.3 MB | 188/733 kB | 150/327 kB | 61/62 kB
Progress (5): 356/409 kB | 0.4/2.3 MB | 188/733 kB | 150/327 kB | 62 kB   
Progress (5): 360/409 kB | 0.4/2.3 MB | 188/733 kB | 150/327 kB | 62 kB
Progress (5): 364/409 kB | 0.4/2.3 MB | 188/733 kB | 150/327 kB | 62 kB
Progress (5): 368/409 kB | 0.4/2.3 MB | 188/733 kB | 150/327 kB | 62 kB
Progress (5): 372/409 kB | 0.4/2.3 MB | 188/733 kB | 150/327 kB | 62 kB
Progress (5): 372/409 kB | 0.4/2.3 MB | 188/733 kB | 150/327 kB | 62 kB
Progress (5): 372/409 kB | 0.4/2.3 MB | 188/733 kB | 150/327 kB | 62 kB
Progress (5): 372/409 kB | 0.4/2.3 MB | 188/733 kB | 150/327 kB | 62 kB
Progress (5): 372/409 kB | 0.5/2.3 MB | 188/733 kB | 150/327 kB | 62 kB
Progress (5): 372/409 kB | 0.5/2.3 MB | 188/733 kB | 150/327 kB | 62 kB
Progress (5): 372/409 kB | 0.5/2.3 MB | 188/733 kB | 150/327 kB | 62 kB
Progress (5): 372/409 kB | 0.5/2.3 MB | 192/733 kB | 150/327 kB | 62 kB
Progress (5): 372/409 kB | 0.5/2.3 MB | 196/733 kB | 150/327 kB | 62 kB
Progress (5): 372/409 kB | 0.5/2.3 MB | 200/733 kB | 150/327 kB | 62 kB
Progress (5): 372/409 kB | 0.5/2.3 MB | 204/733 kB | 150/327 kB | 62 kB
Progress (5): 372/409 kB | 0.5/2.3 MB | 207/733 kB | 150/327 kB | 62 kB
Progress (5): 372/409 kB | 0.5/2.3 MB | 211/733 kB | 150/327 kB | 62 kB
Progress (5): 372/409 kB | 0.5/2.3 MB | 215/733 kB | 150/327 kB | 62 kB
Progress (5): 372/409 kB | 0.5/2.3 MB | 219/733 kB | 150/327 kB | 62 kB
Progress (5): 372/409 kB | 0.5/2.3 MB | 223/733 kB | 150/327 kB | 62 kB
Progress (5): 372/409 kB | 0.5/2.3 MB | 227/733 kB | 150/327 kB | 62 kB
Progress (5): 372/409 kB | 0.5/2.3 MB | 229/733 kB | 150/327 kB | 62 kB
Progress (5): 372/409 kB | 0.5/2.3 MB | 233/733 kB | 150/327 kB | 62 kB
Progress (5): 372/409 kB | 0.5/2.3 MB | 238/733 kB | 150/327 kB | 62 kB
Progress (5): 372/409 kB | 0.5/2.3 MB | 242/733 kB | 150/327 kB | 62 kB
Progress (5): 372/409 kB | 0.5/2.3 MB | 246/733 kB | 150/327 kB | 62 kB
Progress (5): 372/409 kB | 0.5/2.3 MB | 250/733 kB | 150/327 kB | 62 kB
Progress (5): 372/409 kB | 0.5/2.3 MB | 254/733 kB | 150/327 kB | 62 kB
Progress (5): 372/409 kB | 0.5/2.3 MB | 258/733 kB | 150/327 kB | 62 kB
Progress (5): 372/409 kB | 0.5/2.3 MB | 262/733 kB | 150/327 kB | 62 kB
Progress (5): 372/409 kB | 0.5/2.3 MB | 266/733 kB | 150/327 kB | 62 kB
Progress (5): 372/409 kB | 0.5/2.3 MB | 266/733 kB | 154/327 kB | 62 kB
Progress (5): 372/409 kB | 0.5/2.3 MB | 266/733 kB | 158/327 kB | 62 kB
Progress (5): 372/409 kB | 0.5/2.3 MB | 266/733 kB | 162/327 kB | 62 kB
Progress (5): 372/409 kB | 0.5/2.3 MB | 266/733 kB | 166/327 kB | 62 kB
Progress (5): 372/409 kB | 0.5/2.3 MB | 266/733 kB | 170/327 kB | 62 kB
Progress (5): 372/409 kB | 0.5/2.3 MB | 266/733 kB | 174/327 kB | 62 kB
Progress (5): 372/409 kB | 0.5/2.3 MB | 266/733 kB | 178/327 kB | 62 kB
Progress (5): 372/409 kB | 0.5/2.3 MB | 266/733 kB | 182/327 kB | 62 kB
Progress (5): 372/409 kB | 0.5/2.3 MB | 266/733 kB | 187/327 kB | 62 kB
Progress (5): 376/409 kB | 0.5/2.3 MB | 266/733 kB | 187/327 kB | 62 kB
Progress (5): 376/409 kB | 0.5/2.3 MB | 266/733 kB | 191/327 kB | 62 kB
Progress (5): 381/409 kB | 0.5/2.3 MB | 266/733 kB | 191/327 kB | 62 kB
Progress (5): 381/409 kB | 0.5/2.3 MB | 266/733 kB | 195/327 kB | 62 kB
Progress (5): 385/409 kB | 0.5/2.3 MB | 266/733 kB | 195/327 kB | 62 kB
Progress (5): 389/409 kB | 0.5/2.3 MB | 266/733 kB | 195/327 kB | 62 kB
Progress (5): 389/409 kB | 0.5/2.3 MB | 266/733 kB | 199/327 kB | 62 kB
Progress (5): 389/409 kB | 0.5/2.3 MB | 266/733 kB | 203/327 kB | 62 kB
Progress (5): 389/409 kB | 0.5/2.3 MB | 266/733 kB | 207/327 kB | 62 kB
Progress (5): 389/409 kB | 0.5/2.3 MB | 266/733 kB | 211/327 kB | 62 kB
Progress (5): 389/409 kB | 0.5/2.3 MB | 266/733 kB | 215/327 kB | 62 kB
Progress (5): 389/409 kB | 0.5/2.3 MB | 266/733 kB | 219/327 kB | 62 kB
Progress (5): 389/409 kB | 0.5/2.3 MB | 266/733 kB | 222/327 kB | 62 kB
Progress (5): 389/409 kB | 0.5/2.3 MB | 266/733 kB | 226/327 kB | 62 kB
Progress (5): 389/409 kB | 0.5/2.3 MB | 266/733 kB | 229/327 kB | 62 kB
Progress (5): 389/409 kB | 0.5/2.3 MB | 266/733 kB | 233/327 kB | 62 kB
Progress (5): 389/409 kB | 0.5/2.3 MB | 266/733 kB | 238/327 kB | 62 kB
Progress (5): 393/409 kB | 0.5/2.3 MB | 266/733 kB | 238/327 kB | 62 kB
Progress (5): 397/409 kB | 0.5/2.3 MB | 266/733 kB | 238/327 kB | 62 kB
Progress (5): 401/409 kB | 0.5/2.3 MB | 266/733 kB | 238/327 kB | 62 kB
Progress (5): 405/409 kB | 0.5/2.3 MB | 266/733 kB | 238/327 kB | 62 kB
Progress (5): 409/409 kB | 0.5/2.3 MB | 266/733 kB | 238/327 kB | 62 kB
Progress (5): 409 kB | 0.5/2.3 MB | 266/733 kB | 238/327 kB | 62 kB    
Progress (5): 409 kB | 0.5/2.3 MB | 266/733 kB | 238/327 kB | 62 kB
Progress (5): 409 kB | 0.5/2.3 MB | 266/733 kB | 238/327 kB | 62 kB
Progress (5): 409 kB | 0.5/2.3 MB | 266/733 kB | 238/327 kB | 62 kB
Progress (5): 409 kB | 0.5/2.3 MB | 266/733 kB | 238/327 kB | 62 kB
Progress (5): 409 kB | 0.6/2.3 MB | 266/733 kB | 238/327 kB | 62 kB
Progress (5): 409 kB | 0.6/2.3 MB | 266/733 kB | 238/327 kB | 62 kB
Progress (5): 409 kB | 0.6/2.3 MB | 266/733 kB | 238/327 kB | 62 kB
Progress (5): 409 kB | 0.6/2.3 MB | 270/733 kB | 238/327 kB | 62 kB
Progress (5): 409 kB | 0.6/2.3 MB | 274/733 kB | 238/327 kB | 62 kB
Progress (5): 409 kB | 0.6/2.3 MB | 279/733 kB | 238/327 kB | 62 kB
Progress (5): 409 kB | 0.6/2.3 MB | 283/733 kB | 238/327 kB | 62 kB
Progress (5): 409 kB | 0.6/2.3 MB | 287/733 kB | 238/327 kB | 62 kB
Progress (5): 409 kB | 0.6/2.3 MB | 291/733 kB | 238/327 kB | 62 kB
Progress (5): 409 kB | 0.6/2.3 MB | 295/733 kB | 238/327 kB | 62 kB
Progress (5): 409 kB | 0.6/2.3 MB | 299/733 kB | 238/327 kB | 62 kB
Progress (5): 409 kB | 0.6/2.3 MB | 303/733 kB | 238/327 kB | 62 kB
Progress (5): 409 kB | 0.6/2.3 MB | 307/733 kB | 238/327 kB | 62 kB
Progress (5): 409 kB | 0.6/2.3 MB | 311/733 kB | 238/327 kB | 62 kB
Progress (5): 409 kB | 0.6/2.3 MB | 315/733 kB | 238/327 kB | 62 kB
Progress (5): 409 kB | 0.6/2.3 MB | 319/733 kB | 238/327 kB | 62 kB
Progress (5): 409 kB | 0.6/2.3 MB | 324/733 kB | 238/327 kB | 62 kB
Progress (5): 409 kB | 0.6/2.3 MB | 327/733 kB | 238/327 kB | 62 kB
Progress (5): 409 kB | 0.6/2.3 MB | 327/733 kB | 242/327 kB | 62 kB
Progress (5): 409 kB | 0.6/2.3 MB | 327/733 kB | 246/327 kB | 62 kB
Progress (5): 409 kB | 0.6/2.3 MB | 327/733 kB | 250/327 kB | 62 kB
Progress (5): 409 kB | 0.6/2.3 MB | 327/733 kB | 254/327 kB | 62 kB
Progress (5): 409 kB | 0.6/2.3 MB | 327/733 kB | 258/327 kB | 62 kB
Progress (5): 409 kB | 0.6/2.3 MB | 327/733 kB | 262/327 kB | 62 kB
Progress (5): 409 kB | 0.6/2.3 MB | 327/733 kB | 266/327 kB | 62 kB
Progress (5): 409 kB | 0.6/2.3 MB | 327/733 kB | 270/327 kB | 62 kB
Progress (5): 409 kB | 0.6/2.3 MB | 327/733 kB | 274/327 kB | 62 kB
Progress (5): 409 kB | 0.6/2.3 MB | 327/733 kB | 279/327 kB | 62 kB
Progress (5): 409 kB | 0.6/2.3 MB | 327/733 kB | 283/327 kB | 62 kB
Progress (5): 409 kB | 0.6/2.3 MB | 327/733 kB | 287/327 kB | 62 kB
Progress (5): 409 kB | 0.6/2.3 MB | 327/733 kB | 291/327 kB | 62 kB
Progress (5): 409 kB | 0.6/2.3 MB | 327/733 kB | 295/327 kB | 62 kB
Progress (5): 409 kB | 0.6/2.3 MB | 327/733 kB | 299/327 kB | 62 kB
Progress (5): 409 kB | 0.6/2.3 MB | 327/733 kB | 303/327 kB | 62 kB
Progress (5): 409 kB | 0.6/2.3 MB | 327/733 kB | 307/327 kB | 62 kB
Progress (5): 409 kB | 0.6/2.3 MB | 327/733 kB | 311/327 kB | 62 kB
Progress (5): 409 kB | 0.6/2.3 MB | 327/733 kB | 315/327 kB | 62 kB
Progress (5): 409 kB | 0.6/2.3 MB | 327/733 kB | 319/327 kB | 62 kB
Progress (5): 409 kB | 0.6/2.3 MB | 327/733 kB | 324/327 kB | 62 kB
Progress (5): 409 kB | 0.6/2.3 MB | 327/733 kB | 327 kB | 62 kB    
Progress (5): 409 kB | 0.6/2.3 MB | 327/733 kB | 327 kB | 62 kB
Progress (5): 409 kB | 0.6/2.3 MB | 327/733 kB | 327 kB | 62 kB
                                                               
Downloaded from RSO-public-group: http://repository.sonatype.org/content/groups/sonatype-public-grid/commons-logging/commons-logging/1.2/commons-logging-1.2.jar (62 kB at 55 kB/s)
Progress (4): 409 kB | 0.6/2.3 MB | 327/733 kB | 327 kB
                                                       
Downloading from RSO-public-group: http://repository.sonatype.org/content/groups/sonatype-public-grid/commons-codec/commons-codec/1.9/commons-codec-1.9.jar
Progress (4): 409 kB | 0.6/2.3 MB | 327/733 kB | 327 kB
Progress (4): 409 kB | 0.7/2.3 MB | 327/733 kB | 327 kB
Progress (4): 409 kB | 0.7/2.3 MB | 327/733 kB | 327 kB
Progress (4): 409 kB | 0.7/2.3 MB | 327/733 kB | 327 kB
Progress (4): 409 kB | 0.7/2.3 MB | 331/733 kB | 327 kB
Progress (4): 409 kB | 0.7/2.3 MB | 335/733 kB | 327 kB
Progress (4): 409 kB | 0.7/2.3 MB | 339/733 kB | 327 kB
Progress (4): 409 kB | 0.7/2.3 MB | 343/733 kB | 327 kB
Progress (4): 409 kB | 0.7/2.3 MB | 348/733 kB | 327 kB
Progress (4): 409 kB | 0.7/2.3 MB | 352/733 kB | 327 kB
Progress (4): 409 kB | 0.7/2.3 MB | 356/733 kB | 327 kB
Progress (4): 409 kB | 0.7/2.3 MB | 360/733 kB | 327 kB
Progress (4): 409 kB | 0.7/2.3 MB | 364/733 kB | 327 kB
Progress (4): 409 kB | 0.7/2.3 MB | 368/733 kB | 327 kB
Progress (4): 409 kB | 0.7/2.3 MB | 372/733 kB | 327 kB
Progress (4): 409 kB | 0.7/2.3 MB | 376/733 kB | 327 kB
Progress (4): 409 kB | 0.7/2.3 MB | 380/733 kB | 327 kB
Progress (4): 409 kB | 0.7/2.3 MB | 384/733 kB | 327 kB
Progress (4): 409 kB | 0.7/2.3 MB | 389/733 kB | 327 kB
Progress (4): 409 kB | 0.7/2.3 MB | 393/733 kB | 327 kB
                                                       
Downloaded from RSO-public-group: http://repository.sonatype.org/content/groups/sonatype-public-grid/org/apache/commons/commons-compress/1.10/commons-compress-1.10.jar (409 kB at 355 kB/s)
Progress (3): 0.7/2.3 MB | 393/733 kB | 327 kB
                                              
Downloading from RSO-public-group: http://repository.sonatype.org/content/groups/sonatype-public-grid/org/apache/httpcomponents/httpmime/4.5.1/httpmime-4.5.1.jar
Progress (3): 0.7/2.3 MB | 393/733 kB | 327 kB
Progress (3): 0.7/2.3 MB | 393/733 kB | 327 kB
Progress (3): 0.8/2.3 MB | 393/733 kB | 327 kB
Progress (3): 0.8/2.3 MB | 393/733 kB | 327 kB
Progress (3): 0.8/2.3 MB | 393/733 kB | 327 kB
Progress (3): 0.8/2.3 MB | 393/733 kB | 327 kB
Progress (3): 0.8/2.3 MB | 397/733 kB | 327 kB
Progress (3): 0.8/2.3 MB | 401/733 kB | 327 kB
Progress (3): 0.8/2.3 MB | 405/733 kB | 327 kB
Progress (3): 0.8/2.3 MB | 409/733 kB | 327 kB
Progress (3): 0.8/2.3 MB | 413/733 kB | 327 kB
Progress (3): 0.8/2.3 MB | 417/733 kB | 327 kB
Progress (3): 0.8/2.3 MB | 421/733 kB | 327 kB
Progress (3): 0.8/2.3 MB | 425/733 kB | 327 kB
Progress (3): 0.8/2.3 MB | 430/733 kB | 327 kB
Progress (3): 0.8/2.3 MB | 434/733 kB | 327 kB
Progress (3): 0.8/2.3 MB | 438/733 kB | 327 kB
Progress (3): 0.8/2.3 MB | 442/733 kB | 327 kB
Progress (3): 0.8/2.3 MB | 446/733 kB | 327 kB
Progress (3): 0.8/2.3 MB | 450/733 kB | 327 kB
Progress (3): 0.8/2.3 MB | 454/733 kB | 327 kB
Progress (3): 0.8/2.3 MB | 458/733 kB | 327 kB
Progress (3): 0.8/2.3 MB | 462/733 kB | 327 kB
Progress (3): 0.8/2.3 MB | 466/733 kB | 327 kB
Progress (3): 0.8/2.3 MB | 470/733 kB | 327 kB
Progress (3): 0.8/2.3 MB | 475/733 kB | 327 kB
                                              
Downloaded from RSO-public-group: http://repository.sonatype.org/content/groups/sonatype-public-grid/org/apache/httpcomponents/httpcore/4.4.3/httpcore-4.4.3.jar (327 kB at 276 kB/s)
Downloading from RSO-public-group: http://repository.sonatype.org/content/groups/sonatype-public-grid/com/google/auto/value/auto-value/1.1/auto-value-1.1.jar
Progress (2): 0.8/2.3 MB | 475/733 kB
Progress (2): 0.8/2.3 MB | 475/733 kB
Progress (2): 0.8/2.3 MB | 475/733 kB
Progress (2): 0.9/2.3 MB | 475/733 kB
Progress (2): 0.9/2.3 MB | 475/733 kB
Progress (2): 0.9/2.3 MB | 475/733 kB
Progress (2): 0.9/2.3 MB | 475/733 kB
Progress (3): 0.9/2.3 MB | 475/733 kB | 4.1/264 kB
Progress (3): 0.9/2.3 MB | 475/733 kB | 7.8/264 kB
Progress (3): 0.9/2.3 MB | 475/733 kB | 12/264 kB 
Progress (3): 0.9/2.3 MB | 475/733 kB | 16/264 kB
Progress (3): 0.9/2.3 MB | 475/733 kB | 20/264 kB
Progress (3): 0.9/2.3 MB | 475/733 kB | 24/264 kB
Progress (3): 0.9/2.3 MB | 479/733 kB | 24/264 kB
Progress (3): 0.9/2.3 MB | 479/733 kB | 28/264 kB
Progress (3): 0.9/2.3 MB | 481/733 kB | 28/264 kB
Progress (3): 0.9/2.3 MB | 481/733 kB | 32/264 kB
Progress (3): 0.9/2.3 MB | 481/733 kB | 37/264 kB
Progress (3): 0.9/2.3 MB | 481/733 kB | 41/264 kB
Progress (3): 0.9/2.3 MB | 481/733 kB | 45/264 kB
Progress (3): 0.9/2.3 MB | 481/733 kB | 49/264 kB
Progress (3): 0.9/2.3 MB | 481/733 kB | 53/264 kB
Progress (3): 0.9/2.3 MB | 485/733 kB | 53/264 kB
Progress (3): 0.9/2.3 MB | 489/733 kB | 53/264 kB
Progress (3): 0.9/2.3 MB | 493/733 kB | 53/264 kB
Progress (3): 0.9/2.3 MB | 493/733 kB | 57/264 kB
Progress (3): 0.9/2.3 MB | 497/733 kB | 57/264 kB
Progress (3): 0.9/2.3 MB | 497/733 kB | 61/264 kB
Progress (3): 0.9/2.3 MB | 497/733 kB | 65/264 kB
Progress (3): 0.9/2.3 MB | 497/733 kB | 69/264 kB
Progress (3): 0.9/2.3 MB | 501/733 kB | 69/264 kB
Progress (3): 0.9/2.3 MB | 505/733 kB | 69/264 kB
Progress (3): 0.9/2.3 MB | 508/733 kB | 69/264 kB
Progress (3): 0.9/2.3 MB | 512/733 kB | 69/264 kB
Progress (3): 0.9/2.3 MB | 516/733 kB | 69/264 kB
Progress (3): 0.9/2.3 MB | 520/733 kB | 69/264 kB
Progress (3): 0.9/2.3 MB | 524/733 kB | 69/264 kB
Progress (3): 0.9/2.3 MB | 528/733 kB | 69/264 kB
Progress (3): 0.9/2.3 MB | 532/733 kB | 69/264 kB
Progress (3): 0.9/2.3 MB | 536/733 kB | 69/264 kB
Progress (3): 0.9/2.3 MB | 540/733 kB | 69/264 kB
Progress (3): 0.9/2.3 MB | 540/733 kB | 69/264 kB
Progress (3): 0.9/2.3 MB | 540/733 kB | 69/264 kB
Progress (3): 0.9/2.3 MB | 540/733 kB | 69/264 kB
Progress (3): 1.0/2.3 MB | 540/733 kB | 69/264 kB
Progress (3): 1.0/2.3 MB | 540/733 kB | 69/264 kB
Progress (3): 1.0/2.3 MB | 540/733 kB | 69/264 kB
Progress (3): 1.0/2.3 MB | 540/733 kB | 69/264 kB
Progress (4): 1.0/2.3 MB | 540/733 kB | 69/264 kB | 4.1/41 kB
Progress (4): 1.0/2.3 MB | 540/733 kB | 69/264 kB | 7.8/41 kB
Progress (4): 1.0/2.3 MB | 540/733 kB | 69/264 kB | 12/41 kB 
Progress (4): 1.0/2.3 MB | 540/733 kB | 69/264 kB | 16/41 kB
Progress (4): 1.0/2.3 MB | 540/733 kB | 69/264 kB | 20/41 kB
Progress (4): 1.0/2.3 MB | 540/733 kB | 69/264 kB | 24/41 kB
Progress (4): 1.0/2.3 MB | 540/733 kB | 69/264 kB | 28/41 kB
Progress (4): 1.0/2.3 MB | 540/733 kB | 69/264 kB | 32/41 kB
Progress (4): 1.0/2.3 MB | 540/733 kB | 69/264 kB | 37/41 kB
Progress (4): 1.0/2.3 MB | 540/733 kB | 69/264 kB | 41/41 kB
Progress (4): 1.0/2.3 MB | 540/733 kB | 69/264 kB | 41 kB   
Progress (4): 1.0/2.3 MB | 540/733 kB | 73/264 kB | 41 kB
Progress (4): 1.0/2.3 MB | 540/733 kB | 77/264 kB | 41 kB
Progress (4): 1.0/2.3 MB | 540/733 kB | 82/264 kB | 41 kB
Progress (4): 1.0/2.3 MB | 540/733 kB | 86/264 kB | 41 kB
Progress (4): 1.0/2.3 MB | 540/733 kB | 90/264 kB | 41 kB
Progress (4): 1.0/2.3 MB | 540/733 kB | 94/264 kB | 41 kB
Progress (4): 1.0/2.3 MB | 540/733 kB | 98/264 kB | 41 kB
Progress (4): 1.0/2.3 MB | 540/733 kB | 102/264 kB | 41 kB
Progress (4): 1.0/2.3 MB | 540/733 kB | 106/264 kB | 41 kB
Progress (4): 1.0/2.3 MB | 544/733 kB | 106/264 kB | 41 kB
Progress (4): 1.0/2.3 MB | 549/733 kB | 106/264 kB | 41 kB
Progress (4): 1.0/2.3 MB | 549/733 kB | 110/264 kB | 41 kB
Progress (4): 1.0/2.3 MB | 553/733 kB | 110/264 kB | 41 kB
Progress (4): 1.0/2.3 MB | 553/733 kB | 114/264 kB | 41 kB
Progress (4): 1.0/2.3 MB | 557/733 kB | 114/264 kB | 41 kB
Progress (4): 1.0/2.3 MB | 557/733 kB | 118/264 kB | 41 kB
Progress (4): 1.0/2.3 MB | 557/733 kB | 123/264 kB | 41 kB
Progress (4): 1.0/2.3 MB | 561/733 kB | 123/264 kB | 41 kB
Progress (4): 1.0/2.3 MB | 561/733 kB | 127/264 kB | 41 kB
Progress (4): 1.0/2.3 MB | 565/733 kB | 127/264 kB | 41 kB
Progress (4): 1.0/2.3 MB | 565/733 kB | 131/264 kB | 41 kB
Progress (4): 1.0/2.3 MB | 569/733 kB | 131/264 kB | 41 kB
Progress (4): 1.0/2.3 MB | 569/733 kB | 135/264 kB | 41 kB
Progress (4): 1.0/2.3 MB | 573/733 kB | 135/264 kB | 41 kB
Progress (4): 1.0/2.3 MB | 573/733 kB | 139/264 kB | 41 kB
Progress (4): 1.0/2.3 MB | 576/733 kB | 139/264 kB | 41 kB
Progress (4): 1.0/2.3 MB | 576/733 kB | 143/264 kB | 41 kB
Progress (4): 1.0/2.3 MB | 576/733 kB | 147/264 kB | 41 kB
Progress (4): 1.0/2.3 MB | 576/733 kB | 151/264 kB | 41 kB
Progress (4): 1.0/2.3 MB | 576/733 kB | 155/264 kB | 41 kB
Progress (4): 1.0/2.3 MB | 576/733 kB | 159/264 kB | 41 kB
Progress (4): 1.0/2.3 MB | 576/733 kB | 163/264 kB | 41 kB
Progress (4): 1.0/2.3 MB | 580/733 kB | 163/264 kB | 41 kB
Progress (4): 1.0/2.3 MB | 580/733 kB | 168/264 kB | 41 kB
Progress (4): 1.0/2.3 MB | 584/733 kB | 168/264 kB | 41 kB
Progress (4): 1.0/2.3 MB | 589/733 kB | 168/264 kB | 41 kB
Progress (4): 1.0/2.3 MB | 593/733 kB | 168/264 kB | 41 kB
Progress (4): 1.0/2.3 MB | 597/733 kB | 168/264 kB | 41 kB
Progress (4): 1.0/2.3 MB | 601/733 kB | 168/264 kB | 41 kB
Progress (4): 1.0/2.3 MB | 605/733 kB | 168/264 kB | 41 kB
Progress (4): 1.0/2.3 MB | 609/733 kB | 168/264 kB | 41 kB
Progress (4): 1.0/2.3 MB | 609/733 kB | 168/264 kB | 41 kB
Progress (4): 1.0/2.3 MB | 609/733 kB | 168/264 kB | 41 kB
Progress (4): 1.0/2.3 MB | 609/733 kB | 168/264 kB | 41 kB
Progress (4): 1.1/2.3 MB | 609/733 kB | 168/264 kB | 41 kB
Progress (4): 1.1/2.3 MB | 609/733 kB | 168/264 kB | 41 kB
Progress (4): 1.1/2.3 MB | 609/733 kB | 168/264 kB | 41 kB
Progress (4): 1.1/2.3 MB | 609/733 kB | 168/264 kB | 41 kB
Progress (4): 1.1/2.3 MB | 609/733 kB | 168/264 kB | 41 kB
Progress (5): 1.1/2.3 MB | 609/733 kB | 168/264 kB | 41 kB | 0/1.9 MB
Progress (5): 1.1/2.3 MB | 609/733 kB | 172/264 kB | 41 kB | 0/1.9 MB
Progress (5): 1.1/2.3 MB | 609/733 kB | 172/264 kB | 41 kB | 0/1.9 MB
Progress (5): 1.1/2.3 MB | 609/733 kB | 176/264 kB | 41 kB | 0/1.9 MB
Progress (5): 1.1/2.3 MB | 609/733 kB | 180/264 kB | 41 kB | 0/1.9 MB
Progress (5): 1.1/2.3 MB | 609/733 kB | 184/264 kB | 41 kB | 0/1.9 MB
Progress (5): 1.1/2.3 MB | 609/733 kB | 184/264 kB | 41 kB | 0/1.9 MB
Progress (5): 1.1/2.3 MB | 613/733 kB | 184/264 kB | 41 kB | 0/1.9 MB
Progress (5): 1.1/2.3 MB | 613/733 kB | 184/264 kB | 41 kB | 0/1.9 MB
Progress (5): 1.1/2.3 MB | 617/733 kB | 184/264 kB | 41 kB | 0/1.9 MB
Progress (5): 1.1/2.3 MB | 617/733 kB | 184/264 kB | 41 kB | 0.1/1.9 MB
Progress (5): 1.1/2.3 MB | 617/733 kB | 188/264 kB | 41 kB | 0.1/1.9 MB
Progress (5): 1.1/2.3 MB | 621/733 kB | 188/264 kB | 41 kB | 0.1/1.9 MB
Progress (5): 1.1/2.3 MB | 621/733 kB | 192/264 kB | 41 kB | 0.1/1.9 MB
Progress (5): 1.1/2.3 MB | 625/733 kB | 192/264 kB | 41 kB | 0.1/1.9 MB
Progress (5): 1.1/2.3 MB | 625/733 kB | 192/264 kB | 41 kB | 0.1/1.9 MB
Progress (5): 1.1/2.3 MB | 625/733 kB | 196/264 kB | 41 kB | 0.1/1.9 MB
Progress (5): 1.1/2.3 MB | 625/733 kB | 196/264 kB | 41 kB | 0.1/1.9 MB
Progress (5): 1.1/2.3 MB | 625/733 kB | 200/264 kB | 41 kB | 0.1/1.9 MB
Progress (5): 1.1/2.3 MB | 629/733 kB | 200/264 kB | 41 kB | 0.1/1.9 MB
Progress (5): 1.1/2.3 MB | 633/733 kB | 200/264 kB | 41 kB | 0.1/1.9 MB
Progress (5): 1.1/2.3 MB | 633/733 kB | 204/264 kB | 41 kB | 0.1/1.9 MB
Progress (5): 1.1/2.3 MB | 633/733 kB | 204/264 kB | 41 kB | 0.1/1.9 MB
Progress (5): 1.1/2.3 MB | 633/733 kB | 209/264 kB | 41 kB | 0.1/1.9 MB
Progress (5): 1.1/2.3 MB | 637/733 kB | 209/264 kB | 41 kB | 0.1/1.9 MB
Progress (5): 1.1/2.3 MB | 637/733 kB | 213/264 kB | 41 kB | 0.1/1.9 MB
Progress (5): 1.1/2.3 MB | 637/733 kB | 213/264 kB | 41 kB | 0.1/1.9 MB
Progress (5): 1.1/2.3 MB | 642/733 kB | 213/264 kB | 41 kB | 0.1/1.9 MB
Progress (5): 1.1/2.3 MB | 642/733 kB | 217/264 kB | 41 kB | 0.1/1.9 MB
Progress (5): 1.1/2.3 MB | 642/733 kB | 221/264 kB | 41 kB | 0.1/1.9 MB
Progress (5): 1.1/2.3 MB | 646/733 kB | 221/264 kB | 41 kB | 0.1/1.9 MB
Progress (5): 1.1/2.3 MB | 646/733 kB | 225/264 kB | 41 kB | 0.1/1.9 MB
Progress (5): 1.1/2.3 MB | 650/733 kB | 225/264 kB | 41 kB | 0.1/1.9 MB
Progress (5): 1.1/2.3 MB | 650/733 kB | 229/264 kB | 41 kB | 0.1/1.9 MB
Progress (5): 1.1/2.3 MB | 654/733 kB | 229/264 kB | 41 kB | 0.1/1.9 MB
Progress (5): 1.1/2.3 MB | 654/733 kB | 233/264 kB | 41 kB | 0.1/1.9 MB
Progress (5): 1.1/2.3 MB | 658/733 kB | 233/264 kB | 41 kB | 0.1/1.9 MB
Progress (5): 1.1/2.3 MB | 658/733 kB | 237/264 kB | 41 kB | 0.1/1.9 MB
Progress (5): 1.1/2.3 MB | 662/733 kB | 237/264 kB | 41 kB | 0.1/1.9 MB
Progress (5): 1.1/2.3 MB | 662/733 kB | 241/264 kB | 41 kB | 0.1/1.9 MB
Progress (5): 1.1/2.3 MB | 666/733 kB | 241/264 kB | 41 kB | 0.1/1.9 MB
Progress (5): 1.1/2.3 MB | 666/733 kB | 245/264 kB | 41 kB | 0.1/1.9 MB
Progress (5): 1.1/2.3 MB | 670/733 kB | 245/264 kB | 41 kB | 0.1/1.9 MB
Progress (5): 1.1/2.3 MB | 674/733 kB | 245/264 kB | 41 kB | 0.1/1.9 MB
Progress (5): 1.1/2.3 MB | 678/733 kB | 245/264 kB | 41 kB | 0.1/1.9 MB
Progress (5): 1.1/2.3 MB | 682/733 kB | 245/264 kB | 41 kB | 0.1/1.9 MB
Progress (5): 1.1/2.3 MB | 687/733 kB | 245/264 kB | 41 kB | 0.1/1.9 MB
Progress (5): 1.1/2.3 MB | 687/733 kB | 245/264 kB | 41 kB | 0.1/1.9 MB
Progress (5): 1.1/2.3 MB | 687/733 kB | 245/264 kB | 41 kB | 0.1/1.9 MB
Progress (5): 1.2/2.3 MB | 687/733 kB | 245/264 kB | 41 kB | 0.1/1.9 MB
Progress (5): 1.2/2.3 MB | 687/733 kB | 245/264 kB | 41 kB | 0.1/1.9 MB
Progress (5): 1.2/2.3 MB | 687/733 kB | 245/264 kB | 41 kB | 0.1/1.9 MB
Progress (5): 1.2/2.3 MB | 687/733 kB | 245/264 kB | 41 kB | 0.1/1.9 MB
Progress (5): 1.2/2.3 MB | 687/733 kB | 245/264 kB | 41 kB | 0.1/1.9 MB
Progress (5): 1.2/2.3 MB | 687/733 kB | 245/264 kB | 41 kB | 0.1/1.9 MB
Progress (5): 1.2/2.3 MB | 687/733 kB | 245/264 kB | 41 kB | 0.1/1.9 MB
Progress (5): 1.2/2.3 MB | 687/733 kB | 250/264 kB | 41 kB | 0.1/1.9 MB
Progress (5): 1.2/2.3 MB | 687/733 kB | 254/264 kB | 41 kB | 0.1/1.9 MB
Progress (5): 1.2/2.3 MB | 687/733 kB | 258/264 kB | 41 kB | 0.1/1.9 MB
Progress (5): 1.2/2.3 MB | 687/733 kB | 262/264 kB | 41 kB | 0.1/1.9 MB
Progress (5): 1.2/2.3 MB | 687/733 kB | 262/264 kB | 41 kB | 0.1/1.9 MB
Progress (5): 1.2/2.3 MB | 687/733 kB | 264 kB | 41 kB | 0.1/1.9 MB    
Progress (5): 1.2/2.3 MB | 687/733 kB | 264 kB | 41 kB | 0.1/1.9 MB
Progress (5): 1.2/2.3 MB | 687/733 kB | 264 kB | 41 kB | 0.1/1.9 MB
Progress (5): 1.2/2.3 MB | 687/733 kB | 264 kB | 41 kB | 0.1/1.9 MB
                                                                   
Downloaded from RSO-public-group: http://repository.sonatype.org/content/groups/sonatype-public-grid/org/apache/httpcomponents/httpmime/4.5.1/httpmime-4.5.1.jar (41 kB at 31 kB/s)
Progress (4): 1.2/2.3 MB | 691/733 kB | 264 kB | 0.1/1.9 MB
Progress (4): 1.2/2.3 MB | 691/733 kB | 264 kB | 0.2/1.9 MB
Progress (4): 1.2/2.3 MB | 695/733 kB | 264 kB | 0.2/1.9 MB
Progress (4): 1.2/2.3 MB | 699/733 kB | 264 kB | 0.2/1.9 MB
Progress (4): 1.2/2.3 MB | 703/733 kB | 264 kB | 0.2/1.9 MB
Progress (4): 1.2/2.3 MB | 703/733 kB | 264 kB | 0.2/1.9 MB
Progress (4): 1.2/2.3 MB | 706/733 kB | 264 kB | 0.2/1.9 MB
Progress (4): 1.2/2.3 MB | 706/733 kB | 264 kB | 0.2/1.9 MB
Progress (4): 1.2/2.3 MB | 709/733 kB | 264 kB | 0.2/1.9 MB
Progress (4): 1.2/2.3 MB | 713/733 kB | 264 kB | 0.2/1.9 MB
Progress (4): 1.2/2.3 MB | 717/733 kB | 264 kB | 0.2/1.9 MB
Progress (4): 1.2/2.3 MB | 721/733 kB | 264 kB | 0.2/1.9 MB
Progress (4): 1.2/2.3 MB | 725/733 kB | 264 kB | 0.2/1.9 MB
Progress (4): 1.2/2.3 MB | 730/733 kB | 264 kB | 0.2/1.9 MB
Progress (4): 1.2/2.3 MB | 733 kB | 264 kB | 0.2/1.9 MB    
Progress (4): 1.2/2.3 MB | 733 kB | 264 kB | 0.2/1.9 MB
Progress (4): 1.2/2.3 MB | 733 kB | 264 kB | 0.2/1.9 MB
Progress (4): 1.3/2.3 MB | 733 kB | 264 kB | 0.2/1.9 MB
Progress (4): 1.3/2.3 MB | 733 kB | 264 kB | 0.2/1.9 MB
Progress (4): 1.3/2.3 MB | 733 kB | 264 kB | 0.2/1.9 MB
Progress (4): 1.3/2.3 MB | 733 kB | 264 kB | 0.2/1.9 MB
Progress (4): 1.3/2.3 MB | 733 kB | 264 kB | 0.2/1.9 MB
Progress (4): 1.3/2.3 MB | 733 kB | 264 kB | 0.2/1.9 MB
Progress (4): 1.3/2.3 MB | 733 kB | 264 kB | 0.2/1.9 MB
Progress (4): 1.3/2.3 MB | 733 kB | 264 kB | 0.2/1.9 MB
Progress (4): 1.3/2.3 MB | 733 kB | 264 kB | 0.2/1.9 MB
Progress (4): 1.3/2.3 MB | 733 kB | 264 kB | 0.2/1.9 MB
Progress (4): 1.3/2.3 MB | 733 kB | 264 kB | 0.2/1.9 MB
Progress (4): 1.3/2.3 MB | 733 kB | 264 kB | 0.2/1.9 MB
Progress (4): 1.3/2.3 MB | 733 kB | 264 kB | 0.2/1.9 MB
Progress (4): 1.3/2.3 MB | 733 kB | 264 kB | 0.3/1.9 MB
Progress (4): 1.3/2.3 MB | 733 kB | 264 kB | 0.3/1.9 MB
Progress (4): 1.3/2.3 MB | 733 kB | 264 kB | 0.3/1.9 MB
Progress (4): 1.3/2.3 MB | 733 kB | 264 kB | 0.3/1.9 MB
Progress (4): 1.4/2.3 MB | 733 kB | 264 kB | 0.3/1.9 MB
Progress (4): 1.4/2.3 MB | 733 kB | 264 kB | 0.3/1.9 MB
Progress (4): 1.4/2.3 MB | 733 kB | 264 kB | 0.3/1.9 MB
Progress (4): 1.4/2.3 MB | 733 kB | 264 kB | 0.3/1.9 MB
Progress (4): 1.4/2.3 MB | 733 kB | 264 kB | 0.3/1.9 MB
Progress (4): 1.4/2.3 MB | 733 kB | 264 kB | 0.3/1.9 MB
Progress (4): 1.4/2.3 MB | 733 kB | 264 kB | 0.3/1.9 MB
Progress (4): 1.4/2.3 MB | 733 kB | 264 kB | 0.3/1.9 MB
Progress (4): 1.4/2.3 MB | 733 kB | 264 kB | 0.3/1.9 MB
Progress (4): 1.4/2.3 MB | 733 kB | 264 kB | 0.3/1.9 MB
Progress (4): 1.4/2.3 MB | 733 kB | 264 kB | 0.3/1.9 MB
Progress (4): 1.4/2.3 MB | 733 kB | 264 kB | 0.3/1.9 MB
Progress (4): 1.4/2.3 MB | 733 kB | 264 kB | 0.3/1.9 MB
Progress (4): 1.4/2.3 MB | 733 kB | 264 kB | 0.3/1.9 MB
Progress (4): 1.4/2.3 MB | 733 kB | 264 kB | 0.3/1.9 MB
Progress (4): 1.4/2.3 MB | 733 kB | 264 kB | 0.4/1.9 MB
                                                       
Downloaded from RSO-public-group: http://repository.sonatype.org/content/groups/sonatype-public-grid/commons-codec/commons-codec/1.9/commons-codec-1.9.jar (264 kB at 192 kB/s)
Downloaded from RSO-public-group: http://repository.sonatype.org/content/groups/sonatype-public-grid/org/apache/httpcomponents/httpclient/4.5.1/httpclient-4.5.1.jar (733 kB at 530 kB/s)
Progress (2): 1.4/2.3 MB | 0.4/1.9 MB
Progress (2): 1.5/2.3 MB | 0.4/1.9 MB
Progress (2): 1.5/2.3 MB | 0.4/1.9 MB
Progress (2): 1.5/2.3 MB | 0.4/1.9 MB
Progress (2): 1.5/2.3 MB | 0.4/1.9 MB
Progress (2): 1.5/2.3 MB | 0.4/1.9 MB
Progress (2): 1.5/2.3 MB | 0.4/1.9 MB
Progress (2): 1.5/2.3 MB | 0.4/1.9 MB
Progress (2): 1.5/2.3 MB | 0.4/1.9 MB
Progress (2): 1.5/2.3 MB | 0.4/1.9 MB
Progress (2): 1.5/2.3 MB | 0.4/1.9 MB
Progress (2): 1.5/2.3 MB | 0.4/1.9 MB
Progress (2): 1.5/2.3 MB | 0.4/1.9 MB
Progress (2): 1.5/2.3 MB | 0.4/1.9 MB
Progress (2): 1.5/2.3 MB | 0.4/1.9 MB
Progress (2): 1.5/2.3 MB | 0.4/1.9 MB
Progress (2): 1.6/2.3 MB | 0.4/1.9 MB
Progress (2): 1.6/2.3 MB | 0.4/1.9 MB
Progress (2): 1.6/2.3 MB | 0.4/1.9 MB
Progress (2): 1.6/2.3 MB | 0.4/1.9 MB
Progress (2): 1.6/2.3 MB | 0.4/1.9 MB
Progress (2): 1.6/2.3 MB | 0.4/1.9 MB
Progress (2): 1.6/2.3 MB | 0.4/1.9 MB
Progress (2): 1.6/2.3 MB | 0.5/1.9 MB
Progress (2): 1.6/2.3 MB | 0.5/1.9 MB
Progress (2): 1.6/2.3 MB | 0.5/1.9 MB
Progress (2): 1.6/2.3 MB | 0.5/1.9 MB
Progress (2): 1.6/2.3 MB | 0.5/1.9 MB
Progress (2): 1.6/2.3 MB | 0.5/1.9 MB
Progress (2): 1.6/2.3 MB | 0.5/1.9 MB
Progress (2): 1.6/2.3 MB | 0.5/1.9 MB
Progress (2): 1.6/2.3 MB | 0.5/1.9 MB
Progress (2): 1.6/2.3 MB | 0.5/1.9 MB
Progress (2): 1.7/2.3 MB | 0.5/1.9 MB
Progress (2): 1.7/2.3 MB | 0.5/1.9 MB
Progress (2): 1.7/2.3 MB | 0.5/1.9 MB
Progress (2): 1.7/2.3 MB | 0.5/1.9 MB
Progress (2): 1.7/2.3 MB | 0.5/1.9 MB
Progress (2): 1.7/2.3 MB | 0.5/1.9 MB
Progress (2): 1.8/2.3 MB | 0.5/1.9 MB
Progress (2): 1.8/2.3 MB | 0.5/1.9 MB
Progress (2): 1.8/2.3 MB | 0.6/1.9 MB
Progress (2): 1.8/2.3 MB | 0.6/1.9 MB
Progress (2): 1.8/2.3 MB | 0.6/1.9 MB
Progress (2): 1.8/2.3 MB | 0.6/1.9 MB
Progress (2): 1.8/2.3 MB | 0.6/1.9 MB
Progress (2): 1.8/2.3 MB | 0.6/1.9 MB
Progress (2): 1.8/2.3 MB | 0.6/1.9 MB
Progress (2): 1.8/2.3 MB | 0.6/1.9 MB
Progress (2): 1.8/2.3 MB | 0.6/1.9 MB
Progress (2): 1.8/2.3 MB | 0.6/1.9 MB
Progress (2): 1.8/2.3 MB | 0.6/1.9 MB
Progress (2): 1.8/2.3 MB | 0.6/1.9 MB
Progress (2): 1.8/2.3 MB | 0.6/1.9 MB
Progress (2): 1.8/2.3 MB | 0.6/1.9 MB
Progress (2): 1.9/2.3 MB | 0.6/1.9 MB
Progress (2): 1.9/2.3 MB | 0.6/1.9 MB
Progress (2): 1.9/2.3 MB | 0.6/1.9 MB
Progress (2): 1.9/2.3 MB | 0.7/1.9 MB
Progress (2): 1.9/2.3 MB | 0.7/1.9 MB
Progress (2): 1.9/2.3 MB | 0.7/1.9 MB
Progress (2): 1.9/2.3 MB | 0.7/1.9 MB
Progress (2): 1.9/2.3 MB | 0.7/1.9 MB
Progress (2): 1.9/2.3 MB | 0.7/1.9 MB
Progress (2): 1.9/2.3 MB | 0.7/1.9 MB
Progress (2): 1.9/2.3 MB | 0.7/1.9 MB
Progress (2): 1.9/2.3 MB | 0.7/1.9 MB
Progress (2): 1.9/2.3 MB | 0.7/1.9 MB
Progress (2): 1.9/2.3 MB | 0.7/1.9 MB
Progress (2): 1.9/2.3 MB | 0.7/1.9 MB
Progress (2): 1.9/2.3 MB | 0.7/1.9 MB
Progress (2): 1.9/2.3 MB | 0.7/1.9 MB
Progress (2): 1.9/2.3 MB | 0.7/1.9 MB
Progress (2): 2.0/2.3 MB | 0.7/1.9 MB
Progress (2): 2.0/2.3 MB | 0.7/1.9 MB
Progress (2): 2.0/2.3 MB | 0.7/1.9 MB
Progress (2): 2.0/2.3 MB | 0.7/1.9 MB
Progress (2): 2.0/2.3 MB | 0.8/1.9 MB
Progress (2): 2.0/2.3 MB | 0.8/1.9 MB
Progress (2): 2.0/2.3 MB | 0.8/1.9 MB
Progress (2): 2.0/2.3 MB | 0.8/1.9 MB
Progress (2): 2.0/2.3 MB | 0.8/1.9 MB
Progress (2): 2.0/2.3 MB | 0.8/1.9 MB
Progress (2): 2.0/2.3 MB | 0.8/1.9 MB
Progress (2): 2.0/2.3 MB | 0.8/1.9 MB
Progress (2): 2.0/2.3 MB | 0.8/1.9 MB
Progress (2): 2.0/2.3 MB | 0.8/1.9 MB
Progress (2): 2.0/2.3 MB | 0.8/1.9 MB
Progress (2): 2.0/2.3 MB | 0.8/1.9 MB
Progress (2): 2.1/2.3 MB | 0.8/1.9 MB
Progress (2): 2.1/2.3 MB | 0.8/1.9 MB
Progress (2): 2.1/2.3 MB | 0.8/1.9 MB
Progress (2): 2.1/2.3 MB | 0.8/1.9 MB
Progress (2): 2.1/2.3 MB | 0.8/1.9 MB
Progress (2): 2.1/2.3 MB | 0.8/1.9 MB
Progress (2): 2.1/2.3 MB | 0.9/1.9 MB
Progress (2): 2.1/2.3 MB | 0.9/1.9 MB
Progress (2): 2.1/2.3 MB | 0.9/1.9 MB
Progress (2): 2.1/2.3 MB | 0.9/1.9 MB
Progress (2): 2.1/2.3 MB | 0.9/1.9 MB
Progress (2): 2.1/2.3 MB | 0.9/1.9 MB
Progress (2): 2.1/2.3 MB | 0.9/1.9 MB
Progress (2): 2.1/2.3 MB | 0.9/1.9 MB
Progress (2): 2.1/2.3 MB | 0.9/1.9 MB
Progress (2): 2.1/2.3 MB | 0.9/1.9 MB
Progress (2): 2.1/2.3 MB | 0.9/1.9 MB
Progress (2): 2.1/2.3 MB | 0.9/1.9 MB
Progress (2): 2.2/2.3 MB | 0.9/1.9 MB
Progress (2): 2.2/2.3 MB | 0.9/1.9 MB
Progress (2): 2.2/2.3 MB | 0.9/1.9 MB
Progress (2): 2.2/2.3 MB | 0.9/1.9 MB
Progress (2): 2.2/2.3 MB | 0.9/1.9 MB
Progress (2): 2.2/2.3 MB | 0.9/1.9 MB
Progress (2): 2.2/2.3 MB | 0.9/1.9 MB
Progress (2): 2.2/2.3 MB | 1.0/1.9 MB
Progress (2): 2.2/2.3 MB | 1.0/1.9 MB
Progress (2): 2.2/2.3 MB | 1.0/1.9 MB
Progress (2): 2.2/2.3 MB | 1.0/1.9 MB
Progress (2): 2.2/2.3 MB | 1.0/1.9 MB
Progress (2): 2.2/2.3 MB | 1.0/1.9 MB
Progress (2): 2.2/2.3 MB | 1.0/1.9 MB
Progress (2): 2.2/2.3 MB | 1.0/1.9 MB
Progress (2): 2.2/2.3 MB | 1.0/1.9 MB
Progress (2): 2.2/2.3 MB | 1.0/1.9 MB
Progress (2): 2.2/2.3 MB | 1.0/1.9 MB
Progress (2): 2.3/2.3 MB | 1.0/1.9 MB
Progress (2): 2.3/2.3 MB | 1.0/1.9 MB
Progress (2): 2.3/2.3 MB | 1.0/1.9 MB
Progress (2): 2.3 MB | 1.0/1.9 MB    
Progress (2): 2.3 MB | 1.0/1.9 MB
Progress (2): 2.3 MB | 1.0/1.9 MB
Progress (2): 2.3 MB | 1.0/1.9 MB
Progress (2): 2.3 MB | 1.0/1.9 MB
Progress (2): 2.3 MB | 1.0/1.9 MB
Progress (2): 2.3 MB | 1.1/1.9 MB
Progress (2): 2.3 MB | 1.1/1.9 MB
Progress (2): 2.3 MB | 1.1/1.9 MB
Progress (2): 2.3 MB | 1.1/1.9 MB
Progress (2): 2.3 MB | 1.1/1.9 MB
Progress (2): 2.3 MB | 1.1/1.9 MB
Progress (2): 2.3 MB | 1.1/1.9 MB
Progress (2): 2.3 MB | 1.1/1.9 MB
Progress (2): 2.3 MB | 1.1/1.9 MB
Progress (2): 2.3 MB | 1.1/1.9 MB
Progress (2): 2.3 MB | 1.1/1.9 MB
Progress (2): 2.3 MB | 1.1/1.9 MB
Progress (2): 2.3 MB | 1.2/1.9 MB
Progress (2): 2.3 MB | 1.2/1.9 MB
Progress (2): 2.3 MB | 1.2/1.9 MB
Progress (2): 2.3 MB | 1.2/1.9 MB
Progress (2): 2.3 MB | 1.2/1.9 MB
Progress (2): 2.3 MB | 1.2/1.9 MB
Progress (2): 2.3 MB | 1.2/1.9 MB
Progress (2): 2.3 MB | 1.2/1.9 MB
Progress (2): 2.3 MB | 1.2/1.9 MB
                                 
Downloaded from RSO-public-group: http://repository.sonatype.org/content/groups/sonatype-public-grid/com/google/guava/guava/19.0/guava-19.0.jar (2.3 MB at 1.3 MB/s)
Progress (1): 1.2/1.9 MB
Progress (1): 1.2/1.9 MB
Progress (1): 1.2/1.9 MB
Progress (1): 1.3/1.9 MB
Progress (1): 1.3/1.9 MB
Progress (1): 1.3/1.9 MB
Progress (1): 1.3/1.9 MB
Progress (1): 1.3/1.9 MB
Progress (1): 1.3/1.9 MB
Progress (1): 1.3/1.9 MB
Progress (1): 1.3/1.9 MB
Progress (1): 1.3/1.9 MB
Progress (1): 1.3/1.9 MB
Progress (1): 1.3/1.9 MB
Progress (1): 1.3/1.9 MB
Progress (1): 1.4/1.9 MB
Progress (1): 1.4/1.9 MB
Progress (1): 1.4/1.9 MB
Progress (1): 1.4/1.9 MB
Progress (1): 1.4/1.9 MB
Progress (1): 1.4/1.9 MB
Progress (1): 1.4/1.9 MB
Progress (1): 1.4/1.9 MB
Progress (1): 1.4/1.9 MB
Progress (1): 1.4/1.9 MB
Progress (1): 1.4/1.9 MB
Progress (1): 1.4/1.9 MB
Progress (1): 1.4/1.9 MB
Progress (1): 1.5/1.9 MB
Progress (1): 1.5/1.9 MB
Progress (1): 1.5/1.9 MB
Progress (1): 1.5/1.9 MB
Progress (1): 1.5/1.9 MB
Progress (1): 1.5/1.9 MB
Progress (1): 1.5/1.9 MB
Progress (1): 1.5/1.9 MB
Progress (1): 1.5/1.9 MB
Progress (1): 1.5/1.9 MB
Progress (1): 1.5/1.9 MB
Progress (1): 1.5/1.9 MB
Progress (1): 1.6/1.9 MB
Progress (1): 1.6/1.9 MB
Progress (1): 1.6/1.9 MB
Progress (1): 1.6/1.9 MB
Progress (1): 1.6/1.9 MB
Progress (1): 1.6/1.9 MB
Progress (1): 1.6/1.9 MB
Progress (1): 1.6/1.9 MB
Progress (1): 1.6/1.9 MB
Progress (1): 1.6/1.9 MB
Progress (1): 1.6/1.9 MB
Progress (1): 1.6/1.9 MB
Progress (1): 1.7/1.9 MB
Progress (1): 1.7/1.9 MB
Progress (1): 1.7/1.9 MB
Progress (1): 1.7/1.9 MB
Progress (1): 1.7/1.9 MB
Progress (1): 1.7/1.9 MB
Progress (1): 1.7/1.9 MB
Progress (1): 1.7/1.9 MB
Progress (1): 1.7/1.9 MB
Progress (1): 1.7/1.9 MB
Progress (1): 1.7/1.9 MB
Progress (1): 1.7/1.9 MB
Progress (1): 1.8/1.9 MB
Progress (1): 1.8/1.9 MB
Progress (1): 1.8/1.9 MB
Progress (1): 1.8/1.9 MB
Progress (1): 1.8/1.9 MB
Progress (1): 1.8/1.9 MB
Progress (1): 1.8/1.9 MB
Progress (1): 1.8/1.9 MB
Progress (1): 1.8/1.9 MB
Progress (1): 1.8/1.9 MB
Progress (1): 1.8/1.9 MB
Progress (1): 1.8/1.9 MB
Progress (1): 1.9/1.9 MB
Progress (1): 1.9/1.9 MB
Progress (1): 1.9/1.9 MB
Progress (1): 1.9 MB    
                    
Downloaded from RSO-public-group: http://repository.sonatype.org/content/groups/sonatype-public-grid/com/google/auto/value/auto-value/1.1/auto-value-1.1.jar (1.9 MB at 938 kB/s)
[INFO] 
[INFO] --- tycho-pack200b-plugin:1.6.0:pack (pack200-pack) @ org.sonatype.m2e.mavenarchiver.parent ---
[INFO] 
[INFO] --- tycho-p2-plugin:1.6.0:p2-metadata-default (default-p2-metadata-default) @ org.sonatype.m2e.mavenarchiver.parent ---
[INFO] 
[INFO] --- tycho-p2-plugin:1.6.0:feature-p2-metadata (default-feature-p2-metadata) @ org.sonatype.m2e.mavenarchiver.parent ---
[INFO] 
[INFO] --- tycho-p2-plugin:1.6.0:p2-metadata (p2-metadata) @ org.sonatype.m2e.mavenarchiver.parent ---
[INFO] 
[INFO] --- maven-install-plugin:2.3.1:install (default-install) @ org.sonatype.m2e.mavenarchiver.parent ---
Downloading from cbi: https://repo.eclipse.org/content/repositories/cbi-releases/org/apache/maven/maven-project/2.0.6/maven-project-2.0.6.pom
Downloading from RSO-public-group: http://repository.sonatype.org/content/groups/sonatype-public-grid/org/apache/maven/maven-project/2.0.6/maven-project-2.0.6.pom
Progress (1): 2.6 kB
                    
Downloaded from RSO-public-group: http://repository.sonatype.org/content/groups/sonatype-public-grid/org/apache/maven/maven-project/2.0.6/maven-project-2.0.6.pom (2.6 kB at 18 kB/s)
Downloading from cbi: https://repo.eclipse.org/content/repositories/cbi-releases/org/apache/maven/maven-settings/2.0.6/maven-settings-2.0.6.pom
Downloading from RSO-public-group: http://repository.sonatype.org/content/groups/sonatype-public-grid/org/apache/maven/maven-settings/2.0.6/maven-settings-2.0.6.pom
Progress (1): 2.0 kB
                    
Downloaded from RSO-public-group: http://repository.sonatype.org/content/groups/sonatype-public-grid/org/apache/maven/maven-settings/2.0.6/maven-settings-2.0.6.pom (2.0 kB at 12 kB/s)
Downloading from cbi: https://repo.eclipse.org/content/repositories/cbi-releases/org/apache/maven/maven-model/2.0.6/maven-model-2.0.6.pom
Downloading from RSO-public-group: http://repository.sonatype.org/content/groups/sonatype-public-grid/org/apache/maven/maven-model/2.0.6/maven-model-2.0.6.pom
Progress (1): 3.0 kB
                    
Downloaded from RSO-public-group: http://repository.sonatype.org/content/groups/sonatype-public-grid/org/apache/maven/maven-model/2.0.6/maven-model-2.0.6.pom (3.0 kB at 7.9 kB/s)
Downloading from cbi: https://repo.eclipse.org/content/repositories/cbi-releases/org/codehaus/plexus/plexus-utils/1.4.1/plexus-utils-1.4.1.pom
Downloading from RSO-public-group: http://repository.sonatype.org/content/groups/sonatype-public-grid/org/codehaus/plexus/plexus-utils/1.4.1/plexus-utils-1.4.1.pom
Progress (1): 1.9 kB
                    
Downloaded from RSO-public-group: http://repository.sonatype.org/content/groups/sonatype-public-grid/org/codehaus/plexus/plexus-utils/1.4.1/plexus-utils-1.4.1.pom (1.9 kB at 13 kB/s)
Downloading from cbi: https://repo.eclipse.org/content/repositories/cbi-releases/junit/junit/3.8.1/junit-3.8.1.pom
Downloading from RSO-public-group: http://repository.sonatype.org/content/groups/sonatype-public-grid/junit/junit/3.8.1/junit-3.8.1.pom
Progress (1): 998 B
                   
Downloaded from RSO-public-group: http://repository.sonatype.org/content/groups/sonatype-public-grid/junit/junit/3.8.1/junit-3.8.1.pom (998 B at 6.9 kB/s)
Downloading from cbi: https://repo.eclipse.org/content/repositories/cbi-releases/org/codehaus/plexus/plexus-utils/1.0.4/plexus-utils-1.0.4.pom
Downloading from RSO-public-group: http://repository.sonatype.org/content/groups/sonatype-public-grid/org/codehaus/plexus/plexus-utils/1.0.4/plexus-utils-1.0.4.pom
Progress (1): 4.1/6.9 kB
Progress (1): 6.9 kB    
                    
Downloaded from RSO-public-group: http://repository.sonatype.org/content/groups/sonatype-public-grid/org/codehaus/plexus/plexus-utils/1.0.4/plexus-utils-1.0.4.pom (6.9 kB at 47 kB/s)
Downloading from cbi: https://repo.eclipse.org/content/repositories/cbi-releases/org/apache/maven/maven-profile/2.0.6/maven-profile-2.0.6.pom
Downloading from RSO-public-group: http://repository.sonatype.org/content/groups/sonatype-public-grid/org/apache/maven/maven-profile/2.0.6/maven-profile-2.0.6.pom
Progress (1): 2.0 kB
                    
Downloaded from RSO-public-group: http://repository.sonatype.org/content/groups/sonatype-public-grid/org/apache/maven/maven-profile/2.0.6/maven-profile-2.0.6.pom (2.0 kB at 14 kB/s)
Downloading from cbi: https://repo.eclipse.org/content/repositories/cbi-releases/org/apache/maven/maven-artifact-manager/2.0.6/maven-artifact-manager-2.0.6.pom
Downloading from RSO-public-group: http://repository.sonatype.org/content/groups/sonatype-public-grid/org/apache/maven/maven-artifact-manager/2.0.6/maven-artifact-manager-2.0.6.pom
Progress (1): 2.6 kB
                    
Downloaded from RSO-public-group: http://repository.sonatype.org/content/groups/sonatype-public-grid/org/apache/maven/maven-artifact-manager/2.0.6/maven-artifact-manager-2.0.6.pom (2.6 kB at 17 kB/s)
Downloading from cbi: https://repo.eclipse.org/content/repositories/cbi-releases/org/apache/maven/maven-repository-metadata/2.0.6/maven-repository-metadata-2.0.6.pom
Downloading from RSO-public-group: http://repository.sonatype.org/content/groups/sonatype-public-grid/org/apache/maven/maven-repository-metadata/2.0.6/maven-repository-metadata-2.0.6.pom
Progress (1): 1.9 kB
                    
Downloaded from RSO-public-group: http://repository.sonatype.org/content/groups/sonatype-public-grid/org/apache/maven/maven-repository-metadata/2.0.6/maven-repository-metadata-2.0.6.pom (1.9 kB at 13 kB/s)
Downloading from cbi: https://repo.eclipse.org/content/repositories/cbi-releases/org/apache/maven/maven-artifact/2.0.6/maven-artifact-2.0.6.pom
Downloading from RSO-public-group: http://repository.sonatype.org/content/groups/sonatype-public-grid/org/apache/maven/maven-artifact/2.0.6/maven-artifact-2.0.6.pom
Progress (1): 1.6 kB
                    
Downloaded from RSO-public-group: http://repository.sonatype.org/content/groups/sonatype-public-grid/org/apache/maven/maven-artifact/2.0.6/maven-artifact-2.0.6.pom (1.6 kB at 11 kB/s)
Downloading from cbi: https://repo.eclipse.org/content/repositories/cbi-releases/org/apache/maven/maven-plugin-registry/2.0.6/maven-plugin-registry-2.0.6.pom
Downloading from RSO-public-group: http://repository.sonatype.org/content/groups/sonatype-public-grid/org/apache/maven/maven-plugin-registry/2.0.6/maven-plugin-registry-2.0.6.pom
Progress (1): 1.9 kB
                    
Downloaded from RSO-public-group: http://repository.sonatype.org/content/groups/sonatype-public-grid/org/apache/maven/maven-plugin-registry/2.0.6/maven-plugin-registry-2.0.6.pom (1.9 kB at 14 kB/s)
Downloading from cbi: https://repo.eclipse.org/content/repositories/cbi-releases/org/codehaus/plexus/plexus-digest/1.0/plexus-digest-1.0.pom
Downloading from RSO-public-group: http://repository.sonatype.org/content/groups/sonatype-public-grid/org/codehaus/plexus/plexus-digest/1.0/plexus-digest-1.0.pom
Progress (1): 1.1 kB
                    
Downloaded from RSO-public-group: http://repository.sonatype.org/content/groups/sonatype-public-grid/org/codehaus/plexus/plexus-digest/1.0/plexus-digest-1.0.pom (1.1 kB at 7.2 kB/s)
Downloading from cbi: https://repo.eclipse.org/content/repositories/cbi-releases/org/codehaus/plexus/plexus-components/1.1.7/plexus-components-1.1.7.pom
Downloading from RSO-public-group: http://repository.sonatype.org/content/groups/sonatype-public-grid/org/codehaus/plexus/plexus-components/1.1.7/plexus-components-1.1.7.pom
Progress (1): 4.1/5.0 kB
Progress (1): 5.0 kB    
                    
Downloaded from RSO-public-group: http://repository.sonatype.org/content/groups/sonatype-public-grid/org/codehaus/plexus/plexus-components/1.1.7/plexus-components-1.1.7.pom (5.0 kB at 34 kB/s)
Downloading from cbi: https://repo.eclipse.org/content/repositories/cbi-releases/org/codehaus/plexus/plexus/1.0.8/plexus-1.0.8.pom
Downloading from RSO-public-group: http://repository.sonatype.org/content/groups/sonatype-public-grid/org/codehaus/plexus/plexus/1.0.8/plexus-1.0.8.pom
Progress (1): 4.1/7.2 kB
Progress (1): 7.2 kB    
                    
Downloaded from RSO-public-group: http://repository.sonatype.org/content/groups/sonatype-public-grid/org/codehaus/plexus/plexus/1.0.8/plexus-1.0.8.pom (7.2 kB at 51 kB/s)
Downloading from cbi: https://repo.eclipse.org/content/repositories/cbi-releases/org/codehaus/plexus/plexus-container-default/1.0-alpha-8/plexus-container-default-1.0-alpha-8.pom
Downloading from RSO-public-group: http://repository.sonatype.org/content/groups/sonatype-public-grid/org/codehaus/plexus/plexus-container-default/1.0-alpha-8/plexus-container-default-1.0-alpha-8.pom
Progress (1): 4.1/7.3 kB
Progress (1): 7.3 kB    
                    
Downloaded from RSO-public-group: http://repository.sonatype.org/content/groups/sonatype-public-grid/org/codehaus/plexus/plexus-container-default/1.0-alpha-8/plexus-container-default-1.0-alpha-8.pom (7.3 kB at 50 kB/s)
Downloading from cbi: https://repo.eclipse.org/content/repositories/cbi-releases/org/apache/maven/maven-project/2.0.6/maven-project-2.0.6.jar
Downloading from cbi: https://repo.eclipse.org/content/repositories/cbi-releases/org/apache/maven/maven-profile/2.0.6/maven-profile-2.0.6.jar
Downloading from cbi: https://repo.eclipse.org/content/repositories/cbi-releases/org/apache/maven/maven-settings/2.0.6/maven-settings-2.0.6.jar
Downloading from cbi: https://repo.eclipse.org/content/repositories/cbi-releases/junit/junit/3.8.1/junit-3.8.1.jar
Downloading from cbi: https://repo.eclipse.org/content/repositories/cbi-releases/org/apache/maven/maven-plugin-registry/2.0.6/maven-plugin-registry-2.0.6.jar
Downloading from cbi: https://repo.eclipse.org/content/repositories/cbi-releases/org/apache/maven/maven-model/2.0.6/maven-model-2.0.6.jar
Downloading from cbi: https://repo.eclipse.org/content/repositories/cbi-releases/org/apache/maven/maven-artifact-manager/2.0.6/maven-artifact-manager-2.0.6.jar
Downloading from cbi: https://repo.eclipse.org/content/repositories/cbi-releases/org/apache/maven/maven-repository-metadata/2.0.6/maven-repository-metadata-2.0.6.jar
Downloading from cbi: https://repo.eclipse.org/content/repositories/cbi-releases/org/apache/maven/maven-artifact/2.0.6/maven-artifact-2.0.6.jar
Downloading from cbi: https://repo.eclipse.org/content/repositories/cbi-releases/org/codehaus/plexus/plexus-digest/1.0/plexus-digest-1.0.jar
Downloading from RSO-public-group: http://repository.sonatype.org/content/groups/sonatype-public-grid/org/apache/maven/maven-settings/2.0.6/maven-settings-2.0.6.jar
Downloading from RSO-public-group: http://repository.sonatype.org/content/groups/sonatype-public-grid/org/apache/maven/maven-plugin-registry/2.0.6/maven-plugin-registry-2.0.6.jar
Downloading from RSO-public-group: http://repository.sonatype.org/content/groups/sonatype-public-grid/junit/junit/3.8.1/junit-3.8.1.jar
Downloading from RSO-public-group: http://repository.sonatype.org/content/groups/sonatype-public-grid/org/apache/maven/maven-project/2.0.6/maven-project-2.0.6.jar
Downloading from RSO-public-group: http://repository.sonatype.org/content/groups/sonatype-public-grid/org/apache/maven/maven-profile/2.0.6/maven-profile-2.0.6.jar
Progress (1): 4.1/49 kB
Progress (1): 7.8/49 kB
Progress (1): 12/49 kB 
Progress (1): 16/49 kB
Progress (1): 20/49 kB
Progress (1): 24/49 kB
Progress (1): 28/49 kB
Progress (1): 32/49 kB
Progress (1): 37/49 kB
Progress (1): 41/49 kB
Progress (1): 45/49 kB
Progress (1): 49/49 kB
Progress (1): 49 kB   
Progress (2): 49 kB | 4.1/116 kB
Progress (2): 49 kB | 7.8/116 kB
Progress (2): 49 kB | 12/116 kB 
Progress (2): 49 kB | 16/116 kB
Progress (2): 49 kB | 20/116 kB
Progress (2): 49 kB | 24/116 kB
Progress (2): 49 kB | 28/116 kB
Progress (2): 49 kB | 32/116 kB
Progress (3): 49 kB | 32/116 kB | 4.1/35 kB
Progress (3): 49 kB | 32/116 kB | 7.8/35 kB
Progress (3): 49 kB | 32/116 kB | 12/35 kB 
Progress (3): 49 kB | 32/116 kB | 16/35 kB
Progress (3): 49 kB | 32/116 kB | 20/35 kB
Progress (3): 49 kB | 32/116 kB | 24/35 kB
Progress (3): 49 kB | 37/116 kB | 24/35 kB
Progress (3): 49 kB | 41/116 kB | 24/35 kB
Progress (3): 49 kB | 41/116 kB | 28/35 kB
Progress (3): 49 kB | 45/116 kB | 28/35 kB
Progress (3): 49 kB | 45/116 kB | 32/35 kB
Progress (3): 49 kB | 49/116 kB | 32/35 kB
Progress (3): 49 kB | 49/116 kB | 35 kB   
Progress (3): 49 kB | 53/116 kB | 35 kB
Progress (3): 49 kB | 57/116 kB | 35 kB
Progress (3): 49 kB | 61/116 kB | 35 kB
Progress (3): 49 kB | 65/116 kB | 35 kB
Progress (3): 49 kB | 69/116 kB | 35 kB
Progress (4): 49 kB | 69/116 kB | 35 kB | 4.1/29 kB
Progress (4): 49 kB | 69/116 kB | 35 kB | 7.8/29 kB
Progress (4): 49 kB | 69/116 kB | 35 kB | 12/29 kB 
Progress (5): 49 kB | 69/116 kB | 35 kB | 12/29 kB | 4.1/121 kB
Progress (5): 49 kB | 69/116 kB | 35 kB | 16/29 kB | 4.1/121 kB
Progress (5): 49 kB | 69/116 kB | 35 kB | 16/29 kB | 7.8/121 kB
Progress (5): 49 kB | 69/116 kB | 35 kB | 16/29 kB | 12/121 kB 
Progress (5): 49 kB | 69/116 kB | 35 kB | 16/29 kB | 16/121 kB
Progress (5): 49 kB | 69/116 kB | 35 kB | 20/29 kB | 16/121 kB
Progress (5): 49 kB | 69/116 kB | 35 kB | 24/29 kB | 16/121 kB
Progress (5): 49 kB | 69/116 kB | 35 kB | 24/29 kB | 20/121 kB
Progress (5): 49 kB | 69/116 kB | 35 kB | 28/29 kB | 20/121 kB
Progress (5): 49 kB | 69/116 kB | 35 kB | 29 kB | 20/121 kB   
Progress (5): 49 kB | 69/116 kB | 35 kB | 29 kB | 24/121 kB
Progress (5): 49 kB | 69/116 kB | 35 kB | 29 kB | 28/121 kB
Progress (5): 49 kB | 69/116 kB | 35 kB | 29 kB | 32/121 kB
Progress (5): 49 kB | 69/116 kB | 35 kB | 29 kB | 37/121 kB
Progress (5): 49 kB | 69/116 kB | 35 kB | 29 kB | 41/121 kB
Progress (5): 49 kB | 69/116 kB | 35 kB | 29 kB | 45/121 kB
Progress (5): 49 kB | 69/116 kB | 35 kB | 29 kB | 49/121 kB
Progress (5): 49 kB | 69/116 kB | 35 kB | 29 kB | 53/121 kB
Progress (5): 49 kB | 69/116 kB | 35 kB | 29 kB | 57/121 kB
Progress (5): 49 kB | 69/116 kB | 35 kB | 29 kB | 61/121 kB
Progress (5): 49 kB | 69/116 kB | 35 kB | 29 kB | 65/121 kB
Progress (5): 49 kB | 69/116 kB | 35 kB | 29 kB | 69/121 kB
Progress (5): 49 kB | 69/116 kB | 35 kB | 29 kB | 73/121 kB
Progress (5): 49 kB | 69/116 kB | 35 kB | 29 kB | 77/121 kB
Progress (5): 49 kB | 69/116 kB | 35 kB | 29 kB | 82/121 kB
Progress (5): 49 kB | 69/116 kB | 35 kB | 29 kB | 86/121 kB
Progress (5): 49 kB | 69/116 kB | 35 kB | 29 kB | 90/121 kB
Progress (5): 49 kB | 69/116 kB | 35 kB | 29 kB | 94/121 kB
Progress (5): 49 kB | 69/116 kB | 35 kB | 29 kB | 98/121 kB
Progress (5): 49 kB | 69/116 kB | 35 kB | 29 kB | 102/121 kB
Progress (5): 49 kB | 69/116 kB | 35 kB | 29 kB | 106/121 kB
Progress (5): 49 kB | 73/116 kB | 35 kB | 29 kB | 106/121 kB
Progress (5): 49 kB | 77/116 kB | 35 kB | 29 kB | 106/121 kB
Progress (5): 49 kB | 82/116 kB | 35 kB | 29 kB | 106/121 kB
Progress (5): 49 kB | 86/116 kB | 35 kB | 29 kB | 106/121 kB
Progress (5): 49 kB | 90/116 kB | 35 kB | 29 kB | 106/121 kB
Progress (5): 49 kB | 94/116 kB | 35 kB | 29 kB | 106/121 kB
Progress (5): 49 kB | 98/116 kB | 35 kB | 29 kB | 106/121 kB
Progress (5): 49 kB | 102/116 kB | 35 kB | 29 kB | 106/121 kB
Progress (5): 49 kB | 106/116 kB | 35 kB | 29 kB | 106/121 kB
Progress (5): 49 kB | 110/116 kB | 35 kB | 29 kB | 106/121 kB
Progress (5): 49 kB | 114/116 kB | 35 kB | 29 kB | 106/121 kB
Progress (5): 49 kB | 116 kB | 35 kB | 29 kB | 106/121 kB    
                                                         
Downloaded from RSO-public-group: http://repository.sonatype.org/content/groups/sonatype-public-grid/org/apache/maven/maven-settings/2.0.6/maven-settings-2.0.6.jar (49 kB at 325 kB/s)
Downloading from RSO-public-group: http://repository.sonatype.org/content/groups/sonatype-public-grid/org/apache/maven/maven-model/2.0.6/maven-model-2.0.6.jar
Progress (4): 116 kB | 35 kB | 29 kB | 110/121 kB
Progress (4): 116 kB | 35 kB | 29 kB | 114/121 kB
Progress (4): 116 kB | 35 kB | 29 kB | 118/121 kB
Progress (4): 116 kB | 35 kB | 29 kB | 121 kB    
                                             
Downloaded from RSO-public-group: http://repository.sonatype.org/content/groups/sonatype-public-grid/org/apache/maven/maven-plugin-registry/2.0.6/maven-plugin-registry-2.0.6.jar (29 kB at 182 kB/s)
Downloading from RSO-public-group: http://repository.sonatype.org/content/groups/sonatype-public-grid/org/apache/maven/maven-artifact-manager/2.0.6/maven-artifact-manager-2.0.6.jar
Downloaded from RSO-public-group: http://repository.sonatype.org/content/groups/sonatype-public-grid/org/apache/maven/maven-project/2.0.6/maven-project-2.0.6.jar (116 kB at 615 kB/s)
Downloading from RSO-public-group: http://repository.sonatype.org/content/groups/sonatype-public-grid/org/apache/maven/maven-repository-metadata/2.0.6/maven-repository-metadata-2.0.6.jar
Progress (3): 35 kB | 121 kB | 4.1/86 kB
Progress (3): 35 kB | 121 kB | 7.8/86 kB
Progress (3): 35 kB | 121 kB | 12/86 kB 
Progress (3): 35 kB | 121 kB | 16/86 kB
Progress (3): 35 kB | 121 kB | 20/86 kB
Progress (3): 35 kB | 121 kB | 24/86 kB
Progress (3): 35 kB | 121 kB | 28/86 kB
Progress (3): 35 kB | 121 kB | 32/86 kB
Progress (3): 35 kB | 121 kB | 37/86 kB
Progress (3): 35 kB | 121 kB | 41/86 kB
                                       
Downloaded from RSO-public-group: http://repository.sonatype.org/content/groups/sonatype-public-grid/junit/junit/3.8.1/junit-3.8.1.jar (121 kB at 536 kB/s)
Progress (2): 35 kB | 45/86 kB
                              
Downloading from RSO-public-group: http://repository.sonatype.org/content/groups/sonatype-public-grid/org/apache/maven/maven-artifact/2.0.6/maven-artifact-2.0.6.jar
Progress (2): 35 kB | 49/86 kB
Progress (2): 35 kB | 53/86 kB
Progress (2): 35 kB | 57/86 kB
Progress (2): 35 kB | 61/86 kB
Progress (2): 35 kB | 65/86 kB
Progress (2): 35 kB | 69/86 kB
Progress (2): 35 kB | 73/86 kB
Progress (3): 35 kB | 73/86 kB | 4.1/57 kB
Progress (3): 35 kB | 73/86 kB | 7.8/57 kB
Progress (3): 35 kB | 73/86 kB | 12/57 kB 
Progress (3): 35 kB | 73/86 kB | 16/57 kB
Progress (3): 35 kB | 73/86 kB | 20/57 kB
Progress (3): 35 kB | 73/86 kB | 24/57 kB
Progress (3): 35 kB | 73/86 kB | 28/57 kB
Progress (3): 35 kB | 73/86 kB | 32/57 kB
Progress (3): 35 kB | 73/86 kB | 37/57 kB
Progress (3): 35 kB | 73/86 kB | 41/57 kB
Progress (3): 35 kB | 73/86 kB | 45/57 kB
Progress (3): 35 kB | 73/86 kB | 49/57 kB
Progress (3): 35 kB | 73/86 kB | 53/57 kB
Progress (3): 35 kB | 73/86 kB | 57 kB   
Progress (3): 35 kB | 77/86 kB | 57 kB
Progress (3): 35 kB | 82/86 kB | 57 kB
Progress (3): 35 kB | 86/86 kB | 57 kB
Progress (3): 35 kB | 86 kB | 57 kB   
Progress (4): 35 kB | 86 kB | 57 kB | 4.1/24 kB
Progress (4): 35 kB | 86 kB | 57 kB | 7.8/24 kB
Progress (4): 35 kB | 86 kB | 57 kB | 12/24 kB 
Progress (4): 35 kB | 86 kB | 57 kB | 16/24 kB
Progress (4): 35 kB | 86 kB | 57 kB | 20/24 kB
Progress (4): 35 kB | 86 kB | 57 kB | 24/24 kB
Progress (4): 35 kB | 86 kB | 57 kB | 24 kB   
Progress (5): 35 kB | 86 kB | 57 kB | 24 kB | 4.1/87 kB
Progress (5): 35 kB | 86 kB | 57 kB | 24 kB | 7.8/87 kB
Progress (5): 35 kB | 86 kB | 57 kB | 24 kB | 12/87 kB 
Progress (5): 35 kB | 86 kB | 57 kB | 24 kB | 16/87 kB
Progress (5): 35 kB | 86 kB | 57 kB | 24 kB | 20/87 kB
Progress (5): 35 kB | 86 kB | 57 kB | 24 kB | 24/87 kB
Progress (5): 35 kB | 86 kB | 57 kB | 24 kB | 28/87 kB
Progress (5): 35 kB | 86 kB | 57 kB | 24 kB | 32/87 kB
Progress (5): 35 kB | 86 kB | 57 kB | 24 kB | 37/87 kB
Progress (5): 35 kB | 86 kB | 57 kB | 24 kB | 41/87 kB
Progress (5): 35 kB | 86 kB | 57 kB | 24 kB | 45/87 kB
Progress (5): 35 kB | 86 kB | 57 kB | 24 kB | 49/87 kB
Progress (5): 35 kB | 86 kB | 57 kB | 24 kB | 53/87 kB
Progress (5): 35 kB | 86 kB | 57 kB | 24 kB | 57/87 kB
Progress (5): 35 kB | 86 kB | 57 kB | 24 kB | 61/87 kB
Progress (5): 35 kB | 86 kB | 57 kB | 24 kB | 65/87 kB
Progress (5): 35 kB | 86 kB | 57 kB | 24 kB | 69/87 kB
Progress (5): 35 kB | 86 kB | 57 kB | 24 kB | 73/87 kB
                                                      
Downloaded from RSO-public-group: http://repository.sonatype.org/content/groups/sonatype-public-grid/org/apache/maven/maven-artifact-manager/2.0.6/maven-artifact-manager-2.0.6.jar (57 kB at 183 kB/s)
Downloading from RSO-public-group: http://repository.sonatype.org/content/groups/sonatype-public-grid/org/codehaus/plexus/plexus-digest/1.0/plexus-digest-1.0.jar
Downloaded from RSO-public-group: http://repository.sonatype.org/content/groups/sonatype-public-grid/org/apache/maven/maven-model/2.0.6/maven-model-2.0.6.jar (86 kB at 263 kB/s)
Progress (3): 35 kB | 24 kB | 77/87 kB
Progress (3): 35 kB | 24 kB | 82/87 kB
Progress (3): 35 kB | 24 kB | 86/87 kB
Progress (3): 35 kB | 24 kB | 87 kB   
                                   
Downloaded from RSO-public-group: http://repository.sonatype.org/content/groups/sonatype-public-grid/org/apache/maven/maven-repository-metadata/2.0.6/maven-repository-metadata-2.0.6.jar (24 kB at 72 kB/s)
Progress (3): 35 kB | 87 kB | 4.1/12 kB
Progress (3): 35 kB | 87 kB | 7.8/12 kB
Progress (3): 35 kB | 87 kB | 12 kB    
                                   
Downloaded from RSO-public-group: http://repository.sonatype.org/content/groups/sonatype-public-grid/org/apache/maven/maven-profile/2.0.6/maven-profile-2.0.6.jar (35 kB at 90 kB/s)
Downloaded from RSO-public-group: http://repository.sonatype.org/content/groups/sonatype-public-grid/org/apache/maven/maven-artifact/2.0.6/maven-artifact-2.0.6.jar (87 kB at 214 kB/s)
Downloaded from RSO-public-group: http://repository.sonatype.org/content/groups/sonatype-public-grid/org/codehaus/plexus/plexus-digest/1.0/plexus-digest-1.0.jar (12 kB at 26 kB/s)
[INFO] Installing /home/jenkins/agent/workspace/m2eclipse-mavenarchiver/pom.xml to /home/jenkins/agent/workspace/m2eclipse-mavenarchiver/.repository/org/sonatype/m2e/extras/org.sonatype.m2e.mavenarchiver.parent/0.17.5-SNAPSHOT/org.sonatype.m2e.mavenarchiver.parent-0.17.5-SNAPSHOT.pom
[INFO] 
[INFO] -------< org.sonatype.m2e.extras:org.sonatype.m2e.mavenarchiver >-------
[INFO] Building org.sonatype.m2e.mavenarchiver 0.17.5-SNAPSHOT            [2/5]
[INFO] ---------------------------[ eclipse-plugin ]---------------------------
[INFO] 
[INFO] --- maven-clean-plugin:2.4.1:clean (default-clean) @ org.sonatype.m2e.mavenarchiver ---
[INFO] 
[INFO] --- tycho-packaging-plugin:1.6.0:build-qualifier (default-build-qualifier) @ org.sonatype.m2e.mavenarchiver ---
[INFO] The project's OSGi version is 0.17.5.202002191354
[INFO] 
[INFO] --- tycho-packaging-plugin:1.6.0:validate-id (default-validate-id) @ org.sonatype.m2e.mavenarchiver ---
[INFO] 
[INFO] --- tycho-packaging-plugin:1.6.0:validate-version (default-validate-version) @ org.sonatype.m2e.mavenarchiver ---
[INFO] 
[INFO] --- maven-resources-plugin:2.6:resources (default-resources) @ org.sonatype.m2e.mavenarchiver ---
Downloading from cbi: https://repo.eclipse.org/content/repositories/cbi-releases/org/apache/maven/maven-core/2.0.6/maven-core-2.0.6.pom
Downloading from RSO-public-group: http://repository.sonatype.org/content/groups/sonatype-public-grid/org/apache/maven/maven-core/2.0.6/maven-core-2.0.6.pom
Progress (1): 4.1/6.7 kB
Progress (1): 6.7 kB    
                    
Downloaded from RSO-public-group: http://repository.sonatype.org/content/groups/sonatype-public-grid/org/apache/maven/maven-core/2.0.6/maven-core-2.0.6.pom (6.7 kB at 45 kB/s)
Downloading from cbi: https://repo.eclipse.org/content/repositories/cbi-releases/org/apache/maven/maven-plugin-parameter-documenter/2.0.6/maven-plugin-parameter-documenter-2.0.6.pom
Downloading from RSO-public-group: http://repository.sonatype.org/content/groups/sonatype-public-grid/org/apache/maven/maven-plugin-parameter-documenter/2.0.6/maven-plugin-parameter-documenter-2.0.6.pom
Progress (1): 1.9 kB
                    
Downloaded from RSO-public-group: http://repository.sonatype.org/content/groups/sonatype-public-grid/org/apache/maven/maven-plugin-parameter-documenter/2.0.6/maven-plugin-parameter-documenter-2.0.6.pom (1.9 kB at 13 kB/s)
Downloading from cbi: https://repo.eclipse.org/content/repositories/cbi-releases/org/apache/maven/reporting/maven-reporting-api/2.0.6/maven-reporting-api-2.0.6.pom
Downloading from RSO-public-group: http://repository.sonatype.org/content/groups/sonatype-public-grid/org/apache/maven/reporting/maven-reporting-api/2.0.6/maven-reporting-api-2.0.6.pom
Progress (1): 1.8 kB
                    
Downloaded from RSO-public-group: http://repository.sonatype.org/content/groups/sonatype-public-grid/org/apache/maven/reporting/maven-reporting-api/2.0.6/maven-reporting-api-2.0.6.pom (1.8 kB at 12 kB/s)
Downloading from cbi: https://repo.eclipse.org/content/repositories/cbi-releases/org/apache/maven/reporting/maven-reporting/2.0.6/maven-reporting-2.0.6.pom
Downloading from RSO-public-group: http://repository.sonatype.org/content/groups/sonatype-public-grid/org/apache/maven/reporting/maven-reporting/2.0.6/maven-reporting-2.0.6.pom
Progress (1): 1.4 kB
                    
Downloaded from RSO-public-group: http://repository.sonatype.org/content/groups/sonatype-public-grid/org/apache/maven/reporting/maven-reporting/2.0.6/maven-reporting-2.0.6.pom (1.4 kB at 9.7 kB/s)
Downloading from cbi: https://repo.eclipse.org/content/repositories/cbi-releases/org/apache/maven/doxia/doxia-sink-api/1.0-alpha-7/doxia-sink-api-1.0-alpha-7.pom
Downloading from RSO-public-group: http://repository.sonatype.org/content/groups/sonatype-public-grid/org/apache/maven/doxia/doxia-sink-api/1.0-alpha-7/doxia-sink-api-1.0-alpha-7.pom
Progress (1): 424 B
                   
Downloaded from RSO-public-group: http://repository.sonatype.org/content/groups/sonatype-public-grid/org/apache/maven/doxia/doxia-sink-api/1.0-alpha-7/doxia-sink-api-1.0-alpha-7.pom (424 B at 2.9 kB/s)
Downloading from cbi: https://repo.eclipse.org/content/repositories/cbi-releases/org/apache/maven/doxia/doxia/1.0-alpha-7/doxia-1.0-alpha-7.pom
Downloading from RSO-public-group: http://repository.sonatype.org/content/groups/sonatype-public-grid/org/apache/maven/doxia/doxia/1.0-alpha-7/doxia-1.0-alpha-7.pom
Progress (1): 3.9 kB
                    
Downloaded from RSO-public-group: http://repository.sonatype.org/content/groups/sonatype-public-grid/org/apache/maven/doxia/doxia/1.0-alpha-7/doxia-1.0-alpha-7.pom (3.9 kB at 27 kB/s)
Downloading from cbi: https://repo.eclipse.org/content/repositories/cbi-releases/org/apache/maven/maven-error-diagnostics/2.0.6/maven-error-diagnostics-2.0.6.pom
Downloading from RSO-public-group: http://repository.sonatype.org/content/groups/sonatype-public-grid/org/apache/maven/maven-error-diagnostics/2.0.6/maven-error-diagnostics-2.0.6.pom
Progress (1): 1.7 kB
                    
Downloaded from RSO-public-group: http://repository.sonatype.org/content/groups/sonatype-public-grid/org/apache/maven/maven-error-diagnostics/2.0.6/maven-error-diagnostics-2.0.6.pom (1.7 kB at 12 kB/s)
Downloading from cbi: https://repo.eclipse.org/content/repositories/cbi-releases/commons-cli/commons-cli/1.0/commons-cli-1.0.pom
Downloading from RSO-public-group: http://repository.sonatype.org/content/groups/sonatype-public-grid/commons-cli/commons-cli/1.0/commons-cli-1.0.pom
Progress (1): 2.1 kB
                    
Downloaded from RSO-public-group: http://repository.sonatype.org/content/groups/sonatype-public-grid/commons-cli/commons-cli/1.0/commons-cli-1.0.pom (2.1 kB at 15 kB/s)
Downloading from cbi: https://repo.eclipse.org/content/repositories/cbi-releases/org/apache/maven/maven-plugin-descriptor/2.0.6/maven-plugin-descriptor-2.0.6.pom
Downloading from RSO-public-group: http://repository.sonatype.org/content/groups/sonatype-public-grid/org/apache/maven/maven-plugin-descriptor/2.0.6/maven-plugin-descriptor-2.0.6.pom
Progress (1): 2.0 kB
                    
Downloaded from RSO-public-group: http://repository.sonatype.org/content/groups/sonatype-public-grid/org/apache/maven/maven-plugin-descriptor/2.0.6/maven-plugin-descriptor-2.0.6.pom (2.0 kB at 14 kB/s)
Downloading from cbi: https://repo.eclipse.org/content/repositories/cbi-releases/org/codehaus/plexus/plexus-interactivity-api/1.0-alpha-4/plexus-interactivity-api-1.0-alpha-4.pom
Downloading from RSO-public-group: http://repository.sonatype.org/content/groups/sonatype-public-grid/org/codehaus/plexus/plexus-interactivity-api/1.0-alpha-4/plexus-interactivity-api-1.0-alpha-4.pom
Progress (1): 4.1/7.1 kB
Progress (1): 7.1 kB    
                    
Downloaded from RSO-public-group: http://repository.sonatype.org/content/groups/sonatype-public-grid/org/codehaus/plexus/plexus-interactivity-api/1.0-alpha-4/plexus-interactivity-api-1.0-alpha-4.pom (7.1 kB at 48 kB/s)
Downloading from cbi: https://repo.eclipse.org/content/repositories/cbi-releases/org/apache/maven/maven-monitor/2.0.6/maven-monitor-2.0.6.pom
Downloading from RSO-public-group: http://repository.sonatype.org/content/groups/sonatype-public-grid/org/apache/maven/maven-monitor/2.0.6/maven-monitor-2.0.6.pom
Progress (1): 1.3 kB
                    
Downloaded from RSO-public-group: http://repository.sonatype.org/content/groups/sonatype-public-grid/org/apache/maven/maven-monitor/2.0.6/maven-monitor-2.0.6.pom (1.3 kB at 8.6 kB/s)
Downloading from cbi: https://repo.eclipse.org/content/repositories/cbi-releases/classworlds/classworlds/1.1/classworlds-1.1.pom
Downloading from RSO-public-group: http://repository.sonatype.org/content/groups/sonatype-public-grid/classworlds/classworlds/1.1/classworlds-1.1.pom
Progress (1): 3.3 kB
                    
Downloaded from RSO-public-group: http://repository.sonatype.org/content/groups/sonatype-public-grid/classworlds/classworlds/1.1/classworlds-1.1.pom (3.3 kB at 23 kB/s)
Downloading from cbi: https://repo.eclipse.org/content/repositories/cbi-releases/org/apache/maven/shared/maven-filtering/1.1/maven-filtering-1.1.pom
Downloading from RSO-public-group: http://repository.sonatype.org/content/groups/sonatype-public-grid/org/apache/maven/shared/maven-filtering/1.1/maven-filtering-1.1.pom
Progress (1): 4.1/5.8 kB
Progress (1): 5.8 kB    
                    
Downloaded from RSO-public-group: http://repository.sonatype.org/content/groups/sonatype-public-grid/org/apache/maven/shared/maven-filtering/1.1/maven-filtering-1.1.pom (5.8 kB at 39 kB/s)
Downloading from cbi: https://repo.eclipse.org/content/repositories/cbi-releases/org/apache/maven/shared/maven-shared-components/17/maven-shared-components-17.pom
Downloading from RSO-public-group: http://repository.sonatype.org/content/groups/sonatype-public-grid/org/apache/maven/shared/maven-shared-components/17/maven-shared-components-17.pom
Progress (1): 4.1/8.7 kB
Progress (1): 7.9/8.7 kB
Progress (1): 8.7 kB    
                    
Downloaded from RSO-public-group: http://repository.sonatype.org/content/groups/sonatype-public-grid/org/apache/maven/shared/maven-shared-components/17/maven-shared-components-17.pom (8.7 kB at 60 kB/s)
Downloading from cbi: https://repo.eclipse.org/content/repositories/cbi-releases/org/apache/maven/maven-parent/21/maven-parent-21.pom
Downloading from RSO-public-group: http://repository.sonatype.org/content/groups/sonatype-public-grid/org/apache/maven/maven-parent/21/maven-parent-21.pom
Progress (1): 4.1/26 kB
Progress (1): 7.9/26 kB
Progress (1): 12/26 kB 
Progress (1): 16/26 kB
Progress (1): 20/26 kB
Progress (1): 24/26 kB
Progress (1): 26 kB   
                   
Downloaded from RSO-public-group: http://repository.sonatype.org/content/groups/sonatype-public-grid/org/apache/maven/maven-parent/21/maven-parent-21.pom (26 kB at 181 kB/s)
Downloading from cbi: https://repo.eclipse.org/content/repositories/cbi-releases/org/apache/apache/10/apache-10.pom
Downloading from RSO-public-group: http://repository.sonatype.org/content/groups/sonatype-public-grid/org/apache/apache/10/apache-10.pom
Progress (1): 4.1/15 kB
Progress (1): 7.9/15 kB
Progress (1): 12/15 kB 
Progress (1): 15 kB   
                   
Downloaded from RSO-public-group: http://repository.sonatype.org/content/groups/sonatype-public-grid/org/apache/apache/10/apache-10.pom (15 kB at 101 kB/s)
Downloading from cbi: https://repo.eclipse.org/content/repositories/cbi-releases/org/codehaus/plexus/plexus-utils/1.5.15/plexus-utils-1.5.15.pom
Downloading from RSO-public-group: http://repository.sonatype.org/content/groups/sonatype-public-grid/org/codehaus/plexus/plexus-utils/1.5.15/plexus-utils-1.5.15.pom
Progress (1): 4.1/6.8 kB
Progress (1): 6.8 kB    
                    
Downloaded from RSO-public-group: http://repository.sonatype.org/content/groups/sonatype-public-grid/org/codehaus/plexus/plexus-utils/1.5.15/plexus-utils-1.5.15.pom (6.8 kB at 47 kB/s)
Downloading from cbi: https://repo.eclipse.org/content/repositories/cbi-releases/org/codehaus/plexus/plexus-interpolation/1.12/plexus-interpolation-1.12.pom
Downloading from RSO-public-group: http://repository.sonatype.org/content/groups/sonatype-public-grid/org/codehaus/plexus/plexus-interpolation/1.12/plexus-interpolation-1.12.pom
Progress (1): 889 B
                   
Downloaded from RSO-public-group: http://repository.sonatype.org/content/groups/sonatype-public-grid/org/codehaus/plexus/plexus-interpolation/1.12/plexus-interpolation-1.12.pom (889 B at 6.0 kB/s)
Downloading from cbi: https://repo.eclipse.org/content/repositories/cbi-releases/org/sonatype/plexus/plexus-build-api/0.0.4/plexus-build-api-0.0.4.pom
Downloading from RSO-public-group: http://repository.sonatype.org/content/groups/sonatype-public-grid/org/sonatype/plexus/plexus-build-api/0.0.4/plexus-build-api-0.0.4.pom
Progress (1): 2.9 kB
                    
Downloaded from RSO-public-group: http://repository.sonatype.org/content/groups/sonatype-public-grid/org/sonatype/plexus/plexus-build-api/0.0.4/plexus-build-api-0.0.4.pom (2.9 kB at 20 kB/s)
Downloading from cbi: https://repo.eclipse.org/content/repositories/cbi-releases/org/sonatype/spice/spice-parent/10/spice-parent-10.pom
Downloading from RSO-public-group: http://repository.sonatype.org/content/groups/sonatype-public-grid/org/sonatype/spice/spice-parent/10/spice-parent-10.pom
Progress (1): 3.0 kB
                    
Downloaded from RSO-public-group: http://repository.sonatype.org/content/groups/sonatype-public-grid/org/sonatype/spice/spice-parent/10/spice-parent-10.pom (3.0 kB at 21 kB/s)
Downloading from cbi: https://repo.eclipse.org/content/repositories/cbi-releases/org/sonatype/forge/forge-parent/3/forge-parent-3.pom
Downloading from RSO-public-group: http://repository.sonatype.org/content/groups/sonatype-public-grid/org/sonatype/forge/forge-parent/3/forge-parent-3.pom
Progress (1): 4.1/5.0 kB
Progress (1): 5.0 kB    
                    
Downloaded from RSO-public-group: http://repository.sonatype.org/content/groups/sonatype-public-grid/org/sonatype/forge/forge-parent/3/forge-parent-3.pom (5.0 kB at 13 kB/s)
Downloading from cbi: https://repo.eclipse.org/content/repositories/cbi-releases/org/codehaus/plexus/plexus-utils/1.5.8/plexus-utils-1.5.8.pom
Downloading from RSO-public-group: http://repository.sonatype.org/content/groups/sonatype-public-grid/org/codehaus/plexus/plexus-utils/1.5.8/plexus-utils-1.5.8.pom
Progress (1): 4.1/8.1 kB
Progress (1): 7.9/8.1 kB
Progress (1): 8.1 kB    
                    
Downloaded from RSO-public-group: http://repository.sonatype.org/content/groups/sonatype-public-grid/org/codehaus/plexus/plexus-utils/1.5.8/plexus-utils-1.5.8.pom (8.1 kB at 55 kB/s)
Downloading from cbi: https://repo.eclipse.org/content/repositories/cbi-releases/org/codehaus/plexus/plexus-interpolation/1.13/plexus-interpolation-1.13.pom
Downloading from RSO-public-group: http://repository.sonatype.org/content/groups/sonatype-public-grid/org/codehaus/plexus/plexus-interpolation/1.13/plexus-interpolation-1.13.pom
Progress (1): 890 B
                   
Downloaded from RSO-public-group: http://repository.sonatype.org/content/groups/sonatype-public-grid/org/codehaus/plexus/plexus-interpolation/1.13/plexus-interpolation-1.13.pom (890 B at 6.0 kB/s)
Downloading from cbi: https://repo.eclipse.org/content/repositories/cbi-releases/org/codehaus/plexus/plexus-components/1.1.15/plexus-components-1.1.15.pom
Downloading from RSO-public-group: http://repository.sonatype.org/content/groups/sonatype-public-grid/org/codehaus/plexus/plexus-components/1.1.15/plexus-components-1.1.15.pom
Progress (1): 2.8 kB
                    
Downloaded from RSO-public-group: http://repository.sonatype.org/content/groups/sonatype-public-grid/org/codehaus/plexus/plexus-components/1.1.15/plexus-components-1.1.15.pom (2.8 kB at 19 kB/s)
Downloading from cbi: https://repo.eclipse.org/content/repositories/cbi-releases/org/codehaus/plexus/plexus/2.0.3/plexus-2.0.3.pom
Downloading from RSO-public-group: http://repository.sonatype.org/content/groups/sonatype-public-grid/org/codehaus/plexus/plexus/2.0.3/plexus-2.0.3.pom
Progress (1): 4.1/15 kB
Progress (1): 7.9/15 kB
Progress (1): 12/15 kB 
Progress (1): 15 kB   
                   
Downloaded from RSO-public-group: http://repository.sonatype.org/content/groups/sonatype-public-grid/org/codehaus/plexus/plexus/2.0.3/plexus-2.0.3.pom (15 kB at 105 kB/s)
Downloading from cbi: https://repo.eclipse.org/content/repositories/cbi-releases/org/apache/maven/maven-core/2.0.6/maven-core-2.0.6.jar
Downloading from cbi: https://repo.eclipse.org/content/repositories/cbi-releases/org/apache/maven/maven-plugin-parameter-documenter/2.0.6/maven-plugin-parameter-documenter-2.0.6.jar
Downloading from cbi: https://repo.eclipse.org/content/repositories/cbi-releases/org/apache/maven/maven-error-diagnostics/2.0.6/maven-error-diagnostics-2.0.6.jar
Downloading from cbi: https://repo.eclipse.org/content/repositories/cbi-releases/org/apache/maven/reporting/maven-reporting-api/2.0.6/maven-reporting-api-2.0.6.jar
Downloading from cbi: https://repo.eclipse.org/content/repositories/cbi-releases/org/apache/maven/doxia/doxia-sink-api/1.0-alpha-7/doxia-sink-api-1.0-alpha-7.jar
Downloading from cbi: https://repo.eclipse.org/content/repositories/cbi-releases/commons-cli/commons-cli/1.0/commons-cli-1.0.jar
Downloading from cbi: https://repo.eclipse.org/content/repositories/cbi-releases/org/apache/maven/maven-plugin-descriptor/2.0.6/maven-plugin-descriptor-2.0.6.jar
Downloading from cbi: https://repo.eclipse.org/content/repositories/cbi-releases/org/codehaus/plexus/plexus-interactivity-api/1.0-alpha-4/plexus-interactivity-api-1.0-alpha-4.jar
Downloading from cbi: https://repo.eclipse.org/content/repositories/cbi-releases/classworlds/classworlds/1.1/classworlds-1.1.jar
Downloading from cbi: https://repo.eclipse.org/content/repositories/cbi-releases/org/apache/maven/maven-monitor/2.0.6/maven-monitor-2.0.6.jar
Downloading from cbi: https://repo.eclipse.org/content/repositories/cbi-releases/org/apache/maven/shared/maven-filtering/1.1/maven-filtering-1.1.jar
Downloading from cbi: https://repo.eclipse.org/content/repositories/cbi-releases/org/sonatype/plexus/plexus-build-api/0.0.4/plexus-build-api-0.0.4.jar
Downloading from cbi: https://repo.eclipse.org/content/repositories/cbi-releases/org/codehaus/plexus/plexus-interpolation/1.13/plexus-interpolation-1.13.jar
Downloading from RSO-public-group: http://repository.sonatype.org/content/groups/sonatype-public-grid/org/apache/maven/maven-core/2.0.6/maven-core-2.0.6.jar
Downloading from RSO-public-group: http://repository.sonatype.org/content/groups/sonatype-public-grid/org/apache/maven/maven-plugin-parameter-documenter/2.0.6/maven-plugin-parameter-documenter-2.0.6.jar
Downloading from RSO-public-group: http://repository.sonatype.org/content/groups/sonatype-public-grid/org/apache/maven/maven-error-diagnostics/2.0.6/maven-error-diagnostics-2.0.6.jar
Downloading from RSO-public-group: http://repository.sonatype.org/content/groups/sonatype-public-grid/org/apache/maven/doxia/doxia-sink-api/1.0-alpha-7/doxia-sink-api-1.0-alpha-7.jar
Downloading from RSO-public-group: http://repository.sonatype.org/content/groups/sonatype-public-grid/org/apache/maven/reporting/maven-reporting-api/2.0.6/maven-reporting-api-2.0.6.jar
Progress (1): 4.1/152 kB
Progress (1): 7.8/152 kB
Progress (1): 12/152 kB 
Progress (1): 16/152 kB
Progress (1): 20/152 kB
Progress (1): 24/152 kB
Progress (1): 28/152 kB
Progress (1): 32/152 kB
Progress (1): 37/152 kB
Progress (1): 41/152 kB
Progress (1): 45/152 kB
Progress (1): 49/152 kB
Progress (1): 53/152 kB
Progress (2): 53/152 kB | 4.1/14 kB
Progress (2): 57/152 kB | 4.1/14 kB
Progress (2): 57/152 kB | 7.8/14 kB
Progress (2): 57/152 kB | 12/14 kB 
Progress (2): 61/152 kB | 12/14 kB
Progress (2): 61/152 kB | 14 kB   
Progress (2): 65/152 kB | 14 kB
Progress (3): 65/152 kB | 14 kB | 4.1/5.9 kB
Progress (3): 65/152 kB | 14 kB | 5.9 kB    
Progress (3): 69/152 kB | 14 kB | 5.9 kB
Progress (3): 73/152 kB | 14 kB | 5.9 kB
Progress (4): 73/152 kB | 14 kB | 5.9 kB | 4.1/9.9 kB
Progress (4): 73/152 kB | 14 kB | 5.9 kB | 7.8/9.9 kB
Progress (4): 73/152 kB | 14 kB | 5.9 kB | 9.9 kB    
Progress (5): 73/152 kB | 14 kB | 5.9 kB | 9.9 kB | 4.1/21 kB
Progress (5): 73/152 kB | 14 kB | 5.9 kB | 9.9 kB | 7.8/21 kB
Progress (5): 73/152 kB | 14 kB | 5.9 kB | 9.9 kB | 12/21 kB 
Progress (5): 73/152 kB | 14 kB | 5.9 kB | 9.9 kB | 16/21 kB
Progress (5): 73/152 kB | 14 kB | 5.9 kB | 9.9 kB | 20/21 kB
Progress (5): 73/152 kB | 14 kB | 5.9 kB | 9.9 kB | 21 kB   
Progress (5): 77/152 kB | 14 kB | 5.9 kB | 9.9 kB | 21 kB
Progress (5): 82/152 kB | 14 kB | 5.9 kB | 9.9 kB | 21 kB
Progress (5): 86/152 kB | 14 kB | 5.9 kB | 9.9 kB | 21 kB
Progress (5): 90/152 kB | 14 kB | 5.9 kB | 9.9 kB | 21 kB
Progress (5): 94/152 kB | 14 kB | 5.9 kB | 9.9 kB | 21 kB
Progress (5): 98/152 kB | 14 kB | 5.9 kB | 9.9 kB | 21 kB
Progress (5): 102/152 kB | 14 kB | 5.9 kB | 9.9 kB | 21 kB
Progress (5): 106/152 kB | 14 kB | 5.9 kB | 9.9 kB | 21 kB
Progress (5): 110/152 kB | 14 kB | 5.9 kB | 9.9 kB | 21 kB
Progress (5): 114/152 kB | 14 kB | 5.9 kB | 9.9 kB | 21 kB
Progress (5): 118/152 kB | 14 kB | 5.9 kB | 9.9 kB | 21 kB
Progress (5): 123/152 kB | 14 kB | 5.9 kB | 9.9 kB | 21 kB
Progress (5): 127/152 kB | 14 kB | 5.9 kB | 9.9 kB | 21 kB
Progress (5): 131/152 kB | 14 kB | 5.9 kB | 9.9 kB | 21 kB
Progress (5): 135/152 kB | 14 kB | 5.9 kB | 9.9 kB | 21 kB
Progress (5): 139/152 kB | 14 kB | 5.9 kB | 9.9 kB | 21 kB
Progress (5): 143/152 kB | 14 kB | 5.9 kB | 9.9 kB | 21 kB
Progress (5): 147/152 kB | 14 kB | 5.9 kB | 9.9 kB | 21 kB
Progress (5): 151/152 kB | 14 kB | 5.9 kB | 9.9 kB | 21 kB
Progress (5): 152 kB | 14 kB | 5.9 kB | 9.9 kB | 21 kB    
                                                      
Downloaded from RSO-public-group: http://repository.sonatype.org/content/groups/sonatype-public-grid/org/apache/maven/maven-error-diagnostics/2.0.6/maven-error-diagnostics-2.0.6.jar (14 kB at 90 kB/s)
Downloading from RSO-public-group: http://repository.sonatype.org/content/groups/sonatype-public-grid/commons-cli/commons-cli/1.0/commons-cli-1.0.jar
Downloaded from RSO-public-group: http://repository.sonatype.org/content/groups/sonatype-public-grid/org/apache/maven/doxia/doxia-sink-api/1.0-alpha-7/doxia-sink-api-1.0-alpha-7.jar (5.9 kB at 39 kB/s)
Downloading from RSO-public-group: http://repository.sonatype.org/content/groups/sonatype-public-grid/org/apache/maven/maven-plugin-descriptor/2.0.6/maven-plugin-descriptor-2.0.6.jar
Downloaded from RSO-public-group: http://repository.sonatype.org/content/groups/sonatype-public-grid/org/apache/maven/reporting/maven-reporting-api/2.0.6/maven-reporting-api-2.0.6.jar (9.9 kB at 64 kB/s)
Downloading from RSO-public-group: http://repository.sonatype.org/content/groups/sonatype-public-grid/org/codehaus/plexus/plexus-interactivity-api/1.0-alpha-4/plexus-interactivity-api-1.0-alpha-4.jar
Downloaded from RSO-public-group: http://repository.sonatype.org/content/groups/sonatype-public-grid/org/apache/maven/maven-plugin-parameter-documenter/2.0.6/maven-plugin-parameter-documenter-2.0.6.jar (21 kB at 129 kB/s)
Downloading from RSO-public-group: http://repository.sonatype.org/content/groups/sonatype-public-grid/classworlds/classworlds/1.1/classworlds-1.1.jar
Downloaded from RSO-public-group: http://repository.sonatype.org/content/groups/sonatype-public-grid/org/apache/maven/maven-core/2.0.6/maven-core-2.0.6.jar (152 kB at 798 kB/s)
Downloading from RSO-public-group: http://repository.sonatype.org/content/groups/sonatype-public-grid/org/apache/maven/maven-monitor/2.0.6/maven-monitor-2.0.6.jar
Progress (1): 4.1/30 kB
Progress (1): 7.8/30 kB
Progress (1): 12/30 kB 
Progress (1): 16/30 kB
Progress (1): 20/30 kB
Progress (1): 24/30 kB
Progress (1): 28/30 kB
Progress (1): 30 kB   
Progress (2): 30 kB | 4.1/37 kB
Progress (2): 30 kB | 7.8/37 kB
Progress (2): 30 kB | 12/37 kB 
Progress (2): 30 kB | 16/37 kB
Progress (2): 30 kB | 20/37 kB
Progress (3): 30 kB | 20/37 kB | 4.1/13 kB
Progress (3): 30 kB | 24/37 kB | 4.1/13 kB
Progress (3): 30 kB | 24/37 kB | 7.8/13 kB
Progress (3): 30 kB | 28/37 kB | 7.8/13 kB
Progress (3): 30 kB | 28/37 kB | 12/13 kB 
Progress (3): 30 kB | 28/37 kB | 13 kB   
Progress (3): 30 kB | 32/37 kB | 13 kB
Progress (3): 30 kB | 37/37 kB | 13 kB
Progress (3): 30 kB | 37 kB | 13 kB   
Progress (4): 30 kB | 37 kB | 13 kB | 4.1/38 kB
Progress (4): 30 kB | 37 kB | 13 kB | 7.8/38 kB
Progress (4): 30 kB | 37 kB | 13 kB | 12/38 kB 
Progress (4): 30 kB | 37 kB | 13 kB | 16/38 kB
Progress (4): 30 kB | 37 kB | 13 kB | 20/38 kB
Progress (4): 30 kB | 37 kB | 13 kB | 24/38 kB
Progress (4): 30 kB | 37 kB | 13 kB | 28/38 kB
Progress (4): 30 kB | 37 kB | 13 kB | 32/38 kB
Progress (4): 30 kB | 37 kB | 13 kB | 37/38 kB
Progress (4): 30 kB | 37 kB | 13 kB | 38 kB   
Progress (5): 30 kB | 37 kB | 13 kB | 38 kB | 4.1/10 kB
Progress (5): 30 kB | 37 kB | 13 kB | 38 kB | 7.8/10 kB
Progress (5): 30 kB | 37 kB | 13 kB | 38 kB | 10 kB    
                                                   
Downloaded from RSO-public-group: http://repository.sonatype.org/content/groups/sonatype-public-grid/commons-cli/commons-cli/1.0/commons-cli-1.0.jar (30 kB at 101 kB/s)
Downloading from RSO-public-group: http://repository.sonatype.org/content/groups/sonatype-public-grid/org/apache/maven/shared/maven-filtering/1.1/maven-filtering-1.1.jar
Downloaded from RSO-public-group: http://repository.sonatype.org/content/groups/sonatype-public-grid/org/apache/maven/maven-plugin-descriptor/2.0.6/maven-plugin-descriptor-2.0.6.jar (37 kB at 122 kB/s)
Downloading from RSO-public-group: http://repository.sonatype.org/content/groups/sonatype-public-grid/org/sonatype/plexus/plexus-build-api/0.0.4/plexus-build-api-0.0.4.jar
Downloaded from RSO-public-group: http://repository.sonatype.org/content/groups/sonatype-public-grid/org/codehaus/plexus/plexus-interactivity-api/1.0-alpha-4/plexus-interactivity-api-1.0-alpha-4.jar (13 kB at 44 kB/s)
Downloading from RSO-public-group: http://repository.sonatype.org/content/groups/sonatype-public-grid/org/codehaus/plexus/plexus-interpolation/1.13/plexus-interpolation-1.13.jar
Downloaded from RSO-public-group: http://repository.sonatype.org/content/groups/sonatype-public-grid/classworlds/classworlds/1.1/classworlds-1.1.jar (38 kB at 122 kB/s)
Downloaded from RSO-public-group: http://repository.sonatype.org/content/groups/sonatype-public-grid/org/apache/maven/maven-monitor/2.0.6/maven-monitor-2.0.6.jar (10 kB at 30 kB/s)
Progress (1): 4.1/43 kB
Progress (1): 7.8/43 kB
Progress (1): 12/43 kB 
Progress (1): 16/43 kB
Progress (1): 20/43 kB
Progress (1): 24/43 kB
Progress (1): 28/43 kB
Progress (1): 32/43 kB
Progress (1): 37/43 kB
Progress (1): 41/43 kB
Progress (1): 43 kB   
Progress (2): 43 kB | 3.8/6.8 kB
Progress (2): 43 kB | 6.8 kB    
Progress (3): 43 kB | 6.8 kB | 4.1/61 kB
Progress (3): 43 kB | 6.8 kB | 7.8/61 kB
Progress (3): 43 kB | 6.8 kB | 12/61 kB 
Progress (3): 43 kB | 6.8 kB | 16/61 kB
Progress (3): 43 kB | 6.8 kB | 20/61 kB
Progress (3): 43 kB | 6.8 kB | 24/61 kB
Progress (3): 43 kB | 6.8 kB | 28/61 kB
Progress (3): 43 kB | 6.8 kB | 32/61 kB
Progress (3): 43 kB | 6.8 kB | 37/61 kB
Progress (3): 43 kB | 6.8 kB | 41/61 kB
Progress (3): 43 kB | 6.8 kB | 45/61 kB
Progress (3): 43 kB | 6.8 kB | 49/61 kB
Progress (3): 43 kB | 6.8 kB | 53/61 kB
Progress (3): 43 kB | 6.8 kB | 57/61 kB
Progress (3): 43 kB | 6.8 kB | 61 kB   
                                    
Downloaded from RSO-public-group: http://repository.sonatype.org/content/groups/sonatype-public-grid/org/apache/maven/shared/maven-filtering/1.1/maven-filtering-1.1.jar (43 kB at 96 kB/s)
Downloaded from RSO-public-group: http://repository.sonatype.org/content/groups/sonatype-public-grid/org/sonatype/plexus/plexus-build-api/0.0.4/plexus-build-api-0.0.4.jar (6.8 kB at 15 kB/s)
Downloaded from RSO-public-group: http://repository.sonatype.org/content/groups/sonatype-public-grid/org/codehaus/plexus/plexus-interpolation/1.13/plexus-interpolation-1.13.jar (61 kB at 133 kB/s)
[INFO] Using 'UTF-8' encoding to copy filtered resources.
[INFO] skip non existing resourceDirectory /home/jenkins/agent/workspace/m2eclipse-mavenarchiver/org.sonatype.m2e.mavenarchiver/src/main/resources
[INFO] 
[INFO] --- tycho-compiler-plugin:1.6.0:compile (default-compile) @ org.sonatype.m2e.mavenarchiver ---
Downloading from cbi: https://repo.eclipse.org/content/repositories/cbi-releases/org/codehaus/plexus/plexus-compiler-manager/2.8.5/plexus-compiler-manager-2.8.5.pom
Downloading from RSO-public-group: http://repository.sonatype.org/content/groups/sonatype-public-grid/org/codehaus/plexus/plexus-compiler-manager/2.8.5/plexus-compiler-manager-2.8.5.pom
Progress (1): 692 B
                   
Downloaded from RSO-public-group: http://repository.sonatype.org/content/groups/sonatype-public-grid/org/codehaus/plexus/plexus-compiler-manager/2.8.5/plexus-compiler-manager-2.8.5.pom (692 B at 4.8 kB/s)
Downloading from cbi: https://repo.eclipse.org/content/repositories/cbi-releases/org/codehaus/plexus/plexus-compiler/2.8.5/plexus-compiler-2.8.5.pom
Downloading from RSO-public-group: http://repository.sonatype.org/content/groups/sonatype-public-grid/org/codehaus/plexus/plexus-compiler/2.8.5/plexus-compiler-2.8.5.pom
Progress (1): 4.1/6.0 kB
Progress (1): 6.0 kB    
                    
Downloaded from RSO-public-group: http://repository.sonatype.org/content/groups/sonatype-public-grid/org/codehaus/plexus/plexus-compiler/2.8.5/plexus-compiler-2.8.5.pom (6.0 kB at 41 kB/s)
Downloading from cbi: https://repo.eclipse.org/content/repositories/cbi-releases/org/codehaus/plexus/plexus-components/4.0/plexus-components-4.0.pom
Downloading from RSO-public-group: http://repository.sonatype.org/content/groups/sonatype-public-grid/org/codehaus/plexus/plexus-components/4.0/plexus-components-4.0.pom
Progress (1): 2.7 kB
                    
Downloaded from RSO-public-group: http://repository.sonatype.org/content/groups/sonatype-public-grid/org/codehaus/plexus/plexus-components/4.0/plexus-components-4.0.pom (2.7 kB at 18 kB/s)
Downloading from cbi: https://repo.eclipse.org/content/repositories/cbi-releases/org/codehaus/plexus/plexus-compiler-api/2.8.5/plexus-compiler-api-2.8.5.pom
Downloading from RSO-public-group: http://repository.sonatype.org/content/groups/sonatype-public-grid/org/codehaus/plexus/plexus-compiler-api/2.8.5/plexus-compiler-api-2.8.5.pom
Progress (1): 867 B
                   
Downloaded from RSO-public-group: http://repository.sonatype.org/content/groups/sonatype-public-grid/org/codehaus/plexus/plexus-compiler-api/2.8.5/plexus-compiler-api-2.8.5.pom (867 B at 6.0 kB/s)
Downloading from cbi: https://repo.eclipse.org/content/repositories/cbi-releases/org/eclipse/tycho/tycho-compiler-jdt/1.6.0/tycho-compiler-jdt-1.6.0.pom
Downloading from RSO-public-group: http://repository.sonatype.org/content/groups/sonatype-public-grid/org/eclipse/tycho/tycho-compiler-jdt/1.6.0/tycho-compiler-jdt-1.6.0.pom
Progress (1): 2.4 kB
                    
Downloaded from RSO-public-group: http://repository.sonatype.org/content/groups/sonatype-public-grid/org/eclipse/tycho/tycho-compiler-jdt/1.6.0/tycho-compiler-jdt-1.6.0.pom (2.4 kB at 16 kB/s)
Downloading from cbi: https://repo.eclipse.org/content/repositories/cbi-releases/org/eclipse/tycho/tycho-lib-detector/1.6.0/tycho-lib-detector-1.6.0.pom
Downloading from RSO-public-group: http://repository.sonatype.org/content/groups/sonatype-public-grid/org/eclipse/tycho/tycho-lib-detector/1.6.0/tycho-lib-detector-1.6.0.pom
Progress (1): 1.6 kB
                    
Downloaded from RSO-public-group: http://repository.sonatype.org/content/groups/sonatype-public-grid/org/eclipse/tycho/tycho-lib-detector/1.6.0/tycho-lib-detector-1.6.0.pom (1.6 kB at 11 kB/s)
Downloading from cbi: https://repo.eclipse.org/content/repositories/cbi-releases/org/eclipse/jdt/ecj/3.20.0/ecj-3.20.0.pom
Downloading from RSO-public-group: http://repository.sonatype.org/content/groups/sonatype-public-grid/org/eclipse/jdt/ecj/3.20.0/ecj-3.20.0.pom
Progress (1): 1.7 kB
                    
Downloaded from RSO-public-group: http://repository.sonatype.org/content/groups/sonatype-public-grid/org/eclipse/jdt/ecj/3.20.0/ecj-3.20.0.pom (1.7 kB at 12 kB/s)
Downloading from cbi: https://repo.eclipse.org/content/repositories/cbi-releases/org/codehaus/plexus/plexus-compiler-manager/2.8.5/plexus-compiler-manager-2.8.5.jar
Downloading from cbi: https://repo.eclipse.org/content/repositories/cbi-releases/org/eclipse/tycho/tycho-lib-detector/1.6.0/tycho-lib-detector-1.6.0.jar
Downloading from cbi: https://repo.eclipse.org/content/repositories/cbi-releases/org/eclipse/jdt/ecj/3.20.0/ecj-3.20.0.jar
Downloading from cbi: https://repo.eclipse.org/content/repositories/cbi-releases/org/eclipse/tycho/tycho-compiler-jdt/1.6.0/tycho-compiler-jdt-1.6.0.jar
Downloading from cbi: https://repo.eclipse.org/content/repositories/cbi-releases/org/codehaus/plexus/plexus-compiler-api/2.8.5/plexus-compiler-api-2.8.5.jar
Downloading from RSO-public-group: http://repository.sonatype.org/content/groups/sonatype-public-grid/org/codehaus/plexus/plexus-compiler-manager/2.8.5/plexus-compiler-manager-2.8.5.jar
Downloading from RSO-public-group: http://repository.sonatype.org/content/groups/sonatype-public-grid/org/eclipse/tycho/tycho-lib-detector/1.6.0/tycho-lib-detector-1.6.0.jar
Downloading from RSO-public-group: http://repository.sonatype.org/content/groups/sonatype-public-grid/org/eclipse/tycho/tycho-compiler-jdt/1.6.0/tycho-compiler-jdt-1.6.0.jar
Downloading from RSO-public-group: http://repository.sonatype.org/content/groups/sonatype-public-grid/org/codehaus/plexus/plexus-compiler-api/2.8.5/plexus-compiler-api-2.8.5.jar
Downloading from RSO-public-group: http://repository.sonatype.org/content/groups/sonatype-public-grid/org/eclipse/jdt/ecj/3.20.0/ecj-3.20.0.jar
Progress (1): 3.5 kB
Progress (2): 3.5 kB | 4.1/4.7 kB
Progress (2): 3.5 kB | 4.7 kB    
Progress (3): 3.5 kB | 4.7 kB | 0/3.0 MB
Progress (3): 3.5 kB | 4.7 kB | 0/3.0 MB
Progress (3): 3.5 kB | 4.7 kB | 0.1/3.0 MB
Progress (4): 3.5 kB | 4.7 kB | 0.1/3.0 MB | 4.1/17 kB
Progress (4): 3.5 kB | 4.7 kB | 0.1/3.0 MB | 7.8/17 kB
Progress (4): 3.5 kB | 4.7 kB | 0.1/3.0 MB | 12/17 kB 
Progress (4): 3.5 kB | 4.7 kB | 0.1/3.0 MB | 16/17 kB
Progress (4): 3.5 kB | 4.7 kB | 0.1/3.0 MB | 17 kB   
Progress (4): 3.5 kB | 4.7 kB | 0.1/3.0 MB | 17 kB
Progress (5): 3.5 kB | 4.7 kB | 0.1/3.0 MB | 17 kB | 4.1/27 kB
Progress (5): 3.5 kB | 4.7 kB | 0.1/3.0 MB | 17 kB | 7.8/27 kB
Progress (5): 3.5 kB | 4.7 kB | 0.1/3.0 MB | 17 kB | 12/27 kB 
Progress (5): 3.5 kB | 4.7 kB | 0.1/3.0 MB | 17 kB | 16/27 kB
Progress (5): 3.5 kB | 4.7 kB | 0.1/3.0 MB | 17 kB | 20/27 kB
Progress (5): 3.5 kB | 4.7 kB | 0.1/3.0 MB | 17 kB | 24/27 kB
Progress (5): 3.5 kB | 4.7 kB | 0.1/3.0 MB | 17 kB | 27 kB   
Progress (5): 3.5 kB | 4.7 kB | 0.1/3.0 MB | 17 kB | 27 kB
Progress (5): 3.5 kB | 4.7 kB | 0.1/3.0 MB | 17 kB | 27 kB
Progress (5): 3.5 kB | 4.7 kB | 0.1/3.0 MB | 17 kB | 27 kB
Progress (5): 3.5 kB | 4.7 kB | 0.1/3.0 MB | 17 kB | 27 kB
Progress (5): 3.5 kB | 4.7 kB | 0.2/3.0 MB | 17 kB | 27 kB
Progress (5): 3.5 kB | 4.7 kB | 0.2/3.0 MB | 17 kB | 27 kB
                                                          
Downloaded from RSO-public-group: http://repository.sonatype.org/content/groups/sonatype-public-grid/org/eclipse/tycho/tycho-lib-detector/1.6.0/tycho-lib-detector-1.6.0.jar (3.5 kB at 24 kB/s)
Progress (4): 4.7 kB | 0.2/3.0 MB | 17 kB | 27 kB
Progress (4): 4.7 kB | 0.2/3.0 MB | 17 kB | 27 kB
Progress (4): 4.7 kB | 0.2/3.0 MB | 17 kB | 27 kB
Progress (4): 4.7 kB | 0.3/3.0 MB | 17 kB | 27 kB
                                                 
Downloaded from RSO-public-group: http://repository.sonatype.org/content/groups/sonatype-public-grid/org/codehaus/plexus/plexus-compiler-manager/2.8.5/plexus-compiler-manager-2.8.5.jar (4.7 kB at 31 kB/s)
Downloaded from RSO-public-group: http://repository.sonatype.org/content/groups/sonatype-public-grid/org/eclipse/tycho/tycho-compiler-jdt/1.6.0/tycho-compiler-jdt-1.6.0.jar (17 kB at 112 kB/s)
Progress (2): 0.3/3.0 MB | 27 kB
Progress (2): 0.3/3.0 MB | 27 kB
Progress (2): 0.3/3.0 MB | 27 kB
Progress (2): 0.3/3.0 MB | 27 kB
Progress (2): 0.3/3.0 MB | 27 kB
Progress (2): 0.4/3.0 MB | 27 kB
Progress (2): 0.4/3.0 MB | 27 kB
Progress (2): 0.4/3.0 MB | 27 kB
Progress (2): 0.4/3.0 MB | 27 kB
Progress (2): 0.4/3.0 MB | 27 kB
Progress (2): 0.4/3.0 MB | 27 kB
Progress (2): 0.5/3.0 MB | 27 kB
Progress (2): 0.5/3.0 MB | 27 kB
Progress (2): 0.5/3.0 MB | 27 kB
Progress (2): 0.5/3.0 MB | 27 kB
Progress (2): 0.5/3.0 MB | 27 kB
Progress (2): 0.5/3.0 MB | 27 kB
Progress (2): 0.6/3.0 MB | 27 kB
Progress (2): 0.6/3.0 MB | 27 kB
Progress (2): 0.6/3.0 MB | 27 kB
Progress (2): 0.6/3.0 MB | 27 kB
Progress (2): 0.6/3.0 MB | 27 kB
Progress (2): 0.6/3.0 MB | 27 kB
Progress (2): 0.7/3.0 MB | 27 kB
Progress (2): 0.7/3.0 MB | 27 kB
Progress (2): 0.7/3.0 MB | 27 kB
Progress (2): 0.7/3.0 MB | 27 kB
Progress (2): 0.7/3.0 MB | 27 kB
Progress (2): 0.7/3.0 MB | 27 kB
Progress (2): 0.8/3.0 MB | 27 kB
                                
Downloaded from RSO-public-group: http://repository.sonatype.org/content/groups/sonatype-public-grid/org/codehaus/plexus/plexus-compiler-api/2.8.5/plexus-compiler-api-2.8.5.jar (27 kB at 69 kB/s)
Progress (1): 0.8/3.0 MB
Progress (1): 0.8/3.0 MB
Progress (1): 0.8/3.0 MB
Progress (1): 0.8/3.0 MB
Progress (1): 0.8/3.0 MB
Progress (1): 0.9/3.0 MB
Progress (1): 0.9/3.0 MB
Progress (1): 0.9/3.0 MB
Progress (1): 0.9/3.0 MB
Progress (1): 0.9/3.0 MB
Progress (1): 0.9/3.0 MB
Progress (1): 1.0/3.0 MB
Progress (1): 1.0/3.0 MB
Progress (1): 1.0/3.0 MB
Progress (1): 1.0/3.0 MB
Progress (1): 1.0/3.0 MB
Progress (1): 1.0/3.0 MB
Progress (1): 1.1/3.0 MB
Progress (1): 1.1/3.0 MB
Progress (1): 1.1/3.0 MB
Progress (1): 1.1/3.0 MB
Progress (1): 1.1/3.0 MB
Progress (1): 1.1/3.0 MB
Progress (1): 1.2/3.0 MB
Progress (1): 1.2/3.0 MB
Progress (1): 1.2/3.0 MB
Progress (1): 1.2/3.0 MB
Progress (1): 1.2/3.0 MB
Progress (1): 1.2/3.0 MB
Progress (1): 1.3/3.0 MB
Progress (1): 1.3/3.0 MB
Progress (1): 1.3/3.0 MB
Progress (1): 1.3/3.0 MB
Progress (1): 1.3/3.0 MB
Progress (1): 1.3/3.0 MB
Progress (1): 1.4/3.0 MB
Progress (1): 1.4/3.0 MB
Progress (1): 1.4/3.0 MB
Progress (1): 1.4/3.0 MB
Progress (1): 1.4/3.0 MB
Progress (1): 1.4/3.0 MB
Progress (1): 1.4/3.0 MB
Progress (1): 1.5/3.0 MB
Progress (1): 1.5/3.0 MB
Progress (1): 1.5/3.0 MB
Progress (1): 1.5/3.0 MB
Progress (1): 1.5/3.0 MB
Progress (1): 1.5/3.0 MB
Progress (1): 1.6/3.0 MB
Progress (1): 1.6/3.0 MB
Progress (1): 1.6/3.0 MB
Progress (1): 1.6/3.0 MB
Progress (1): 1.6/3.0 MB
Progress (1): 1.6/3.0 MB
Progress (1): 1.7/3.0 MB
Progress (1): 1.7/3.0 MB
Progress (1): 1.7/3.0 MB
Progress (1): 1.7/3.0 MB
Progress (1): 1.7/3.0 MB
Progress (1): 1.7/3.0 MB
Progress (1): 1.8/3.0 MB
Progress (1): 1.8/3.0 MB
Progress (1): 1.8/3.0 MB
Progress (1): 1.8/3.0 MB
Progress (1): 1.8/3.0 MB
Progress (1): 1.8/3.0 MB
Progress (1): 1.9/3.0 MB
Progress (1): 1.9/3.0 MB
Progress (1): 1.9/3.0 MB
Progress (1): 1.9/3.0 MB
Progress (1): 1.9/3.0 MB
Progress (1): 1.9/3.0 MB
Progress (1): 2.0/3.0 MB
Progress (1): 2.0/3.0 MB
Progress (1): 2.0/3.0 MB
Progress (1): 2.0/3.0 MB
Progress (1): 2.0/3.0 MB
Progress (1): 2.0/3.0 MB
Progress (1): 2.1/3.0 MB
Progress (1): 2.1/3.0 MB
Progress (1): 2.1/3.0 MB
Progress (1): 2.1/3.0 MB
Progress (1): 2.1/3.0 MB
Progress (1): 2.1/3.0 MB
Progress (1): 2.2/3.0 MB
Progress (1): 2.2/3.0 MB
Progress (1): 2.2/3.0 MB
Progress (1): 2.2/3.0 MB
Progress (1): 2.2/3.0 MB
Progress (1): 2.2/3.0 MB
Progress (1): 2.3/3.0 MB
Progress (1): 2.3/3.0 MB
Progress (1): 2.3/3.0 MB
Progress (1): 2.3/3.0 MB
Progress (1): 2.3/3.0 MB
Progress (1): 2.3/3.0 MB
Progress (1): 2.4/3.0 MB
Progress (1): 2.4/3.0 MB
Progress (1): 2.4/3.0 MB
Progress (1): 2.4/3.0 MB
Progress (1): 2.4/3.0 MB
Progress (1): 2.4/3.0 MB
Progress (1): 2.4/3.0 MB
Progress (1): 2.5/3.0 MB
Progress (1): 2.5/3.0 MB
Progress (1): 2.5/3.0 MB
Progress (1): 2.5/3.0 MB
Progress (1): 2.5/3.0 MB
Progress (1): 2.5/3.0 MB
Progress (1): 2.6/3.0 MB
Progress (1): 2.6/3.0 MB
Progress (1): 2.6/3.0 MB
Progress (1): 2.6/3.0 MB
Progress (1): 2.6/3.0 MB
Progress (1): 2.6/3.0 MB
Progress (1): 2.7/3.0 MB
Progress (1): 2.7/3.0 MB
Progress (1): 2.7/3.0 MB
Progress (1): 2.7/3.0 MB
Progress (1): 2.7/3.0 MB
Progress (1): 2.7/3.0 MB
Progress (1): 2.8/3.0 MB
Progress (1): 2.8/3.0 MB
Progress (1): 2.8/3.0 MB
Progress (1): 2.8/3.0 MB
Progress (1): 2.8/3.0 MB
Progress (1): 2.8/3.0 MB
Progress (1): 2.9/3.0 MB
Progress (1): 2.9/3.0 MB
Progress (1): 2.9/3.0 MB
Progress (1): 2.9/3.0 MB
Progress (1): 2.9/3.0 MB
Progress (1): 2.9/3.0 MB
Progress (1): 3.0/3.0 MB
Progress (1): 3.0/3.0 MB
Progress (1): 3.0 MB    
                    
Downloaded from RSO-public-group: http://repository.sonatype.org/content/groups/sonatype-public-grid/org/eclipse/jdt/ecj/3.20.0/ecj-3.20.0.jar (3.0 MB at 1.5 MB/s)
[WARNING] Parameter 'useProjectSettings' is set to true, but preferences file '/home/jenkins/agent/workspace/m2eclipse-mavenarchiver/org.sonatype.m2e.mavenarchiver/.settings/org.eclipse.jdt.core.prefs' could not be found!
[INFO] Compiling 3 source files to /home/jenkins/agent/workspace/m2eclipse-mavenarchiver/org.sonatype.m2e.mavenarchiver/target/classes
[INFO] 
[INFO] --- maven-resources-plugin:2.6:testResources (default-testResources) @ org.sonatype.m2e.mavenarchiver ---
[INFO] Using 'UTF-8' encoding to copy filtered resources.
[INFO] skip non existing resourceDirectory /home/jenkins/agent/workspace/m2eclipse-mavenarchiver/org.sonatype.m2e.mavenarchiver/src/test/resources
[INFO] 
[INFO] --- target-platform-configuration:1.6.0:target-platform (default-target-platform) @ org.sonatype.m2e.mavenarchiver ---
[INFO] 
[INFO] --- tycho-packaging-plugin:1.6.0:package-plugin (default-package-plugin) @ org.sonatype.m2e.mavenarchiver ---
[INFO] Building jar: /home/jenkins/agent/workspace/m2eclipse-mavenarchiver/org.sonatype.m2e.mavenarchiver/target/org.sonatype.m2e.mavenarchiver-0.17.5-SNAPSHOT.jar
[INFO] 
[INFO] --- tycho-p2-plugin:1.6.0:p2-metadata-default (default-p2-metadata-default) @ org.sonatype.m2e.mavenarchiver ---
[INFO] 
[INFO] --- tycho-pack200a-plugin:1.6.0:normalize (pack200-normalize) @ org.sonatype.m2e.mavenarchiver ---
[INFO] Pack200 normalizing jar /home/jenkins/agent/workspace/m2eclipse-mavenarchiver/org.sonatype.m2e.mavenarchiver/target/org.sonatype.m2e.mavenarchiver-0.17.5-SNAPSHOT.jar
[INFO] 
[INFO] --- eclipse-jarsigner-plugin:1.1.3:sign (sign) @ org.sonatype.m2e.mavenarchiver ---
[INFO] Signing jar: /home/jenkins/agent/workspace/m2eclipse-mavenarchiver/org.sonatype.m2e.mavenarchiver/target/org.sonatype.m2e.mavenarchiver-0.17.5-SNAPSHOT.jar
[INFO] 
[INFO] --- tycho-pack200b-plugin:1.6.0:pack (pack200-pack) @ org.sonatype.m2e.mavenarchiver ---
[INFO] Pack200 packing jar /home/jenkins/agent/workspace/m2eclipse-mavenarchiver/org.sonatype.m2e.mavenarchiver/target/org.sonatype.m2e.mavenarchiver-0.17.5-SNAPSHOT.jar
[INFO] 
[INFO] --- tycho-p2-plugin:1.6.0:feature-p2-metadata (default-feature-p2-metadata) @ org.sonatype.m2e.mavenarchiver ---
[INFO] 
[INFO] --- tycho-p2-plugin:1.6.0:p2-metadata (p2-metadata) @ org.sonatype.m2e.mavenarchiver ---
[INFO] 
[INFO] --- maven-install-plugin:2.3.1:install (default-install) @ org.sonatype.m2e.mavenarchiver ---
[INFO] Installing /home/jenkins/agent/workspace/m2eclipse-mavenarchiver/org.sonatype.m2e.mavenarchiver/target/org.sonatype.m2e.mavenarchiver-0.17.5-SNAPSHOT.jar to /home/jenkins/agent/workspace/m2eclipse-mavenarchiver/.repository/org/sonatype/m2e/extras/org.sonatype.m2e.mavenarchiver/0.17.5-SNAPSHOT/org.sonatype.m2e.mavenarchiver-0.17.5-SNAPSHOT.jar
[INFO] Installing /home/jenkins/agent/workspace/m2eclipse-mavenarchiver/org.sonatype.m2e.mavenarchiver/pom.xml to /home/jenkins/agent/workspace/m2eclipse-mavenarchiver/.repository/org/sonatype/m2e/extras/org.sonatype.m2e.mavenarchiver/0.17.5-SNAPSHOT/org.sonatype.m2e.mavenarchiver-0.17.5-SNAPSHOT.pom
[INFO] Installing /home/jenkins/agent/workspace/m2eclipse-mavenarchiver/org.sonatype.m2e.mavenarchiver/target/org.sonatype.m2e.mavenarchiver-0.17.5-SNAPSHOT.jar.pack.gz to /home/jenkins/agent/workspace/m2eclipse-mavenarchiver/.repository/org/sonatype/m2e/extras/org.sonatype.m2e.mavenarchiver/0.17.5-SNAPSHOT/org.sonatype.m2e.mavenarchiver-0.17.5-SNAPSHOT-pack200.jar.pack.gz
[INFO] Installing /home/jenkins/agent/workspace/m2eclipse-mavenarchiver/org.sonatype.m2e.mavenarchiver/target/p2content.xml to /home/jenkins/agent/workspace/m2eclipse-mavenarchiver/.repository/org/sonatype/m2e/extras/org.sonatype.m2e.mavenarchiver/0.17.5-SNAPSHOT/org.sonatype.m2e.mavenarchiver-0.17.5-SNAPSHOT-p2metadata.xml
[INFO] Installing /home/jenkins/agent/workspace/m2eclipse-mavenarchiver/org.sonatype.m2e.mavenarchiver/target/p2artifacts.xml to /home/jenkins/agent/workspace/m2eclipse-mavenarchiver/.repository/org/sonatype/m2e/extras/org.sonatype.m2e.mavenarchiver/0.17.5-SNAPSHOT/org.sonatype.m2e.mavenarchiver-0.17.5-SNAPSHOT-p2artifacts.xml
[INFO] 
[INFO] --- tycho-p2-plugin:1.6.0:update-local-index (default-update-local-index) @ org.sonatype.m2e.mavenarchiver ---
[INFO] 
[INFO] ---< org.sonatype.m2e.extras:org.sonatype.m2e.mavenarchiver.feature >---
[INFO] Building org.sonatype.m2e.mavenarchiver.feature 0.17.5-SNAPSHOT    [3/5]
[INFO] --------------------------[ eclipse-feature ]---------------------------
[INFO] 
[INFO] --- maven-clean-plugin:2.4.1:clean (default-clean) @ org.sonatype.m2e.mavenarchiver.feature ---
[INFO] 
[INFO] --- tycho-packaging-plugin:1.6.0:build-qualifier-aggregator (default-build-qualifier-aggregator) @ org.sonatype.m2e.mavenarchiver.feature ---
[INFO] The project's OSGi version is 0.17.5.202002191354
[INFO] 
[INFO] --- tycho-packaging-plugin:1.6.0:validate-id (default-validate-id) @ org.sonatype.m2e.mavenarchiver.feature ---
[INFO] 
[INFO] --- tycho-packaging-plugin:1.6.0:validate-version (default-validate-version) @ org.sonatype.m2e.mavenarchiver.feature ---
[INFO] 
[INFO] --- target-platform-configuration:1.6.0:target-platform (default-target-platform) @ org.sonatype.m2e.mavenarchiver.feature ---
[INFO] 
[INFO] --- tycho-packaging-plugin:1.6.0:package-feature (default-package-feature) @ org.sonatype.m2e.mavenarchiver.feature ---
[INFO] Building jar: /home/jenkins/agent/workspace/m2eclipse-mavenarchiver/org.sonatype.m2e.mavenarchiver.feature/target/org.sonatype.m2e.mavenarchiver.feature-0.17.5-SNAPSHOT.jar
[INFO] 
[INFO] --- tycho-p2-plugin:1.6.0:p2-metadata-default (default-p2-metadata-default) @ org.sonatype.m2e.mavenarchiver.feature ---
[INFO] 
[INFO] --- tycho-p2-plugin:1.6.0:feature-p2-metadata (default-feature-p2-metadata) @ org.sonatype.m2e.mavenarchiver.feature ---
[INFO] 
[INFO] --- tycho-pack200a-plugin:1.6.0:normalize (pack200-normalize) @ org.sonatype.m2e.mavenarchiver.feature ---
[INFO] 
[INFO] --- eclipse-jarsigner-plugin:1.1.3:sign (sign) @ org.sonatype.m2e.mavenarchiver.feature ---
[INFO] Signing jar: /home/jenkins/agent/workspace/m2eclipse-mavenarchiver/org.sonatype.m2e.mavenarchiver.feature/target/org.sonatype.m2e.mavenarchiver.feature-0.17.5-SNAPSHOT.jar
[INFO] 
[INFO] --- tycho-pack200b-plugin:1.6.0:pack (pack200-pack) @ org.sonatype.m2e.mavenarchiver.feature ---
[INFO] 
[INFO] --- tycho-p2-plugin:1.6.0:p2-metadata (p2-metadata) @ org.sonatype.m2e.mavenarchiver.feature ---
[INFO] 
[INFO] --- maven-install-plugin:2.3.1:install (default-install) @ org.sonatype.m2e.mavenarchiver.feature ---
[INFO] Installing /home/jenkins/agent/workspace/m2eclipse-mavenarchiver/org.sonatype.m2e.mavenarchiver.feature/target/org.sonatype.m2e.mavenarchiver.feature-0.17.5-SNAPSHOT.jar to /home/jenkins/agent/workspace/m2eclipse-mavenarchiver/.repository/org/sonatype/m2e/extras/org.sonatype.m2e.mavenarchiver.feature/0.17.5-SNAPSHOT/org.sonatype.m2e.mavenarchiver.feature-0.17.5-SNAPSHOT.jar
[INFO] Installing /home/jenkins/agent/workspace/m2eclipse-mavenarchiver/org.sonatype.m2e.mavenarchiver.feature/pom.xml to /home/jenkins/agent/workspace/m2eclipse-mavenarchiver/.repository/org/sonatype/m2e/extras/org.sonatype.m2e.mavenarchiver.feature/0.17.5-SNAPSHOT/org.sonatype.m2e.mavenarchiver.feature-0.17.5-SNAPSHOT.pom
[INFO] Installing /home/jenkins/agent/workspace/m2eclipse-mavenarchiver/org.sonatype.m2e.mavenarchiver.feature/target/p2content.xml to /home/jenkins/agent/workspace/m2eclipse-mavenarchiver/.repository/org/sonatype/m2e/extras/org.sonatype.m2e.mavenarchiver.feature/0.17.5-SNAPSHOT/org.sonatype.m2e.mavenarchiver.feature-0.17.5-SNAPSHOT-p2metadata.xml
[INFO] Installing /home/jenkins/agent/workspace/m2eclipse-mavenarchiver/org.sonatype.m2e.mavenarchiver.feature/target/p2artifacts.xml to /home/jenkins/agent/workspace/m2eclipse-mavenarchiver/.repository/org/sonatype/m2e/extras/org.sonatype.m2e.mavenarchiver.feature/0.17.5-SNAPSHOT/org.sonatype.m2e.mavenarchiver.feature-0.17.5-SNAPSHOT-p2artifacts.xml
[INFO] 
[INFO] --- tycho-p2-plugin:1.6.0:update-local-index (default-update-local-index) @ org.sonatype.m2e.mavenarchiver.feature ---
[INFO] 
[INFO] ----< org.sonatype.m2e.extras:org.sonatype.m2e.mavenarchiver.tests >----
[INFO] Building org.sonatype.m2e.mavenarchiver.tests 0.17.5-SNAPSHOT      [4/5]
[INFO] ------------------------[ eclipse-test-plugin ]-------------------------
[INFO] 
[INFO] --- maven-clean-plugin:2.4.1:clean (default-clean) @ org.sonatype.m2e.mavenarchiver.tests ---
[INFO] 
[INFO] --- tycho-packaging-plugin:1.6.0:build-qualifier (default-build-qualifier) @ org.sonatype.m2e.mavenarchiver.tests ---
[INFO] The project's OSGi version is 0.17.5.202002191354
[INFO] 
[INFO] --- tycho-packaging-plugin:1.6.0:validate-id (default-validate-id) @ org.sonatype.m2e.mavenarchiver.tests ---
[INFO] 
[INFO] --- tycho-packaging-plugin:1.6.0:validate-version (default-validate-version) @ org.sonatype.m2e.mavenarchiver.tests ---
[INFO] 
[INFO] --- maven-resources-plugin:2.6:resources (default-resources) @ org.sonatype.m2e.mavenarchiver.tests ---
[INFO] Using 'UTF-8' encoding to copy filtered resources.
[INFO] skip non existing resourceDirectory /home/jenkins/agent/workspace/m2eclipse-mavenarchiver/org.sonatype.m2e.mavenarchiver.tests/src/main/resources
[INFO] 
[INFO] --- tycho-compiler-plugin:1.6.0:compile (default-compile) @ org.sonatype.m2e.mavenarchiver.tests ---
[WARNING] Parameter 'useProjectSettings' is set to true, but preferences file '/home/jenkins/agent/workspace/m2eclipse-mavenarchiver/org.sonatype.m2e.mavenarchiver.tests/.settings/org.eclipse.jdt.core.prefs' could not be found!
[INFO] Compiling 1 source file to /home/jenkins/agent/workspace/m2eclipse-mavenarchiver/org.sonatype.m2e.mavenarchiver.tests/target/classes
[INFO] 
[INFO] --- maven-resources-plugin:2.6:testResources (default-testResources) @ org.sonatype.m2e.mavenarchiver.tests ---
[INFO] Using 'UTF-8' encoding to copy filtered resources.
[INFO] skip non existing resourceDirectory /home/jenkins/agent/workspace/m2eclipse-mavenarchiver/org.sonatype.m2e.mavenarchiver.tests/src/test/resources
[INFO] 
[INFO] --- target-platform-configuration:1.6.0:target-platform (default-target-platform) @ org.sonatype.m2e.mavenarchiver.tests ---
[INFO] 
[INFO] --- tycho-packaging-plugin:1.6.0:package-plugin (default-package-plugin) @ org.sonatype.m2e.mavenarchiver.tests ---
[INFO] Building jar: /home/jenkins/agent/workspace/m2eclipse-mavenarchiver/org.sonatype.m2e.mavenarchiver.tests/target/org.sonatype.m2e.mavenarchiver.tests-0.17.5-SNAPSHOT.jar
[INFO] 
[INFO] --- tycho-p2-plugin:1.6.0:p2-metadata-default (default-p2-metadata-default) @ org.sonatype.m2e.mavenarchiver.tests ---
[INFO] 
[INFO] --- tycho-pack200a-plugin:1.6.0:normalize (pack200-normalize) @ org.sonatype.m2e.mavenarchiver.tests ---
[INFO] Pack200 normalizing jar /home/jenkins/agent/workspace/m2eclipse-mavenarchiver/org.sonatype.m2e.mavenarchiver.tests/target/org.sonatype.m2e.mavenarchiver.tests-0.17.5-SNAPSHOT.jar
[INFO] 
[INFO] --- eclipse-jarsigner-plugin:1.1.3:sign (sign) @ org.sonatype.m2e.mavenarchiver.tests ---
[INFO] Signing jar: /home/jenkins/agent/workspace/m2eclipse-mavenarchiver/org.sonatype.m2e.mavenarchiver.tests/target/org.sonatype.m2e.mavenarchiver.tests-0.17.5-SNAPSHOT.jar
[INFO] 
[INFO] --- tycho-pack200b-plugin:1.6.0:pack (pack200-pack) @ org.sonatype.m2e.mavenarchiver.tests ---
[INFO] Pack200 packing jar /home/jenkins/agent/workspace/m2eclipse-mavenarchiver/org.sonatype.m2e.mavenarchiver.tests/target/org.sonatype.m2e.mavenarchiver.tests-0.17.5-SNAPSHOT.jar
[INFO] 
[INFO] --- tycho-p2-plugin:1.6.0:feature-p2-metadata (default-feature-p2-metadata) @ org.sonatype.m2e.mavenarchiver.tests ---
[INFO] 
[INFO] --- tycho-p2-plugin:1.6.0:p2-metadata (p2-metadata) @ org.sonatype.m2e.mavenarchiver.tests ---
[INFO] 
[INFO] --- tycho-surefire-plugin:1.6.0:test (default-test) @ org.sonatype.m2e.mavenarchiver.tests ---
[INFO] Expected eclipse log file: /home/jenkins/agent/workspace/m2eclipse-mavenarchiver/org.sonatype.m2e.mavenarchiver.tests/target/work/data/.metadata/.log
[INFO] Command line:
	[/opt/tools/java/oracle/jdk-8/1.8.0_202/jre/bin/java, -Dosgi.noShutdown=false, -Dosgi.os=linux, -Dosgi.ws=gtk, -Dosgi.arch=x86_64, -Xmx512m, -XX:MaxPermSize=256m, -Dosgi.clean=true, -jar, /home/jenkins/agent/workspace/m2eclipse-mavenarchiver/.repository/p2/osgi/bundle/org.eclipse.equinox.launcher/1.5.600.v20191014-2022/org.eclipse.equinox.launcher-1.5.600.v20191014-2022.jar, -data, /home/jenkins/agent/workspace/m2eclipse-mavenarchiver/org.sonatype.m2e.mavenarchiver.tests/target/work/data, -install, /home/jenkins/agent/workspace/m2eclipse-mavenarchiver/org.sonatype.m2e.mavenarchiver.tests/target/work, -configuration, /home/jenkins/agent/workspace/m2eclipse-mavenarchiver/org.sonatype.m2e.mavenarchiver.tests/target/work/configuration, -application, org.eclipse.tycho.surefire.osgibooter.uitest, -testproperties, /home/jenkins/agent/workspace/m2eclipse-mavenarchiver/org.sonatype.m2e.mavenarchiver.tests/target/surefire.properties, -timeout, 600000]
Picked up JAVA_TOOL_OPTIONS: -XX:+IgnoreUnrecognizedVMOptions -XX:+UseContainerSupport -XX:+UnlockExperimentalVMOptions -XX:+UseCGroupMemoryLimitForHeap
Java HotSpot(TM) 64-Bit Server VM warning: ignoring option MaxPermSize=256m; support was removed in 8.0
Picked up _JAVA_OPTIONS: -XX:MaxRAMPercentage=64.0
An error has occurred. See the log file
/home/jenkins/agent/workspace/m2eclipse-mavenarchiver/org.sonatype.m2e.mavenarchiver.tests/target/work/data/.metadata/.log.
[INFO] ------------------------------------------------------------------------
[INFO] Reactor Summary for M2E Maven Archiver Connector 0.17.5-SNAPSHOT:
[INFO] 
[INFO] M2E Maven Archiver Connector ....................... SUCCESS [ 18.757 s]
[INFO] org.sonatype.m2e.mavenarchiver ..................... SUCCESS [ 12.874 s]
[INFO] org.sonatype.m2e.mavenarchiver.feature ............. SUCCESS [  1.195 s]
[INFO] org.sonatype.m2e.mavenarchiver.tests ............... FAILURE [  4.420 s]
[INFO] org.sonatype.m2e.mavenarchiver.repository .......... SKIPPED
[INFO] ------------------------------------------------------------------------
[INFO] BUILD FAILURE
[INFO] ------------------------------------------------------------------------
[INFO] Total time:  02:08 min
[INFO] Finished at: 2020-02-19T13:56:40Z
[INFO] ------------------------------------------------------------------------
[ERROR] Failed to execute goal org.eclipse.tycho:tycho-surefire-plugin:1.6.0:test (default-test) on project org.sonatype.m2e.mavenarchiver.tests: An unexpected error occurred while launching the test runtime (return code 13). See log /home/jenkins/agent/workspace/m2eclipse-mavenarchiver/org.sonatype.m2e.mavenarchiver.tests/target/work/data/.metadata/.log for details. -> [Help 1]
[ERROR] 
[ERROR] To see the full stack trace of the errors, re-run Maven with the -e switch.
[ERROR] Re-run Maven using the -X switch to enable full debug logging.
[ERROR] 
[ERROR] For more information about the errors and possible solutions, please read the following articles:
[ERROR] [Help 1] http://cwiki.apache.org/confluence/display/MAVEN/MojoFailureException
[ERROR] 
[ERROR] After correcting the problems, you can resume the build with the command
[ERROR]   mvn <args> -rf :org.sonatype.m2e.mavenarchiver.tests
Build step 'Invoke top-level Maven targets' marked build as failure
$ ssh-agent -k
unset SSH_AUTH_SOCK;
unset SSH_AGENT_PID;
echo Agent pid 49 killed;
[ssh-agent] Stopped.
Sending e-mails to: fbricon@gmail.com
Archiving artifacts
Finished: FAILURE