FailedConsole Output

Skipping 255 KB.. Full Log
8 kB   
Progress (5): 155/194 kB | 69/524 kB | 39 kB | 36/273 kB | 16/38 kB
Progress (5): 159/194 kB | 69/524 kB | 39 kB | 36/273 kB | 16/38 kB
Progress (5): 163/194 kB | 69/524 kB | 39 kB | 36/273 kB | 16/38 kB
Progress (5): 163/194 kB | 69/524 kB | 39 kB | 36/273 kB | 20/38 kB
Progress (5): 163/194 kB | 69/524 kB | 39 kB | 36/273 kB | 24/38 kB
Progress (5): 163/194 kB | 69/524 kB | 39 kB | 40/273 kB | 24/38 kB
Progress (5): 163/194 kB | 73/524 kB | 39 kB | 40/273 kB | 24/38 kB
Progress (5): 163/194 kB | 73/524 kB | 39 kB | 45/273 kB | 24/38 kB
Progress (5): 163/194 kB | 73/524 kB | 39 kB | 45/273 kB | 28/38 kB
Progress (5): 167/194 kB | 73/524 kB | 39 kB | 45/273 kB | 28/38 kB
Progress (5): 167/194 kB | 73/524 kB | 39 kB | 45/273 kB | 32/38 kB
Progress (5): 167/194 kB | 73/524 kB | 39 kB | 49/273 kB | 32/38 kB
Progress (5): 167/194 kB | 77/524 kB | 39 kB | 49/273 kB | 32/38 kB
Progress (5): 167/194 kB | 77/524 kB | 39 kB | 49/273 kB | 36/38 kB
Progress (5): 171/194 kB | 77/524 kB | 39 kB | 49/273 kB | 36/38 kB
Progress (5): 171/194 kB | 77/524 kB | 39 kB | 49/273 kB | 38 kB   
Progress (5): 171/194 kB | 77/524 kB | 39 kB | 53/273 kB | 38 kB
Progress (5): 171/194 kB | 81/524 kB | 39 kB | 53/273 kB | 38 kB
Progress (5): 171/194 kB | 81/524 kB | 39 kB | 57/273 kB | 38 kB
Progress (5): 176/194 kB | 81/524 kB | 39 kB | 57/273 kB | 38 kB
Progress (5): 176/194 kB | 81/524 kB | 39 kB | 61/273 kB | 38 kB
Progress (5): 176/194 kB | 85/524 kB | 39 kB | 61/273 kB | 38 kB
Progress (5): 180/194 kB | 85/524 kB | 39 kB | 61/273 kB | 38 kB
Progress (5): 180/194 kB | 90/524 kB | 39 kB | 61/273 kB | 38 kB
Progress (5): 180/194 kB | 90/524 kB | 39 kB | 65/273 kB | 38 kB
Progress (5): 184/194 kB | 90/524 kB | 39 kB | 65/273 kB | 38 kB
Progress (5): 188/194 kB | 90/524 kB | 39 kB | 65/273 kB | 38 kB
Progress (5): 188/194 kB | 94/524 kB | 39 kB | 65/273 kB | 38 kB
Progress (5): 192/194 kB | 94/524 kB | 39 kB | 65/273 kB | 38 kB
Progress (5): 192/194 kB | 98/524 kB | 39 kB | 65/273 kB | 38 kB
Progress (5): 192/194 kB | 98/524 kB | 39 kB | 69/273 kB | 38 kB
Progress (5): 194 kB | 98/524 kB | 39 kB | 69/273 kB | 38 kB    
Progress (5): 194 kB | 98/524 kB | 39 kB | 73/273 kB | 38 kB
Progress (5): 194 kB | 102/524 kB | 39 kB | 73/273 kB | 38 kB
Progress (5): 194 kB | 102/524 kB | 39 kB | 77/273 kB | 38 kB
Progress (5): 194 kB | 106/524 kB | 39 kB | 77/273 kB | 38 kB
Progress (5): 194 kB | 106/524 kB | 39 kB | 81/273 kB | 38 kB
Progress (5): 194 kB | 110/524 kB | 39 kB | 81/273 kB | 38 kB
Progress (5): 194 kB | 114/524 kB | 39 kB | 81/273 kB | 38 kB
Progress (5): 194 kB | 114/524 kB | 39 kB | 85/273 kB | 38 kB
Progress (5): 194 kB | 118/524 kB | 39 kB | 85/273 kB | 38 kB
Progress (5): 194 kB | 118/524 kB | 39 kB | 90/273 kB | 38 kB
Progress (5): 194 kB | 122/524 kB | 39 kB | 90/273 kB | 38 kB
Progress (5): 194 kB | 122/524 kB | 39 kB | 94/273 kB | 38 kB
Progress (5): 194 kB | 126/524 kB | 39 kB | 94/273 kB | 38 kB
Progress (5): 194 kB | 126/524 kB | 39 kB | 98/273 kB | 38 kB
Progress (5): 194 kB | 131/524 kB | 39 kB | 98/273 kB | 38 kB
Progress (5): 194 kB | 131/524 kB | 39 kB | 102/273 kB | 38 kB
Progress (5): 194 kB | 135/524 kB | 39 kB | 102/273 kB | 38 kB
Progress (5): 194 kB | 135/524 kB | 39 kB | 106/273 kB | 38 kB
Progress (5): 194 kB | 139/524 kB | 39 kB | 106/273 kB | 38 kB
Progress (5): 194 kB | 139/524 kB | 39 kB | 110/273 kB | 38 kB
Progress (5): 194 kB | 143/524 kB | 39 kB | 110/273 kB | 38 kB
Progress (5): 194 kB | 143/524 kB | 39 kB | 114/273 kB | 38 kB
Progress (5): 194 kB | 147/524 kB | 39 kB | 114/273 kB | 38 kB
Progress (5): 194 kB | 147/524 kB | 39 kB | 118/273 kB | 38 kB
Progress (5): 194 kB | 151/524 kB | 39 kB | 118/273 kB | 38 kB
Progress (5): 194 kB | 151/524 kB | 39 kB | 122/273 kB | 38 kB
                                                              
Downloaded from eclipse.maven.central.mirror: https://repo.eclipse.org/content/repositories/maven_central/org/apache/maven/maven-plugin-descriptor/2.2.1/maven-plugin-descriptor-2.2.1.jar (39 kB at 198 kB/s)
Progress (4): 194 kB | 155/524 kB | 122/273 kB | 38 kB
                                                      
Downloading from eclipse.maven.central.mirror: https://repo.eclipse.org/content/repositories/maven_central/org/apache/maven/maven-project/2.2.1/maven-project-2.2.1.jar
Progress (4): 194 kB | 155/524 kB | 126/273 kB | 38 kB
Progress (4): 194 kB | 159/524 kB | 126/273 kB | 38 kB
Progress (4): 194 kB | 159/524 kB | 131/273 kB | 38 kB
Progress (4): 194 kB | 163/524 kB | 131/273 kB | 38 kB
Progress (4): 194 kB | 163/524 kB | 135/273 kB | 38 kB
Progress (4): 194 kB | 167/524 kB | 135/273 kB | 38 kB
Progress (4): 194 kB | 167/524 kB | 139/273 kB | 38 kB
Progress (4): 194 kB | 171/524 kB | 139/273 kB | 38 kB
Progress (4): 194 kB | 171/524 kB | 143/273 kB | 38 kB
Progress (4): 194 kB | 176/524 kB | 143/273 kB | 38 kB
Progress (4): 194 kB | 180/524 kB | 143/273 kB | 38 kB
Progress (4): 194 kB | 180/524 kB | 147/273 kB | 38 kB
Progress (4): 194 kB | 184/524 kB | 147/273 kB | 38 kB
Progress (4): 194 kB | 188/524 kB | 147/273 kB | 38 kB
Progress (4): 194 kB | 188/524 kB | 151/273 kB | 38 kB
Progress (5): 194 kB | 188/524 kB | 151/273 kB | 38 kB | 4.1/156 kB
Progress (5): 194 kB | 188/524 kB | 155/273 kB | 38 kB | 4.1/156 kB
Progress (5): 194 kB | 192/524 kB | 155/273 kB | 38 kB | 4.1/156 kB
Progress (5): 194 kB | 192/524 kB | 159/273 kB | 38 kB | 4.1/156 kB
Progress (5): 194 kB | 192/524 kB | 159/273 kB | 38 kB | 7.7/156 kB
Progress (5): 194 kB | 192/524 kB | 163/273 kB | 38 kB | 7.7/156 kB
Progress (5): 194 kB | 196/524 kB | 163/273 kB | 38 kB | 7.7/156 kB
Progress (5): 194 kB | 196/524 kB | 163/273 kB | 38 kB | 12/156 kB 
Progress (5): 194 kB | 196/524 kB | 163/273 kB | 38 kB | 16/156 kB
Progress (5): 194 kB | 200/524 kB | 163/273 kB | 38 kB | 16/156 kB
Progress (5): 194 kB | 200/524 kB | 167/273 kB | 38 kB | 16/156 kB
Progress (5): 194 kB | 200/524 kB | 167/273 kB | 38 kB | 20/156 kB
Progress (5): 194 kB | 204/524 kB | 167/273 kB | 38 kB | 20/156 kB
Progress (5): 194 kB | 204/524 kB | 167/273 kB | 38 kB | 24/156 kB
Progress (5): 194 kB | 204/524 kB | 171/273 kB | 38 kB | 24/156 kB
Progress (5): 194 kB | 204/524 kB | 171/273 kB | 38 kB | 28/156 kB
Progress (5): 194 kB | 208/524 kB | 171/273 kB | 38 kB | 28/156 kB
Progress (5): 194 kB | 208/524 kB | 171/273 kB | 38 kB | 32/156 kB
Progress (5): 194 kB | 208/524 kB | 176/273 kB | 38 kB | 32/156 kB
Progress (5): 194 kB | 212/524 kB | 176/273 kB | 38 kB | 32/156 kB
Progress (5): 194 kB | 212/524 kB | 180/273 kB | 38 kB | 32/156 kB
Progress (5): 194 kB | 212/524 kB | 180/273 kB | 38 kB | 36/156 kB
Progress (5): 194 kB | 217/524 kB | 180/273 kB | 38 kB | 36/156 kB
Progress (5): 194 kB | 217/524 kB | 180/273 kB | 38 kB | 40/156 kB
Progress (5): 194 kB | 221/524 kB | 180/273 kB | 38 kB | 40/156 kB
Progress (5): 194 kB | 221/524 kB | 180/273 kB | 38 kB | 45/156 kB
Progress (5): 194 kB | 221/524 kB | 184/273 kB | 38 kB | 45/156 kB
Progress (5): 194 kB | 225/524 kB | 184/273 kB | 38 kB | 45/156 kB
Progress (5): 194 kB | 225/524 kB | 188/273 kB | 38 kB | 45/156 kB
Progress (5): 194 kB | 225/524 kB | 188/273 kB | 38 kB | 49/156 kB
Progress (5): 194 kB | 225/524 kB | 192/273 kB | 38 kB | 49/156 kB
Progress (5): 194 kB | 229/524 kB | 192/273 kB | 38 kB | 49/156 kB
Progress (5): 194 kB | 229/524 kB | 196/273 kB | 38 kB | 49/156 kB
Progress (5): 194 kB | 229/524 kB | 196/273 kB | 38 kB | 53/156 kB
Progress (5): 194 kB | 229/524 kB | 196/273 kB | 38 kB | 57/156 kB
Progress (5): 194 kB | 233/524 kB | 196/273 kB | 38 kB | 57/156 kB
Progress (5): 194 kB | 233/524 kB | 196/273 kB | 38 kB | 61/156 kB
Progress (5): 194 kB | 237/524 kB | 196/273 kB | 38 kB | 61/156 kB
Progress (5): 194 kB | 237/524 kB | 200/273 kB | 38 kB | 61/156 kB
Progress (5): 194 kB | 237/524 kB | 200/273 kB | 38 kB | 65/156 kB
Progress (5): 194 kB | 237/524 kB | 204/273 kB | 38 kB | 65/156 kB
Progress (5): 194 kB | 241/524 kB | 204/273 kB | 38 kB | 65/156 kB
Progress (5): 194 kB | 241/524 kB | 208/273 kB | 38 kB | 65/156 kB
Progress (5): 194 kB | 245/524 kB | 208/273 kB | 38 kB | 65/156 kB
Progress (5): 194 kB | 245/524 kB | 208/273 kB | 38 kB | 69/156 kB
Progress (5): 194 kB | 245/524 kB | 212/273 kB | 38 kB | 69/156 kB
Progress (5): 194 kB | 245/524 kB | 212/273 kB | 38 kB | 73/156 kB
Progress (5): 194 kB | 249/524 kB | 212/273 kB | 38 kB | 73/156 kB
Progress (5): 194 kB | 249/524 kB | 212/273 kB | 38 kB | 77/156 kB
Progress (5): 194 kB | 253/524 kB | 212/273 kB | 38 kB | 77/156 kB
Progress (5): 194 kB | 253/524 kB | 212/273 kB | 38 kB | 81/156 kB
Progress (5): 194 kB | 258/524 kB | 212/273 kB | 38 kB | 81/156 kB
Progress (5): 194 kB | 258/524 kB | 217/273 kB | 38 kB | 81/156 kB
Progress (5): 194 kB | 262/524 kB | 217/273 kB | 38 kB | 81/156 kB
Progress (5): 194 kB | 262/524 kB | 217/273 kB | 38 kB | 85/156 kB
Progress (5): 194 kB | 262/524 kB | 221/273 kB | 38 kB | 85/156 kB
Progress (5): 194 kB | 262/524 kB | 221/273 kB | 38 kB | 90/156 kB
Progress (5): 194 kB | 262/524 kB | 225/273 kB | 38 kB | 90/156 kB
Progress (5): 194 kB | 266/524 kB | 225/273 kB | 38 kB | 90/156 kB
Progress (5): 194 kB | 266/524 kB | 229/273 kB | 38 kB | 90/156 kB
Progress (5): 194 kB | 266/524 kB | 229/273 kB | 38 kB | 94/156 kB
Progress (5): 194 kB | 270/524 kB | 229/273 kB | 38 kB | 94/156 kB
Progress (5): 194 kB | 270/524 kB | 229/273 kB | 38 kB | 98/156 kB
                                                                  
Downloaded from eclipse.maven.central.mirror: https://repo.eclipse.org/content/repositories/maven_central/org/codehaus/plexus/plexus-container-default/1.0-alpha-9-stable-1/plexus-container-default-1.0-alpha-9-stable-1.jar (194 kB at 929 kB/s)
Progress (4): 274/524 kB | 229/273 kB | 38 kB | 98/156 kB
                                                         
Downloading from eclipse.maven.central.mirror: https://repo.eclipse.org/content/repositories/maven_central/org/apache/maven/maven-profile/2.2.1/maven-profile-2.2.1.jar
Progress (4): 274/524 kB | 229/273 kB | 38 kB | 102/156 kB
Progress (4): 274/524 kB | 233/273 kB | 38 kB | 102/156 kB
Progress (4): 274/524 kB | 233/273 kB | 38 kB | 106/156 kB
Progress (4): 278/524 kB | 233/273 kB | 38 kB | 106/156 kB
Progress (4): 278/524 kB | 233/273 kB | 38 kB | 110/156 kB
Progress (4): 278/524 kB | 237/273 kB | 38 kB | 110/156 kB
Progress (4): 278/524 kB | 237/273 kB | 38 kB | 114/156 kB
Progress (4): 278/524 kB | 241/273 kB | 38 kB | 114/156 kB
Progress (4): 282/524 kB | 241/273 kB | 38 kB | 114/156 kB
Progress (4): 282/524 kB | 245/273 kB | 38 kB | 114/156 kB
Progress (4): 282/524 kB | 245/273 kB | 38 kB | 118/156 kB
Progress (4): 286/524 kB | 245/273 kB | 38 kB | 118/156 kB
Progress (4): 286/524 kB | 245/273 kB | 38 kB | 122/156 kB
Progress (4): 290/524 kB | 245/273 kB | 38 kB | 122/156 kB
Progress (4): 290/524 kB | 245/273 kB | 38 kB | 126/156 kB
Progress (4): 294/524 kB | 245/273 kB | 38 kB | 126/156 kB
Progress (4): 294/524 kB | 245/273 kB | 38 kB | 131/156 kB
Progress (4): 294/524 kB | 249/273 kB | 38 kB | 131/156 kB
                                                          
Downloaded from eclipse.maven.central.mirror: https://repo.eclipse.org/content/repositories/maven_central/classworlds/classworlds/1.1-alpha-2/classworlds-1.1-alpha-2.jar (38 kB at 177 kB/s)
Downloading from eclipse.maven.central.mirror: https://repo.eclipse.org/content/repositories/maven_central/org/apache/maven/maven-artifact-manager/2.2.1/maven-artifact-manager-2.2.1.jar
Progress (4): 294/524 kB | 249/273 kB | 131/156 kB | 4.1/35 kB
Progress (4): 294/524 kB | 249/273 kB | 135/156 kB | 4.1/35 kB
Progress (4): 298/524 kB | 249/273 kB | 135/156 kB | 4.1/35 kB
Progress (4): 298/524 kB | 253/273 kB | 135/156 kB | 4.1/35 kB
Progress (4): 303/524 kB | 253/273 kB | 135/156 kB | 4.1/35 kB
Progress (4): 303/524 kB | 253/273 kB | 139/156 kB | 4.1/35 kB
Progress (4): 303/524 kB | 253/273 kB | 139/156 kB | 7.7/35 kB
Progress (4): 303/524 kB | 253/273 kB | 143/156 kB | 7.7/35 kB
Progress (4): 307/524 kB | 253/273 kB | 143/156 kB | 7.7/35 kB
Progress (4): 307/524 kB | 258/273 kB | 143/156 kB | 7.7/35 kB
Progress (4): 311/524 kB | 258/273 kB | 143/156 kB | 7.7/35 kB
Progress (4): 311/524 kB | 258/273 kB | 147/156 kB | 7.7/35 kB
Progress (4): 311/524 kB | 258/273 kB | 147/156 kB | 12/35 kB 
Progress (5): 311/524 kB | 258/273 kB | 147/156 kB | 12/35 kB | 4.1/68 kB
Progress (5): 315/524 kB | 258/273 kB | 147/156 kB | 12/35 kB | 4.1/68 kB
Progress (5): 315/524 kB | 262/273 kB | 147/156 kB | 12/35 kB | 4.1/68 kB
Progress (5): 319/524 kB | 262/273 kB | 147/156 kB | 12/35 kB | 4.1/68 kB
Progress (5): 319/524 kB | 262/273 kB | 147/156 kB | 12/35 kB | 7.7/68 kB
Progress (5): 319/524 kB | 262/273 kB | 151/156 kB | 12/35 kB | 7.7/68 kB
Progress (5): 319/524 kB | 262/273 kB | 151/156 kB | 16/35 kB | 7.7/68 kB
Progress (5): 319/524 kB | 266/273 kB | 151/156 kB | 16/35 kB | 7.7/68 kB
Progress (5): 319/524 kB | 266/273 kB | 155/156 kB | 16/35 kB | 7.7/68 kB
Progress (5): 319/524 kB | 266/273 kB | 155/156 kB | 16/35 kB | 12/68 kB 
Progress (5): 323/524 kB | 266/273 kB | 155/156 kB | 16/35 kB | 12/68 kB
Progress (5): 323/524 kB | 266/273 kB | 155/156 kB | 16/35 kB | 16/68 kB
Progress (5): 323/524 kB | 266/273 kB | 156 kB | 16/35 kB | 16/68 kB    
Progress (5): 323/524 kB | 266/273 kB | 156 kB | 20/35 kB | 16/68 kB
Progress (5): 323/524 kB | 270/273 kB | 156 kB | 20/35 kB | 16/68 kB
Progress (5): 323/524 kB | 270/273 kB | 156 kB | 24/35 kB | 16/68 kB
Progress (5): 327/524 kB | 270/273 kB | 156 kB | 24/35 kB | 16/68 kB
Progress (5): 327/524 kB | 270/273 kB | 156 kB | 28/35 kB | 16/68 kB
Progress (5): 327/524 kB | 273 kB | 156 kB | 28/35 kB | 16/68 kB    
Progress (5): 327/524 kB | 273 kB | 156 kB | 28/35 kB | 20/68 kB
Progress (5): 331/524 kB | 273 kB | 156 kB | 28/35 kB | 20/68 kB
Progress (5): 331/524 kB | 273 kB | 156 kB | 32/35 kB | 20/68 kB
Progress (5): 335/524 kB | 273 kB | 156 kB | 32/35 kB | 20/68 kB
Progress (5): 335/524 kB | 273 kB | 156 kB | 32/35 kB | 24/68 kB
Progress (5): 339/524 kB | 273 kB | 156 kB | 32/35 kB | 24/68 kB
Progress (5): 339/524 kB | 273 kB | 156 kB | 35 kB | 24/68 kB   
Progress (5): 344/524 kB | 273 kB | 156 kB | 35 kB | 24/68 kB
Progress (5): 344/524 kB | 273 kB | 156 kB | 35 kB | 28/68 kB
Progress (5): 344/524 kB | 273 kB | 156 kB | 35 kB | 32/68 kB
Progress (5): 348/524 kB | 273 kB | 156 kB | 35 kB | 32/68 kB
Progress (5): 352/524 kB | 273 kB | 156 kB | 35 kB | 32/68 kB
Progress (5): 352/524 kB | 273 kB | 156 kB | 35 kB | 36/68 kB
Progress (5): 356/524 kB | 273 kB | 156 kB | 35 kB | 36/68 kB
Progress (5): 356/524 kB | 273 kB | 156 kB | 35 kB | 40/68 kB
Progress (5): 360/524 kB | 273 kB | 156 kB | 35 kB | 40/68 kB
Progress (5): 360/524 kB | 273 kB | 156 kB | 35 kB | 45/68 kB
Progress (5): 360/524 kB | 273 kB | 156 kB | 35 kB | 49/68 kB
Progress (5): 364/524 kB | 273 kB | 156 kB | 35 kB | 49/68 kB
Progress (5): 368/524 kB | 273 kB | 156 kB | 35 kB | 49/68 kB
Progress (5): 368/524 kB | 273 kB | 156 kB | 35 kB | 53/68 kB
Progress (5): 372/524 kB | 273 kB | 156 kB | 35 kB | 53/68 kB
Progress (5): 372/524 kB | 273 kB | 156 kB | 35 kB | 57/68 kB
Progress (5): 376/524 kB | 273 kB | 156 kB | 35 kB | 57/68 kB
Progress (5): 376/524 kB | 273 kB | 156 kB | 35 kB | 61/68 kB
Progress (5): 376/524 kB | 273 kB | 156 kB | 35 kB | 65/68 kB
Progress (5): 376/524 kB | 273 kB | 156 kB | 35 kB | 68 kB   
Progress (5): 380/524 kB | 273 kB | 156 kB | 35 kB | 68 kB
Progress (5): 384/524 kB | 273 kB | 156 kB | 35 kB | 68 kB
Progress (5): 389/524 kB | 273 kB | 156 kB | 35 kB | 68 kB
Progress (5): 393/524 kB | 273 kB | 156 kB | 35 kB | 68 kB
Progress (5): 397/524 kB | 273 kB | 156 kB | 35 kB | 68 kB
Progress (5): 401/524 kB | 273 kB | 156 kB | 35 kB | 68 kB
Progress (5): 405/524 kB | 273 kB | 156 kB | 35 kB | 68 kB
Progress (5): 409/524 kB | 273 kB | 156 kB | 35 kB | 68 kB
Progress (5): 413/524 kB | 273 kB | 156 kB | 35 kB | 68 kB
Progress (5): 417/524 kB | 273 kB | 156 kB | 35 kB | 68 kB
Progress (5): 421/524 kB | 273 kB | 156 kB | 35 kB | 68 kB
Progress (5): 425/524 kB | 273 kB | 156 kB | 35 kB | 68 kB
Progress (5): 430/524 kB | 273 kB | 156 kB | 35 kB | 68 kB
Progress (5): 434/524 kB | 273 kB | 156 kB | 35 kB | 68 kB
Progress (5): 438/524 kB | 273 kB | 156 kB | 35 kB | 68 kB
Progress (5): 442/524 kB | 273 kB | 156 kB | 35 kB | 68 kB
Progress (5): 446/524 kB | 273 kB | 156 kB | 35 kB | 68 kB
Progress (5): 450/524 kB | 273 kB | 156 kB | 35 kB | 68 kB
Progress (5): 454/524 kB | 273 kB | 156 kB | 35 kB | 68 kB
Progress (5): 458/524 kB | 273 kB | 156 kB | 35 kB | 68 kB
Progress (5): 462/524 kB | 273 kB | 156 kB | 35 kB | 68 kB
Progress (5): 466/524 kB | 273 kB | 156 kB | 35 kB | 68 kB
Progress (5): 471/524 kB | 273 kB | 156 kB | 35 kB | 68 kB
Progress (5): 475/524 kB | 273 kB | 156 kB | 35 kB | 68 kB
Progress (5): 479/524 kB | 273 kB | 156 kB | 35 kB | 68 kB
Progress (5): 483/524 kB | 273 kB | 156 kB | 35 kB | 68 kB
Progress (5): 487/524 kB | 273 kB | 156 kB | 35 kB | 68 kB
Progress (5): 491/524 kB | 273 kB | 156 kB | 35 kB | 68 kB
Progress (5): 495/524 kB | 273 kB | 156 kB | 35 kB | 68 kB
Progress (5): 499/524 kB | 273 kB | 156 kB | 35 kB | 68 kB
Progress (5): 503/524 kB | 273 kB | 156 kB | 35 kB | 68 kB
Progress (5): 507/524 kB | 273 kB | 156 kB | 35 kB | 68 kB
Progress (5): 511/524 kB | 273 kB | 156 kB | 35 kB | 68 kB
Progress (5): 516/524 kB | 273 kB | 156 kB | 35 kB | 68 kB
Progress (5): 520/524 kB | 273 kB | 156 kB | 35 kB | 68 kB
Progress (5): 524/524 kB | 273 kB | 156 kB | 35 kB | 68 kB
Progress (5): 524 kB | 273 kB | 156 kB | 35 kB | 68 kB    
                                                      
Downloaded from eclipse.maven.central.mirror: https://repo.eclipse.org/content/repositories/maven_central/org/apache/maven/maven-project/2.2.1/maven-project-2.2.1.jar (156 kB at 550 kB/s)
Downloaded from eclipse.maven.central.mirror: https://repo.eclipse.org/content/repositories/maven_central/org/apache/maven/surefire/surefire-booter/2.22.0/surefire-booter-2.22.0.jar (273 kB at 963 kB/s)
Downloaded from eclipse.maven.central.mirror: https://repo.eclipse.org/content/repositories/maven_central/org/apache/maven/maven-profile/2.2.1/maven-profile-2.2.1.jar (35 kB at 125 kB/s)
Downloaded from eclipse.maven.central.mirror: https://repo.eclipse.org/content/repositories/maven_central/org/apache/maven/maven-artifact-manager/2.2.1/maven-artifact-manager-2.2.1.jar (68 kB at 237 kB/s)
Downloading from eclipse.maven.central.mirror: https://repo.eclipse.org/content/repositories/maven_central/org/apache/maven/maven-toolchain/2.2.1/maven-toolchain-2.2.1.jar
Downloading from eclipse.maven.central.mirror: https://repo.eclipse.org/content/repositories/maven_central/org/apache/maven/maven-plugin-registry/2.2.1/maven-plugin-registry-2.2.1.jar
Downloading from eclipse.maven.central.mirror: https://repo.eclipse.org/content/repositories/maven_central/backport-util-concurrent/backport-util-concurrent/3.1/backport-util-concurrent-3.1.jar
Downloaded from eclipse.maven.central.mirror: https://repo.eclipse.org/content/repositories/maven_central/org/apache/maven/surefire/maven-surefire-common/2.22.0/maven-surefire-common-2.22.0.jar (524 kB at 1.8 MB/s)
Downloading from eclipse.maven.central.mirror: https://repo.eclipse.org/content/repositories/maven_central/org/codehaus/plexus/plexus-java/0.9.8/plexus-java-0.9.8.jar
Downloading from eclipse.maven.central.mirror: https://repo.eclipse.org/content/repositories/maven_central/org/ow2/asm/asm/6.1.1/asm-6.1.1.jar
Progress (1): 4.1/30 kB
Progress (1): 7.7/30 kB
Progress (1): 12/30 kB 
Progress (1): 16/30 kB
Progress (1): 20/30 kB
Progress (1): 24/30 kB
Progress (1): 28/30 kB
Progress (1): 30 kB   
                   
Downloaded from eclipse.maven.central.mirror: https://repo.eclipse.org/content/repositories/maven_central/org/apache/maven/maven-plugin-registry/2.2.1/maven-plugin-registry-2.2.1.jar (30 kB at 103 kB/s)
Downloading from eclipse.maven.central.mirror: https://repo.eclipse.org/content/repositories/maven_central/com/thoughtworks/qdox/qdox/2.0-M7/qdox-2.0-M7.jar
Progress (1): 4.1/108 kB
Progress (1): 7.7/108 kB
Progress (1): 12/108 kB 
Progress (1): 16/108 kB
Progress (1): 20/108 kB
Progress (1): 24/108 kB
Progress (1): 28/108 kB
Progress (1): 32/108 kB
Progress (1): 36/108 kB
Progress (1): 40/108 kB
Progress (1): 45/108 kB
Progress (1): 49/108 kB
Progress (1): 53/108 kB
Progress (1): 57/108 kB
Progress (1): 61/108 kB
Progress (1): 65/108 kB
Progress (1): 69/108 kB
Progress (1): 73/108 kB
Progress (1): 77/108 kB
Progress (1): 81/108 kB
Progress (2): 81/108 kB | 4.1/332 kB
Progress (2): 85/108 kB | 4.1/332 kB
Progress (2): 85/108 kB | 7.7/332 kB
Progress (2): 90/108 kB | 7.7/332 kB
Progress (2): 90/108 kB | 12/332 kB 
Progress (2): 94/108 kB | 12/332 kB
Progress (2): 94/108 kB | 16/332 kB
Progress (2): 98/108 kB | 16/332 kB
Progress (2): 98/108 kB | 20/332 kB
Progress (2): 102/108 kB | 20/332 kB
Progress (2): 102/108 kB | 24/332 kB
Progress (2): 106/108 kB | 24/332 kB
Progress (3): 106/108 kB | 24/332 kB | 4.1/315 kB
Progress (3): 108 kB | 24/332 kB | 4.1/315 kB    
Progress (3): 108 kB | 28/332 kB | 4.1/315 kB
Progress (3): 108 kB | 28/332 kB | 7.7/315 kB
Progress (3): 108 kB | 32/332 kB | 7.7/315 kB
Progress (3): 108 kB | 32/332 kB | 12/315 kB 
Progress (3): 108 kB | 32/332 kB | 16/315 kB
Progress (3): 108 kB | 36/332 kB | 16/315 kB
Progress (3): 108 kB | 40/332 kB | 16/315 kB
Progress (3): 108 kB | 40/332 kB | 20/315 kB
Progress (3): 108 kB | 45/332 kB | 20/315 kB
Progress (3): 108 kB | 45/332 kB | 24/315 kB
Progress (3): 108 kB | 49/332 kB | 24/315 kB
Progress (3): 108 kB | 49/332 kB | 28/315 kB
Progress (3): 108 kB | 49/332 kB | 32/315 kB
Progress (3): 108 kB | 53/332 kB | 32/315 kB
Progress (3): 108 kB | 57/332 kB | 32/315 kB
Progress (3): 108 kB | 57/332 kB | 36/315 kB
Progress (3): 108 kB | 61/332 kB | 36/315 kB
Progress (3): 108 kB | 61/332 kB | 40/315 kB
Progress (3): 108 kB | 65/332 kB | 40/315 kB
Progress (3): 108 kB | 65/332 kB | 45/315 kB
Progress (3): 108 kB | 65/332 kB | 49/315 kB
Progress (3): 108 kB | 69/332 kB | 49/315 kB
Progress (3): 108 kB | 73/332 kB | 49/315 kB
Progress (3): 108 kB | 77/332 kB | 49/315 kB
Progress (3): 108 kB | 81/332 kB | 49/315 kB
Progress (3): 108 kB | 81/332 kB | 53/315 kB
Progress (3): 108 kB | 85/332 kB | 53/315 kB
Progress (3): 108 kB | 85/332 kB | 57/315 kB
Progress (3): 108 kB | 90/332 kB | 57/315 kB
Progress (3): 108 kB | 90/332 kB | 61/315 kB
Progress (3): 108 kB | 94/332 kB | 61/315 kB
Progress (3): 108 kB | 94/332 kB | 65/315 kB
Progress (3): 108 kB | 98/332 kB | 65/315 kB
Progress (3): 108 kB | 98/332 kB | 69/315 kB
Progress (3): 108 kB | 102/332 kB | 69/315 kB
Progress (3): 108 kB | 102/332 kB | 73/315 kB
Progress (3): 108 kB | 106/332 kB | 73/315 kB
Progress (3): 108 kB | 106/332 kB | 77/315 kB
Progress (3): 108 kB | 110/332 kB | 77/315 kB
Progress (3): 108 kB | 110/332 kB | 81/315 kB
Progress (3): 108 kB | 114/332 kB | 81/315 kB
Progress (3): 108 kB | 114/332 kB | 85/315 kB
Progress (3): 108 kB | 118/332 kB | 85/315 kB
Progress (3): 108 kB | 118/332 kB | 90/315 kB
Progress (3): 108 kB | 122/332 kB | 90/315 kB
Progress (3): 108 kB | 122/332 kB | 94/315 kB
Progress (3): 108 kB | 126/332 kB | 94/315 kB
Progress (3): 108 kB | 126/332 kB | 98/315 kB
Progress (3): 108 kB | 131/332 kB | 98/315 kB
Progress (3): 108 kB | 131/332 kB | 102/315 kB
Progress (3): 108 kB | 135/332 kB | 102/315 kB
Progress (3): 108 kB | 135/332 kB | 106/315 kB
Progress (3): 108 kB | 139/332 kB | 106/315 kB
Progress (3): 108 kB | 139/332 kB | 110/315 kB
Progress (3): 108 kB | 143/332 kB | 110/315 kB
Progress (3): 108 kB | 143/332 kB | 114/315 kB
Progress (3): 108 kB | 147/332 kB | 114/315 kB
Progress (3): 108 kB | 147/332 kB | 118/315 kB
Progress (3): 108 kB | 147/332 kB | 122/315 kB
Progress (3): 108 kB | 151/332 kB | 122/315 kB
Progress (3): 108 kB | 151/332 kB | 126/315 kB
Progress (3): 108 kB | 155/332 kB | 126/315 kB
Progress (3): 108 kB | 155/332 kB | 131/315 kB
Progress (3): 108 kB | 159/332 kB | 131/315 kB
Progress (3): 108 kB | 163/332 kB | 131/315 kB
Progress (3): 108 kB | 163/332 kB | 135/315 kB
Progress (3): 108 kB | 163/332 kB | 139/315 kB
Progress (3): 108 kB | 167/332 kB | 139/315 kB
Progress (3): 108 kB | 167/332 kB | 143/315 kB
Progress (3): 108 kB | 171/332 kB | 143/315 kB
Progress (3): 108 kB | 171/332 kB | 147/315 kB
Progress (3): 108 kB | 176/332 kB | 147/315 kB
Progress (3): 108 kB | 180/332 kB | 147/315 kB
Progress (3): 108 kB | 180/332 kB | 151/315 kB
Progress (3): 108 kB | 180/332 kB | 155/315 kB
Progress (3): 108 kB | 184/332 kB | 155/315 kB
Progress (3): 108 kB | 184/332 kB | 159/315 kB
Progress (3): 108 kB | 188/332 kB | 159/315 kB
Progress (3): 108 kB | 188/332 kB | 163/315 kB
Progress (3): 108 kB | 192/332 kB | 163/315 kB
Progress (3): 108 kB | 196/332 kB | 163/315 kB
Progress (3): 108 kB | 196/332 kB | 167/315 kB
Progress (3): 108 kB | 196/332 kB | 171/315 kB
Progress (3): 108 kB | 200/332 kB | 171/315 kB
Progress (3): 108 kB | 200/332 kB | 176/315 kB
Progress (3): 108 kB | 204/332 kB | 176/315 kB
Progress (3): 108 kB | 204/332 kB | 180/315 kB
Progress (3): 108 kB | 208/332 kB | 180/315 kB
Progress (3): 108 kB | 212/332 kB | 180/315 kB
Progress (3): 108 kB | 212/332 kB | 184/315 kB
Progress (3): 108 kB | 212/332 kB | 188/315 kB
Progress (3): 108 kB | 217/332 kB | 188/315 kB
Progress (3): 108 kB | 217/332 kB | 192/315 kB
Progress (3): 108 kB | 221/332 kB | 192/315 kB
Progress (3): 108 kB | 221/332 kB | 196/315 kB
Progress (3): 108 kB | 225/332 kB | 196/315 kB
Progress (3): 108 kB | 229/332 kB | 196/315 kB
Progress (3): 108 kB | 229/332 kB | 200/315 kB
Progress (3): 108 kB | 229/332 kB | 204/315 kB
Progress (3): 108 kB | 229/332 kB | 208/315 kB
Progress (3): 108 kB | 233/332 kB | 208/315 kB
Progress (3): 108 kB | 233/332 kB | 212/315 kB
Progress (3): 108 kB | 237/332 kB | 212/315 kB
Progress (3): 108 kB | 241/332 kB | 212/315 kB
Progress (3): 108 kB | 245/332 kB | 212/315 kB
Progress (3): 108 kB | 245/332 kB | 217/315 kB
Progress (3): 108 kB | 245/332 kB | 221/315 kB
Progress (3): 108 kB | 245/332 kB | 225/315 kB
Progress (3): 108 kB | 245/332 kB | 229/315 kB
Progress (3): 108 kB | 249/332 kB | 229/315 kB
Progress (4): 108 kB | 249/332 kB | 229/315 kB | 4.1/35 kB
Progress (4): 108 kB | 253/332 kB | 229/315 kB | 4.1/35 kB
Progress (4): 108 kB | 253/332 kB | 233/315 kB | 4.1/35 kB
Progress (4): 108 kB | 253/332 kB | 233/315 kB | 7.7/35 kB
Progress (4): 108 kB | 253/332 kB | 237/315 kB | 7.7/35 kB
Progress (4): 108 kB | 258/332 kB | 237/315 kB | 7.7/35 kB
Progress (4): 108 kB | 258/332 kB | 241/315 kB | 7.7/35 kB
Progress (4): 108 kB | 258/332 kB | 241/315 kB | 12/35 kB 
Progress (4): 108 kB | 258/332 kB | 245/315 kB | 12/35 kB
Progress (4): 108 kB | 262/332 kB | 245/315 kB | 12/35 kB
Progress (5): 108 kB | 262/332 kB | 245/315 kB | 12/35 kB | 4.1/38 kB
Progress (5): 108 kB | 262/332 kB | 245/315 kB | 16/35 kB | 4.1/38 kB
Progress (5): 108 kB | 262/332 kB | 245/315 kB | 16/35 kB | 7.7/38 kB
Progress (5): 108 kB | 262/332 kB | 249/315 kB | 16/35 kB | 7.7/38 kB
Progress (5): 108 kB | 262/332 kB | 249/315 kB | 16/35 kB | 12/38 kB 
Progress (5): 108 kB | 266/332 kB | 249/315 kB | 16/35 kB | 12/38 kB
Progress (5): 108 kB | 266/332 kB | 249/315 kB | 16/35 kB | 16/38 kB
Progress (5): 108 kB | 266/332 kB | 249/315 kB | 20/35 kB | 16/38 kB
Progress (5): 108 kB | 266/332 kB | 253/315 kB | 20/35 kB | 16/38 kB
Progress (5): 108 kB | 266/332 kB | 253/315 kB | 24/35 kB | 16/38 kB
Progress (5): 108 kB | 270/332 kB | 253/315 kB | 24/35 kB | 16/38 kB
Progress (5): 108 kB | 270/332 kB | 253/315 kB | 28/35 kB | 16/38 kB
Progress (5): 108 kB | 270/332 kB | 253/315 kB | 28/35 kB | 20/38 kB
Progress (5): 108 kB | 270/332 kB | 258/315 kB | 28/35 kB | 20/38 kB
Progress (5): 108 kB | 270/332 kB | 258/315 kB | 28/35 kB | 24/38 kB
Progress (5): 108 kB | 270/332 kB | 258/315 kB | 32/35 kB | 24/38 kB
Progress (5): 108 kB | 274/332 kB | 258/315 kB | 32/35 kB | 24/38 kB
Progress (5): 108 kB | 274/332 kB | 258/315 kB | 32/35 kB | 28/38 kB
Progress (5): 108 kB | 274/332 kB | 262/315 kB | 32/35 kB | 28/38 kB
Progress (5): 108 kB | 274/332 kB | 262/315 kB | 32/35 kB | 32/38 kB
Progress (5): 108 kB | 278/332 kB | 262/315 kB | 32/35 kB | 32/38 kB
Progress (5): 108 kB | 278/332 kB | 262/315 kB | 32/35 kB | 36/38 kB
Progress (5): 108 kB | 278/332 kB | 266/315 kB | 32/35 kB | 36/38 kB
Progress (5): 108 kB | 278/332 kB | 270/315 kB | 32/35 kB | 36/38 kB
Progress (5): 108 kB | 278/332 kB | 274/315 kB | 32/35 kB | 36/38 kB
Progress (5): 108 kB | 278/332 kB | 278/315 kB | 32/35 kB | 36/38 kB
Progress (5): 108 kB | 278/332 kB | 282/315 kB | 32/35 kB | 36/38 kB
Progress (5): 108 kB | 278/332 kB | 286/315 kB | 32/35 kB | 36/38 kB
Progress (5): 108 kB | 278/332 kB | 290/315 kB | 32/35 kB | 36/38 kB
Progress (5): 108 kB | 278/332 kB | 294/315 kB | 32/35 kB | 36/38 kB
Progress (5): 108 kB | 278/332 kB | 298/315 kB | 32/35 kB | 36/38 kB
Progress (5): 108 kB | 278/332 kB | 303/315 kB | 32/35 kB | 36/38 kB
Progress (5): 108 kB | 278/332 kB | 307/315 kB | 32/35 kB | 36/38 kB
Progress (5): 108 kB | 278/332 kB | 311/315 kB | 32/35 kB | 36/38 kB
Progress (5): 108 kB | 278/332 kB | 315/315 kB | 32/35 kB | 36/38 kB
Progress (5): 108 kB | 278/332 kB | 315 kB | 32/35 kB | 36/38 kB    
Progress (5): 108 kB | 278/332 kB | 315 kB | 35 kB | 36/38 kB   
Progress (5): 108 kB | 282/332 kB | 315 kB | 35 kB | 36/38 kB
Progress (5): 108 kB | 282/332 kB | 315 kB | 35 kB | 38 kB   
Progress (5): 108 kB | 286/332 kB | 315 kB | 35 kB | 38 kB
Progress (5): 108 kB | 290/332 kB | 315 kB | 35 kB | 38 kB
Progress (5): 108 kB | 294/332 kB | 315 kB | 35 kB | 38 kB
Progress (5): 108 kB | 298/332 kB | 315 kB | 35 kB | 38 kB
Progress (5): 108 kB | 303/332 kB | 315 kB | 35 kB | 38 kB
Progress (5): 108 kB | 307/332 kB | 315 kB | 35 kB | 38 kB
                                                          
Downloaded from eclipse.maven.central.mirror: https://repo.eclipse.org/content/repositories/maven_central/org/ow2/asm/asm/6.1.1/asm-6.1.1.jar (108 kB at 338 kB/s)
Progress (4): 311/332 kB | 315 kB | 35 kB | 38 kB
Progress (4): 315/332 kB | 315 kB | 35 kB | 38 kB
Progress (4): 319/332 kB | 315 kB | 35 kB | 38 kB
Progress (4): 323/332 kB | 315 kB | 35 kB | 38 kB
Progress (4): 327/332 kB | 315 kB | 35 kB | 38 kB
Progress (4): 331/332 kB | 315 kB | 35 kB | 38 kB
Progress (4): 332 kB | 315 kB | 35 kB | 38 kB    
                                             
Downloaded from eclipse.maven.central.mirror: https://repo.eclipse.org/content/repositories/maven_central/com/thoughtworks/qdox/qdox/2.0-M7/qdox-2.0-M7.jar (315 kB at 966 kB/s)
Downloaded from eclipse.maven.central.mirror: https://repo.eclipse.org/content/repositories/maven_central/org/codehaus/plexus/plexus-java/0.9.8/plexus-java-0.9.8.jar (35 kB at 107 kB/s)
Downloaded from eclipse.maven.central.mirror: https://repo.eclipse.org/content/repositories/maven_central/org/apache/maven/maven-toolchain/2.2.1/maven-toolchain-2.2.1.jar (38 kB at 109 kB/s)
Downloaded from eclipse.maven.central.mirror: https://repo.eclipse.org/content/repositories/maven_central/backport-util-concurrent/backport-util-concurrent/3.1/backport-util-concurrent-3.1.jar (332 kB at 953 kB/s)
[WARNING] No explicit target runtime environment configuration. Build is platform dependent.
Downloading from eclipse.maven.central.mirror: https://repo.eclipse.org/content/repositories/maven_central/org/sonatype/plugins/maven-upload-plugin/0.0.1/maven-upload-plugin-0.0.1.pom
Progress (1): 1.7 kB
                    
Downloaded from eclipse.maven.central.mirror: https://repo.eclipse.org/content/repositories/maven_central/org/sonatype/plugins/maven-upload-plugin/0.0.1/maven-upload-plugin-0.0.1.pom (1.7 kB at 5.8 kB/s)
Downloading from eclipse.maven.central.mirror: https://repo.eclipse.org/content/repositories/maven_central/org/sonatype/plugins/plugins-parent/5/plugins-parent-5.pom
Progress (1): 2.6 kB
                    
Downloaded from eclipse.maven.central.mirror: https://repo.eclipse.org/content/repositories/maven_central/org/sonatype/plugins/plugins-parent/5/plugins-parent-5.pom (2.6 kB at 61 kB/s)
Downloading from eclipse.maven.central.mirror: https://repo.eclipse.org/content/repositories/maven_central/org/sonatype/plugins/maven-upload-plugin/0.0.1/maven-upload-plugin-0.0.1.jar
Progress (1): 4.1/8.8 kB
Progress (1): 7.7/8.8 kB
Progress (1): 8.8 kB    
                    
Downloaded from eclipse.maven.central.mirror: https://repo.eclipse.org/content/repositories/maven_central/org/sonatype/plugins/maven-upload-plugin/0.0.1/maven-upload-plugin-0.0.1.jar (8.8 kB at 25 kB/s)
Downloading from eclipse.maven.central.mirror: https://repo.eclipse.org/content/repositories/maven_central/org/eclipse/tycho/tycho-p2-publisher-plugin/1.6.0/tycho-p2-publisher-plugin-1.6.0.pom
Progress (1): 2.0 kB
                    
Downloaded from eclipse.maven.central.mirror: https://repo.eclipse.org/content/repositories/maven_central/org/eclipse/tycho/tycho-p2-publisher-plugin/1.6.0/tycho-p2-publisher-plugin-1.6.0.pom (2.0 kB at 1.0 MB/s)
Downloading from eclipse.maven.central.mirror: https://repo.eclipse.org/content/repositories/maven_central/org/eclipse/tycho/tycho-p2-publisher-plugin/1.6.0/tycho-p2-publisher-plugin-1.6.0.jar
Progress (1): 4.1/21 kB
Progress (1): 7.7/21 kB
Progress (1): 12/21 kB 
Progress (1): 16/21 kB
Progress (1): 20/21 kB
Progress (1): 21 kB   
                   
Downloaded from eclipse.maven.central.mirror: https://repo.eclipse.org/content/repositories/maven_central/org/eclipse/tycho/tycho-p2-publisher-plugin/1.6.0/tycho-p2-publisher-plugin-1.6.0.jar (21 kB at 588 kB/s)
Downloading from eclipse.maven.central.mirror: https://repo.eclipse.org/content/repositories/maven_central/org/apache/commons/commons-lang3/3.1/commons-lang3-3.1.pom
Progress (1): 4.1 kB
Progress (1): 8.2 kB
Progress (1): 12 kB 
Progress (1): 16 kB
Progress (1): 17 kB
                   
Downloaded from eclipse.maven.central.mirror: https://repo.eclipse.org/content/repositories/maven_central/org/apache/commons/commons-lang3/3.1/commons-lang3-3.1.pom (17 kB at 3.3 MB/s)
Downloading from eclipse.maven.central.mirror: https://repo.eclipse.org/content/repositories/maven_central/org/apache/commons/commons-parent/22/commons-parent-22.pom
Progress (1): 4.1 kB
Progress (1): 8.2 kB
Progress (1): 12 kB 
Progress (1): 16 kB
Progress (1): 20 kB
Progress (1): 25 kB
Progress (1): 29 kB
Progress (1): 33 kB
Progress (1): 37 kB
Progress (1): 41 kB
Progress (1): 42 kB
                   
Downloaded from eclipse.maven.central.mirror: https://repo.eclipse.org/content/repositories/maven_central/org/apache/commons/commons-parent/22/commons-parent-22.pom (42 kB at 6.0 MB/s)
Downloading from eclipse.maven.central.mirror: https://repo.eclipse.org/content/repositories/maven_central/org/apache/maven/maven-archiver/3.5.0/maven-archiver-3.5.0.pom
Progress (1): 4.1 kB
Progress (1): 4.5 kB
                    
Downloaded from eclipse.maven.central.mirror: https://repo.eclipse.org/content/repositories/maven_central/org/apache/maven/maven-archiver/3.5.0/maven-archiver-3.5.0.pom (4.5 kB at 892 kB/s)
Downloading from eclipse.maven.central.mirror: https://repo.eclipse.org/content/repositories/maven_central/org/apache/maven/shared/maven-shared-components/33/maven-shared-components-33.pom
Progress (1): 4.1 kB
Progress (1): 5.1 kB
                    
Downloaded from eclipse.maven.central.mirror: https://repo.eclipse.org/content/repositories/maven_central/org/apache/maven/shared/maven-shared-components/33/maven-shared-components-33.pom (5.1 kB at 463 kB/s)
Downloading from eclipse.maven.central.mirror: https://repo.eclipse.org/content/repositories/maven_central/org/apache/maven/shared/maven-shared-utils/3.2.1/maven-shared-utils-3.2.1.pom
Progress (1): 4.1 kB
Progress (1): 5.6 kB
                    
Downloaded from eclipse.maven.central.mirror: https://repo.eclipse.org/content/repositories/maven_central/org/apache/maven/shared/maven-shared-utils/3.2.1/maven-shared-utils-3.2.1.pom (5.6 kB at 626 kB/s)
Downloading from eclipse.maven.central.mirror: https://repo.eclipse.org/content/repositories/maven_central/org/apache/maven/shared/maven-shared-components/30/maven-shared-components-30.pom
Progress (1): 4.1 kB
Progress (1): 4.6 kB
                    
Downloaded from eclipse.maven.central.mirror: https://repo.eclipse.org/content/repositories/maven_central/org/apache/maven/shared/maven-shared-components/30/maven-shared-components-30.pom (4.6 kB at 1.5 MB/s)
Downloading from eclipse.maven.central.mirror: https://repo.eclipse.org/content/repositories/maven_central/org/apache/maven/maven-parent/30/maven-parent-30.pom
Progress (1): 4.1 kB
Progress (1): 8.2 kB
Progress (1): 12 kB 
Progress (1): 16 kB
Progress (1): 20 kB
Progress (1): 25 kB
Progress (1): 29 kB
Progress (1): 33 kB
Progress (1): 37 kB
Progress (1): 41 kB
Progress (1): 41 kB
                   
Downloaded from eclipse.maven.central.mirror: https://repo.eclipse.org/content/repositories/maven_central/org/apache/maven/maven-parent/30/maven-parent-30.pom (41 kB at 6.9 MB/s)
Downloading from eclipse.maven.central.mirror: https://repo.eclipse.org/content/repositories/maven_central/commons-io/commons-io/2.5/commons-io-2.5.pom
Progress (1): 4.1 kB
Progress (1): 8.2 kB
Progress (1): 12 kB 
Progress (1): 13 kB
                   
Downloaded from eclipse.maven.central.mirror: https://repo.eclipse.org/content/repositories/maven_central/commons-io/commons-io/2.5/commons-io-2.5.pom (13 kB at 4.4 MB/s)
Downloading from eclipse.maven.central.mirror: https://repo.eclipse.org/content/repositories/maven_central/org/apache/commons/commons-parent/39/commons-parent-39.pom
Progress (1): 4.1 kB
Progress (1): 8.2 kB
Progress (1): 12 kB 
Progress (1): 16 kB
Progress (1): 20 kB
Progress (1): 25 kB
Progress (1): 29 kB
Progress (1): 33 kB
Progress (1): 37 kB
Progress (1): 41 kB
Progress (1): 45 kB
Progress (1): 49 kB
Progress (1): 53 kB
Progress (1): 57 kB
Progress (1): 61 kB
Progress (1): 62 kB
                   
Downloaded from eclipse.maven.central.mirror: https://repo.eclipse.org/content/repositories/maven_central/org/apache/commons/commons-parent/39/commons-parent-39.pom (62 kB at 6.2 MB/s)
Downloading from eclipse.maven.central.mirror: https://repo.eclipse.org/content/repositories/maven_central/org/apache/apache/16/apache-16.pom
Progress (1): 4.1 kB
Progress (1): 8.2 kB
Progress (1): 12 kB 
Progress (1): 15 kB
                   
Downloaded from eclipse.maven.central.mirror: https://repo.eclipse.org/content/repositories/maven_central/org/apache/apache/16/apache-16.pom (15 kB at 3.8 MB/s)
Downloading from eclipse.maven.central.mirror: https://repo.eclipse.org/content/repositories/maven_central/org/codehaus/plexus/plexus-interpolation/1.25/plexus-interpolation-1.25.pom
Progress (1): 2.6 kB
                    
Downloaded from eclipse.maven.central.mirror: https://repo.eclipse.org/content/repositories/maven_central/org/codehaus/plexus/plexus-interpolation/1.25/plexus-interpolation-1.25.pom (2.6 kB at 882 kB/s)
Downloading from eclipse.maven.central.mirror: https://repo.eclipse.org/content/repositories/maven_central/org/apache/commons/commons-lang3/3.1/commons-lang3-3.1.jar
Downloading from eclipse.maven.central.mirror: https://repo.eclipse.org/content/repositories/maven_central/org/apache/maven/shared/maven-shared-utils/3.2.1/maven-shared-utils-3.2.1.jar
Downloading from eclipse.maven.central.mirror: https://repo.eclipse.org/content/repositories/maven_central/org/apache/maven/maven-archiver/3.5.0/maven-archiver-3.5.0.jar
Downloading from eclipse.maven.central.mirror: https://repo.eclipse.org/content/repositories/maven_central/commons-io/commons-io/2.5/commons-io-2.5.jar
Progress (1): 4.1/316 kB
Progress (1): 7.7/316 kB
Progress (1): 12/316 kB 
Progress (1): 16/316 kB
Progress (1): 20/316 kB
Progress (1): 24/316 kB
Progress (1): 28/316 kB
Progress (1): 32/316 kB
Progress (1): 36/316 kB
Progress (2): 36/316 kB | 4.1/167 kB
Progress (2): 40/316 kB | 4.1/167 kB
Progress (2): 40/316 kB | 7.7/167 kB
Progress (2): 45/316 kB | 7.7/167 kB
Progress (2): 45/316 kB | 12/167 kB 
Progress (2): 49/316 kB | 12/167 kB
Progress (2): 49/316 kB | 16/167 kB
Progress (2): 53/316 kB | 16/167 kB
Progress (2): 53/316 kB | 20/167 kB
Progress (2): 57/316 kB | 20/167 kB
Progress (2): 57/316 kB | 24/167 kB
Progress (2): 61/316 kB | 24/167 kB
Progress (2): 61/316 kB | 28/167 kB
Progress (2): 65/316 kB | 28/167 kB
Progress (2): 65/316 kB | 32/167 kB
Progress (2): 69/316 kB | 32/167 kB
Progress (2): 69/316 kB | 36/167 kB
Progress (2): 73/316 kB | 36/167 kB
Progress (2): 73/316 kB | 40/167 kB
Progress (2): 77/316 kB | 40/167 kB
Progress (2): 77/316 kB | 45/167 kB
Progress (2): 81/316 kB | 45/167 kB
Progress (2): 81/316 kB | 49/167 kB
Progress (2): 85/316 kB | 49/167 kB
Progress (2): 85/316 kB | 53/167 kB
Progress (2): 90/316 kB | 53/167 kB
Progress (2): 90/316 kB | 57/167 kB
Progress (2): 94/316 kB | 57/167 kB
Progress (2): 94/316 kB | 61/167 kB
Progress (2): 98/316 kB | 61/167 kB
Progress (2): 98/316 kB | 65/167 kB
Progress (2): 102/316 kB | 65/167 kB
Progress (2): 102/316 kB | 69/167 kB
Progress (2): 106/316 kB | 69/167 kB
Progress (2): 106/316 kB | 73/167 kB
Progress (2): 110/316 kB | 73/167 kB
Progress (2): 110/316 kB | 77/167 kB
Progress (2): 114/316 kB | 77/167 kB
Progress (2): 114/316 kB | 81/167 kB
Progress (2): 114/316 kB | 85/167 kB
Progress (2): 118/316 kB | 85/167 kB
Progress (2): 118/316 kB | 90/167 kB
Progress (2): 122/316 kB | 90/167 kB
Progress (2): 122/316 kB | 94/167 kB
Progress (2): 126/316 kB | 94/167 kB
Progress (2): 126/316 kB | 98/167 kB
Progress (2): 131/316 kB | 98/167 kB
Progress (3): 131/316 kB | 98/167 kB | 4.1/209 kB
Progress (3): 131/316 kB | 98/167 kB | 7.7/209 kB
Progress (3): 131/316 kB | 102/167 kB | 7.7/209 kB
Progress (3): 135/316 kB | 102/167 kB | 7.7/209 kB
Progress (3): 135/316 kB | 102/167 kB | 12/209 kB 
Progress (3): 139/316 kB | 102/167 kB | 12/209 kB
Progress (3): 139/316 kB | 106/167 kB | 12/209 kB
Progress (3): 143/316 kB | 106/167 kB | 12/209 kB
Progress (3): 143/316 kB | 106/167 kB | 16/209 kB
Progress (3): 147/316 kB | 106/167 kB | 16/209 kB
Progress (3): 147/316 kB | 110/167 kB | 16/209 kB
Progress (4): 147/316 kB | 110/167 kB | 16/209 kB | 4.1/26 kB
Progress (4): 147/316 kB | 110/167 kB | 20/209 kB | 4.1/26 kB
Progress (4): 147/316 kB | 114/167 kB | 20/209 kB | 4.1/26 kB
Progress (4): 147/316 kB | 114/167 kB | 24/209 kB | 4.1/26 kB
Progress (4): 147/316 kB | 114/167 kB | 24/209 kB | 7.7/26 kB
Progress (4): 151/316 kB | 114/167 kB | 24/209 kB | 7.7/26 kB
Progress (4): 151/316 kB | 114/167 kB | 28/209 kB | 7.7/26 kB
Progress (4): 151/316 kB | 118/167 kB | 28/209 kB | 7.7/26 kB
Progress (4): 155/316 kB | 118/167 kB | 28/209 kB | 7.7/26 kB
Progress (4): 155/316 kB | 118/167 kB | 28/209 kB | 12/26 kB 
Progress (4): 159/316 kB | 118/167 kB | 28/209 kB | 12/26 kB
Progress (4): 159/316 kB | 122/167 kB | 28/209 kB | 12/26 kB
Progress (4): 159/316 kB | 122/167 kB | 32/209 kB | 12/26 kB
Progress (4): 159/316 kB | 126/167 kB | 32/209 kB | 12/26 kB
Progress (4): 163/316 kB | 126/167 kB | 32/209 kB | 12/26 kB
Progress (4): 163/316 kB | 126/167 kB | 32/209 kB | 16/26 kB
Progress (4): 163/316 kB | 126/167 kB | 36/209 kB | 16/26 kB
Progress (4): 163/316 kB | 131/167 kB | 36/209 kB | 16/26 kB
Progress (4): 163/316 kB | 131/167 kB | 40/209 kB | 16/26 kB
Progress (4): 163/316 kB | 131/167 kB | 40/209 kB | 20/26 kB
Progress (4): 163/316 kB | 131/167 kB | 45/209 kB | 20/26 kB
Progress (4): 163/316 kB | 131/167 kB | 45/209 kB | 24/26 kB
Progress (4): 167/316 kB | 131/167 kB | 45/209 kB | 24/26 kB
Progress (4): 167/316 kB | 131/167 kB | 45/209 kB | 26 kB   
Progress (4): 167/316 kB | 135/167 kB | 45/209 kB | 26 kB
Progress (4): 167/316 kB | 135/167 kB | 49/209 kB | 26 kB
Progress (4): 167/316 kB | 139/167 kB | 49/209 kB | 26 kB
Progress (4): 171/316 kB | 139/167 kB | 49/209 kB | 26 kB
Progress (4): 171/316 kB | 143/167 kB | 49/209 kB | 26 kB
Progress (4): 171/316 kB | 143/167 kB | 53/209 kB | 26 kB
Progress (4): 176/316 kB | 143/167 kB | 53/209 kB | 26 kB
Progress (4): 176/316 kB | 143/167 kB | 57/209 kB | 26 kB
Progress (4): 176/316 kB | 147/167 kB | 57/209 kB | 26 kB
Progress (4): 176/316 kB | 147/167 kB | 61/209 kB | 26 kB
Progress (4): 180/316 kB | 147/167 kB | 61/209 kB | 26 kB
Progress (4): 180/316 kB | 147/167 kB | 65/209 kB | 26 kB
Progress (4): 180/316 kB | 151/167 kB | 65/209 kB | 26 kB
Progress (4): 180/316 kB | 155/167 kB | 65/209 kB | 26 kB
Progress (4): 180/316 kB | 155/167 kB | 69/209 kB | 26 kB
Progress (4): 180/316 kB | 159/167 kB | 69/209 kB | 26 kB
Progress (4): 184/316 kB | 159/167 kB | 69/209 kB | 26 kB
Progress (4): 184/316 kB | 159/167 kB | 73/209 kB | 26 kB
Progress (4): 188/316 kB | 159/167 kB | 73/209 kB | 26 kB
Progress (4): 188/316 kB | 163/167 kB | 73/209 kB | 26 kB
Progress (4): 192/316 kB | 163/167 kB | 73/209 kB | 26 kB
Progress (4): 192/316 kB | 163/167 kB | 77/209 kB | 26 kB
Progress (4): 196/316 kB | 163/167 kB | 77/209 kB | 26 kB
Progress (4): 196/316 kB | 167 kB | 77/209 kB | 26 kB    
Progress (4): 196/316 kB | 167 kB | 81/209 kB | 26 kB
Progress (4): 200/316 kB | 167 kB | 81/209 kB | 26 kB
Progress (4): 200/316 kB | 167 kB | 85/209 kB | 26 kB
Progress (4): 204/316 kB | 167 kB | 85/209 kB | 26 kB
Progress (4): 204/316 kB | 167 kB | 90/209 kB | 26 kB
Progress (4): 208/316 kB | 167 kB | 90/209 kB | 26 kB
Progress (4): 208/316 kB | 167 kB | 94/209 kB | 26 kB
Progress (4): 212/316 kB | 167 kB | 94/209 kB | 26 kB
Progress (4): 212/316 kB | 167 kB | 98/209 kB | 26 kB
Progress (4): 217/316 kB | 167 kB | 98/209 kB | 26 kB
Progress (4): 217/316 kB | 167 kB | 102/209 kB | 26 kB
Progress (4): 221/316 kB | 167 kB | 102/209 kB | 26 kB
Progress (4): 221/316 kB | 167 kB | 106/209 kB | 26 kB
Progress (4): 225/316 kB | 167 kB | 106/209 kB | 26 kB
Progress (4): 225/316 kB | 167 kB | 110/209 kB | 26 kB
Progress (4): 229/316 kB | 167 kB | 110/209 kB | 26 kB
Progress (4): 229/316 kB | 167 kB | 114/209 kB | 26 kB
Progress (4): 233/316 kB | 167 kB | 114/209 kB | 26 kB
Progress (4): 233/316 kB | 167 kB | 118/209 kB | 26 kB
Progress (4): 237/316 kB | 167 kB | 118/209 kB | 26 kB
Progress (4): 237/316 kB | 167 kB | 122/209 kB | 26 kB
Progress (4): 241/316 kB | 167 kB | 122/209 kB | 26 kB
Progress (4): 241/316 kB | 167 kB | 126/209 kB | 26 kB
Progress (4): 245/316 kB | 167 kB | 126/209 kB | 26 kB
Progress (4): 245/316 kB | 167 kB | 131/209 kB | 26 kB
Progress (4): 249/316 kB | 167 kB | 131/209 kB | 26 kB
Progress (4): 249/316 kB | 167 kB | 135/209 kB | 26 kB
Progress (4): 253/316 kB | 167 kB | 135/209 kB | 26 kB
Progress (4): 253/316 kB | 167 kB | 139/209 kB | 26 kB
Progress (4): 258/316 kB | 167 kB | 139/209 kB | 26 kB
Progress (4): 258/316 kB | 167 kB | 143/209 kB | 26 kB
Progress (4): 262/316 kB | 167 kB | 143/209 kB | 26 kB
Progress (4): 262/316 kB | 167 kB | 147/209 kB | 26 kB
Progress (4): 266/316 kB | 167 kB | 147/209 kB | 26 kB
Progress (4): 266/316 kB | 167 kB | 151/209 kB | 26 kB
Progress (4): 270/316 kB | 167 kB | 151/209 kB | 26 kB
Progress (4): 270/316 kB | 167 kB | 155/209 kB | 26 kB
Progress (4): 274/316 kB | 167 kB | 155/209 kB | 26 kB
Progress (4): 274/316 kB | 167 kB | 159/209 kB | 26 kB
Progress (4): 278/316 kB | 167 kB | 159/209 kB | 26 kB
Progress (4): 278/316 kB | 167 kB | 163/209 kB | 26 kB
Progress (4): 282/316 kB | 167 kB | 163/209 kB | 26 kB
Progress (4): 282/316 kB | 167 kB | 167/209 kB | 26 kB
Progress (4): 286/316 kB | 167 kB | 167/209 kB | 26 kB
Progress (4): 286/316 kB | 167 kB | 171/209 kB | 26 kB
Progress (4): 290/316 kB | 167 kB | 171/209 kB | 26 kB
Progress (4): 290/316 kB | 167 kB | 176/209 kB | 26 kB
Progress (4): 294/316 kB | 167 kB | 176/209 kB | 26 kB
Progress (4): 294/316 kB | 167 kB | 180/209 kB | 26 kB
Progress (4): 298/316 kB | 167 kB | 180/209 kB | 26 kB
Progress (4): 298/316 kB | 167 kB | 184/209 kB | 26 kB
Progress (4): 303/316 kB | 167 kB | 184/209 kB | 26 kB
Progress (4): 303/316 kB | 167 kB | 188/209 kB | 26 kB
Progress (4): 307/316 kB | 167 kB | 188/209 kB | 26 kB
Progress (4): 307/316 kB | 167 kB | 192/209 kB | 26 kB
Progress (4): 311/316 kB | 167 kB | 192/209 kB | 26 kB
Progress (4): 311/316 kB | 167 kB | 196/209 kB | 26 kB
Progress (4): 315/316 kB | 167 kB | 196/209 kB | 26 kB
Progress (4): 315/316 kB | 167 kB | 200/209 kB | 26 kB
Progress (4): 316 kB | 167 kB | 200/209 kB | 26 kB    
Progress (4): 316 kB | 167 kB | 204/209 kB | 26 kB
Progress (4): 316 kB | 167 kB | 208/209 kB | 26 kB
Progress (4): 316 kB | 167 kB | 209 kB | 26 kB    
                                              
Downloaded from eclipse.maven.central.mirror: https://repo.eclipse.org/content/repositories/maven_central/org/apache/commons/commons-lang3/3.1/commons-lang3-3.1.jar (316 kB at 10 MB/s)
Downloaded from eclipse.maven.central.mirror: https://repo.eclipse.org/content/repositories/maven_central/commons-io/commons-io/2.5/commons-io-2.5.jar (209 kB at 6.5 MB/s)
Downloaded from eclipse.maven.central.mirror: https://repo.eclipse.org/content/repositories/maven_central/org/apache/maven/shared/maven-shared-utils/3.2.1/maven-shared-utils-3.2.1.jar (167 kB at 4.2 MB/s)
Downloaded from eclipse.maven.central.mirror: https://repo.eclipse.org/content/repositories/maven_central/org/apache/maven/maven-archiver/3.5.0/maven-archiver-3.5.0.jar (26 kB at 531 kB/s)
Downloading from eclipse.maven.central.mirror: https://repo.eclipse.org/content/repositories/maven_central/org/eclipse/tycho/tycho-p2-repository-plugin/1.6.0/tycho-p2-repository-plugin-1.6.0.pom
Progress (1): 1.4 kB
                    
Downloaded from eclipse.maven.central.mirror: https://repo.eclipse.org/content/repositories/maven_central/org/eclipse/tycho/tycho-p2-repository-plugin/1.6.0/tycho-p2-repository-plugin-1.6.0.pom (1.4 kB at 475 kB/s)
Downloading from eclipse.maven.central.mirror: https://repo.eclipse.org/content/repositories/maven_central/org/eclipse/tycho/tycho-p2-repository-plugin/1.6.0/tycho-p2-repository-plugin-1.6.0.jar
Progress (1): 4.1/14 kB
Progress (1): 7.7/14 kB
Progress (1): 12/14 kB 
Progress (1): 14 kB   
                   
Downloaded from eclipse.maven.central.mirror: https://repo.eclipse.org/content/repositories/maven_central/org/eclipse/tycho/tycho-p2-repository-plugin/1.6.0/tycho-p2-repository-plugin-1.6.0.jar (14 kB at 4.8 MB/s)
[INFO] Computing target platform for MavenProject: org.sonatype.m2e.extras:org.sonatype.m2e.mavenarchiver:0.17.5-SNAPSHOT @ /home/jenkins/agent/workspace/m2eclipse-mavenarchiver/org.sonatype.m2e.mavenarchiver/pom.xml
[INFO] Fetching p2.index from http://download.eclipse.org/releases/2019-12/
[INFO] Adding repository http://download.eclipse.org/releases/2019-12
[INFO] Fetching compositeContent.jar from http://download.eclipse.org/releases/2019-12/ (482B)
[INFO] Fetching p2.index from http://download.eclipse.org/technology/epp/packages/2019-12/
[INFO] Fetching content.xml.xz from http://download.eclipse.org/technology/epp/packages/2019-12/
[INFO] Fetching p2.index from http://download.eclipse.org/releases/2019-12/201912181000/
[INFO] Fetching content.xml.xz from http://download.eclipse.org/releases/2019-12/201912181000/
[INFO] Fetching p2.index from https://download.eclipse.org/cbi/updates/license/
[INFO] Adding repository https://download.eclipse.org/cbi/updates/license
[INFO] Fetching compositeContent.jar from https://download.eclipse.org/cbi/updates/license/ (423B)
[INFO] Fetching content.jar from https://download.eclipse.org/cbi/updates/license/1.0.0.v20131003-1638/ (3.87kB)
[INFO] Fetching content.jar from https://download.eclipse.org/cbi/updates/license/1.0.1.v20140414-1359/ (3.83kB)
[INFO] Fetching p2.index from https://download.eclipse.org/cbi/updates/license/2.0.2.v20181016-2210/
[INFO] Fetching content.xml.xz from https://download.eclipse.org/cbi/updates/license/2.0.2.v20181016-2210/
[INFO] Fetching p2.index from http://download.eclipse.org/technology/m2e/releases/1.14/
[INFO] Adding repository http://download.eclipse.org/technology/m2e/releases/1.14
[INFO] Fetching compositeContent.xml from http://download.eclipse.org/technology/m2e/releases/1.14/
[INFO] Fetching p2.index from http://download.eclipse.org/technology/m2e/releases/1.14/1.14.0.20191209-1925/
[INFO] Fetching content.xml.xz from http://download.eclipse.org/technology/m2e/releases/1.14/1.14.0.20191209-1925/
[INFO] Fetching p2.index from http://download.eclipse.org/releases/mars/
[INFO] Adding repository http://download.eclipse.org/releases/mars
[INFO] Fetching compositeContent.jar from http://download.eclipse.org/releases/mars/ (502B)
[INFO] Fetching p2.index from http://download.eclipse.org/technology/epp/packages/mars/
[INFO] Fetching content.xml.xz from http://download.eclipse.org/technology/epp/packages/mars/
[INFO] Fetching p2.index from http://download.eclipse.org/releases/mars/201506241002/
[INFO] Fetching content.xml.xz from http://download.eclipse.org/releases/mars/201506241002/
[INFO] Fetching p2.index from http://download.eclipse.org/releases/mars/201510021000/
[INFO] Fetching content.xml.xz from http://download.eclipse.org/releases/mars/201510021000/
[INFO] Fetching p2.index from http://download.eclipse.org/releases/mars/201602261000/
[INFO] Fetching content.xml.xz from http://download.eclipse.org/releases/mars/201602261000/
[INFO] Resolving dependencies of MavenProject: org.sonatype.m2e.extras:org.sonatype.m2e.mavenarchiver:0.17.5-SNAPSHOT @ /home/jenkins/agent/workspace/m2eclipse-mavenarchiver/org.sonatype.m2e.mavenarchiver/pom.xml
[INFO] Fetching com.google.guava_27.1.0.v20190517-1946.jar.pack.gz from http://download.eclipse.org/releases/2019-12/201912181000/plugins/ (743.15kB)
[INFO] Fetching org.eclipse.osgi_3.15.100.v20191114-1701.jar.pack.gz from http://download.eclipse.org/releases/2019-12/201912181000/plugins/ (458.65kB)
[INFO] Fetching org.eclipse.equinox.common_3.10.600.v20191004-1420.jar.pack.gz from http://download.eclipse.org/releases/2019-12/201912181000/plugins/ (52.5kB)
[INFO] Fetching org.eclipse.core.commands_3.9.600.v20191122-2109.jar.pack.gz from http://download.eclipse.org/releases/2019-12/201912181000/plugins/ (42.96kB)
[INFO] Fetching org.eclipse.equinox.preferences_3.7.600.v20191017-2055.jar.pack.gz from http://download.eclipse.org/releases/2019-12/201912181000/plugins/ (54.22kB)
[INFO] Fetching org.eclipse.equinox.registry_3.8.600.v20191017-2055.jar.pack.gz from http://download.eclipse.org/releases/2019-12/201912181000/plugins/ (76.89kB)
[INFO] Fetching org.eclipse.core.contenttype_3.7.500.v20190916-2125.jar.pack.gz from http://download.eclipse.org/releases/2019-12/201912181000/plugins/ (41.62kB)
[INFO] Fetching org.eclipse.core.runtime_3.17.0.v20191122-2104.jar.pack.gz from http://download.eclipse.org/releases/2019-12/201912181000/plugins/ (33.74kB)
[INFO] Fetching org.eclipse.core.expressions_3.6.600.v20191122-2104.jar.pack.gz from http://download.eclipse.org/releases/2019-12/201912181000/plugins/ (33.81kB)
[INFO] Fetching org.eclipse.core.filesystem_1.7.600.v20191122-2104.jar.pack.gz from http://download.eclipse.org/releases/2019-12/201912181000/plugins/ (27.8kB)
[INFO] Fetching org.eclipse.core.jobs_3.10.600.v20191122-2104.jar.pack.gz from http://download.eclipse.org/releases/2019-12/201912181000/plugins/ (46.12kB)
[INFO] Fetching org.eclipse.core.resources_3.13.600.v20191122-2104.jar from http://download.eclipse.org/releases/2019-12/201912181000/plugins/ (873.23kB)
[INFO] Fetching org.eclipse.equinox.app_1.4.300.v20190815-1535.jar.pack.gz from http://download.eclipse.org/releases/2019-12/201912181000/plugins/ (42.16kB)
[INFO] Fetching org.eclipse.core.variables_3.4.700.v20191114-1848.jar.pack.gz from http://download.eclipse.org/releases/2019-12/201912181000/plugins/ (18.05kB)
[INFO] Fetching com.ibm.icu.base_54.1.1.v201501272100.jar from http://download.eclipse.org/releases/mars/201506241002/plugins/ (177.19kB)
[INFO] Fetching org.eclipse.debug.core_3.14.100.v20191115-1406.jar.pack.gz from http://download.eclipse.org/releases/2019-12/201912181000/plugins/ (125.76kB)
[INFO] Fetching org.eclipse.text_3.10.0.v20191122-2108.jar.pack.gz from http://download.eclipse.org/releases/2019-12/201912181000/plugins/ (100.78kB)
[INFO] Fetching org.eclipse.jdt.core_3.20.0.v20191203-2131.jar from http://download.eclipse.org/releases/2019-12/201912181000/plugins/ (6.71MB)
[INFO] Fetching org.eclipse.jdt.debug_3.14.0.v20191105-0758.jar.pack.gz from http://download.eclipse.org/releases/2019-12/201912181000/plugins/ (937.08kB)
[INFO] Fetching org.eclipse.jdt.launching_3.16.0.v20191108-0353.jar.pack.gz from http://download.eclipse.org/releases/2019-12/201912181000/plugins/ (273.76kB)
[INFO] Fetching org.eclipse.m2e.archetype.common_1.14.0.20191209-1923.jar from http://download.eclipse.org/releases/2019-12/201912181000/plugins/ (1.91MB)
[INFO] Fetching org.eclipse.m2e.maven.runtime_1.14.0.20191209-1923.jar from http://download.eclipse.org/releases/2019-12/201912181000/plugins/ (7.22MB)
[INFO] Fetching org.eclipse.m2e.workspace.cli_0.3.1.jar from http://download.eclipse.org/releases/2019-12/201912181000/plugins/ (15.56kB)
[INFO] Fetching org.slf4j.api_1.7.10.v20170428-1633.jar from http://download.eclipse.org/releases/2019-12/201912181000/plugins/ (42.51kB)
[INFO] Fetching org.eclipse.m2e.core_1.14.0.20191209-1925.jar.pack.gz from http://download.eclipse.org/releases/2019-12/201912181000/plugins/ (197.9kB)
[INFO] Fetching org.eclipse.m2e.maven.indexer_1.14.0.20191209-1923.jar from http://download.eclipse.org/releases/2019-12/201912181000/plugins/ (1.08MB)
[INFO] Fetching org.eclipse.m2e.jdt_1.14.0.20191209-1925.jar.pack.gz from http://download.eclipse.org/releases/2019-12/201912181000/plugins/ (55.03kB)
[INFO] Fetching javax.inject_1.0.0.v20091030.jar from http://download.eclipse.org/releases/2019-12/201912181000/plugins/ (14.07kB)
[INFO] Fetching org.eclipse.m2e.maven.runtime.slf4j.simple_1.14.0.20191209-1923.jar from http://download.eclipse.org/releases/2019-12/201912181000/plugins/ (19.43kB)
[INFO] Resolving class path of MavenProject: org.sonatype.m2e.extras:org.sonatype.m2e.mavenarchiver:0.17.5-SNAPSHOT @ /home/jenkins/agent/workspace/m2eclipse-mavenarchiver/org.sonatype.m2e.mavenarchiver/pom.xml
[INFO] Computing target platform for MavenProject: org.sonatype.m2e.extras:org.sonatype.m2e.mavenarchiver.feature:0.17.5-SNAPSHOT @ /home/jenkins/agent/workspace/m2eclipse-mavenarchiver/org.sonatype.m2e.mavenarchiver.feature/pom.xml
[INFO] Resolving dependencies of MavenProject: org.sonatype.m2e.extras:org.sonatype.m2e.mavenarchiver.feature:0.17.5-SNAPSHOT @ /home/jenkins/agent/workspace/m2eclipse-mavenarchiver/org.sonatype.m2e.mavenarchiver.feature/pom.xml
[INFO] Fetching com.ibm.icu_64.2.0.v20190507-1337.jar.pack.gz from http://download.eclipse.org/releases/2019-12/201912181000/plugins/ (9.5MB)
[INFO] Fetching org.eclipse.license_2.0.2.v20181016-2210.jar from https://download.eclipse.org/cbi/updates/license/2.0.2.v20181016-2210/features/ (13.05kB)
[INFO] Resolving class path of MavenProject: org.sonatype.m2e.extras:org.sonatype.m2e.mavenarchiver.feature:0.17.5-SNAPSHOT @ /home/jenkins/agent/workspace/m2eclipse-mavenarchiver/org.sonatype.m2e.mavenarchiver.feature/pom.xml
[INFO] Computing target platform for MavenProject: org.sonatype.m2e.extras:org.sonatype.m2e.mavenarchiver.tests:0.17.5-SNAPSHOT @ /home/jenkins/agent/workspace/m2eclipse-mavenarchiver/org.sonatype.m2e.mavenarchiver.tests/pom.xml
[INFO] Resolving dependencies of MavenProject: org.sonatype.m2e.extras:org.sonatype.m2e.mavenarchiver.tests:0.17.5-SNAPSHOT @ /home/jenkins/agent/workspace/m2eclipse-mavenarchiver/org.sonatype.m2e.mavenarchiver.tests/pom.xml
[INFO] Fetching javax.annotation_1.2.0.v201602091430.jar.pack.gz from http://download.eclipse.org/releases/2019-12/201912181000/plugins/ (21.32kB)
[INFO] Fetching org.apache.batik.constants_1.11.0.v20190515-0436.jar.pack.gz from http://download.eclipse.org/releases/2019-12/201912181000/plugins/ (13.03kB)
[INFO] Fetching org.w3c.dom.events_3.0.0.draft20060413_v201105210656.jar from http://download.eclipse.org/releases/2019-12/201912181000/plugins/ (15.35kB)
[INFO] Fetching org.w3c.css.sac_1.3.1.v200903091627.jar from http://download.eclipse.org/releases/2019-12/201912181000/plugins/ (35.59kB)
[INFO] Fetching org.w3c.dom.svg_1.1.0.v201011041433.jar from http://download.eclipse.org/releases/2019-12/201912181000/plugins/ (95.26kB)
[INFO] Fetching org.apache.batik.css_1.11.0.v20190515-0436.jar.pack.gz from http://download.eclipse.org/releases/2019-12/201912181000/plugins/ (101.68kB)
[INFO] Fetching org.apache.batik.i18n_1.11.0.v20190515-0436.jar.pack.gz from http://download.eclipse.org/releases/2019-12/201912181000/plugins/ (14.52kB)
[INFO] Fetching org.apache.batik.util_1.11.0.v20190515-0436.jar.pack.gz from http://download.eclipse.org/releases/2019-12/201912181000/plugins/ (63.49kB)
[INFO] Fetching org.apache.xmlgraphics_2.3.0.v20190515-0436.jar.pack.gz from http://download.eclipse.org/releases/2019-12/201912181000/plugins/ (258.72kB)
[INFO] Fetching org.apache.commons.io_2.6.0.v20190123-2029.jar.pack.gz from http://download.eclipse.org/releases/2019-12/201912181000/plugins/ (82.7kB)
[INFO] Fetching org.apache.commons.logging_1.2.0.v20180409-1502.jar.pack.gz from http://download.eclipse.org/releases/2019-12/201912181000/plugins/ (33.71kB)
[INFO] Fetching org.eclipse.osgi.services_3.8.0.v20190206-2147.jar.pack.gz from http://download.eclipse.org/releases/2019-12/201912181000/plugins/ (44.03kB)
[INFO] Fetching org.apache.felix.scr_2.1.14.v20190123-1619.jar.pack.gz from http://download.eclipse.org/releases/2019-12/201912181000/plugins/ (154.23kB)
[INFO] Fetching org.eclipse.osgi.util_3.5.300.v20190708-1141.jar.pack.gz from http://download.eclipse.org/releases/2019-12/201912181000/plugins/ (30.65kB)
[INFO] Fetching org.eclipse.ui_3.115.0.v20191127-1056.jar.pack.gz from http://download.eclipse.org/releases/2019-12/201912181000/plugins/ (364.34kB)
[INFO] Fetching org.eclipse.jface.text_3.16.100.v20191203-1634.jar.pack.gz from http://download.eclipse.org/releases/2019-12/201912181000/plugins/ (319.42kB)
[INFO] Fetching org.eclipse.ui.ide_3.16.100.v20191122-2109.jar.pack.gz from http://download.eclipse.org/releases/2019-12/201912181000/plugins/ (962.29kB)
[INFO] Fetching org.eclipse.ui.views_3.10.100.v20191114-0830.jar.pack.gz from http://download.eclipse.org/releases/2019-12/201912181000/plugins/ (48.42kB)
[INFO] Fetching org.eclipse.ui.workbench.texteditor_3.14.0.v20191122-2108.jar.pack.gz from http://download.eclipse.org/releases/2019-12/201912181000/plugins/ (234.26kB)
[INFO] Fetching org.eclipse.ui.editors_3.13.0.v20191203-1122.jar.pack.gz from http://download.eclipse.org/releases/2019-12/201912181000/plugins/ (204.63kB)
[INFO] Fetching org.eclipse.ui.forms_3.8.200.v20191114-0830.jar.pack.gz from http://download.eclipse.org/releases/2019-12/201912181000/plugins/ (123.32kB)
[INFO] Fetching org.eclipse.compare.core_3.6.700.v20191122-2107.jar.pack.gz from http://download.eclipse.org/releases/2019-12/201912181000/plugins/ (33.06kB)
[INFO] Fetching org.eclipse.compare_3.7.800.v20191122-2107.jar.pack.gz from http://download.eclipse.org/releases/2019-12/201912181000/plugins/ (304.82kB)
[INFO] Fetching org.eclipse.core.databinding.observable_1.8.100.v20191118-0932.jar.pack.gz from http://download.eclipse.org/releases/2019-12/201912181000/plugins/ (82.52kB)
[INFO] Fetching org.eclipse.core.databinding.property_1.7.200.v20191105-1311.jar.pack.gz from http://download.eclipse.org/releases/2019-12/201912181000/plugins/ (44.79kB)
[INFO] Fetching org.eclipse.core.databinding_1.7.700.v20191122-2109.jar.pack.gz from http://download.eclipse.org/releases/2019-12/201912181000/plugins/ (55.83kB)
[INFO] Fetching org.eclipse.core.filebuffers_3.6.800.v20191122-2108.jar.pack.gz from http://download.eclipse.org/releases/2019-12/201912181000/plugins/ (41.95kB)
[INFO] Fetching org.eclipse.equinox.security_1.3.400.v20191008-0645.jar.pack.gz from http://download.eclipse.org/releases/2019-12/201912181000/plugins/ (44.58kB)
[INFO] Fetching org.eclipse.core.net_1.3.700.v20191122-2107.jar.pack.gz from http://download.eclipse.org/releases/2019-12/201912181000/plugins/ (33.77kB)
[INFO] Fetching org.eclipse.e4.core.di_1.7.500.v20190916-2125.jar.pack.gz from http://download.eclipse.org/releases/2019-12/201912181000/plugins/ (25.92kB)
[INFO] Fetching org.eclipse.e4.core.contexts_1.8.300.v20191017-1404.jar.pack.gz from http://download.eclipse.org/releases/2019-12/201912181000/plugins/ (22.69kB)
[INFO] Fetching org.eclipse.e4.core.services_2.2.100.v20191122-2104.jar.pack.gz from http://download.eclipse.org/releases/2019-12/201912181000/plugins/ (28.26kB)
[INFO] Fetching org.eclipse.e4.core.commands_0.12.800.v20190926-0808.jar.pack.gz from http://download.eclipse.org/releases/2019-12/201912181000/plugins/ (13.78kB)
[INFO] Fetching org.eclipse.e4.core.di.annotations_1.6.500.v20190925-0538.jar.pack.gz from http://download.eclipse.org/releases/2019-12/201912181000/plugins/ (7.68kB)
[INFO] Fetching org.eclipse.e4.core.di.extensions_0.15.400.v20191122-2104.jar.pack.gz from http://download.eclipse.org/releases/2019-12/201912181000/plugins/ (7.77kB)
[INFO] Fetching org.eclipse.e4.core.di.extensions.supplier_0.15.400.v20190709-0707.jar.pack.gz from http://download.eclipse.org/releases/2019-12/201912181000/plugins/ (16.67kB)
[INFO] Fetching org.apache.commons.jxpath_1.3.0.v200911051830.jar.pack.gz from http://download.eclipse.org/releases/2019-12/201912181000/plugins/ (107.16kB)
[INFO] Fetching org.eclipse.emf.ecore_2.20.0.v20190920-0401.jar.pack.gz from http://download.eclipse.org/releases/2019-12/201912181000/plugins/ (485.42kB)
[INFO] Fetching org.eclipse.e4.emf.xpath_0.2.500.v20191021-1408.jar.pack.gz from http://download.eclipse.org/releases/2019-12/201912181000/plugins/ (21.81kB)
[INFO] Fetching org.eclipse.swt_3.113.0.v20191204-0601.jar.pack.gz from http://download.eclipse.org/releases/2019-12/201912181000/plugins/ (16.04kB)
[INFO] Fetching org.eclipse.jface_3.18.0.v20191122-2109.jar.pack.gz from http://download.eclipse.org/releases/2019-12/201912181000/plugins/ (360.91kB)
[INFO] Fetching org.eclipse.e4.ui.bindings_0.12.700.v20191105-1310.jar.pack.gz from http://download.eclipse.org/releases/2019-12/201912181000/plugins/ (22.97kB)
[INFO] Fetching org.eclipse.e4.ui.css.core_0.12.900.v20191106-1716.jar.pack.gz from http://download.eclipse.org/releases/2019-12/201912181000/plugins/ (64.89kB)
[INFO] Fetching org.eclipse.e4.ui.css.swt_0.13.700.v20191113-1031.jar.pack.gz from http://download.eclipse.org/releases/2019-12/201912181000/plugins/ (79.15kB)
[INFO] Fetching org.eclipse.e4.ui.css.swt.theme_0.12.500.v20191125-1011.jar.pack.gz from http://download.eclipse.org/releases/2019-12/201912181000/plugins/ (17.02kB)
[INFO] Fetching org.eclipse.e4.ui.di_1.2.700.v20191114-0830.jar.pack.gz from http://download.eclipse.org/releases/2019-12/201912181000/plugins/ (9.82kB)
[INFO] Fetching org.eclipse.e4.ui.dialogs_1.1.600.v20190814-0636.jar.pack.gz from http://download.eclipse.org/releases/2019-12/201912181000/plugins/ (21.82kB)
[INFO] Fetching org.eclipse.e4.ui.model.workbench_2.1.600.v20191106-1503.jar.pack.gz from http://download.eclipse.org/releases/2019-12/201912181000/plugins/ (111.15kB)
[INFO] Fetching org.eclipse.e4.ui.services_1.3.700.v20190930-1643.jar.pack.gz from http://download.eclipse.org/releases/2019-12/201912181000/plugins/ (13.16kB)
[INFO] Fetching org.eclipse.equinox.event_1.5.300.v20191001-1333.jar.pack.gz from http://download.eclipse.org/releases/2019-12/201912181000/plugins/ (16.7kB)
[INFO] Fetching org.eclipse.e4.ui.widgets_1.2.600.v20190926-0808.jar.pack.gz from http://download.eclipse.org/releases/2019-12/201912181000/plugins/ (9.46kB)
[INFO] Fetching org.eclipse.emf.ecore.change_2.14.0.v20190528-0725.jar.pack.gz from http://download.eclipse.org/releases/2019-12/201912181000/plugins/ (51.07kB)
[INFO] Fetching org.eclipse.emf.ecore.xmi_2.16.0.v20190528-0725.jar.pack.gz from http://download.eclipse.org/releases/2019-12/201912181000/plugins/ (84.22kB)
[INFO] Fetching org.eclipse.e4.ui.workbench_1.11.0.v20191120-1917.jar.pack.gz from http://download.eclipse.org/releases/2019-12/201912181000/plugins/ (85.9kB)
[INFO] Fetching org.eclipse.e4.ui.workbench.renderers.swt_0.14.900.v20191114-0715.jar.pack.gz from http://download.eclipse.org/releases/2019-12/201912181000/plugins/ (94.87kB)
[INFO] Fetching org.eclipse.e4.ui.workbench.swt_0.14.800.v20190930-1643.jar.pack.gz from http://download.eclipse.org/releases/2019-12/201912181000/plugins/ (61.45kB)
[INFO] Fetching org.eclipse.e4.ui.workbench.addons.swt_1.3.700.v20191030-1314.jar.pack.gz from http://download.eclipse.org/releases/2019-12/201912181000/plugins/ (49.92kB)
[INFO] Fetching org.eclipse.jface.databinding_1.9.200.v20191113-1050.jar.pack.gz from http://download.eclipse.org/releases/2019-12/201912181000/plugins/ (77.54kB)
[INFO] Fetching org.eclipse.e4.ui.workbench3_0.15.300.v20190926-0808.jar.pack.gz from http://download.eclipse.org/releases/2019-12/201912181000/plugins/ (13.07kB)
[INFO] Fetching org.eclipse.emf.common_2.17.0.v20190920-0401.jar.pack.gz from http://download.eclipse.org/releases/2019-12/201912181000/plugins/ (114.83kB)
[INFO] Fetching org.eclipse.equinox.bidi_1.2.200.v20191008-0718.jar.pack.gz from http://download.eclipse.org/releases/2019-12/201912181000/plugins/ (23.94kB)
[INFO] Fetching org.eclipse.equinox.launcher_1.5.600.v20191014-2022.jar.pack.gz from http://download.eclipse.org/releases/2019-12/201912181000/plugins/ (29.94kB)
[INFO] Fetching org.eclipse.equinox.p2.core_2.6.200.v20191014-1220.jar.pack.gz from http://download.eclipse.org/releases/2019-12/201912181000/plugins/ (32.06kB)
[INFO] Fetching org.eclipse.equinox.p2.metadata_2.4.600.v20191002-0702.jar.pack.gz from http://download.eclipse.org/releases/2019-12/201912181000/plugins/ (108.01kB)
[INFO] Fetching org.eclipse.equinox.p2.metadata.repository_1.3.300.v20191002-0702.jar.pack.gz from http://download.eclipse.org/releases/2019-12/201912181000/plugins/ (50.95kB)
[INFO] Fetching org.eclipse.equinox.p2.repository_2.4.600.v20191016-0510.jar.pack.gz from http://download.eclipse.org/releases/2019-12/201912181000/plugins/ (55.47kB)
[INFO] Fetching org.eclipse.equinox.p2.engine_2.6.500.v20191014-1645.jar.pack.gz from http://download.eclipse.org/releases/2019-12/201912181000/plugins/ (74.72kB)
[INFO] Fetching org.tukaani.xz_1.8.0.v20180207-1613.jar.pack.gz from http://download.eclipse.org/releases/2019-12/201912181000/plugins/ (44.42kB)
[INFO] Fetching org.eclipse.help_3.8.600.v20191123-0656.jar.pack.gz from http://download.eclipse.org/releases/2019-12/201912181000/plugins/ (125.97kB)
[INFO] Fetching org.eclipse.ltk.core.refactoring_3.10.300.v20191104-1954.jar.pack.gz from http://download.eclipse.org/releases/2019-12/201912181000/plugins/ (107.92kB)
[INFO] Fetching org.eclipse.ui.navigator_3.9.100.v20191122-2109.jar.pack.gz from http://download.eclipse.org/releases/2019-12/201912181000/plugins/ (133.62kB)
[INFO] Fetching org.eclipse.team.core_3.8.800.v20191122-2107.jar.pack.gz from http://download.eclipse.org/releases/2019-12/201912181000/plugins/ (127.12kB)
[INFO] Fetching org.eclipse.team.ui_3.8.700.v20191122-2107.jar.pack.gz from http://download.eclipse.org/releases/2019-12/201912181000/plugins/ (494.27kB)
[INFO] Fetching org.eclipse.ltk.ui.refactoring_3.10.100.v20191113-0119.jar.pack.gz from http://download.eclipse.org/releases/2019-12/201912181000/plugins/ (182.08kB)
[INFO] Fetching org.eclipse.m2e.lifecyclemapping.defaults_1.14.0.20191209-1925.jar.pack.gz from http://download.eclipse.org/releases/2019-12/201912181000/plugins/ (8.22kB)
[INFO] Fetching org.junit_4.12.0.v201504281640.jar.pack.gz from http://download.eclipse.org/releases/2019-12/201912181000/plugins/ (284.7kB)
[INFO] Fetching org.eclipse.m2e.tests.common_1.14.0.20191209-1925.jar.pack.gz from http://download.eclipse.org/releases/2019-12/201912181000/plugins/ (827.5kB)
[INFO] Fetching org.eclipse.swt.gtk.linux.x86_64_3.113.0.v20191204-0601.jar.pack.gz from http://download.eclipse.org/releases/2019-12/201912181000/plugins/ (1,008.75kB)
[INFO] Fetching org.eclipse.ui.workbench_3.117.0.v20191126-1131.jar.pack.gz from http://download.eclipse.org/releases/2019-12/201912181000/plugins/ (1,004.33kB)
[INFO] Fetching org.eclipse.ui.navigator.resources_3.7.100.v20191209-1336.jar.pack.gz from http://download.eclipse.org/releases/2019-12/201912181000/plugins/ (71.13kB)
[INFO] Fetching org.eclipse.ui.ide.application_1.3.500.v20191122-2109.jar.pack.gz from http://download.eclipse.org/releases/2019-12/201912181000/plugins/ (55.35kB)
[INFO] Fetching org.eclipse.urischeme_1.0.500.v20191122-2109.jar.pack.gz from http://download.eclipse.org/releases/2019-12/201912181000/plugins/ (21.45kB)
[INFO] Fetching org.eclipse.ui.views.properties.tabbed_3.8.700.v20191113-0939.jar.pack.gz from http://download.eclipse.org/releases/2019-12/201912181000/plugins/ (40.96kB)
[INFO] Fetching org.hamcrest.core_1.3.0.v20180420-1519.jar.pack.gz from http://download.eclipse.org/releases/2019-12/201912181000/plugins/ (29.18kB)
[INFO] Fetching org.w3c.dom.smil_1.0.1.v200903091627.jar.pack.gz from http://download.eclipse.org/releases/2019-12/201912181000/plugins/ (16.71kB)
[INFO] Resolving class path of MavenProject: org.sonatype.m2e.extras:org.sonatype.m2e.mavenarchiver.tests:0.17.5-SNAPSHOT @ /home/jenkins/agent/workspace/m2eclipse-mavenarchiver/org.sonatype.m2e.mavenarchiver.tests/pom.xml
[INFO] Computing target platform for MavenProject: org.sonatype.m2e.extras:org.sonatype.m2e.mavenarchiver.repository:0.17.5-SNAPSHOT @ /home/jenkins/agent/workspace/m2eclipse-mavenarchiver/org.sonatype.m2e.mavenarchiver.repository/pom.xml
[INFO] Resolving dependencies of MavenProject: org.sonatype.m2e.extras:org.sonatype.m2e.mavenarchiver.repository:0.17.5-SNAPSHOT @ /home/jenkins/agent/workspace/m2eclipse-mavenarchiver/org.sonatype.m2e.mavenarchiver.repository/pom.xml
[INFO] Resolving class path of MavenProject: org.sonatype.m2e.extras:org.sonatype.m2e.mavenarchiver.repository:0.17.5-SNAPSHOT @ /home/jenkins/agent/workspace/m2eclipse-mavenarchiver/org.sonatype.m2e.mavenarchiver.repository/pom.xml
[INFO] ------------------------------------------------------------------------
[INFO] Reactor Build Order:
[INFO] 
[INFO] M2E Maven Archiver Connector                                       [pom]
[INFO] org.sonatype.m2e.mavenarchiver                          [eclipse-plugin]
[INFO] org.sonatype.m2e.mavenarchiver.feature                 [eclipse-feature]
[INFO] org.sonatype.m2e.mavenarchiver.tests               [eclipse-test-plugin]
[INFO] org.sonatype.m2e.mavenarchiver.repository           [eclipse-repository]
[INFO] 
[INFO] ---< org.sonatype.m2e.extras:org.sonatype.m2e.mavenarchiver.parent >----
[INFO] Building M2E Maven Archiver Connector 0.17.5-SNAPSHOT              [1/5]
[INFO] --------------------------------[ pom ]---------------------------------
[INFO] 
[INFO] --- maven-clean-plugin:2.4.1:clean (default-clean) @ org.sonatype.m2e.mavenarchiver.parent ---
Downloading from eclipse.maven.central.mirror: https://repo.eclipse.org/content/repositories/maven_central/org/apache/maven/maven-plugin-api/2.0.6/maven-plugin-api-2.0.6.pom
Progress (1): 1.5 kB
                    
Downloaded from eclipse.maven.central.mirror: https://repo.eclipse.org/content/repositories/maven_central/org/apache/maven/maven-plugin-api/2.0.6/maven-plugin-api-2.0.6.pom (1.5 kB at 38 kB/s)
Downloading from eclipse.maven.central.mirror: https://repo.eclipse.org/content/repositories/maven_central/org/apache/maven/maven/2.0.6/maven-2.0.6.pom
Progress (1): 4.1 kB
Progress (1): 8.2 kB
Progress (1): 9.0 kB
                    
Downloaded from eclipse.maven.central.mirror: https://repo.eclipse.org/content/repositories/maven_central/org/apache/maven/maven/2.0.6/maven-2.0.6.pom (9.0 kB at 377 kB/s)
Downloading from eclipse.maven.central.mirror: https://repo.eclipse.org/content/repositories/maven_central/org/apache/maven/maven-parent/5/maven-parent-5.pom
Progress (1): 4.1 kB
Progress (1): 8.2 kB
Progress (1): 12 kB 
Progress (1): 15 kB
                   
Downloaded from eclipse.maven.central.mirror: https://repo.eclipse.org/content/repositories/maven_central/org/apache/maven/maven-parent/5/maven-parent-5.pom (15 kB at 381 kB/s)
Downloading from eclipse.maven.central.mirror: https://repo.eclipse.org/content/repositories/maven_central/org/apache/apache/3/apache-3.pom
Progress (1): 3.4 kB
                    
Downloaded from eclipse.maven.central.mirror: https://repo.eclipse.org/content/repositories/maven_central/org/apache/apache/3/apache-3.pom (3.4 kB at 127 kB/s)
Downloading from eclipse.maven.central.mirror: https://repo.eclipse.org/content/repositories/maven_central/org/codehaus/plexus/plexus-utils/2.0.5/plexus-utils-2.0.5.pom
Progress (1): 3.3 kB
                    
Downloaded from eclipse.maven.central.mirror: https://repo.eclipse.org/content/repositories/maven_central/org/codehaus/plexus/plexus-utils/2.0.5/plexus-utils-2.0.5.pom (3.3 kB at 175 kB/s)
Downloading from eclipse.maven.central.mirror: https://repo.eclipse.org/content/repositories/maven_central/org/apache/maven/maven-plugin-api/2.0.6/maven-plugin-api-2.0.6.jar
Downloading from eclipse.maven.central.mirror: https://repo.eclipse.org/content/repositories/maven_central/org/codehaus/plexus/plexus-utils/2.0.5/plexus-utils-2.0.5.jar
Progress (1): 4.1/13 kB
Progress (1): 7.7/13 kB
Progress (1): 12/13 kB 
Progress (1): 13 kB   
Progress (2): 13 kB | 4.1/223 kB
Progress (2): 13 kB | 7.7/223 kB
Progress (2): 13 kB | 12/223 kB 
Progress (2): 13 kB | 16/223 kB
Progress (2): 13 kB | 20/223 kB
Progress (2): 13 kB | 24/223 kB
Progress (2): 13 kB | 28/223 kB
Progress (2): 13 kB | 32/223 kB
Progress (2): 13 kB | 36/223 kB
Progress (2): 13 kB | 40/223 kB
Progress (2): 13 kB | 45/223 kB
Progress (2): 13 kB | 49/223 kB
Progress (2): 13 kB | 53/223 kB
Progress (2): 13 kB | 57/223 kB
Progress (2): 13 kB | 61/223 kB
Progress (2): 13 kB | 65/223 kB
Progress (2): 13 kB | 69/223 kB
Progress (2): 13 kB | 73/223 kB
Progress (2): 13 kB | 77/223 kB
Progress (2): 13 kB | 81/223 kB
Progress (2): 13 kB | 85/223 kB
Progress (2): 13 kB | 90/223 kB
Progress (2): 13 kB | 94/223 kB
Progress (2): 13 kB | 98/223 kB
Progress (2): 13 kB | 102/223 kB
Progress (2): 13 kB | 106/223 kB
Progress (2): 13 kB | 110/223 kB
Progress (2): 13 kB | 114/223 kB
Progress (2): 13 kB | 118/223 kB
Progress (2): 13 kB | 122/223 kB
Progress (2): 13 kB | 126/223 kB
Progress (2): 13 kB | 131/223 kB
Progress (2): 13 kB | 135/223 kB
Progress (2): 13 kB | 139/223 kB
Progress (2): 13 kB | 143/223 kB
Progress (2): 13 kB | 147/223 kB
Progress (2): 13 kB | 151/223 kB
Progress (2): 13 kB | 155/223 kB
Progress (2): 13 kB | 159/223 kB
Progress (2): 13 kB | 163/223 kB
Progress (2): 13 kB | 167/223 kB
Progress (2): 13 kB | 171/223 kB
Progress (2): 13 kB | 176/223 kB
Progress (2): 13 kB | 180/223 kB
Progress (2): 13 kB | 184/223 kB
Progress (2): 13 kB | 188/223 kB
Progress (2): 13 kB | 192/223 kB
Progress (2): 13 kB | 196/223 kB
Progress (2): 13 kB | 200/223 kB
Progress (2): 13 kB | 204/223 kB
Progress (2): 13 kB | 208/223 kB
Progress (2): 13 kB | 212/223 kB
Progress (2): 13 kB | 217/223 kB
Progress (2): 13 kB | 221/223 kB
Progress (2): 13 kB | 223 kB    
                            
Downloaded from eclipse.maven.central.mirror: https://repo.eclipse.org/content/repositories/maven_central/org/codehaus/plexus/plexus-utils/2.0.5/plexus-utils-2.0.5.jar (223 kB at 3.3 MB/s)
Downloaded from eclipse.maven.central.mirror: https://repo.eclipse.org/content/repositories/maven_central/org/apache/maven/maven-plugin-api/2.0.6/maven-plugin-api-2.0.6.jar (13 kB at 184 kB/s)
[INFO] 
[INFO] --- maven-install-plugin:2.3.1:install (default-install) @ org.sonatype.m2e.mavenarchiver.parent ---
Downloading from eclipse.maven.central.mirror: https://repo.eclipse.org/content/repositories/maven_central/org/apache/maven/maven-project/2.0.6/maven-project-2.0.6.pom
Progress (1): 2.6 kB
                    
Downloaded from eclipse.maven.central.mirror: https://repo.eclipse.org/content/repositories/maven_central/org/apache/maven/maven-project/2.0.6/maven-project-2.0.6.pom (2.6 kB at 220 kB/s)
Downloading from eclipse.maven.central.mirror: https://repo.eclipse.org/content/repositories/maven_central/org/apache/maven/maven-settings/2.0.6/maven-settings-2.0.6.pom
Progress (1): 2.0 kB
                    
Downloaded from eclipse.maven.central.mirror: https://repo.eclipse.org/content/repositories/maven_central/org/apache/maven/maven-settings/2.0.6/maven-settings-2.0.6.pom (2.0 kB at 118 kB/s)
Downloading from eclipse.maven.central.mirror: https://repo.eclipse.org/content/repositories/maven_central/org/apache/maven/maven-model/2.0.6/maven-model-2.0.6.pom
Progress (1): 3.0 kB
                    
Downloaded from eclipse.maven.central.mirror: https://repo.eclipse.org/content/repositories/maven_central/org/apache/maven/maven-model/2.0.6/maven-model-2.0.6.pom (3.0 kB at 179 kB/s)
Downloading from eclipse.maven.central.mirror: https://repo.eclipse.org/content/repositories/maven_central/org/codehaus/plexus/plexus-utils/1.4.1/plexus-utils-1.4.1.pom
Progress (1): 1.9 kB
                    
Downloaded from eclipse.maven.central.mirror: https://repo.eclipse.org/content/repositories/maven_central/org/codehaus/plexus/plexus-utils/1.4.1/plexus-utils-1.4.1.pom (1.9 kB at 112 kB/s)
Downloading from eclipse.maven.central.mirror: https://repo.eclipse.org/content/repositories/maven_central/org/codehaus/plexus/plexus/1.0.11/plexus-1.0.11.pom
Progress (1): 4.1 kB
Progress (1): 8.2 kB
Progress (1): 9.0 kB
                    
Downloaded from eclipse.maven.central.mirror: https://repo.eclipse.org/content/repositories/maven_central/org/codehaus/plexus/plexus/1.0.11/plexus-1.0.11.pom (9.0 kB at 498 kB/s)
Downloading from eclipse.maven.central.mirror: https://repo.eclipse.org/content/repositories/maven_central/junit/junit/3.8.1/junit-3.8.1.pom
Progress (1): 998 B
                   
Downloaded from eclipse.maven.central.mirror: https://repo.eclipse.org/content/repositories/maven_central/junit/junit/3.8.1/junit-3.8.1.pom (998 B at 59 kB/s)
Downloading from eclipse.maven.central.mirror: https://repo.eclipse.org/content/repositories/maven_central/org/codehaus/plexus/plexus-utils/1.0.4/plexus-utils-1.0.4.pom
Progress (1): 4.1 kB
Progress (1): 6.9 kB
                    
Downloaded from eclipse.maven.central.mirror: https://repo.eclipse.org/content/repositories/maven_central/org/codehaus/plexus/plexus-utils/1.0.4/plexus-utils-1.0.4.pom (6.9 kB at 29 kB/s)
Downloading from eclipse.maven.central.mirror: https://repo.eclipse.org/content/repositories/maven_central/org/apache/maven/maven-profile/2.0.6/maven-profile-2.0.6.pom
Progress (1): 2.0 kB
                    
Downloaded from eclipse.maven.central.mirror: https://repo.eclipse.org/content/repositories/maven_central/org/apache/maven/maven-profile/2.0.6/maven-profile-2.0.6.pom (2.0 kB at 116 kB/s)
Downloading from eclipse.maven.central.mirror: https://repo.eclipse.org/content/repositories/maven_central/org/apache/maven/maven-artifact-manager/2.0.6/maven-artifact-manager-2.0.6.pom
Progress (1): 2.6 kB
                    
Downloaded from eclipse.maven.central.mirror: https://repo.eclipse.org/content/repositories/maven_central/org/apache/maven/maven-artifact-manager/2.0.6/maven-artifact-manager-2.0.6.pom (2.6 kB at 146 kB/s)
Downloading from eclipse.maven.central.mirror: https://repo.eclipse.org/content/repositories/maven_central/org/apache/maven/maven-repository-metadata/2.0.6/maven-repository-metadata-2.0.6.pom
Progress (1): 1.9 kB
                    
Downloaded from eclipse.maven.central.mirror: https://repo.eclipse.org/content/repositories/maven_central/org/apache/maven/maven-repository-metadata/2.0.6/maven-repository-metadata-2.0.6.pom (1.9 kB at 109 kB/s)
Downloading from eclipse.maven.central.mirror: https://repo.eclipse.org/content/repositories/maven_central/org/apache/maven/maven-artifact/2.0.6/maven-artifact-2.0.6.pom
Progress (1): 1.6 kB
                    
Downloaded from eclipse.maven.central.mirror: https://repo.eclipse.org/content/repositories/maven_central/org/apache/maven/maven-artifact/2.0.6/maven-artifact-2.0.6.pom (1.6 kB at 88 kB/s)
Downloading from eclipse.maven.central.mirror: https://repo.eclipse.org/content/repositories/maven_central/org/apache/maven/maven-plugin-registry/2.0.6/maven-plugin-registry-2.0.6.pom
Progress (1): 1.9 kB
                    
Downloaded from eclipse.maven.central.mirror: https://repo.eclipse.org/content/repositories/maven_central/org/apache/maven/maven-plugin-registry/2.0.6/maven-plugin-registry-2.0.6.pom (1.9 kB at 973 kB/s)
Downloading from eclipse.maven.central.mirror: https://repo.eclipse.org/content/repositories/maven_central/org/codehaus/plexus/plexus-digest/1.0/plexus-digest-1.0.pom
Progress (1): 1.1 kB
                    
Downloaded from eclipse.maven.central.mirror: https://repo.eclipse.org/content/repositories/maven_central/org/codehaus/plexus/plexus-digest/1.0/plexus-digest-1.0.pom (1.1 kB at 530 kB/s)
Downloading from eclipse.maven.central.mirror: https://repo.eclipse.org/content/repositories/maven_central/org/codehaus/plexus/plexus-components/1.1.7/plexus-components-1.1.7.pom
Progress (1): 4.1 kB
Progress (1): 5.0 kB
                    
Downloaded from eclipse.maven.central.mirror: https://repo.eclipse.org/content/repositories/maven_central/org/codehaus/plexus/plexus-components/1.1.7/plexus-components-1.1.7.pom (5.0 kB at 1.7 MB/s)
Downloading from eclipse.maven.central.mirror: https://repo.eclipse.org/content/repositories/maven_central/org/codehaus/plexus/plexus/1.0.8/plexus-1.0.8.pom
Progress (1): 4.1 kB
Progress (1): 7.2 kB
                    
Downloaded from eclipse.maven.central.mirror: https://repo.eclipse.org/content/repositories/maven_central/org/codehaus/plexus/plexus/1.0.8/plexus-1.0.8.pom (7.2 kB at 2.4 MB/s)
Downloading from eclipse.maven.central.mirror: https://repo.eclipse.org/content/repositories/maven_central/org/codehaus/plexus/plexus-container-default/1.0-alpha-8/plexus-container-default-1.0-alpha-8.pom
Progress (1): 4.1 kB
Progress (1): 7.3 kB
                    
Downloaded from eclipse.maven.central.mirror: https://repo.eclipse.org/content/repositories/maven_central/org/codehaus/plexus/plexus-container-default/1.0-alpha-8/plexus-container-default-1.0-alpha-8.pom (7.3 kB at 454 kB/s)
Downloading from eclipse.maven.central.mirror: https://repo.eclipse.org/content/repositories/maven_central/org/apache/maven/maven-project/2.0.6/maven-project-2.0.6.jar
Downloading from eclipse.maven.central.mirror: https://repo.eclipse.org/content/repositories/maven_central/junit/junit/3.8.1/junit-3.8.1.jar
Downloading from eclipse.maven.central.mirror: https://repo.eclipse.org/content/repositories/maven_central/org/apache/maven/maven-plugin-registry/2.0.6/maven-plugin-registry-2.0.6.jar
Downloading from eclipse.maven.central.mirror: https://repo.eclipse.org/content/repositories/maven_central/org/apache/maven/maven-profile/2.0.6/maven-profile-2.0.6.jar
Downloading from eclipse.maven.central.mirror: https://repo.eclipse.org/content/repositories/maven_central/org/apache/maven/maven-settings/2.0.6/maven-settings-2.0.6.jar
Progress (1): 4.1/116 kB
Progress (1): 7.7/116 kB
Progress (1): 12/116 kB 
Progress (1): 16/116 kB
Progress (1): 20/116 kB
Progress (1): 24/116 kB
Progress (1): 28/116 kB
Progress (1): 32/116 kB
Progress (1): 36/116 kB
Progress (1): 40/116 kB
Progress (1): 45/116 kB
Progress (2): 45/116 kB | 4.1/49 kB
Progress (3): 45/116 kB | 4.1/49 kB | 4.1/29 kB
Progress (3): 49/116 kB | 4.1/49 kB | 4.1/29 kB
Progress (3): 49/116 kB | 4.1/49 kB | 7.7/29 kB
Progress (3): 49/116 kB | 7.7/49 kB | 7.7/29 kB
Progress (3): 49/116 kB | 7.7/49 kB | 12/29 kB 
Progress (3): 53/116 kB | 7.7/49 kB | 12/29 kB
Progress (3): 53/116 kB | 12/49 kB | 12/29 kB 
Progress (3): 57/116 kB | 12/49 kB | 12/29 kB
Progress (3): 57/116 kB | 12/49 kB | 16/29 kB
Progress (3): 61/116 kB | 12/49 kB | 16/29 kB
Progress (3): 61/116 kB | 16/49 kB | 16/29 kB
Progress (3): 65/116 kB | 16/49 kB | 16/29 kB
Progress (3): 65/116 kB | 16/49 kB | 20/29 kB
Progress (3): 65/116 kB | 20/49 kB | 20/29 kB
Progress (3): 69/116 kB | 20/49 kB | 20/29 kB
Progress (3): 69/116 kB | 20/49 kB | 24/29 kB
Progress (3): 73/116 kB | 20/49 kB | 24/29 kB
Progress (3): 73/116 kB | 24/49 kB | 24/29 kB
Progress (3): 77/116 kB | 24/49 kB | 24/29 kB
Progress (3): 77/116 kB | 24/49 kB | 28/29 kB
Progress (3): 81/116 kB | 24/49 kB | 28/29 kB
Progress (3): 81/116 kB | 28/49 kB | 28/29 kB
Progress (3): 81/116 kB | 28/49 kB | 29 kB   
Progress (3): 81/116 kB | 32/49 kB | 29 kB
Progress (3): 85/116 kB | 32/49 kB | 29 kB
Progress (3): 90/116 kB | 32/49 kB | 29 kB
Progress (3): 94/116 kB | 32/49 kB | 29 kB
Progress (3): 94/116 kB | 36/49 kB | 29 kB
Progress (3): 98/116 kB | 36/49 kB | 29 kB
Progress (3): 98/116 kB | 40/49 kB | 29 kB
Progress (3): 98/116 kB | 45/49 kB | 29 kB
Progress (3): 98/116 kB | 49/49 kB | 29 kB
Progress (3): 98/116 kB | 49 kB | 29 kB   
Progress (3): 102/116 kB | 49 kB | 29 kB
Progress (3): 106/116 kB | 49 kB | 29 kB
Progress (3): 110/116 kB | 49 kB | 29 kB
                                        
Downloaded from eclipse.maven.central.mirror: https://repo.eclipse.org/content/repositories/maven_central/org/apache/maven/maven-plugin-registry/2.0.6/maven-plugin-registry-2.0.6.jar (29 kB at 4.1 MB/s)
Progress (2): 114/116 kB | 49 kB
                                
Downloading from eclipse.maven.central.mirror: https://repo.eclipse.org/content/repositories/maven_central/org/apache/maven/maven-model/2.0.6/maven-model-2.0.6.jar
Progress (2): 116 kB | 49 kB
Progress (3): 116 kB | 49 kB | 4.1/35 kB
Progress (3): 116 kB | 49 kB | 7.7/35 kB
Progress (3): 116 kB | 49 kB | 12/35 kB 
Progress (3): 116 kB | 49 kB | 16/35 kB
Progress (4): 116 kB | 49 kB | 16/35 kB | 4.1/86 kB
Progress (4): 116 kB | 49 kB | 16/35 kB | 7.7/86 kB
Progress (4): 116 kB | 49 kB | 16/35 kB | 12/86 kB 
Progress (4): 116 kB | 49 kB | 20/35 kB | 12/86 kB
Progress (4): 116 kB | 49 kB | 20/35 kB | 16/86 kB
Progress (4): 116 kB | 49 kB | 24/35 kB | 16/86 kB
Progress (4): 116 kB | 49 kB | 28/35 kB | 16/86 kB
Progress (4): 116 kB | 49 kB | 32/35 kB | 16/86 kB
Progress (4): 116 kB | 49 kB | 35 kB | 16/86 kB   
Progress (4): 116 kB | 49 kB | 35 kB | 20/86 kB
Progress (4): 116 kB | 49 kB | 35 kB | 24/86 kB
Progress (4): 116 kB | 49 kB | 35 kB | 28/86 kB
Progress (4): 116 kB | 49 kB | 35 kB | 32/86 kB
Progress (4): 116 kB | 49 kB | 35 kB | 36/86 kB
Progress (4): 116 kB | 49 kB | 35 kB | 40/86 kB
Progress (4): 116 kB | 49 kB | 35 kB | 45/86 kB
Progress (4): 116 kB | 49 kB | 35 kB | 49/86 kB
Progress (4): 116 kB | 49 kB | 35 kB | 53/86 kB
Progress (4): 116 kB | 49 kB | 35 kB | 57/86 kB
Progress (4): 116 kB | 49 kB | 35 kB | 61/86 kB
Progress (4): 116 kB | 49 kB | 35 kB | 65/86 kB
Progress (4): 116 kB | 49 kB | 35 kB | 69/86 kB
Progress (4): 116 kB | 49 kB | 35 kB | 73/86 kB
Progress (4): 116 kB | 49 kB | 35 kB | 77/86 kB
Progress (4): 116 kB | 49 kB | 35 kB | 81/86 kB
Progress (4): 116 kB | 49 kB | 35 kB | 85/86 kB
Progress (4): 116 kB | 49 kB | 35 kB | 86 kB   
                                            
Downloaded from eclipse.maven.central.mirror: https://repo.eclipse.org/content/repositories/maven_central/org/apache/maven/maven-model/2.0.6/maven-model-2.0.6.jar (86 kB at 5.8 MB/s)
Downloading from eclipse.maven.central.mirror: https://repo.eclipse.org/content/repositories/maven_central/org/apache/maven/maven-artifact-manager/2.0.6/maven-artifact-manager-2.0.6.jar
Progress (4): 116 kB | 49 kB | 35 kB | 4.1/57 kB
Progress (4): 116 kB | 49 kB | 35 kB | 7.7/57 kB
Progress (4): 116 kB | 49 kB | 35 kB | 12/57 kB 
Progress (4): 116 kB | 49 kB | 35 kB | 16/57 kB
Progress (4): 116 kB | 49 kB | 35 kB | 20/57 kB
Progress (4): 116 kB | 49 kB | 35 kB | 24/57 kB
Progress (4): 116 kB | 49 kB | 35 kB | 28/57 kB
Progress (4): 116 kB | 49 kB | 35 kB | 32/57 kB
Progress (4): 116 kB | 49 kB | 35 kB | 36/57 kB
Progress (4): 116 kB | 49 kB | 35 kB | 40/57 kB
Progress (4): 116 kB | 49 kB | 35 kB | 45/57 kB
Progress (4): 116 kB | 49 kB | 35 kB | 49/57 kB
Progress (4): 116 kB | 49 kB | 35 kB | 53/57 kB
Progress (4): 116 kB | 49 kB | 35 kB | 57 kB   
                                            
Downloaded from eclipse.maven.central.mirror: https://repo.eclipse.org/content/repositories/maven_central/org/apache/maven/maven-artifact-manager/2.0.6/maven-artifact-manager-2.0.6.jar (57 kB at 2.6 MB/s)
Downloading from eclipse.maven.central.mirror: https://repo.eclipse.org/content/repositories/maven_central/org/apache/maven/maven-repository-metadata/2.0.6/maven-repository-metadata-2.0.6.jar
Progress (4): 116 kB | 49 kB | 35 kB | 4.1/24 kB
Progress (4): 116 kB | 49 kB | 35 kB | 7.7/24 kB
Progress (4): 116 kB | 49 kB | 35 kB | 12/24 kB 
Progress (4): 116 kB | 49 kB | 35 kB | 16/24 kB
Progress (4): 116 kB | 49 kB | 35 kB | 20/24 kB
Progress (4): 116 kB | 49 kB | 35 kB | 24/24 kB
Progress (4): 116 kB | 49 kB | 35 kB | 24 kB   
                                            
Downloaded from eclipse.maven.central.mirror: https://repo.eclipse.org/content/repositories/maven_central/org/apache/maven/maven-settings/2.0.6/maven-settings-2.0.6.jar (49 kB at 1.8 MB/s)
Downloading from eclipse.maven.central.mirror: https://repo.eclipse.org/content/repositories/maven_central/org/apache/maven/maven-artifact/2.0.6/maven-artifact-2.0.6.jar
Downloaded from eclipse.maven.central.mirror: https://repo.eclipse.org/content/repositories/maven_central/org/apache/maven/maven-repository-metadata/2.0.6/maven-repository-metadata-2.0.6.jar (24 kB at 874 kB/s)
Downloading from eclipse.maven.central.mirror: https://repo.eclipse.org/content/repositories/maven_central/org/codehaus/plexus/plexus-digest/1.0/plexus-digest-1.0.jar
Progress (3): 116 kB | 35 kB | 4.1/12 kB
Progress (3): 116 kB | 35 kB | 7.7/12 kB
Progress (3): 116 kB | 35 kB | 12/12 kB 
Progress (3): 116 kB | 35 kB | 12 kB   
                                    
Downloaded from eclipse.maven.central.mirror: https://repo.eclipse.org/content/repositories/maven_central/org/codehaus/plexus/plexus-digest/1.0/plexus-digest-1.0.jar (12 kB at 383 kB/s)
Progress (3): 116 kB | 35 kB | 4.1/121 kB
Progress (3): 116 kB | 35 kB | 7.7/121 kB
Progress (3): 116 kB | 35 kB | 12/121 kB 
Progress (3): 116 kB | 35 kB | 16/121 kB
Progress (3): 116 kB | 35 kB | 20/121 kB
Progress (3): 116 kB | 35 kB | 24/121 kB
Progress (3): 116 kB | 35 kB | 28/121 kB
Progress (3): 116 kB | 35 kB | 32/121 kB
Progress (3): 116 kB | 35 kB | 36/121 kB
Progress (3): 116 kB | 35 kB | 40/121 kB
Progress (3): 116 kB | 35 kB | 45/121 kB
Progress (3): 116 kB | 35 kB | 49/121 kB
Progress (3): 116 kB | 35 kB | 53/121 kB
Progress (3): 116 kB | 35 kB | 57/121 kB
Progress (3): 116 kB | 35 kB | 61/121 kB
Progress (3): 116 kB | 35 kB | 65/121 kB
Progress (3): 116 kB | 35 kB | 69/121 kB
Progress (3): 116 kB | 35 kB | 73/121 kB
Progress (3): 116 kB | 35 kB | 77/121 kB
Progress (3): 116 kB | 35 kB | 81/121 kB
Progress (3): 116 kB | 35 kB | 85/121 kB
Progress (3): 116 kB | 35 kB | 90/121 kB
Progress (3): 116 kB | 35 kB | 94/121 kB
Progress (3): 116 kB | 35 kB | 98/121 kB
Progress (3): 116 kB | 35 kB | 102/121 kB
Progress (3): 116 kB | 35 kB | 106/121 kB
Progress (3): 116 kB | 35 kB | 110/121 kB
Progress (3): 116 kB | 35 kB | 114/121 kB
Progress (3): 116 kB | 35 kB | 118/121 kB
Progress (3): 116 kB | 35 kB | 121 kB    
Progress (4): 116 kB | 35 kB | 121 kB | 4.1/87 kB
Progress (4): 116 kB | 35 kB | 121 kB | 7.7/87 kB
Progress (4): 116 kB | 35 kB | 121 kB | 12/87 kB 
Progress (4): 116 kB | 35 kB | 121 kB | 16/87 kB
                                                
Downloaded from eclipse.maven.central.mirror: https://repo.eclipse.org/content/repositories/maven_central/org/apache/maven/maven-profile/2.0.6/maven-profile-2.0.6.jar (35 kB at 801 kB/s)
Progress (3): 116 kB | 121 kB | 20/87 kB
Progress (3): 116 kB | 121 kB | 24/87 kB
Progress (3): 116 kB | 121 kB | 28/87 kB
Progress (3): 116 kB | 121 kB | 32/87 kB
Progress (3): 116 kB | 121 kB | 36/87 kB
Progress (3): 116 kB | 121 kB | 40/87 kB
Progress (3): 116 kB | 121 kB | 45/87 kB
Progress (3): 116 kB | 121 kB | 49/87 kB
Progress (3): 116 kB | 121 kB | 53/87 kB
Progress (3): 116 kB | 121 kB | 57/87 kB
Progress (3): 116 kB | 121 kB | 61/87 kB
Progress (3): 116 kB | 121 kB | 65/87 kB
                                        
Downloaded from eclipse.maven.central.mirror: https://repo.eclipse.org/content/repositories/maven_central/junit/junit/3.8.1/junit-3.8.1.jar (121 kB at 2.7 MB/s)
Progress (2): 116 kB | 69/87 kB
Progress (2): 116 kB | 73/87 kB
Progress (2): 116 kB | 77/87 kB
Progress (2): 116 kB | 81/87 kB
Progress (2): 116 kB | 85/87 kB
Progress (2): 116 kB | 87 kB   
                            
Downloaded from eclipse.maven.central.mirror: https://repo.eclipse.org/content/repositories/maven_central/org/apache/maven/maven-project/2.0.6/maven-project-2.0.6.jar (116 kB at 2.2 MB/s)
Downloaded from eclipse.maven.central.mirror: https://repo.eclipse.org/content/repositories/maven_central/org/apache/maven/maven-artifact/2.0.6/maven-artifact-2.0.6.jar (87 kB at 1.5 MB/s)
[INFO] Installing /home/jenkins/agent/workspace/m2eclipse-mavenarchiver/pom.xml to /home/jenkins/agent/workspace/m2eclipse-mavenarchiver/.repository/org/sonatype/m2e/extras/org.sonatype.m2e.mavenarchiver.parent/0.17.5-SNAPSHOT/org.sonatype.m2e.mavenarchiver.parent-0.17.5-SNAPSHOT.pom
[INFO] 
[INFO] -------< org.sonatype.m2e.extras:org.sonatype.m2e.mavenarchiver >-------
[INFO] Building org.sonatype.m2e.mavenarchiver 0.17.5-SNAPSHOT            [2/5]
[INFO] ---------------------------[ eclipse-plugin ]---------------------------
[INFO] 
[INFO] --- maven-clean-plugin:2.4.1:clean (default-clean) @ org.sonatype.m2e.mavenarchiver ---
[INFO] 
[INFO] --- tycho-packaging-plugin:1.6.0:build-qualifier (default-build-qualifier) @ org.sonatype.m2e.mavenarchiver ---
[INFO] The project's OSGi version is 0.17.5.202002181833
[INFO] 
[INFO] --- tycho-packaging-plugin:1.6.0:validate-id (default-validate-id) @ org.sonatype.m2e.mavenarchiver ---
[INFO] 
[INFO] --- tycho-packaging-plugin:1.6.0:validate-version (default-validate-version) @ org.sonatype.m2e.mavenarchiver ---
[INFO] 
[INFO] --- maven-resources-plugin:2.6:resources (default-resources) @ org.sonatype.m2e.mavenarchiver ---
Downloading from eclipse.maven.central.mirror: https://repo.eclipse.org/content/repositories/maven_central/org/apache/maven/maven-core/2.0.6/maven-core-2.0.6.pom
Progress (1): 4.1 kB
Progress (1): 6.7 kB
                    
Downloaded from eclipse.maven.central.mirror: https://repo.eclipse.org/content/repositories/maven_central/org/apache/maven/maven-core/2.0.6/maven-core-2.0.6.pom (6.7 kB at 353 kB/s)
Downloading from eclipse.maven.central.mirror: https://repo.eclipse.org/content/repositories/maven_central/org/apache/maven/maven-plugin-parameter-documenter/2.0.6/maven-plugin-parameter-documenter-2.0.6.pom
Progress (1): 1.9 kB
                    
Downloaded from eclipse.maven.central.mirror: https://repo.eclipse.org/content/repositories/maven_central/org/apache/maven/maven-plugin-parameter-documenter/2.0.6/maven-plugin-parameter-documenter-2.0.6.pom (1.9 kB at 64 kB/s)
Downloading from eclipse.maven.central.mirror: https://repo.eclipse.org/content/repositories/maven_central/org/apache/maven/reporting/maven-reporting-api/2.0.6/maven-reporting-api-2.0.6.pom
Progress (1): 1.8 kB
                    
Downloaded from eclipse.maven.central.mirror: https://repo.eclipse.org/content/repositories/maven_central/org/apache/maven/reporting/maven-reporting-api/2.0.6/maven-reporting-api-2.0.6.pom (1.8 kB at 92 kB/s)
Downloading from eclipse.maven.central.mirror: https://repo.eclipse.org/content/repositories/maven_central/org/apache/maven/reporting/maven-reporting/2.0.6/maven-reporting-2.0.6.pom
Progress (1): 1.4 kB
                    
Downloaded from eclipse.maven.central.mirror: https://repo.eclipse.org/content/repositories/maven_central/org/apache/maven/reporting/maven-reporting/2.0.6/maven-reporting-2.0.6.pom (1.4 kB at 85 kB/s)
Downloading from eclipse.maven.central.mirror: https://repo.eclipse.org/content/repositories/maven_central/org/apache/maven/doxia/doxia-sink-api/1.0-alpha-7/doxia-sink-api-1.0-alpha-7.pom
Progress (1): 424 B
                   
Downloaded from eclipse.maven.central.mirror: https://repo.eclipse.org/content/repositories/maven_central/org/apache/maven/doxia/doxia-sink-api/1.0-alpha-7/doxia-sink-api-1.0-alpha-7.pom (424 B at 14 kB/s)
Downloading from eclipse.maven.central.mirror: https://repo.eclipse.org/content/repositories/maven_central/org/apache/maven/doxia/doxia/1.0-alpha-7/doxia-1.0-alpha-7.pom
Progress (1): 3.9 kB
                    
Downloaded from eclipse.maven.central.mirror: https://repo.eclipse.org/content/repositories/maven_central/org/apache/maven/doxia/doxia/1.0-alpha-7/doxia-1.0-alpha-7.pom (3.9 kB at 206 kB/s)
Downloading from eclipse.maven.central.mirror: https://repo.eclipse.org/content/repositories/maven_central/org/apache/maven/maven-error-diagnostics/2.0.6/maven-error-diagnostics-2.0.6.pom
Progress (1): 1.7 kB
                    
Downloaded from eclipse.maven.central.mirror: https://repo.eclipse.org/content/repositories/maven_central/org/apache/maven/maven-error-diagnostics/2.0.6/maven-error-diagnostics-2.0.6.pom (1.7 kB at 95 kB/s)
Downloading from eclipse.maven.central.mirror: https://repo.eclipse.org/content/repositories/maven_central/commons-cli/commons-cli/1.0/commons-cli-1.0.pom
Progress (1): 2.1 kB
                    
Downloaded from eclipse.maven.central.mirror: https://repo.eclipse.org/content/repositories/maven_central/commons-cli/commons-cli/1.0/commons-cli-1.0.pom (2.1 kB at 117 kB/s)
Downloading from eclipse.maven.central.mirror: https://repo.eclipse.org/content/repositories/maven_central/org/apache/maven/maven-plugin-descriptor/2.0.6/maven-plugin-descriptor-2.0.6.pom
Progress (1): 2.0 kB
                    
Downloaded from eclipse.maven.central.mirror: https://repo.eclipse.org/content/repositories/maven_central/org/apache/maven/maven-plugin-descriptor/2.0.6/maven-plugin-descriptor-2.0.6.pom (2.0 kB at 112 kB/s)
Downloading from eclipse.maven.central.mirror: https://repo.eclipse.org/content/repositories/maven_central/org/codehaus/plexus/plexus-interactivity-api/1.0-alpha-4/plexus-interactivity-api-1.0-alpha-4.pom
Progress (1): 4.1 kB
Progress (1): 7.1 kB
                    
Downloaded from eclipse.maven.central.mirror: https://repo.eclipse.org/content/repositories/maven_central/org/codehaus/plexus/plexus-interactivity-api/1.0-alpha-4/plexus-interactivity-api-1.0-alpha-4.pom (7.1 kB at 273 kB/s)
Downloading from eclipse.maven.central.mirror: https://repo.eclipse.org/content/repositories/maven_central/org/apache/maven/maven-monitor/2.0.6/maven-monitor-2.0.6.pom
Progress (1): 1.3 kB
                    
Downloaded from eclipse.maven.central.mirror: https://repo.eclipse.org/content/repositories/maven_central/org/apache/maven/maven-monitor/2.0.6/maven-monitor-2.0.6.pom (1.3 kB at 70 kB/s)
Downloading from eclipse.maven.central.mirror: https://repo.eclipse.org/content/repositories/maven_central/classworlds/classworlds/1.1/classworlds-1.1.pom
Progress (1): 3.3 kB
                    
Downloaded from eclipse.maven.central.mirror: https://repo.eclipse.org/content/repositories/maven_central/classworlds/classworlds/1.1/classworlds-1.1.pom (3.3 kB at 196 kB/s)
Downloading from eclipse.maven.central.mirror: https://repo.eclipse.org/content/repositories/maven_central/org/apache/maven/shared/maven-filtering/1.1/maven-filtering-1.1.pom
Progress (1): 4.1 kB
Progress (1): 5.8 kB
                    
Downloaded from eclipse.maven.central.mirror: https://repo.eclipse.org/content/repositories/maven_central/org/apache/maven/shared/maven-filtering/1.1/maven-filtering-1.1.pom (5.8 kB at 1.9 MB/s)
Downloading from eclipse.maven.central.mirror: https://repo.eclipse.org/content/repositories/maven_central/org/apache/maven/shared/maven-shared-components/17/maven-shared-components-17.pom
Progress (1): 4.1 kB
Progress (1): 8.2 kB
Progress (1): 8.7 kB
                    
Downloaded from eclipse.maven.central.mirror: https://repo.eclipse.org/content/repositories/maven_central/org/apache/maven/shared/maven-shared-components/17/maven-shared-components-17.pom (8.7 kB at 290 kB/s)
Downloading from eclipse.maven.central.mirror: https://repo.eclipse.org/content/repositories/maven_central/org/apache/maven/maven-parent/21/maven-parent-21.pom
Progress (1): 4.1 kB
Progress (1): 8.2 kB
Progress (1): 12 kB 
Progress (1): 16 kB
Progress (1): 20 kB
Progress (1): 25 kB
Progress (1): 26 kB
                   
Downloaded from eclipse.maven.central.mirror: https://repo.eclipse.org/content/repositories/maven_central/org/apache/maven/maven-parent/21/maven-parent-21.pom (26 kB at 6.6 MB/s)
Downloading from eclipse.maven.central.mirror: https://repo.eclipse.org/content/repositories/maven_central/org/apache/apache/10/apache-10.pom
Progress (1): 4.1 kB
Progress (1): 8.2 kB
Progress (1): 12 kB 
Progress (1): 15 kB
                   
Downloaded from eclipse.maven.central.mirror: https://repo.eclipse.org/content/repositories/maven_central/org/apache/apache/10/apache-10.pom (15 kB at 3.0 MB/s)
Downloading from eclipse.maven.central.mirror: https://repo.eclipse.org/content/repositories/maven_central/org/codehaus/plexus/plexus-utils/1.5.15/plexus-utils-1.5.15.pom
Progress (1): 4.1 kB
Progress (1): 6.8 kB
                    
Downloaded from eclipse.maven.central.mirror: https://repo.eclipse.org/content/repositories/maven_central/org/codehaus/plexus/plexus-utils/1.5.15/plexus-utils-1.5.15.pom (6.8 kB at 1.7 MB/s)
Downloading from eclipse.maven.central.mirror: https://repo.eclipse.org/content/repositories/maven_central/org/codehaus/plexus/plexus-interpolation/1.12/plexus-interpolation-1.12.pom
Progress (1): 889 B
                   
Downloaded from eclipse.maven.central.mirror: https://repo.eclipse.org/content/repositories/maven_central/org/codehaus/plexus/plexus-interpolation/1.12/plexus-interpolation-1.12.pom (889 B at 444 kB/s)
Downloading from eclipse.maven.central.mirror: https://repo.eclipse.org/content/repositories/maven_central/org/sonatype/plexus/plexus-build-api/0.0.4/plexus-build-api-0.0.4.pom
Progress (1): 2.9 kB
                    
Downloaded from eclipse.maven.central.mirror: https://repo.eclipse.org/content/repositories/maven_central/org/sonatype/plexus/plexus-build-api/0.0.4/plexus-build-api-0.0.4.pom (2.9 kB at 1.4 MB/s)
Downloading from eclipse.maven.central.mirror: https://repo.eclipse.org/content/repositories/maven_central/org/sonatype/spice/spice-parent/10/spice-parent-10.pom
Progress (1): 3.0 kB
                    
Downloaded from eclipse.maven.central.mirror: https://repo.eclipse.org/content/repositories/maven_central/org/sonatype/spice/spice-parent/10/spice-parent-10.pom (3.0 kB at 188 kB/s)
Downloading from eclipse.maven.central.mirror: https://repo.eclipse.org/content/repositories/maven_central/org/sonatype/forge/forge-parent/3/forge-parent-3.pom
Progress (1): 4.1 kB
Progress (1): 5.0 kB
                    
Downloaded from eclipse.maven.central.mirror: https://repo.eclipse.org/content/repositories/maven_central/org/sonatype/forge/forge-parent/3/forge-parent-3.pom (5.0 kB at 2.5 MB/s)
Downloading from eclipse.maven.central.mirror: https://repo.eclipse.org/content/repositories/maven_central/org/codehaus/plexus/plexus-utils/1.5.8/plexus-utils-1.5.8.pom
Progress (1): 4.1 kB
Progress (1): 8.1 kB
                    
Downloaded from eclipse.maven.central.mirror: https://repo.eclipse.org/content/repositories/maven_central/org/codehaus/plexus/plexus-utils/1.5.8/plexus-utils-1.5.8.pom (8.1 kB at 2.7 MB/s)
Downloading from eclipse.maven.central.mirror: https://repo.eclipse.org/content/repositories/maven_central/org/codehaus/plexus/plexus-interpolation/1.13/plexus-interpolation-1.13.pom
Progress (1): 890 B
                   
Downloaded from eclipse.maven.central.mirror: https://repo.eclipse.org/content/repositories/maven_central/org/codehaus/plexus/plexus-interpolation/1.13/plexus-interpolation-1.13.pom (890 B at 29 kB/s)
Downloading from eclipse.maven.central.mirror: https://repo.eclipse.org/content/repositories/maven_central/org/codehaus/plexus/plexus-components/1.1.15/plexus-components-1.1.15.pom
Progress (1): 2.8 kB
                    
Downloaded from eclipse.maven.central.mirror: https://repo.eclipse.org/content/repositories/maven_central/org/codehaus/plexus/plexus-components/1.1.15/plexus-components-1.1.15.pom (2.8 kB at 949 kB/s)
Downloading from eclipse.maven.central.mirror: https://repo.eclipse.org/content/repositories/maven_central/org/codehaus/plexus/plexus/2.0.3/plexus-2.0.3.pom
Progress (1): 4.1 kB
Progress (1): 8.2 kB
Progress (1): 12 kB 
Progress (1): 15 kB
                   
Downloaded from eclipse.maven.central.mirror: https://repo.eclipse.org/content/repositories/maven_central/org/codehaus/plexus/plexus/2.0.3/plexus-2.0.3.pom (15 kB at 3.9 MB/s)
Downloading from eclipse.maven.central.mirror: https://repo.eclipse.org/content/repositories/maven_central/org/apache/maven/maven-core/2.0.6/maven-core-2.0.6.jar
Downloading from eclipse.maven.central.mirror: https://repo.eclipse.org/content/repositories/maven_central/org/apache/maven/doxia/doxia-sink-api/1.0-alpha-7/doxia-sink-api-1.0-alpha-7.jar
Downloading from eclipse.maven.central.mirror: https://repo.eclipse.org/content/repositories/maven_central/org/apache/maven/reporting/maven-reporting-api/2.0.6/maven-reporting-api-2.0.6.jar
Downloading from eclipse.maven.central.mirror: https://repo.eclipse.org/content/repositories/maven_central/org/apache/maven/maven-plugin-parameter-documenter/2.0.6/maven-plugin-parameter-documenter-2.0.6.jar
Downloading from eclipse.maven.central.mirror: https://repo.eclipse.org/content/repositories/maven_central/org/apache/maven/maven-error-diagnostics/2.0.6/maven-error-diagnostics-2.0.6.jar
Progress (1): 4.1/5.9 kB
Progress (1): 5.9 kB    
Progress (2): 5.9 kB | 4.1/152 kB
Progress (2): 5.9 kB | 7.7/152 kB
Progress (3): 5.9 kB | 7.7/152 kB | 4.1/9.9 kB
Progress (3): 5.9 kB | 12/152 kB | 4.1/9.9 kB 
Progress (3): 5.9 kB | 12/152 kB | 7.7/9.9 kB
Progress (3): 5.9 kB | 16/152 kB | 7.7/9.9 kB
Progress (3): 5.9 kB | 16/152 kB | 9.9 kB    
Progress (4): 5.9 kB | 16/152 kB | 9.9 kB | 4.1/21 kB
Progress (4): 5.9 kB | 16/152 kB | 9.9 kB | 7.7/21 kB
                                                     
Downloaded from eclipse.maven.central.mirror: https://repo.eclipse.org/content/repositories/maven_central/org/apache/maven/doxia/doxia-sink-api/1.0-alpha-7/doxia-sink-api-1.0-alpha-7.jar (5.9 kB at 1.5 MB/s)
Progress (3): 20/152 kB | 9.9 kB | 7.7/21 kB
                                            
Downloading from eclipse.maven.central.mirror: https://repo.eclipse.org/content/repositories/maven_central/commons-cli/commons-cli/1.0/commons-cli-1.0.jar
Progress (3): 20/152 kB | 9.9 kB | 12/21 kB
Progress (3): 24/152 kB | 9.9 kB | 12/21 kB
Progress (3): 24/152 kB | 9.9 kB | 16/21 kB
Progress (3): 28/152 kB | 9.9 kB | 16/21 kB
Progress (3): 32/152 kB | 9.9 kB | 16/21 kB
Progress (3): 32/152 kB | 9.9 kB | 20/21 kB
Progress (3): 32/152 kB | 9.9 kB | 21 kB   
Progress (3): 36/152 kB | 9.9 kB | 21 kB
Progress (3): 40/152 kB | 9.9 kB | 21 kB
Progress (3): 45/152 kB | 9.9 kB | 21 kB
Progress (3): 49/152 kB | 9.9 kB | 21 kB
Progress (3): 53/152 kB | 9.9 kB | 21 kB
Progress (3): 57/152 kB | 9.9 kB | 21 kB
Progress (3): 61/152 kB | 9.9 kB | 21 kB
Progress (3): 65/152 kB | 9.9 kB | 21 kB
Progress (4): 65/152 kB | 9.9 kB | 21 kB | 4.1/30 kB
Progress (4): 65/152 kB | 9.9 kB | 21 kB | 7.7/30 kB
Progress (4): 69/152 kB | 9.9 kB | 21 kB | 7.7/30 kB
Progress (4): 69/152 kB | 9.9 kB | 21 kB | 12/30 kB 
Progress (4): 73/152 kB | 9.9 kB | 21 kB | 12/30 kB
Progress (4): 73/152 kB | 9.9 kB | 21 kB | 16/30 kB
Progress (4): 77/152 kB | 9.9 kB | 21 kB | 16/30 kB
Progress (4): 81/152 kB | 9.9 kB | 21 kB | 16/30 kB
Progress (4): 81/152 kB | 9.9 kB | 21 kB | 20/30 kB
Progress (4): 85/152 kB | 9.9 kB | 21 kB | 20/30 kB
Progress (4): 85/152 kB | 9.9 kB | 21 kB | 24/30 kB
Progress (4): 90/152 kB | 9.9 kB | 21 kB | 24/30 kB
Progress (4): 90/152 kB | 9.9 kB | 21 kB | 28/30 kB
Progress (4): 94/152 kB | 9.9 kB | 21 kB | 28/30 kB
Progress (4): 94/152 kB | 9.9 kB | 21 kB | 30 kB   
Progress (4): 98/152 kB | 9.9 kB | 21 kB | 30 kB
Progress (4): 102/152 kB | 9.9 kB | 21 kB | 30 kB
Progress (4): 106/152 kB | 9.9 kB | 21 kB | 30 kB
Progress (4): 110/152 kB | 9.9 kB | 21 kB | 30 kB
Progress (4): 114/152 kB | 9.9 kB | 21 kB | 30 kB
Progress (4): 118/152 kB | 9.9 kB | 21 kB | 30 kB
Progress (4): 122/152 kB | 9.9 kB | 21 kB | 30 kB
Progress (4): 126/152 kB | 9.9 kB | 21 kB | 30 kB
Progress (4): 131/152 kB | 9.9 kB | 21 kB | 30 kB
                                                 
Downloaded from eclipse.maven.central.mirror: https://repo.eclipse.org/content/repositories/maven_central/commons-cli/commons-cli/1.0/commons-cli-1.0.jar (30 kB at 3.3 MB/s)
Progress (3): 135/152 kB | 9.9 kB | 21 kB
                                         
Downloading from eclipse.maven.central.mirror: https://repo.eclipse.org/content/repositories/maven_central/org/apache/maven/maven-plugin-descriptor/2.0.6/maven-plugin-descriptor-2.0.6.jar
Progress (3): 139/152 kB | 9.9 kB | 21 kB
Progress (3): 143/152 kB | 9.9 kB | 21 kB
Progress (3): 147/152 kB | 9.9 kB | 21 kB
Progress (3): 151/152 kB | 9.9 kB | 21 kB
Progress (3): 152 kB | 9.9 kB | 21 kB    
                                     
Downloaded from eclipse.maven.central.mirror: https://repo.eclipse.org/content/repositories/maven_central/org/apache/maven/maven-core/2.0.6/maven-core-2.0.6.jar (152 kB at 12 MB/s)
Downloading from eclipse.maven.central.mirror: https://repo.eclipse.org/content/repositories/maven_central/org/codehaus/plexus/plexus-interactivity-api/1.0-alpha-4/plexus-interactivity-api-1.0-alpha-4.jar
Progress (3): 9.9 kB | 21 kB | 4.1/13 kB
Progress (3): 9.9 kB | 21 kB | 7.7/13 kB
Progress (3): 9.9 kB | 21 kB | 12/13 kB 
Progress (3): 9.9 kB | 21 kB | 13 kB   
                                    
Downloaded from eclipse.maven.central.mirror: https://repo.eclipse.org/content/repositories/maven_central/org/codehaus/plexus/plexus-interactivity-api/1.0-alpha-4/plexus-interactivity-api-1.0-alpha-4.jar (13 kB at 838 kB/s)
Downloading from eclipse.maven.central.mirror: https://repo.eclipse.org/content/repositories/maven_central/classworlds/classworlds/1.1/classworlds-1.1.jar
Progress (3): 9.9 kB | 21 kB | 4.1/38 kB
Progress (3): 9.9 kB | 21 kB | 7.7/38 kB
Progress (3): 9.9 kB | 21 kB | 12/38 kB 
Progress (3): 9.9 kB | 21 kB | 16/38 kB
Progress (3): 9.9 kB | 21 kB | 20/38 kB
Progress (3): 9.9 kB | 21 kB | 24/38 kB
Progress (3): 9.9 kB | 21 kB | 28/38 kB
Progress (3): 9.9 kB | 21 kB | 32/38 kB
Progress (4): 9.9 kB | 21 kB | 32/38 kB | 4.1/14 kB
Progress (4): 9.9 kB | 21 kB | 36/38 kB | 4.1/14 kB
Progress (4): 9.9 kB | 21 kB | 36/38 kB | 7.7/14 kB
Progress (4): 9.9 kB | 21 kB | 38 kB | 7.7/14 kB   
Progress (4): 9.9 kB | 21 kB | 38 kB | 12/14 kB 
Progress (4): 9.9 kB | 21 kB | 38 kB | 14 kB   
                                            
Downloaded from eclipse.maven.central.mirror: https://repo.eclipse.org/content/repositories/maven_central/classworlds/classworlds/1.1/classworlds-1.1.jar (38 kB at 1.8 MB/s)
Downloading from eclipse.maven.central.mirror: https://repo.eclipse.org/content/repositories/maven_central/org/apache/maven/maven-monitor/2.0.6/maven-monitor-2.0.6.jar
Downloaded from eclipse.maven.central.mirror: https://repo.eclipse.org/content/repositories/maven_central/org/apache/maven/reporting/maven-reporting-api/2.0.6/maven-reporting-api-2.0.6.jar (9.9 kB at 292 kB/s)
Downloading from eclipse.maven.central.mirror: https://repo.eclipse.org/content/repositories/maven_central/org/apache/maven/shared/maven-filtering/1.1/maven-filtering-1.1.jar
Downloaded from eclipse.maven.central.mirror: https://repo.eclipse.org/content/repositories/maven_central/org/apache/maven/maven-error-diagnostics/2.0.6/maven-error-diagnostics-2.0.6.jar (14 kB at 400 kB/s)
Downloaded from eclipse.maven.central.mirror: https://repo.eclipse.org/content/repositories/maven_central/org/apache/maven/maven-plugin-parameter-documenter/2.0.6/maven-plugin-parameter-documenter-2.0.6.jar (21 kB at 577 kB/s)
Downloading from eclipse.maven.central.mirror: https://repo.eclipse.org/content/repositories/maven_central/org/codehaus/plexus/plexus-interpolation/1.13/plexus-interpolation-1.13.jar
Progress (1): 4.1/37 kB
                       
Downloading from eclipse.maven.central.mirror: https://repo.eclipse.org/content/repositories/maven_central/org/sonatype/plexus/plexus-build-api/0.0.4/plexus-build-api-0.0.4.jar
Progress (1): 7.7/37 kB
Progress (2): 7.7/37 kB | 4.1/10 kB
Progress (2): 12/37 kB | 4.1/10 kB 
Progress (2): 12/37 kB | 7.7/10 kB
Progress (2): 16/37 kB | 7.7/10 kB
Progress (2): 16/37 kB | 10 kB    
Progress (3): 16/37 kB | 10 kB | 4.1/43 kB
Progress (3): 16/37 kB | 10 kB | 7.7/43 kB
Progress (3): 16/37 kB | 10 kB | 12/43 kB 
Progress (3): 16/37 kB | 10 kB | 16/43 kB
Progress (3): 20/37 kB | 10 kB | 16/43 kB
Progress (3): 24/37 kB | 10 kB | 16/43 kB
Progress (4): 24/37 kB | 10 kB | 16/43 kB | 4.1/6.8 kB
Progress (4): 28/37 kB | 10 kB | 16/43 kB | 4.1/6.8 kB
Progress (4): 28/37 kB | 10 kB | 16/43 kB | 6.8 kB    
Progress (4): 32/37 kB | 10 kB | 16/43 kB | 6.8 kB
Progress (4): 32/37 kB | 10 kB | 20/43 kB | 6.8 kB
Progress (4): 32/37 kB | 10 kB | 24/43 kB | 6.8 kB
Progress (4): 36/37 kB | 10 kB | 24/43 kB | 6.8 kB
Progress (4): 36/37 kB | 10 kB | 28/43 kB | 6.8 kB
Progress (4): 37 kB | 10 kB | 28/43 kB | 6.8 kB   
Progress (4): 37 kB | 10 kB | 32/43 kB | 6.8 kB
Progress (4): 37 kB | 10 kB | 36/43 kB | 6.8 kB
Progress (4): 37 kB | 10 kB | 40/43 kB | 6.8 kB
Progress (4): 37 kB | 10 kB | 43 kB | 6.8 kB   
Progress (5): 37 kB | 10 kB | 43 kB | 6.8 kB | 4.1/61 kB
Progress (5): 37 kB | 10 kB | 43 kB | 6.8 kB | 7.7/61 kB
Progress (5): 37 kB | 10 kB | 43 kB | 6.8 kB | 12/61 kB 
Progress (5): 37 kB | 10 kB | 43 kB | 6.8 kB | 16/61 kB
Progress (5): 37 kB | 10 kB | 43 kB | 6.8 kB | 20/61 kB
Progress (5): 37 kB | 10 kB | 43 kB | 6.8 kB | 24/61 kB
Progress (5): 37 kB | 10 kB | 43 kB | 6.8 kB | 28/61 kB
Progress (5): 37 kB | 10 kB | 43 kB | 6.8 kB | 32/61 kB
                                                       
Downloaded from eclipse.maven.central.mirror: https://repo.eclipse.org/content/repositories/maven_central/org/apache/maven/maven-monitor/2.0.6/maven-monitor-2.0.6.jar (10 kB at 153 kB/s)
Progress (4): 37 kB | 43 kB | 6.8 kB | 36/61 kB
Progress (4): 37 kB | 43 kB | 6.8 kB | 40/61 kB
Progress (4): 37 kB | 43 kB | 6.8 kB | 45/61 kB
Progress (4): 37 kB | 43 kB | 6.8 kB | 49/61 kB
Progress (4): 37 kB | 43 kB | 6.8 kB | 53/61 kB
Progress (4): 37 kB | 43 kB | 6.8 kB | 57/61 kB
Progress (4): 37 kB | 43 kB | 6.8 kB | 61/61 kB
Progress (4): 37 kB | 43 kB | 6.8 kB | 61 kB   
                                            
Downloaded from eclipse.maven.central.mirror: https://repo.eclipse.org/content/repositories/maven_central/org/apache/maven/maven-plugin-descriptor/2.0.6/maven-plugin-descriptor-2.0.6.jar (37 kB at 534 kB/s)
Downloaded from eclipse.maven.central.mirror: https://repo.eclipse.org/content/repositories/maven_central/org/apache/maven/shared/maven-filtering/1.1/maven-filtering-1.1.jar (43 kB at 567 kB/s)
Downloaded from eclipse.maven.central.mirror: https://repo.eclipse.org/content/repositories/maven_central/org/sonatype/plexus/plexus-build-api/0.0.4/plexus-build-api-0.0.4.jar (6.8 kB at 81 kB/s)
Downloaded from eclipse.maven.central.mirror: https://repo.eclipse.org/content/repositories/maven_central/org/codehaus/plexus/plexus-interpolation/1.13/plexus-interpolation-1.13.jar (61 kB at 664 kB/s)
[INFO] Using 'UTF-8' encoding to copy filtered resources.
[INFO] skip non existing resourceDirectory /home/jenkins/agent/workspace/m2eclipse-mavenarchiver/org.sonatype.m2e.mavenarchiver/src/main/resources
[INFO] 
[INFO] --- tycho-compiler-plugin:1.6.0:compile (default-compile) @ org.sonatype.m2e.mavenarchiver ---
Downloading from eclipse.maven.central.mirror: https://repo.eclipse.org/content/repositories/maven_central/org/codehaus/plexus/plexus-compiler-manager/2.8.5/plexus-compiler-manager-2.8.5.pom
Progress (1): 692 B
                   
Downloaded from eclipse.maven.central.mirror: https://repo.eclipse.org/content/repositories/maven_central/org/codehaus/plexus/plexus-compiler-manager/2.8.5/plexus-compiler-manager-2.8.5.pom (692 B at 35 kB/s)
Downloading from eclipse.maven.central.mirror: https://repo.eclipse.org/content/repositories/maven_central/org/codehaus/plexus/plexus-compiler/2.8.5/plexus-compiler-2.8.5.pom
Progress (1): 4.1 kB
Progress (1): 6.0 kB
                    
Downloaded from eclipse.maven.central.mirror: https://repo.eclipse.org/content/repositories/maven_central/org/codehaus/plexus/plexus-compiler/2.8.5/plexus-compiler-2.8.5.pom (6.0 kB at 1.5 MB/s)
Downloading from eclipse.maven.central.mirror: https://repo.eclipse.org/content/repositories/maven_central/org/codehaus/plexus/plexus-components/4.0/plexus-components-4.0.pom
Progress (1): 2.7 kB
                    
Downloaded from eclipse.maven.central.mirror: https://repo.eclipse.org/content/repositories/maven_central/org/codehaus/plexus/plexus-components/4.0/plexus-components-4.0.pom (2.7 kB at 177 kB/s)
Downloading from eclipse.maven.central.mirror: https://repo.eclipse.org/content/repositories/maven_central/org/codehaus/plexus/plexus-compiler-api/2.8.5/plexus-compiler-api-2.8.5.pom
Progress (1): 867 B
                   
Downloaded from eclipse.maven.central.mirror: https://repo.eclipse.org/content/repositories/maven_central/org/codehaus/plexus/plexus-compiler-api/2.8.5/plexus-compiler-api-2.8.5.pom (867 B at 434 kB/s)
Downloading from eclipse.maven.central.mirror: https://repo.eclipse.org/content/repositories/maven_central/org/eclipse/tycho/tycho-compiler-jdt/1.6.0/tycho-compiler-jdt-1.6.0.pom
Progress (1): 2.4 kB
                    
Downloaded from eclipse.maven.central.mirror: https://repo.eclipse.org/content/repositories/maven_central/org/eclipse/tycho/tycho-compiler-jdt/1.6.0/tycho-compiler-jdt-1.6.0.pom (2.4 kB at 108 kB/s)
Downloading from eclipse.maven.central.mirror: https://repo.eclipse.org/content/repositories/maven_central/org/eclipse/tycho/tycho-lib-detector/1.6.0/tycho-lib-detector-1.6.0.pom
Progress (1): 1.6 kB
                    
Downloaded from eclipse.maven.central.mirror: https://repo.eclipse.org/content/repositories/maven_central/org/eclipse/tycho/tycho-lib-detector/1.6.0/tycho-lib-detector-1.6.0.pom (1.6 kB at 92 kB/s)
Downloading from eclipse.maven.central.mirror: https://repo.eclipse.org/content/repositories/maven_central/org/eclipse/jdt/ecj/3.20.0/ecj-3.20.0.pom
Progress (1): 1.7 kB
                    
Downloaded from eclipse.maven.central.mirror: https://repo.eclipse.org/content/repositories/maven_central/org/eclipse/jdt/ecj/3.20.0/ecj-3.20.0.pom (1.7 kB at 556 kB/s)
Downloading from eclipse.maven.central.mirror: https://repo.eclipse.org/content/repositories/maven_central/org/codehaus/plexus/plexus-compiler-manager/2.8.5/plexus-compiler-manager-2.8.5.jar
Downloading from eclipse.maven.central.mirror: https://repo.eclipse.org/content/repositories/maven_central/org/eclipse/jdt/ecj/3.20.0/ecj-3.20.0.jar
Downloading from eclipse.maven.central.mirror: https://repo.eclipse.org/content/repositories/maven_central/org/eclipse/tycho/tycho-lib-detector/1.6.0/tycho-lib-detector-1.6.0.jar
Downloading from eclipse.maven.central.mirror: https://repo.eclipse.org/content/repositories/maven_central/org/codehaus/plexus/plexus-compiler-api/2.8.5/plexus-compiler-api-2.8.5.jar
Downloading from eclipse.maven.central.mirror: https://repo.eclipse.org/content/repositories/maven_central/org/eclipse/tycho/tycho-compiler-jdt/1.6.0/tycho-compiler-jdt-1.6.0.jar
Progress (1): 0/3.0 MB
Progress (1): 0/3.0 MB
Progress (1): 0/3.0 MB
Progress (1): 0.1/3.0 MB
Progress (1): 0.1/3.0 MB
Progress (1): 0.1/3.0 MB
Progress (1): 0.1/3.0 MB
Progress (1): 0.1/3.0 MB
Progress (1): 0.1/3.0 MB
Progress (1): 0.2/3.0 MB
Progress (1): 0.2/3.0 MB
Progress (1): 0.2/3.0 MB
Progress (1): 0.2/3.0 MB
Progress (1): 0.2/3.0 MB
Progress (1): 0.2/3.0 MB
Progress (1): 0.3/3.0 MB
Progress (1): 0.3/3.0 MB
Progress (1): 0.3/3.0 MB
Progress (1): 0.3/3.0 MB
Progress (1): 0.3/3.0 MB
Progress (1): 0.3/3.0 MB
Progress (1): 0.4/3.0 MB
Progress (1): 0.4/3.0 MB
Progress (1): 0.4/3.0 MB
Progress (1): 0.4/3.0 MB
Progress (1): 0.4/3.0 MB
Progress (1): 0.4/3.0 MB
Progress (1): 0.5/3.0 MB
Progress (1): 0.5/3.0 MB
Progress (2): 0.5/3.0 MB | 3.5 kB
Progress (2): 0.5/3.0 MB | 3.5 kB
Progress (2): 0.5/3.0 MB | 3.5 kB
Progress (3): 0.5/3.0 MB | 3.5 kB | 4.1/17 kB
Progress (3): 0.5/3.0 MB | 3.5 kB | 7.7/17 kB
Progress (3): 0.5/3.0 MB | 3.5 kB | 12/17 kB 
Progress (3): 0.5/3.0 MB | 3.5 kB | 16/17 kB
Progress (3): 0.5/3.0 MB | 3.5 kB | 16/17 kB
Progress (3): 0.5/3.0 MB | 3.5 kB | 17 kB   
Progress (3): 0.5/3.0 MB | 3.5 kB | 17 kB
Progress (3): 0.6/3.0 MB | 3.5 kB | 17 kB
Progress (3): 0.6/3.0 MB | 3.5 kB | 17 kB
Progress (4): 0.6/3.0 MB | 3.5 kB | 17 kB | 4.1/4.7 kB
Progress (4): 0.6/3.0 MB | 3.5 kB | 17 kB | 4.1/4.7 kB
Progress (4): 0.6/3.0 MB | 3.5 kB | 17 kB | 4.7 kB    
Progress (4): 0.6/3.0 MB | 3.5 kB | 17 kB | 4.7 kB
Progress (4): 0.6/3.0 MB | 3.5 kB | 17 kB | 4.7 kB
Progress (4): 0.6/3.0 MB | 3.5 kB | 17 kB | 4.7 kB
Progress (4): 0.7/3.0 MB | 3.5 kB | 17 kB | 4.7 kB
Progress (4): 0.7/3.0 MB | 3.5 kB | 17 kB | 4.7 kB
Progress (5): 0.7/3.0 MB | 3.5 kB | 17 kB | 4.7 kB | 4.1/27 kB
Progress (5): 0.7/3.0 MB | 3.5 kB | 17 kB | 4.7 kB | 7.7/27 kB
Progress (5): 0.7/3.0 MB | 3.5 kB | 17 kB | 4.7 kB | 12/27 kB 
Progress (5): 0.7/3.0 MB | 3.5 kB | 17 kB | 4.7 kB | 12/27 kB
Progress (5): 0.7/3.0 MB | 3.5 kB | 17 kB | 4.7 kB | 16/27 kB
Progress (5): 0.7/3.0 MB | 3.5 kB | 17 kB | 4.7 kB | 20/27 kB
Progress (5): 0.7/3.0 MB | 3.5 kB | 17 kB | 4.7 kB | 20/27 kB
Progress (5): 0.7/3.0 MB | 3.5 kB | 17 kB | 4.7 kB | 24/27 kB
Progress (5): 0.7/3.0 MB | 3.5 kB | 17 kB | 4.7 kB | 27 kB   
Progress (5): 0.7/3.0 MB | 3.5 kB | 17 kB | 4.7 kB | 27 kB
Progress (5): 0.7/3.0 MB | 3.5 kB | 17 kB | 4.7 kB | 27 kB
Progress (5): 0.8/3.0 MB | 3.5 kB | 17 kB | 4.7 kB | 27 kB
Progress (5): 0.8/3.0 MB | 3.5 kB | 17 kB | 4.7 kB | 27 kB
Progress (5): 0.8/3.0 MB | 3.5 kB | 17 kB | 4.7 kB | 27 kB
Progress (5): 0.8/3.0 MB | 3.5 kB | 17 kB | 4.7 kB | 27 kB
Progress (5): 0.8/3.0 MB | 3.5 kB | 17 kB | 4.7 kB | 27 kB
Progress (5): 0.8/3.0 MB | 3.5 kB | 17 kB | 4.7 kB | 27 kB
Progress (5): 0.9/3.0 MB | 3.5 kB | 17 kB | 4.7 kB | 27 kB
Progress (5): 0.9/3.0 MB | 3.5 kB | 17 kB | 4.7 kB | 27 kB
Progress (5): 0.9/3.0 MB | 3.5 kB | 17 kB | 4.7 kB | 27 kB
Progress (5): 0.9/3.0 MB | 3.5 kB | 17 kB | 4.7 kB | 27 kB
Progress (5): 0.9/3.0 MB | 3.5 kB | 17 kB | 4.7 kB | 27 kB
Progress (5): 0.9/3.0 MB | 3.5 kB | 17 kB | 4.7 kB | 27 kB
Progress (5): 0.9/3.0 MB | 3.5 kB | 17 kB | 4.7 kB | 27 kB
Progress (5): 1.0/3.0 MB | 3.5 kB | 17 kB | 4.7 kB | 27 kB
Progress (5): 1.0/3.0 MB | 3.5 kB | 17 kB | 4.7 kB | 27 kB
Progress (5): 1.0/3.0 MB | 3.5 kB | 17 kB | 4.7 kB | 27 kB
Progress (5): 1.0/3.0 MB | 3.5 kB | 17 kB | 4.7 kB | 27 kB
Progress (5): 1.0/3.0 MB | 3.5 kB | 17 kB | 4.7 kB | 27 kB
Progress (5): 1.0/3.0 MB | 3.5 kB | 17 kB | 4.7 kB | 27 kB
Progress (5): 1.1/3.0 MB | 3.5 kB | 17 kB | 4.7 kB | 27 kB
Progress (5): 1.1/3.0 MB | 3.5 kB | 17 kB | 4.7 kB | 27 kB
Progress (5): 1.1/3.0 MB | 3.5 kB | 17 kB | 4.7 kB | 27 kB
Progress (5): 1.1/3.0 MB | 3.5 kB | 17 kB | 4.7 kB | 27 kB
Progress (5): 1.1/3.0 MB | 3.5 kB | 17 kB | 4.7 kB | 27 kB
Progress (5): 1.1/3.0 MB | 3.5 kB | 17 kB | 4.7 kB | 27 kB
Progress (5): 1.2/3.0 MB | 3.5 kB | 17 kB | 4.7 kB | 27 kB
Progress (5): 1.2/3.0 MB | 3.5 kB | 17 kB | 4.7 kB | 27 kB
Progress (5): 1.2/3.0 MB | 3.5 kB | 17 kB | 4.7 kB | 27 kB
Progress (5): 1.2/3.0 MB | 3.5 kB | 17 kB | 4.7 kB | 27 kB
Progress (5): 1.2/3.0 MB | 3.5 kB | 17 kB | 4.7 kB | 27 kB
Progress (5): 1.2/3.0 MB | 3.5 kB | 17 kB | 4.7 kB | 27 kB
Progress (5): 1.3/3.0 MB | 3.5 kB | 17 kB | 4.7 kB | 27 kB
Progress (5): 1.3/3.0 MB | 3.5 kB | 17 kB | 4.7 kB | 27 kB
Progress (5): 1.3/3.0 MB | 3.5 kB | 17 kB | 4.7 kB | 27 kB
Progress (5): 1.3/3.0 MB | 3.5 kB | 17 kB | 4.7 kB | 27 kB
Progress (5): 1.3/3.0 MB | 3.5 kB | 17 kB | 4.7 kB | 27 kB
Progress (5): 1.3/3.0 MB | 3.5 kB | 17 kB | 4.7 kB | 27 kB
Progress (5): 1.4/3.0 MB | 3.5 kB | 17 kB | 4.7 kB | 27 kB
                                                          
Downloaded from eclipse.maven.central.mirror: https://repo.eclipse.org/content/repositories/maven_central/org/eclipse/tycho/tycho-compiler-jdt/1.6.0/tycho-compiler-jdt-1.6.0.jar (17 kB at 395 kB/s)
Progress (4): 1.4/3.0 MB | 3.5 kB | 4.7 kB | 27 kB
Progress (4): 1.4/3.0 MB | 3.5 kB | 4.7 kB | 27 kB
                                                  
Downloaded from eclipse.maven.central.mirror: https://repo.eclipse.org/content/repositories/maven_central/org/eclipse/tycho/tycho-lib-detector/1.6.0/tycho-lib-detector-1.6.0.jar (3.5 kB at 76 kB/s)
Progress (3): 1.4/3.0 MB | 4.7 kB | 27 kB
Progress (3): 1.4/3.0 MB | 4.7 kB | 27 kB
Progress (3): 1.4/3.0 MB | 4.7 kB | 27 kB
Progress (3): 1.5/3.0 MB | 4.7 kB | 27 kB
Progress (3): 1.5/3.0 MB | 4.7 kB | 27 kB
Progress (3): 1.5/3.0 MB | 4.7 kB | 27 kB
Progress (3): 1.5/3.0 MB | 4.7 kB | 27 kB
Progress (3): 1.5/3.0 MB | 4.7 kB | 27 kB
Progress (3): 1.5/3.0 MB | 4.7 kB | 27 kB
Progress (3): 1.6/3.0 MB | 4.7 kB | 27 kB
Progress (3): 1.6/3.0 MB | 4.7 kB | 27 kB
Progress (3): 1.6/3.0 MB | 4.7 kB | 27 kB
Progress (3): 1.6/3.0 MB | 4.7 kB | 27 kB
Progress (3): 1.6/3.0 MB | 4.7 kB | 27 kB
Progress (3): 1.6/3.0 MB | 4.7 kB | 27 kB
Progress (3): 1.7/3.0 MB | 4.7 kB | 27 kB
Progress (3): 1.7/3.0 MB | 4.7 kB | 27 kB
Progress (3): 1.7/3.0 MB | 4.7 kB | 27 kB
Progress (3): 1.7/3.0 MB | 4.7 kB | 27 kB
                                         
Downloaded from eclipse.maven.central.mirror: https://repo.eclipse.org/content/repositories/maven_central/org/codehaus/plexus/plexus-compiler-api/2.8.5/plexus-compiler-api-2.8.5.jar (27 kB at 291 kB/s)
Downloaded from eclipse.maven.central.mirror: https://repo.eclipse.org/content/repositories/maven_central/org/codehaus/plexus/plexus-compiler-manager/2.8.5/plexus-compiler-manager-2.8.5.jar (4.7 kB at 51 kB/s)
Progress (1): 1.7/3.0 MB
Progress (1): 1.7/3.0 MB
Progress (1): 1.8/3.0 MB
Progress (1): 1.8/3.0 MB
Progress (1): 1.8/3.0 MB
Progress (1): 1.8/3.0 MB
Progress (1): 1.8/3.0 MB
Progress (1): 1.8/3.0 MB
Progress (1): 1.9/3.0 MB
Progress (1): 1.9/3.0 MB
Progress (1): 1.9/3.0 MB
Progress (1): 1.9/3.0 MB
Progress (1): 1.9/3.0 MB
Progress (1): 1.9/3.0 MB
Progress (1): 1.9/3.0 MB
Progress (1): 2.0/3.0 MB
Progress (1): 2.0/3.0 MB
Progress (1): 2.0/3.0 MB
Progress (1): 2.0/3.0 MB
Progress (1): 2.0/3.0 MB
Progress (1): 2.0/3.0 MB
Progress (1): 2.1/3.0 MB
Progress (1): 2.1/3.0 MB
Progress (1): 2.1/3.0 MB
Progress (1): 2.1/3.0 MB
Progress (1): 2.1/3.0 MB
Progress (1): 2.1/3.0 MB
Progress (1): 2.2/3.0 MB
Progress (1): 2.2/3.0 MB
Progress (1): 2.2/3.0 MB
Progress (1): 2.2/3.0 MB
Progress (1): 2.2/3.0 MB
Progress (1): 2.2/3.0 MB
Progress (1): 2.3/3.0 MB
Progress (1): 2.3/3.0 MB
Progress (1): 2.3/3.0 MB
Progress (1): 2.3/3.0 MB
Progress (1): 2.3/3.0 MB
Progress (1): 2.3/3.0 MB
Progress (1): 2.4/3.0 MB
Progress (1): 2.4/3.0 MB
Progress (1): 2.4/3.0 MB
Progress (1): 2.4/3.0 MB
Progress (1): 2.4/3.0 MB
Progress (1): 2.4/3.0 MB
Progress (1): 2.5/3.0 MB
Progress (1): 2.5/3.0 MB
Progress (1): 2.5/3.0 MB
Progress (1): 2.5/3.0 MB
Progress (1): 2.5/3.0 MB
Progress (1): 2.5/3.0 MB
Progress (1): 2.6/3.0 MB
Progress (1): 2.6/3.0 MB
Progress (1): 2.6/3.0 MB
Progress (1): 2.6/3.0 MB
Progress (1): 2.6/3.0 MB
Progress (1): 2.6/3.0 MB
Progress (1): 2.7/3.0 MB
Progress (1): 2.7/3.0 MB
Progress (1): 2.7/3.0 MB
Progress (1): 2.7/3.0 MB
Progress (1): 2.7/3.0 MB
Progress (1): 2.7/3.0 MB
Progress (1): 2.8/3.0 MB
Progress (1): 2.8/3.0 MB
Progress (1): 2.8/3.0 MB
Progress (1): 2.8/3.0 MB
Progress (1): 2.8/3.0 MB
Progress (1): 2.8/3.0 MB
Progress (1): 2.9/3.0 MB
Progress (1): 2.9/3.0 MB
Progress (1): 2.9/3.0 MB
Progress (1): 2.9/3.0 MB
Progress (1): 2.9/3.0 MB
Progress (1): 2.9/3.0 MB
Progress (1): 2.9/3.0 MB
Progress (1): 3.0/3.0 MB
Progress (1): 3.0/3.0 MB
Progress (1): 3.0 MB    
                    
Downloaded from eclipse.maven.central.mirror: https://repo.eclipse.org/content/repositories/maven_central/org/eclipse/jdt/ecj/3.20.0/ecj-3.20.0.jar (3.0 MB at 24 MB/s)
[WARNING] Parameter 'useProjectSettings' is set to true, but preferences file '/home/jenkins/agent/workspace/m2eclipse-mavenarchiver/org.sonatype.m2e.mavenarchiver/.settings/org.eclipse.jdt.core.prefs' could not be found!
[INFO] Compiling 3 source files to /home/jenkins/agent/workspace/m2eclipse-mavenarchiver/org.sonatype.m2e.mavenarchiver/target/classes
[INFO] 
[INFO] --- maven-resources-plugin:2.6:testResources (default-testResources) @ org.sonatype.m2e.mavenarchiver ---
[INFO] Using 'UTF-8' encoding to copy filtered resources.
[INFO] skip non existing resourceDirectory /home/jenkins/agent/workspace/m2eclipse-mavenarchiver/org.sonatype.m2e.mavenarchiver/src/test/resources
[INFO] 
[INFO] --- target-platform-configuration:1.6.0:target-platform (default-target-platform) @ org.sonatype.m2e.mavenarchiver ---
[INFO] 
[INFO] --- tycho-packaging-plugin:1.6.0:package-plugin (default-package-plugin) @ org.sonatype.m2e.mavenarchiver ---
[INFO] Building jar: /home/jenkins/agent/workspace/m2eclipse-mavenarchiver/org.sonatype.m2e.mavenarchiver/target/org.sonatype.m2e.mavenarchiver-0.17.5-SNAPSHOT.jar
[INFO] 
[INFO] --- tycho-p2-plugin:1.6.0:p2-metadata-default (default-p2-metadata-default) @ org.sonatype.m2e.mavenarchiver ---
[INFO] 
[INFO] --- maven-install-plugin:2.3.1:install (default-install) @ org.sonatype.m2e.mavenarchiver ---
[INFO] Installing /home/jenkins/agent/workspace/m2eclipse-mavenarchiver/org.sonatype.m2e.mavenarchiver/target/org.sonatype.m2e.mavenarchiver-0.17.5-SNAPSHOT.jar to /home/jenkins/agent/workspace/m2eclipse-mavenarchiver/.repository/org/sonatype/m2e/extras/org.sonatype.m2e.mavenarchiver/0.17.5-SNAPSHOT/org.sonatype.m2e.mavenarchiver-0.17.5-SNAPSHOT.jar
[INFO] Installing /home/jenkins/agent/workspace/m2eclipse-mavenarchiver/org.sonatype.m2e.mavenarchiver/pom.xml to /home/jenkins/agent/workspace/m2eclipse-mavenarchiver/.repository/org/sonatype/m2e/extras/org.sonatype.m2e.mavenarchiver/0.17.5-SNAPSHOT/org.sonatype.m2e.mavenarchiver-0.17.5-SNAPSHOT.pom
[INFO] Installing /home/jenkins/agent/workspace/m2eclipse-mavenarchiver/org.sonatype.m2e.mavenarchiver/target/p2content.xml to /home/jenkins/agent/workspace/m2eclipse-mavenarchiver/.repository/org/sonatype/m2e/extras/org.sonatype.m2e.mavenarchiver/0.17.5-SNAPSHOT/org.sonatype.m2e.mavenarchiver-0.17.5-SNAPSHOT-p2metadata.xml
[INFO] Installing /home/jenkins/agent/workspace/m2eclipse-mavenarchiver/org.sonatype.m2e.mavenarchiver/target/p2artifacts.xml to /home/jenkins/agent/workspace/m2eclipse-mavenarchiver/.repository/org/sonatype/m2e/extras/org.sonatype.m2e.mavenarchiver/0.17.5-SNAPSHOT/org.sonatype.m2e.mavenarchiver-0.17.5-SNAPSHOT-p2artifacts.xml
[INFO] 
[INFO] --- tycho-p2-plugin:1.6.0:update-local-index (default-update-local-index) @ org.sonatype.m2e.mavenarchiver ---
[INFO] 
[INFO] ---< org.sonatype.m2e.extras:org.sonatype.m2e.mavenarchiver.feature >---
[INFO] Building org.sonatype.m2e.mavenarchiver.feature 0.17.5-SNAPSHOT    [3/5]
[INFO] --------------------------[ eclipse-feature ]---------------------------
[INFO] 
[INFO] --- maven-clean-plugin:2.4.1:clean (default-clean) @ org.sonatype.m2e.mavenarchiver.feature ---
[INFO] 
[INFO] --- tycho-packaging-plugin:1.6.0:build-qualifier-aggregator (default-build-qualifier-aggregator) @ org.sonatype.m2e.mavenarchiver.feature ---
[INFO] The project's OSGi version is 0.17.5.202002181833
[INFO] 
[INFO] --- tycho-packaging-plugin:1.6.0:validate-id (default-validate-id) @ org.sonatype.m2e.mavenarchiver.feature ---
[INFO] 
[INFO] --- tycho-packaging-plugin:1.6.0:validate-version (default-validate-version) @ org.sonatype.m2e.mavenarchiver.feature ---
[INFO] 
[INFO] --- target-platform-configuration:1.6.0:target-platform (default-target-platform) @ org.sonatype.m2e.mavenarchiver.feature ---
[INFO] 
[INFO] --- tycho-packaging-plugin:1.6.0:package-feature (default-package-feature) @ org.sonatype.m2e.mavenarchiver.feature ---
[INFO] Building jar: /home/jenkins/agent/workspace/m2eclipse-mavenarchiver/org.sonatype.m2e.mavenarchiver.feature/target/org.sonatype.m2e.mavenarchiver.feature-0.17.5-SNAPSHOT.jar
[INFO] 
[INFO] --- tycho-p2-plugin:1.6.0:p2-metadata-default (default-p2-metadata-default) @ org.sonatype.m2e.mavenarchiver.feature ---
[INFO] 
[INFO] --- tycho-p2-plugin:1.6.0:feature-p2-metadata (default-feature-p2-metadata) @ org.sonatype.m2e.mavenarchiver.feature ---
[INFO] 
[INFO] --- maven-install-plugin:2.3.1:install (default-install) @ org.sonatype.m2e.mavenarchiver.feature ---
[INFO] Installing /home/jenkins/agent/workspace/m2eclipse-mavenarchiver/org.sonatype.m2e.mavenarchiver.feature/target/org.sonatype.m2e.mavenarchiver.feature-0.17.5-SNAPSHOT.jar to /home/jenkins/agent/workspace/m2eclipse-mavenarchiver/.repository/org/sonatype/m2e/extras/org.sonatype.m2e.mavenarchiver.feature/0.17.5-SNAPSHOT/org.sonatype.m2e.mavenarchiver.feature-0.17.5-SNAPSHOT.jar
[INFO] Installing /home/jenkins/agent/workspace/m2eclipse-mavenarchiver/org.sonatype.m2e.mavenarchiver.feature/pom.xml to /home/jenkins/agent/workspace/m2eclipse-mavenarchiver/.repository/org/sonatype/m2e/extras/org.sonatype.m2e.mavenarchiver.feature/0.17.5-SNAPSHOT/org.sonatype.m2e.mavenarchiver.feature-0.17.5-SNAPSHOT.pom
[INFO] Installing /home/jenkins/agent/workspace/m2eclipse-mavenarchiver/org.sonatype.m2e.mavenarchiver.feature/target/p2content.xml to /home/jenkins/agent/workspace/m2eclipse-mavenarchiver/.repository/org/sonatype/m2e/extras/org.sonatype.m2e.mavenarchiver.feature/0.17.5-SNAPSHOT/org.sonatype.m2e.mavenarchiver.feature-0.17.5-SNAPSHOT-p2metadata.xml
[INFO] Installing /home/jenkins/agent/workspace/m2eclipse-mavenarchiver/org.sonatype.m2e.mavenarchiver.feature/target/p2artifacts.xml to /home/jenkins/agent/workspace/m2eclipse-mavenarchiver/.repository/org/sonatype/m2e/extras/org.sonatype.m2e.mavenarchiver.feature/0.17.5-SNAPSHOT/org.sonatype.m2e.mavenarchiver.feature-0.17.5-SNAPSHOT-p2artifacts.xml
[INFO] 
[INFO] --- tycho-p2-plugin:1.6.0:update-local-index (default-update-local-index) @ org.sonatype.m2e.mavenarchiver.feature ---
[INFO] 
[INFO] ----< org.sonatype.m2e.extras:org.sonatype.m2e.mavenarchiver.tests >----
[INFO] Building org.sonatype.m2e.mavenarchiver.tests 0.17.5-SNAPSHOT      [4/5]
[INFO] ------------------------[ eclipse-test-plugin ]-------------------------
[INFO] 
[INFO] --- maven-clean-plugin:2.4.1:clean (default-clean) @ org.sonatype.m2e.mavenarchiver.tests ---
[INFO] 
[INFO] --- tycho-packaging-plugin:1.6.0:build-qualifier (default-build-qualifier) @ org.sonatype.m2e.mavenarchiver.tests ---
[INFO] The project's OSGi version is 0.17.5.202002181833
[INFO] 
[INFO] --- tycho-packaging-plugin:1.6.0:validate-id (default-validate-id) @ org.sonatype.m2e.mavenarchiver.tests ---
[INFO] 
[INFO] --- tycho-packaging-plugin:1.6.0:validate-version (default-validate-version) @ org.sonatype.m2e.mavenarchiver.tests ---
[INFO] 
[INFO] --- maven-resources-plugin:2.6:resources (default-resources) @ org.sonatype.m2e.mavenarchiver.tests ---
[INFO] Using 'UTF-8' encoding to copy filtered resources.
[INFO] skip non existing resourceDirectory /home/jenkins/agent/workspace/m2eclipse-mavenarchiver/org.sonatype.m2e.mavenarchiver.tests/src/main/resources
[INFO] 
[INFO] --- tycho-compiler-plugin:1.6.0:compile (default-compile) @ org.sonatype.m2e.mavenarchiver.tests ---
[WARNING] Parameter 'useProjectSettings' is set to true, but preferences file '/home/jenkins/agent/workspace/m2eclipse-mavenarchiver/org.sonatype.m2e.mavenarchiver.tests/.settings/org.eclipse.jdt.core.prefs' could not be found!
[INFO] Compiling 1 source file to /home/jenkins/agent/workspace/m2eclipse-mavenarchiver/org.sonatype.m2e.mavenarchiver.tests/target/classes
[INFO] 
[INFO] --- maven-resources-plugin:2.6:testResources (default-testResources) @ org.sonatype.m2e.mavenarchiver.tests ---
[INFO] Using 'UTF-8' encoding to copy filtered resources.
[INFO] skip non existing resourceDirectory /home/jenkins/agent/workspace/m2eclipse-mavenarchiver/org.sonatype.m2e.mavenarchiver.tests/src/test/resources
[INFO] 
[INFO] --- target-platform-configuration:1.6.0:target-platform (default-target-platform) @ org.sonatype.m2e.mavenarchiver.tests ---
[INFO] 
[INFO] --- tycho-packaging-plugin:1.6.0:package-plugin (default-package-plugin) @ org.sonatype.m2e.mavenarchiver.tests ---
[INFO] Building jar: /home/jenkins/agent/workspace/m2eclipse-mavenarchiver/org.sonatype.m2e.mavenarchiver.tests/target/org.sonatype.m2e.mavenarchiver.tests-0.17.5-SNAPSHOT.jar
[INFO] 
[INFO] --- tycho-p2-plugin:1.6.0:p2-metadata-default (default-p2-metadata-default) @ org.sonatype.m2e.mavenarchiver.tests ---
[INFO] 
[INFO] --- tycho-surefire-plugin:1.6.0:test (default-test) @ org.sonatype.m2e.mavenarchiver.tests ---
[INFO] Expected eclipse log file: /home/jenkins/agent/workspace/m2eclipse-mavenarchiver/org.sonatype.m2e.mavenarchiver.tests/target/work/data/.metadata/.log
[INFO] Command line:
	[/opt/tools/java/oracle/jdk-8/1.8.0_202/jre/bin/java, -Dosgi.noShutdown=false, -Dosgi.os=linux, -Dosgi.ws=gtk, -Dosgi.arch=x86_64, -Xmx512m, -XX:MaxPermSize=256m, -Dosgi.clean=true, -jar, /home/jenkins/agent/workspace/m2eclipse-mavenarchiver/.repository/p2/osgi/bundle/org.eclipse.equinox.launcher/1.5.600.v20191014-2022/org.eclipse.equinox.launcher-1.5.600.v20191014-2022.jar, -data, /home/jenkins/agent/workspace/m2eclipse-mavenarchiver/org.sonatype.m2e.mavenarchiver.tests/target/work/data, -install, /home/jenkins/agent/workspace/m2eclipse-mavenarchiver/org.sonatype.m2e.mavenarchiver.tests/target/work, -configuration, /home/jenkins/agent/workspace/m2eclipse-mavenarchiver/org.sonatype.m2e.mavenarchiver.tests/target/work/configuration, -application, org.eclipse.tycho.surefire.osgibooter.uitest, -testproperties, /home/jenkins/agent/workspace/m2eclipse-mavenarchiver/org.sonatype.m2e.mavenarchiver.tests/target/surefire.properties, -timeout, 600000]
Picked up JAVA_TOOL_OPTIONS: -XX:+IgnoreUnrecognizedVMOptions -XX:+UseContainerSupport -XX:+UnlockExperimentalVMOptions -XX:+UseCGroupMemoryLimitForHeap
Java HotSpot(TM) 64-Bit Server VM warning: ignoring option MaxPermSize=256m; support was removed in 8.0
Picked up _JAVA_OPTIONS: -XX:MaxRAMPercentage=64.0
An error has occurred. See the log file
/home/jenkins/agent/workspace/m2eclipse-mavenarchiver/org.sonatype.m2e.mavenarchiver.tests/target/work/data/.metadata/.log.
[INFO] ------------------------------------------------------------------------
[INFO] Reactor Summary for M2E Maven Archiver Connector 0.17.5-SNAPSHOT:
[INFO] 
[INFO] M2E Maven Archiver Connector ....................... SUCCESS [  0.846 s]
[INFO] org.sonatype.m2e.mavenarchiver ..................... SUCCESS [  1.857 s]
[INFO] org.sonatype.m2e.mavenarchiver.feature ............. SUCCESS [  0.136 s]
[INFO] org.sonatype.m2e.mavenarchiver.tests ............... FAILURE [  2.248 s]
[INFO] org.sonatype.m2e.mavenarchiver.repository .......... SKIPPED
[INFO] ------------------------------------------------------------------------
[INFO] BUILD FAILURE
[INFO] ------------------------------------------------------------------------
[INFO] Total time:  52.432 s
[INFO] Finished at: 2020-02-18T18:34:00Z
[INFO] ------------------------------------------------------------------------
[WARNING] The requested profile "eclipse-sign" could not be activated because it does not exist.
[ERROR] Failed to execute goal org.eclipse.tycho:tycho-surefire-plugin:1.6.0:test (default-test) on project org.sonatype.m2e.mavenarchiver.tests: An unexpected error occurred while launching the test runtime (return code 13). See log /home/jenkins/agent/workspace/m2eclipse-mavenarchiver/org.sonatype.m2e.mavenarchiver.tests/target/work/data/.metadata/.log for details. -> [Help 1]
[ERROR] 
[ERROR] To see the full stack trace of the errors, re-run Maven with the -e switch.
[ERROR] Re-run Maven using the -X switch to enable full debug logging.
[ERROR] 
[ERROR] For more information about the errors and possible solutions, please read the following articles:
[ERROR] [Help 1] http://cwiki.apache.org/confluence/display/MAVEN/MojoFailureException
[ERROR] 
[ERROR] After correcting the problems, you can resume the build with the command
[ERROR]   mvn <args> -rf :org.sonatype.m2e.mavenarchiver.tests
Build step 'Invoke top-level Maven targets' marked build as failure
$ ssh-agent -k
unset SSH_AUTH_SOCK;
unset SSH_AGENT_PID;
echo Agent pid 50 killed;
[ssh-agent] Stopped.
Sending e-mails to: fbricon@gmail.com
Archiving artifacts
Finished: FAILURE