SuccessConsole Output

Skipping 438 KB.. Full Log
@ org.eclipse.m2e.importer.tests ---
[INFO] Building jar: /home/jenkins/agent/workspace/m2e_master/org.eclipse.m2e.importer.tests/target/org.eclipse.m2e.importer.tests-1.16.0-SNAPSHOT.jar
[INFO] 
[INFO] --- tycho-p2-plugin:2.3.0-SNAPSHOT:p2-metadata-default (default-p2-metadata-default) @ org.eclipse.m2e.importer.tests ---
[INFO] 
[INFO] --- tycho-pack200a-plugin:2.3.0-SNAPSHOT:normalize (pack200-normalize) @ org.eclipse.m2e.importer.tests ---
[INFO] Pack200 normalizing jar /home/jenkins/agent/workspace/m2e_master/org.eclipse.m2e.importer.tests/target/org.eclipse.m2e.importer.tests-1.16.0-SNAPSHOT.jar
[INFO] 
[INFO] --- eclipse-jarsigner-plugin:1.1.7:sign (sign) @ org.eclipse.m2e.importer.tests ---
[INFO] Signing of nested jars of '/home/jenkins/agent/workspace/m2e_master/org.eclipse.m2e.importer.tests/target/org.eclipse.m2e.importer.tests-1.16.0-SNAPSHOT.jar' is disabled.
[INFO] Signing jar: /home/jenkins/agent/workspace/m2e_master/org.eclipse.m2e.importer.tests/target/org.eclipse.m2e.importer.tests-1.16.0-SNAPSHOT.jar
[INFO] Signing of nested jars of '/home/jenkins/agent/workspace/m2e_master/org.eclipse.m2e.importer.tests/target/org.eclipse.m2e.importer.tests-1.16.0-SNAPSHOT-sources.jar' is disabled.
[INFO] Signing jar: /home/jenkins/agent/workspace/m2e_master/org.eclipse.m2e.importer.tests/target/org.eclipse.m2e.importer.tests-1.16.0-SNAPSHOT-sources.jar
[INFO] 
[INFO] --- tycho-pack200b-plugin:2.3.0-SNAPSHOT:pack (pack200-pack) @ org.eclipse.m2e.importer.tests ---
[INFO] Pack200 packing jar /home/jenkins/agent/workspace/m2e_master/org.eclipse.m2e.importer.tests/target/org.eclipse.m2e.importer.tests-1.16.0-SNAPSHOT.jar
[INFO] 
[INFO] --- tycho-p2-plugin:2.3.0-SNAPSHOT:p2-metadata (p2-metadata) @ org.eclipse.m2e.importer.tests ---
[INFO] No baseline version MavenProject: org.eclipse.m2e:org.eclipse.m2e.importer.tests:1.16.0-SNAPSHOT @ /home/jenkins/agent/workspace/m2e_master/org.eclipse.m2e.importer.tests/pom.xml
[INFO] 
[INFO] --- tycho-surefire-plugin:2.3.0-SNAPSHOT:test (default-test) @ org.eclipse.m2e.importer.tests ---
[INFO] Executing Test Runtime with timeout 7200, logs (if any) will be placed at: /home/jenkins/agent/workspace/m2e_master/org.eclipse.m2e.importer.tests/target/work/data/.metadata/.log
[INFO] Command line:
	[/opt/tools/java/openjdk/jdk-11/11.0.2+9/bin/java, -Dosgi.noShutdown=false, -Dosgi.os=linux, -Dosgi.ws=gtk, -Dosgi.arch=x86_64, -javaagent:/home/jenkins/agent/workspace/m2e_master/.m2/repository/org/jacoco/org.jacoco.agent/0.8.5/org.jacoco.agent-0.8.5-runtime.jar=destfile=/home/jenkins/agent/workspace/m2e_master/target/jacoco.exec,append=true,includes=org.eclipse.m2e*:org.apache.maven*:org.eclipse.aether*, -Xmx800m, -Dosgi.clean=true, -jar, /home/jenkins/agent/workspace/m2e_master/.m2/repository/p2/osgi/bundle/org.eclipse.equinox.launcher/1.6.0.v20200915-1508/org.eclipse.equinox.launcher-1.6.0.v20200915-1508.jar, -data, /home/jenkins/agent/workspace/m2e_master/org.eclipse.m2e.importer.tests/target/work/data, -install, /home/jenkins/agent/workspace/m2e_master/org.eclipse.m2e.importer.tests/target/work, -configuration, /home/jenkins/agent/workspace/m2e_master/org.eclipse.m2e.importer.tests/target/work/configuration, -application, org.eclipse.tycho.surefire.osgibooter.uitest, -testproperties, /home/jenkins/agent/workspace/m2e_master/org.eclipse.m2e.importer.tests/target/surefire.properties, -nouithread, -timeout, 7200000]

(process:1921): Gtk-WARNING **: 18:45:37.331: Locale not supported by C library.
	Using the fallback 'C' locale.
SWT SessionManagerDBus: Failed to connect to org.gnome.SessionManager: Failed to execute child process ?dbus-launch? (No such file or directory)
SWT SessionManagerDBus: Failed to connect to org.xfce.SessionManager: Failed to execute child process ?dbus-launch? (No such file or directory)
Running org.eclipse.m2e.importer.tests.MavenImporterTest
SLF4J: Failed to load class "org.slf4j.impl.StaticLoggerBinder".
SLF4J: Defaulting to no-operation (NOP) logger implementation
SLF4J: See http://www.slf4j.org/codes.html#StaticLoggerBinder for further details.
SLF4J: Failed to load class "org.slf4j.impl.StaticLoggerBinder".
SLF4J: Defaulting to no-operation (NOP) logger implementation
SLF4J: See http://www.slf4j.org/codes.html#StaticLoggerBinder for further details.
Tests run: 2, Failures: 0, Errors: 0, Skipped: 0, Time elapsed: 7.821 s - in org.eclipse.m2e.importer.tests.MavenImporterTest
testRootWithoutPom(org.eclipse.m2e.importer.tests.MavenImporterTest)  Time elapsed: 5.773 s
test(org.eclipse.m2e.importer.tests.MavenImporterTest)  Time elapsed: 1.583 s

Results:

Tests run: 2, Failures: 0, Errors: 0, Skipped: 0

[INFO] All tests passed!
[INFO] 
[INFO] --- tycho-p2-extras-plugin:2.3.0-SNAPSHOT:compare-version-with-baselines (check-no-version-regression) @ org.eclipse.m2e.importer.tests ---
[INFO] 
[INFO] --------< org.eclipse.m2e:org.eclipse.m2e.binaryproject.tests >---------
[INFO] Building org.eclipse.m2e.binaryproject.tests 1.16.0-SNAPSHOT     [36/43]
[INFO] ------------------------[ eclipse-test-plugin ]-------------------------
[INFO] 
[INFO] --- maven-clean-plugin:2.4.1:clean (default-clean) @ org.eclipse.m2e.binaryproject.tests ---
[INFO] 
[INFO] --- tycho-packaging-plugin:2.3.0-SNAPSHOT:build-qualifier (default-build-qualifier) @ org.eclipse.m2e.binaryproject.tests ---
[INFO] The project's OSGi version is 1.16.0.20210115-1536
[INFO] 
[INFO] --- tycho-packaging-plugin:2.3.0-SNAPSHOT:validate-id (default-validate-id) @ org.eclipse.m2e.binaryproject.tests ---
[INFO] 
[INFO] --- tycho-packaging-plugin:2.3.0-SNAPSHOT:validate-version (default-validate-version) @ org.eclipse.m2e.binaryproject.tests ---
[INFO] 
[INFO] --- jacoco-maven-plugin:0.8.5:prepare-agent (default) @ org.eclipse.m2e.binaryproject.tests ---
[INFO] tycho.testArgLine set to -javaagent:/home/jenkins/agent/workspace/m2e_master/.m2/repository/org/jacoco/org.jacoco.agent/0.8.5/org.jacoco.agent-0.8.5-runtime.jar=destfile=/home/jenkins/agent/workspace/m2e_master/target/jacoco.exec,append=true,includes=org.eclipse.m2e*:org.apache.maven*:org.eclipse.aether* -Xmx800m
[INFO] 
[INFO] --- maven-resources-plugin:2.5:resources (default-resources) @ org.eclipse.m2e.binaryproject.tests ---
[debug] execute contextualize
[INFO] Using 'UTF-8' encoding to copy filtered resources.
[INFO] skip non existing resourceDirectory /home/jenkins/agent/workspace/m2e_master/org.eclipse.m2e.binaryproject.tests/src/main/resources
[INFO] 
[INFO] --- tycho-compiler-plugin:2.3.0-SNAPSHOT:compile (default-compile) @ org.eclipse.m2e.binaryproject.tests ---
[WARNING] Parameter 'useProjectSettings' is set to true, but preferences file '/home/jenkins/agent/workspace/m2e_master/org.eclipse.m2e.binaryproject.tests/.settings/org.eclipse.jdt.core.prefs' could not be found!
[INFO] Compiling 1 source file to /home/jenkins/agent/workspace/m2e_master/org.eclipse.m2e.binaryproject.tests/target/classes
[INFO] 
[INFO] --- maven-resources-plugin:2.5:testResources (default-testResources) @ org.eclipse.m2e.binaryproject.tests ---
[debug] execute contextualize
[INFO] Using 'UTF-8' encoding to copy filtered resources.
[INFO] skip non existing resourceDirectory /home/jenkins/agent/workspace/m2e_master/org.eclipse.m2e.binaryproject.tests/src/test/resources
[INFO] 
[INFO] --- tycho-source-plugin:2.3.0-SNAPSHOT:plugin-source (plugin-source) @ org.eclipse.m2e.binaryproject.tests ---
[WARNING] Bundle-Name header not found in /home/jenkins/agent/workspace/m2e_master/org.eclipse.m2e.binaryproject.tests/META-INF/MANIFEST.MF, fallback to Bundle-SymbolicName for source bundle
[WARNING] Bundle-Vendor header not found in /home/jenkins/agent/workspace/m2e_master/org.eclipse.m2e.binaryproject.tests/META-INF/MANIFEST.MF, fallback to 'unknown' for source bundle
[INFO] Building jar: /home/jenkins/agent/workspace/m2e_master/org.eclipse.m2e.binaryproject.tests/target/org.eclipse.m2e.binaryproject.tests-1.16.0-SNAPSHOT-sources.jar
[INFO] 
[INFO] --- target-platform-configuration:2.3.0-SNAPSHOT:target-platform (default-target-platform) @ org.eclipse.m2e.binaryproject.tests ---
[INFO] 
[INFO] --- tycho-packaging-plugin:2.3.0-SNAPSHOT:package-plugin (default-package-plugin) @ org.eclipse.m2e.binaryproject.tests ---
[INFO] Building jar: /home/jenkins/agent/workspace/m2e_master/org.eclipse.m2e.binaryproject.tests/target/org.eclipse.m2e.binaryproject.tests-1.16.0-SNAPSHOT.jar
[INFO] 
[INFO] --- tycho-p2-plugin:2.3.0-SNAPSHOT:p2-metadata-default (default-p2-metadata-default) @ org.eclipse.m2e.binaryproject.tests ---
[INFO] 
[INFO] --- tycho-pack200a-plugin:2.3.0-SNAPSHOT:normalize (pack200-normalize) @ org.eclipse.m2e.binaryproject.tests ---
[INFO] Pack200 normalizing jar /home/jenkins/agent/workspace/m2e_master/org.eclipse.m2e.binaryproject.tests/target/org.eclipse.m2e.binaryproject.tests-1.16.0-SNAPSHOT.jar
[INFO] 
[INFO] --- eclipse-jarsigner-plugin:1.1.7:sign (sign) @ org.eclipse.m2e.binaryproject.tests ---
[INFO] Signing of nested jars of '/home/jenkins/agent/workspace/m2e_master/org.eclipse.m2e.binaryproject.tests/target/org.eclipse.m2e.binaryproject.tests-1.16.0-SNAPSHOT.jar' is disabled.
[INFO] Signing jar: /home/jenkins/agent/workspace/m2e_master/org.eclipse.m2e.binaryproject.tests/target/org.eclipse.m2e.binaryproject.tests-1.16.0-SNAPSHOT.jar
[INFO] Signing of nested jars of '/home/jenkins/agent/workspace/m2e_master/org.eclipse.m2e.binaryproject.tests/target/org.eclipse.m2e.binaryproject.tests-1.16.0-SNAPSHOT-sources.jar' is disabled.
[INFO] Signing jar: /home/jenkins/agent/workspace/m2e_master/org.eclipse.m2e.binaryproject.tests/target/org.eclipse.m2e.binaryproject.tests-1.16.0-SNAPSHOT-sources.jar
[INFO] 
[INFO] --- tycho-pack200b-plugin:2.3.0-SNAPSHOT:pack (pack200-pack) @ org.eclipse.m2e.binaryproject.tests ---
[INFO] Pack200 packing jar /home/jenkins/agent/workspace/m2e_master/org.eclipse.m2e.binaryproject.tests/target/org.eclipse.m2e.binaryproject.tests-1.16.0-SNAPSHOT.jar
[INFO] 
[INFO] --- tycho-p2-plugin:2.3.0-SNAPSHOT:p2-metadata (p2-metadata) @ org.eclipse.m2e.binaryproject.tests ---
[INFO] No baseline version MavenProject: org.eclipse.m2e:org.eclipse.m2e.binaryproject.tests:1.16.0-SNAPSHOT @ /home/jenkins/agent/workspace/m2e_master/org.eclipse.m2e.binaryproject.tests/pom.xml
[INFO] 
[INFO] --- tycho-surefire-plugin:2.3.0-SNAPSHOT:test (default-test) @ org.eclipse.m2e.binaryproject.tests ---
[INFO] Executing Test Runtime with timeout 7200, logs (if any) will be placed at: /home/jenkins/agent/workspace/m2e_master/org.eclipse.m2e.binaryproject.tests/target/work/data/.metadata/.log
[INFO] Command line:
	[/opt/tools/java/openjdk/jdk-11/11.0.2+9/bin/java, -Dosgi.noShutdown=false, -Dosgi.os=linux, -Dosgi.ws=gtk, -Dosgi.arch=x86_64, -javaagent:/home/jenkins/agent/workspace/m2e_master/.m2/repository/org/jacoco/org.jacoco.agent/0.8.5/org.jacoco.agent-0.8.5-runtime.jar=destfile=/home/jenkins/agent/workspace/m2e_master/target/jacoco.exec,append=true,includes=org.eclipse.m2e*:org.apache.maven*:org.eclipse.aether*, -Xmx800m, -Dosgi.clean=true, -jar, /home/jenkins/agent/workspace/m2e_master/.m2/repository/p2/osgi/bundle/org.eclipse.equinox.launcher/1.6.0.v20200915-1508/org.eclipse.equinox.launcher-1.6.0.v20200915-1508.jar, -data, /home/jenkins/agent/workspace/m2e_master/org.eclipse.m2e.binaryproject.tests/target/work/data, -install, /home/jenkins/agent/workspace/m2e_master/org.eclipse.m2e.binaryproject.tests/target/work, -configuration, /home/jenkins/agent/workspace/m2e_master/org.eclipse.m2e.binaryproject.tests/target/work/configuration, -application, org.eclipse.tycho.surefire.osgibooter.uitest, -testproperties, /home/jenkins/agent/workspace/m2e_master/org.eclipse.m2e.binaryproject.tests/target/surefire.properties, -timeout, 7200000]

(process:2073): Gtk-WARNING **: 18:45:59.512: Locale not supported by C library.
	Using the fallback 'C' locale.
SWT SessionManagerDBus: Failed to connect to org.gnome.SessionManager: Failed to execute child process ?dbus-launch? (No such file or directory)
SWT SessionManagerDBus: Failed to connect to org.xfce.SessionManager: Failed to execute child process ?dbus-launch? (No such file or directory)
Running org.eclipse.m2e.binaryproject.tests.BinaryProjectTest
SLF4J: Failed to load class "org.slf4j.impl.StaticLoggerBinder".
SLF4J: Defaulting to no-operation (NOP) logger implementation
SLF4J: See http://www.slf4j.org/codes.html#StaticLoggerBinder for further details.
SLF4J: Failed to load class "org.slf4j.impl.StaticLoggerBinder".
SLF4J: Defaulting to no-operation (NOP) logger implementation
SLF4J: See http://www.slf4j.org/codes.html#StaticLoggerBinder for further details.
Tests run: 1, Failures: 0, Errors: 0, Skipped: 0, Time elapsed: 19.458 s - in org.eclipse.m2e.binaryproject.tests.BinaryProjectTest
testBasic(org.eclipse.m2e.binaryproject.tests.BinaryProjectTest)  Time elapsed: 19.24 s

Results:

Tests run: 1, Failures: 0, Errors: 0, Skipped: 0

[INFO] All tests passed!
[INFO] 
[INFO] --- tycho-p2-extras-plugin:2.3.0-SNAPSHOT:compare-version-with-baselines (check-no-version-regression) @ org.eclipse.m2e.binaryproject.tests ---
[INFO] 
[INFO] --------< org.eclipse.m2e:org.eclipse.m2e.editor.lemminx.tests >--------
[INFO] Building org.eclipse.m2e.editor.lemminx.tests 1.16.0-SNAPSHOT    [37/43]
[INFO] ------------------------[ eclipse-test-plugin ]-------------------------
[INFO] 
[INFO] --- maven-clean-plugin:2.4.1:clean (default-clean) @ org.eclipse.m2e.editor.lemminx.tests ---
[INFO] 
[INFO] --- tycho-packaging-plugin:2.3.0-SNAPSHOT:build-qualifier (default-build-qualifier) @ org.eclipse.m2e.editor.lemminx.tests ---
[INFO] The project's OSGi version is 1.16.0.20210115-1536
[INFO] 
[INFO] --- tycho-packaging-plugin:2.3.0-SNAPSHOT:validate-id (default-validate-id) @ org.eclipse.m2e.editor.lemminx.tests ---
[INFO] 
[INFO] --- tycho-packaging-plugin:2.3.0-SNAPSHOT:validate-version (default-validate-version) @ org.eclipse.m2e.editor.lemminx.tests ---
[INFO] 
[INFO] --- jacoco-maven-plugin:0.8.5:prepare-agent (default) @ org.eclipse.m2e.editor.lemminx.tests ---
[INFO] tycho.testArgLine set to -javaagent:/home/jenkins/agent/workspace/m2e_master/.m2/repository/org/jacoco/org.jacoco.agent/0.8.5/org.jacoco.agent-0.8.5-runtime.jar=destfile=/home/jenkins/agent/workspace/m2e_master/target/jacoco.exec,append=true,includes=org.eclipse.m2e*:org.apache.maven*:org.eclipse.aether* -Xmx800m
[INFO] 
[INFO] --- maven-resources-plugin:2.5:resources (default-resources) @ org.eclipse.m2e.editor.lemminx.tests ---
[debug] execute contextualize
[INFO] Using 'UTF-8' encoding to copy filtered resources.
[INFO] skip non existing resourceDirectory /home/jenkins/agent/workspace/m2e_master/org.eclipse.m2e.editor.lemminx.tests/src/main/resources
[INFO] 
[INFO] --- tycho-compiler-plugin:2.3.0-SNAPSHOT:compile (default-compile) @ org.eclipse.m2e.editor.lemminx.tests ---
[WARNING] Parameter 'useProjectSettings' is set to true, but preferences file '/home/jenkins/agent/workspace/m2e_master/org.eclipse.m2e.editor.lemminx.tests/.settings/org.eclipse.jdt.core.prefs' could not be found!
[INFO] Compiling 1 source file to /home/jenkins/agent/workspace/m2e_master/org.eclipse.m2e.editor.lemminx.tests/target/classes
[INFO] 
[INFO] --- maven-resources-plugin:2.5:testResources (default-testResources) @ org.eclipse.m2e.editor.lemminx.tests ---
[debug] execute contextualize
[INFO] Using 'UTF-8' encoding to copy filtered resources.
[INFO] skip non existing resourceDirectory /home/jenkins/agent/workspace/m2e_master/org.eclipse.m2e.editor.lemminx.tests/src/test/resources
[INFO] 
[INFO] --- tycho-source-plugin:2.3.0-SNAPSHOT:plugin-source (plugin-source) @ org.eclipse.m2e.editor.lemminx.tests ---
[INFO] Building jar: /home/jenkins/agent/workspace/m2e_master/org.eclipse.m2e.editor.lemminx.tests/target/org.eclipse.m2e.editor.lemminx.tests-1.16.0-SNAPSHOT-sources.jar
[INFO] 
[INFO] --- target-platform-configuration:2.3.0-SNAPSHOT:target-platform (default-target-platform) @ org.eclipse.m2e.editor.lemminx.tests ---
[INFO] 
[INFO] --- tycho-packaging-plugin:2.3.0-SNAPSHOT:package-plugin (default-package-plugin) @ org.eclipse.m2e.editor.lemminx.tests ---
[INFO] Building jar: /home/jenkins/agent/workspace/m2e_master/org.eclipse.m2e.editor.lemminx.tests/target/org.eclipse.m2e.editor.lemminx.tests-1.16.0-SNAPSHOT.jar
[INFO] 
[INFO] --- tycho-p2-plugin:2.3.0-SNAPSHOT:p2-metadata-default (default-p2-metadata-default) @ org.eclipse.m2e.editor.lemminx.tests ---
[INFO] 
[INFO] --- tycho-pack200a-plugin:2.3.0-SNAPSHOT:normalize (pack200-normalize) @ org.eclipse.m2e.editor.lemminx.tests ---
[INFO] Pack200 normalizing jar /home/jenkins/agent/workspace/m2e_master/org.eclipse.m2e.editor.lemminx.tests/target/org.eclipse.m2e.editor.lemminx.tests-1.16.0-SNAPSHOT.jar
[INFO] 
[INFO] --- eclipse-jarsigner-plugin:1.1.7:sign (sign) @ org.eclipse.m2e.editor.lemminx.tests ---
[INFO] Signing of nested jars of '/home/jenkins/agent/workspace/m2e_master/org.eclipse.m2e.editor.lemminx.tests/target/org.eclipse.m2e.editor.lemminx.tests-1.16.0-SNAPSHOT.jar' is disabled.
[INFO] Signing jar: /home/jenkins/agent/workspace/m2e_master/org.eclipse.m2e.editor.lemminx.tests/target/org.eclipse.m2e.editor.lemminx.tests-1.16.0-SNAPSHOT.jar
[INFO] Signing of nested jars of '/home/jenkins/agent/workspace/m2e_master/org.eclipse.m2e.editor.lemminx.tests/target/org.eclipse.m2e.editor.lemminx.tests-1.16.0-SNAPSHOT-sources.jar' is disabled.
[INFO] Signing jar: /home/jenkins/agent/workspace/m2e_master/org.eclipse.m2e.editor.lemminx.tests/target/org.eclipse.m2e.editor.lemminx.tests-1.16.0-SNAPSHOT-sources.jar
[INFO] 
[INFO] --- tycho-pack200b-plugin:2.3.0-SNAPSHOT:pack (pack200-pack) @ org.eclipse.m2e.editor.lemminx.tests ---
[INFO] Pack200 packing jar /home/jenkins/agent/workspace/m2e_master/org.eclipse.m2e.editor.lemminx.tests/target/org.eclipse.m2e.editor.lemminx.tests-1.16.0-SNAPSHOT.jar
[INFO] 
[INFO] --- tycho-p2-plugin:2.3.0-SNAPSHOT:p2-metadata (p2-metadata) @ org.eclipse.m2e.editor.lemminx.tests ---
[INFO] No baseline version MavenProject: org.eclipse.m2e:org.eclipse.m2e.editor.lemminx.tests:1.16.0-SNAPSHOT @ /home/jenkins/agent/workspace/m2e_master/org.eclipse.m2e.editor.lemminx.tests/pom.xml
[INFO] 
[INFO] --- tycho-surefire-plugin:2.3.0-SNAPSHOT:test (default-test) @ org.eclipse.m2e.editor.lemminx.tests ---
[INFO] Executing Test Runtime with timeout 7200, logs (if any) will be placed at: /home/jenkins/agent/workspace/m2e_master/org.eclipse.m2e.editor.lemminx.tests/target/work/data/.metadata/.log
[INFO] Command line:
	[/opt/tools/java/openjdk/jdk-11/11.0.2+9/bin/java, -Dosgi.noShutdown=false, -Dosgi.os=linux, -Dosgi.ws=gtk, -Dosgi.arch=x86_64, -javaagent:/home/jenkins/agent/workspace/m2e_master/.m2/repository/org/jacoco/org.jacoco.agent/0.8.5/org.jacoco.agent-0.8.5-runtime.jar=destfile=/home/jenkins/agent/workspace/m2e_master/target/jacoco.exec,append=true,includes=org.eclipse.m2e*:org.apache.maven*:org.eclipse.aether*, -Xmx800m, -Dosgi.clean=true, -jar, /home/jenkins/agent/workspace/m2e_master/.m2/repository/p2/osgi/bundle/org.eclipse.equinox.launcher/1.6.0.v20200915-1508/org.eclipse.equinox.launcher-1.6.0.v20200915-1508.jar, -data, /home/jenkins/agent/workspace/m2e_master/org.eclipse.m2e.editor.lemminx.tests/target/work/data, -install, /home/jenkins/agent/workspace/m2e_master/org.eclipse.m2e.editor.lemminx.tests/target/work, -configuration, /home/jenkins/agent/workspace/m2e_master/org.eclipse.m2e.editor.lemminx.tests/target/work/configuration, -application, org.eclipse.tycho.surefire.osgibooter.uitest, -testproperties, /home/jenkins/agent/workspace/m2e_master/org.eclipse.m2e.editor.lemminx.tests/target/surefire.properties, -timeout, 7200000]

(process:2215): Gtk-WARNING **: 18:46:29.345: Locale not supported by C library.
	Using the fallback 'C' locale.
SWT SessionManagerDBus: Failed to connect to org.gnome.SessionManager: Failed to execute child process ?dbus-launch? (No such file or directory)
SWT SessionManagerDBus: Failed to connect to org.xfce.SessionManager: Failed to execute child process ?dbus-launch? (No such file or directory)
Running org.eclipse.m2e.editor.lemminx.tests.EditorTest
SLF4J: Failed to load class "org.slf4j.impl.StaticLoggerBinder".
SLF4J: Defaulting to no-operation (NOP) logger implementation
SLF4J: See http://www.slf4j.org/codes.html#StaticLoggerBinder for further details.
Warning: NLS missing message: MavenImpl_error_lookup in: org.eclipse.m2e.editor.internal.messages
Tests run: 2, Failures: 0, Errors: 0, Skipped: 0, Time elapsed: 7.282 s - in org.eclipse.m2e.editor.lemminx.tests.EditorTest
testEditorOpenOnSourcePage(org.eclipse.m2e.editor.lemminx.tests.EditorTest)  Time elapsed: 2.876 s
testGenericEditorHasMavenExtensionEnabled(org.eclipse.m2e.editor.lemminx.tests.EditorTest)  Time elapsed: 4.387 s

Results:

Tests run: 2, Failures: 0, Errors: 0, Skipped: 0

[INFO] All tests passed!
[INFO] 
[INFO] --- tycho-p2-extras-plugin:2.3.0-SNAPSHOT:compare-version-with-baselines (check-no-version-regression) @ org.eclipse.m2e.editor.lemminx.tests ---
[INFO] 
[INFO] -------------< org.eclipse.m2e:org.eclipse.m2e.jdt.tests >--------------
[INFO] Building org.eclipse.m2e.jdt.tests 1.16.0-SNAPSHOT               [38/43]
[INFO] ------------------------[ eclipse-test-plugin ]-------------------------
[INFO] 
[INFO] --- maven-clean-plugin:2.4.1:clean (default-clean) @ org.eclipse.m2e.jdt.tests ---
[INFO] 
[INFO] --- tycho-packaging-plugin:2.3.0-SNAPSHOT:build-qualifier (default-build-qualifier) @ org.eclipse.m2e.jdt.tests ---
[INFO] The project's OSGi version is 1.16.0.20210115-1536
[INFO] 
[INFO] --- tycho-packaging-plugin:2.3.0-SNAPSHOT:validate-id (default-validate-id) @ org.eclipse.m2e.jdt.tests ---
[INFO] 
[INFO] --- tycho-packaging-plugin:2.3.0-SNAPSHOT:validate-version (default-validate-version) @ org.eclipse.m2e.jdt.tests ---
[INFO] 
[INFO] --- jacoco-maven-plugin:0.8.5:prepare-agent (default) @ org.eclipse.m2e.jdt.tests ---
[INFO] tycho.testArgLine set to -javaagent:/home/jenkins/agent/workspace/m2e_master/.m2/repository/org/jacoco/org.jacoco.agent/0.8.5/org.jacoco.agent-0.8.5-runtime.jar=destfile=/home/jenkins/agent/workspace/m2e_master/target/jacoco.exec,append=true,includes=org.eclipse.m2e*:org.apache.maven*:org.eclipse.aether* -Xmx800m
[INFO] 
[INFO] --- maven-resources-plugin:2.5:resources (default-resources) @ org.eclipse.m2e.jdt.tests ---
[debug] execute contextualize
[INFO] Using 'UTF-8' encoding to copy filtered resources.
[INFO] skip non existing resourceDirectory /home/jenkins/agent/workspace/m2e_master/org.eclipse.m2e.jdt.tests/src/main/resources
[INFO] 
[INFO] --- tycho-compiler-plugin:2.3.0-SNAPSHOT:compile (default-compile) @ org.eclipse.m2e.jdt.tests ---
[WARNING] Parameter 'useProjectSettings' is set to true, but preferences file '/home/jenkins/agent/workspace/m2e_master/org.eclipse.m2e.jdt.tests/.settings/org.eclipse.jdt.core.prefs' could not be found!
[INFO] Compiling 1 source file to /home/jenkins/agent/workspace/m2e_master/org.eclipse.m2e.jdt.tests/target/classes
[INFO] 
[INFO] --- maven-resources-plugin:2.5:testResources (default-testResources) @ org.eclipse.m2e.jdt.tests ---
[debug] execute contextualize
[INFO] Using 'UTF-8' encoding to copy filtered resources.
[INFO] skip non existing resourceDirectory /home/jenkins/agent/workspace/m2e_master/org.eclipse.m2e.jdt.tests/src/test/resources
[INFO] 
[INFO] --- tycho-source-plugin:2.3.0-SNAPSHOT:plugin-source (plugin-source) @ org.eclipse.m2e.jdt.tests ---
[WARNING] Bundle-Name header not found in /home/jenkins/agent/workspace/m2e_master/org.eclipse.m2e.jdt.tests/META-INF/MANIFEST.MF, fallback to Bundle-SymbolicName for source bundle
[WARNING] Bundle-Vendor header not found in /home/jenkins/agent/workspace/m2e_master/org.eclipse.m2e.jdt.tests/META-INF/MANIFEST.MF, fallback to 'unknown' for source bundle
[INFO] Building jar: /home/jenkins/agent/workspace/m2e_master/org.eclipse.m2e.jdt.tests/target/org.eclipse.m2e.jdt.tests-1.16.0-SNAPSHOT-sources.jar
[INFO] 
[INFO] --- target-platform-configuration:2.3.0-SNAPSHOT:target-platform (default-target-platform) @ org.eclipse.m2e.jdt.tests ---
[INFO] 
[INFO] --- tycho-packaging-plugin:2.3.0-SNAPSHOT:package-plugin (default-package-plugin) @ org.eclipse.m2e.jdt.tests ---
[INFO] Building jar: /home/jenkins/agent/workspace/m2e_master/org.eclipse.m2e.jdt.tests/target/org.eclipse.m2e.jdt.tests-1.16.0-SNAPSHOT.jar
[INFO] 
[INFO] --- tycho-p2-plugin:2.3.0-SNAPSHOT:p2-metadata-default (default-p2-metadata-default) @ org.eclipse.m2e.jdt.tests ---
[INFO] 
[INFO] --- tycho-pack200a-plugin:2.3.0-SNAPSHOT:normalize (pack200-normalize) @ org.eclipse.m2e.jdt.tests ---
[INFO] Pack200 normalizing jar /home/jenkins/agent/workspace/m2e_master/org.eclipse.m2e.jdt.tests/target/org.eclipse.m2e.jdt.tests-1.16.0-SNAPSHOT.jar
[INFO] 
[INFO] --- eclipse-jarsigner-plugin:1.1.7:sign (sign) @ org.eclipse.m2e.jdt.tests ---
[INFO] Signing of nested jars of '/home/jenkins/agent/workspace/m2e_master/org.eclipse.m2e.jdt.tests/target/org.eclipse.m2e.jdt.tests-1.16.0-SNAPSHOT.jar' is disabled.
[INFO] Signing jar: /home/jenkins/agent/workspace/m2e_master/org.eclipse.m2e.jdt.tests/target/org.eclipse.m2e.jdt.tests-1.16.0-SNAPSHOT.jar
[INFO] Signing of nested jars of '/home/jenkins/agent/workspace/m2e_master/org.eclipse.m2e.jdt.tests/target/org.eclipse.m2e.jdt.tests-1.16.0-SNAPSHOT-sources.jar' is disabled.
[INFO] Signing jar: /home/jenkins/agent/workspace/m2e_master/org.eclipse.m2e.jdt.tests/target/org.eclipse.m2e.jdt.tests-1.16.0-SNAPSHOT-sources.jar
[INFO] 
[INFO] --- tycho-pack200b-plugin:2.3.0-SNAPSHOT:pack (pack200-pack) @ org.eclipse.m2e.jdt.tests ---
[INFO] Pack200 packing jar /home/jenkins/agent/workspace/m2e_master/org.eclipse.m2e.jdt.tests/target/org.eclipse.m2e.jdt.tests-1.16.0-SNAPSHOT.jar
[INFO] 
[INFO] --- tycho-p2-plugin:2.3.0-SNAPSHOT:p2-metadata (p2-metadata) @ org.eclipse.m2e.jdt.tests ---
[INFO] No baseline version MavenProject: org.eclipse.m2e:org.eclipse.m2e.jdt.tests:1.16.0-SNAPSHOT @ /home/jenkins/agent/workspace/m2e_master/org.eclipse.m2e.jdt.tests/pom.xml
[INFO] 
[INFO] --- tycho-surefire-plugin:2.3.0-SNAPSHOT:test (default-test) @ org.eclipse.m2e.jdt.tests ---
[INFO] Executing Test Runtime with timeout 7200, logs (if any) will be placed at: /home/jenkins/agent/workspace/m2e_master/org.eclipse.m2e.jdt.tests/target/work/data/.metadata/.log
[INFO] Command line:
	[/opt/tools/java/openjdk/jdk-11/11.0.2+9/bin/java, -Dosgi.noShutdown=false, -Dosgi.os=linux, -Dosgi.ws=gtk, -Dosgi.arch=x86_64, -javaagent:/home/jenkins/agent/workspace/m2e_master/.m2/repository/org/jacoco/org.jacoco.agent/0.8.5/org.jacoco.agent-0.8.5-runtime.jar=destfile=/home/jenkins/agent/workspace/m2e_master/target/jacoco.exec,append=true,includes=org.eclipse.m2e*:org.apache.maven*:org.eclipse.aether*, -Xmx800m, -Dosgi.clean=true, -jar, /home/jenkins/agent/workspace/m2e_master/.m2/repository/p2/osgi/bundle/org.eclipse.equinox.launcher/1.6.0.v20200915-1508/org.eclipse.equinox.launcher-1.6.0.v20200915-1508.jar, -data, /home/jenkins/agent/workspace/m2e_master/org.eclipse.m2e.jdt.tests/target/work/data, -install, /home/jenkins/agent/workspace/m2e_master/org.eclipse.m2e.jdt.tests/target/work, -configuration, /home/jenkins/agent/workspace/m2e_master/org.eclipse.m2e.jdt.tests/target/work/configuration, -application, org.eclipse.tycho.surefire.osgibooter.uitest, -testproperties, /home/jenkins/agent/workspace/m2e_master/org.eclipse.m2e.jdt.tests/target/surefire.properties, -timeout, 7200000]

(process:2451): Gtk-WARNING **: 18:46:45.321: Locale not supported by C library.
	Using the fallback 'C' locale.
SWT SessionManagerDBus: Failed to connect to org.gnome.SessionManager: Failed to execute child process ?dbus-launch? (No such file or directory)
SWT SessionManagerDBus: Failed to connect to org.xfce.SessionManager: Failed to execute child process ?dbus-launch? (No such file or directory)
Running org.eclipse.m2e.jdt.tests.JavaConfigurationTest
SLF4J: Failed to load class "org.slf4j.impl.StaticLoggerBinder".
SLF4J: Defaulting to no-operation (NOP) logger implementation
SLF4J: See http://www.slf4j.org/codes.html#StaticLoggerBinder for further details.
SLF4J: Failed to load class "org.slf4j.impl.StaticLoggerBinder".
SLF4J: Defaulting to no-operation (NOP) logger implementation
SLF4J: See http://www.slf4j.org/codes.html#StaticLoggerBinder for further details.
Tests run: 1, Failures: 0, Errors: 0, Skipped: 0, Time elapsed: 16.705 s - in org.eclipse.m2e.jdt.tests.JavaConfigurationTest
testFileChangeUpdatesJDTSettings(org.eclipse.m2e.jdt.tests.JavaConfigurationTest)  Time elapsed: 16.224 s

Results:

Tests run: 1, Failures: 0, Errors: 0, Skipped: 0

[INFO] All tests passed!
[INFO] 
[INFO] --- tycho-p2-extras-plugin:2.3.0-SNAPSHOT:compare-version-with-baselines (check-no-version-regression) @ org.eclipse.m2e.jdt.tests ---
[INFO] 
[INFO] --------< org.eclipse.m2e:org.eclipse.m2e.editor.xml.sse.tests >--------
[INFO] Building org.eclipse.m2e.editor.xml.sse.tests 1.16.0-SNAPSHOT    [39/43]
[INFO] ------------------------[ eclipse-test-plugin ]-------------------------
[INFO] 
[INFO] --- maven-clean-plugin:2.4.1:clean (default-clean) @ org.eclipse.m2e.editor.xml.sse.tests ---
[INFO] 
[INFO] --- tycho-packaging-plugin:2.3.0-SNAPSHOT:build-qualifier (default-build-qualifier) @ org.eclipse.m2e.editor.xml.sse.tests ---
[INFO] The project's OSGi version is 1.16.0.20210115-1536
[INFO] 
[INFO] --- tycho-packaging-plugin:2.3.0-SNAPSHOT:validate-id (default-validate-id) @ org.eclipse.m2e.editor.xml.sse.tests ---
[INFO] 
[INFO] --- tycho-packaging-plugin:2.3.0-SNAPSHOT:validate-version (default-validate-version) @ org.eclipse.m2e.editor.xml.sse.tests ---
[INFO] 
[INFO] --- jacoco-maven-plugin:0.8.5:prepare-agent (default) @ org.eclipse.m2e.editor.xml.sse.tests ---
[INFO] tycho.testArgLine set to -javaagent:/home/jenkins/agent/workspace/m2e_master/.m2/repository/org/jacoco/org.jacoco.agent/0.8.5/org.jacoco.agent-0.8.5-runtime.jar=destfile=/home/jenkins/agent/workspace/m2e_master/target/jacoco.exec,append=true,includes=org.eclipse.m2e*:org.apache.maven*:org.eclipse.aether* -Xmx800m
[INFO] 
[INFO] --- maven-resources-plugin:2.5:resources (default-resources) @ org.eclipse.m2e.editor.xml.sse.tests ---
[debug] execute contextualize
[INFO] Using 'UTF-8' encoding to copy filtered resources.
[INFO] skip non existing resourceDirectory /home/jenkins/agent/workspace/m2e_master/org.eclipse.m2e.editor.xml.sse.tests/src/main/resources
[INFO] 
[INFO] --- tycho-compiler-plugin:2.3.0-SNAPSHOT:compile (default-compile) @ org.eclipse.m2e.editor.xml.sse.tests ---
[WARNING] Parameter 'useProjectSettings' is set to true, but preferences file '/home/jenkins/agent/workspace/m2e_master/org.eclipse.m2e.editor.xml.sse.tests/.settings/org.eclipse.jdt.core.prefs' could not be found!
[INFO] Compiling 1 source file to /home/jenkins/agent/workspace/m2e_master/org.eclipse.m2e.editor.xml.sse.tests/target/classes
[INFO] 
[INFO] --- maven-resources-plugin:2.5:testResources (default-testResources) @ org.eclipse.m2e.editor.xml.sse.tests ---
[debug] execute contextualize
[INFO] Using 'UTF-8' encoding to copy filtered resources.
[INFO] skip non existing resourceDirectory /home/jenkins/agent/workspace/m2e_master/org.eclipse.m2e.editor.xml.sse.tests/src/test/resources
[INFO] 
[INFO] --- tycho-source-plugin:2.3.0-SNAPSHOT:plugin-source (plugin-source) @ org.eclipse.m2e.editor.xml.sse.tests ---
[INFO] Building jar: /home/jenkins/agent/workspace/m2e_master/org.eclipse.m2e.editor.xml.sse.tests/target/org.eclipse.m2e.editor.xml.sse.tests-1.16.0-SNAPSHOT-sources.jar
[INFO] 
[INFO] --- target-platform-configuration:2.3.0-SNAPSHOT:target-platform (default-target-platform) @ org.eclipse.m2e.editor.xml.sse.tests ---
[INFO] 
[INFO] --- tycho-packaging-plugin:2.3.0-SNAPSHOT:package-plugin (default-package-plugin) @ org.eclipse.m2e.editor.xml.sse.tests ---
[INFO] Building jar: /home/jenkins/agent/workspace/m2e_master/org.eclipse.m2e.editor.xml.sse.tests/target/org.eclipse.m2e.editor.xml.sse.tests-1.16.0-SNAPSHOT.jar
[INFO] 
[INFO] --- tycho-p2-plugin:2.3.0-SNAPSHOT:p2-metadata-default (default-p2-metadata-default) @ org.eclipse.m2e.editor.xml.sse.tests ---
[INFO] 
[INFO] --- tycho-pack200a-plugin:2.3.0-SNAPSHOT:normalize (pack200-normalize) @ org.eclipse.m2e.editor.xml.sse.tests ---
[INFO] Pack200 normalizing jar /home/jenkins/agent/workspace/m2e_master/org.eclipse.m2e.editor.xml.sse.tests/target/org.eclipse.m2e.editor.xml.sse.tests-1.16.0-SNAPSHOT.jar
[INFO] 
[INFO] --- eclipse-jarsigner-plugin:1.1.7:sign (sign) @ org.eclipse.m2e.editor.xml.sse.tests ---
[INFO] Signing of nested jars of '/home/jenkins/agent/workspace/m2e_master/org.eclipse.m2e.editor.xml.sse.tests/target/org.eclipse.m2e.editor.xml.sse.tests-1.16.0-SNAPSHOT.jar' is disabled.
[INFO] Signing jar: /home/jenkins/agent/workspace/m2e_master/org.eclipse.m2e.editor.xml.sse.tests/target/org.eclipse.m2e.editor.xml.sse.tests-1.16.0-SNAPSHOT.jar
[INFO] Signing of nested jars of '/home/jenkins/agent/workspace/m2e_master/org.eclipse.m2e.editor.xml.sse.tests/target/org.eclipse.m2e.editor.xml.sse.tests-1.16.0-SNAPSHOT-sources.jar' is disabled.
[INFO] Signing jar: /home/jenkins/agent/workspace/m2e_master/org.eclipse.m2e.editor.xml.sse.tests/target/org.eclipse.m2e.editor.xml.sse.tests-1.16.0-SNAPSHOT-sources.jar
[INFO] 
[INFO] --- tycho-pack200b-plugin:2.3.0-SNAPSHOT:pack (pack200-pack) @ org.eclipse.m2e.editor.xml.sse.tests ---
[INFO] Pack200 packing jar /home/jenkins/agent/workspace/m2e_master/org.eclipse.m2e.editor.xml.sse.tests/target/org.eclipse.m2e.editor.xml.sse.tests-1.16.0-SNAPSHOT.jar
[INFO] 
[INFO] --- tycho-p2-plugin:2.3.0-SNAPSHOT:p2-metadata (p2-metadata) @ org.eclipse.m2e.editor.xml.sse.tests ---
[INFO] No baseline version MavenProject: org.eclipse.m2e:org.eclipse.m2e.editor.xml.sse.tests:1.16.0-SNAPSHOT @ /home/jenkins/agent/workspace/m2e_master/org.eclipse.m2e.editor.xml.sse.tests/pom.xml
[INFO] 
[INFO] --- tycho-surefire-plugin:2.3.0-SNAPSHOT:test (default-test) @ org.eclipse.m2e.editor.xml.sse.tests ---
[INFO] Executing Test Runtime with timeout 7200, logs (if any) will be placed at: /home/jenkins/agent/workspace/m2e_master/org.eclipse.m2e.editor.xml.sse.tests/target/work/data/.metadata/.log
[INFO] Command line:
	[/opt/tools/java/openjdk/jdk-11/11.0.2+9/bin/java, -Dosgi.noShutdown=false, -Dosgi.os=linux, -Dosgi.ws=gtk, -Dosgi.arch=x86_64, -javaagent:/home/jenkins/agent/workspace/m2e_master/.m2/repository/org/jacoco/org.jacoco.agent/0.8.5/org.jacoco.agent-0.8.5-runtime.jar=destfile=/home/jenkins/agent/workspace/m2e_master/target/jacoco.exec,append=true,includes=org.eclipse.m2e*:org.apache.maven*:org.eclipse.aether*, -Xmx800m, -Dosgi.clean=true, -jar, /home/jenkins/agent/workspace/m2e_master/.m2/repository/p2/osgi/bundle/org.eclipse.equinox.launcher/1.6.0.v20200915-1508/org.eclipse.equinox.launcher-1.6.0.v20200915-1508.jar, -data, /home/jenkins/agent/workspace/m2e_master/org.eclipse.m2e.editor.xml.sse.tests/target/work/data, -install, /home/jenkins/agent/workspace/m2e_master/org.eclipse.m2e.editor.xml.sse.tests/target/work, -configuration, /home/jenkins/agent/workspace/m2e_master/org.eclipse.m2e.editor.xml.sse.tests/target/work/configuration, -application, org.eclipse.tycho.surefire.osgibooter.uitest, -testproperties, /home/jenkins/agent/workspace/m2e_master/org.eclipse.m2e.editor.xml.sse.tests/target/surefire.properties, -timeout, 7200000]

(process:2552): Gtk-WARNING **: 18:47:14.156: Locale not supported by C library.
	Using the fallback 'C' locale.
SWT SessionManagerDBus: Failed to connect to org.gnome.SessionManager: Failed to execute child process ?dbus-launch? (No such file or directory)
SWT SessionManagerDBus: Failed to connect to org.xfce.SessionManager: Failed to execute child process ?dbus-launch? (No such file or directory)
Running org.eclipse.m2e.editor.xml.sse.tests.WTPEditorTest
SLF4J: Failed to load class "org.slf4j.impl.StaticLoggerBinder".
SLF4J: Defaulting to no-operation (NOP) logger implementation
SLF4J: See http://www.slf4j.org/codes.html#StaticLoggerBinder for further details.
Warning: NLS missing message: MavenImpl_error_lookup in: org.eclipse.m2e.editor.internal.messages
Warning: NLS unused message: MarkerHoverControl_openDiscoveryPrefs in: org.eclipse.m2e.editor.xml.internal.messages
Warning: NLS unused message: MarkerHoverControl_openLifecyclePrefs in: org.eclipse.m2e.editor.xml.internal.messages
Warning: NLS unused message: MarkerHoverControl_openParentDefinition in: org.eclipse.m2e.editor.xml.internal.messages
Warning: NLS unused message: MarkerHoverControl_openWarningsPrefs in: org.eclipse.m2e.editor.xml.internal.messages
Warning: NLS unused message: MavenMarkerResolution_error in: org.eclipse.m2e.editor.xml.internal.messages
Warning: NLS unused message: MavenMarkerResolution_error_title in: org.eclipse.m2e.editor.xml.internal.messages
Warning: NLS unused message: MavenMarkerResolution_schema_label in: org.eclipse.m2e.editor.xml.internal.messages
Tests run: 1, Failures: 0, Errors: 0, Skipped: 0, Time elapsed: 2.512 s - in org.eclipse.m2e.editor.xml.sse.tests.WTPEditorTest
testXSDCompletion(org.eclipse.m2e.editor.xml.sse.tests.WTPEditorTest)  Time elapsed: 2.492 s

Results:

Tests run: 1, Failures: 0, Errors: 0, Skipped: 0

[INFO] All tests passed!
[INFO] 
[INFO] --- tycho-p2-extras-plugin:2.3.0-SNAPSHOT:compare-version-with-baselines (check-no-version-regression) @ org.eclipse.m2e.editor.xml.sse.tests ---
[INFO] 
[INFO] -------------------< org.eclipse.m2e:m2e-core-tests >-------------------
[INFO] Building m2e-core-tests 1.16.0-SNAPSHOT                          [40/43]
[INFO] --------------------------------[ pom ]---------------------------------
[INFO] 
[INFO] --- maven-clean-plugin:2.4.1:clean (default-clean) @ m2e-core-tests ---
[INFO] 
[INFO] --- jacoco-maven-plugin:0.8.5:prepare-agent (default) @ m2e-core-tests ---
[INFO] argLine set to -javaagent:/home/jenkins/agent/workspace/m2e_master/.m2/repository/org/jacoco/org.jacoco.agent/0.8.5/org.jacoco.agent-0.8.5-runtime.jar=destfile=/home/jenkins/agent/workspace/m2e_master/target/jacoco.exec,append=true,includes=org.eclipse.m2e*:org.apache.maven*:org.eclipse.aether*
[INFO] 
[INFO] --- tycho-source-plugin:2.3.0-SNAPSHOT:plugin-source (plugin-source) @ m2e-core-tests ---
[INFO] 
[INFO] --- tycho-pack200a-plugin:2.3.0-SNAPSHOT:normalize (pack200-normalize) @ m2e-core-tests ---
[INFO] 
[INFO] --- eclipse-jarsigner-plugin:1.1.7:sign (sign) @ m2e-core-tests ---
[INFO] 
[INFO] --- tycho-pack200b-plugin:2.3.0-SNAPSHOT:pack (pack200-pack) @ m2e-core-tests ---
[INFO] 
[INFO] --- tycho-p2-plugin:2.3.0-SNAPSHOT:p2-metadata (p2-metadata) @ m2e-core-tests ---
[INFO] 
[INFO] --- tycho-p2-extras-plugin:2.3.0-SNAPSHOT:compare-version-with-baselines (check-no-version-regression) @ m2e-core-tests ---
[INFO] 
[INFO] ---------------< org.eclipse.m2e:org.eclipse.m2e.tests >----------------
[INFO] Building Maven Integration for Eclipse tests 1.17.2-SNAPSHOT     [41/43]
[INFO] ------------------------[ eclipse-test-plugin ]-------------------------
[INFO] 
[INFO] --- maven-clean-plugin:2.4.1:clean (default-clean) @ org.eclipse.m2e.tests ---
[INFO] 
[INFO] --- tycho-packaging-plugin:2.3.0-SNAPSHOT:build-qualifier (default-build-qualifier) @ org.eclipse.m2e.tests ---
[INFO] The project's OSGi version is 1.17.2.20210219-1316
[INFO] 
[INFO] --- tycho-packaging-plugin:2.3.0-SNAPSHOT:validate-id (default-validate-id) @ org.eclipse.m2e.tests ---
[INFO] 
[INFO] --- tycho-packaging-plugin:2.3.0-SNAPSHOT:validate-version (default-validate-version) @ org.eclipse.m2e.tests ---
[INFO] 
[INFO] --- jacoco-maven-plugin:0.8.5:prepare-agent (default) @ org.eclipse.m2e.tests ---
[INFO] tycho.testArgLine set to -javaagent:/home/jenkins/agent/workspace/m2e_master/.m2/repository/org/jacoco/org.jacoco.agent/0.8.5/org.jacoco.agent-0.8.5-runtime.jar=destfile=/home/jenkins/agent/workspace/m2e_master/m2e-core-tests/target/jacoco.exec,append=true,includes=org.eclipse.m2e*:org.apache.maven*:org.eclipse.aether* -Xmx800m
[INFO] 
[INFO] --- maven-resources-plugin:2.5:resources (default-resources) @ org.eclipse.m2e.tests ---
[debug] execute contextualize
[INFO] Using 'UTF-8' encoding to copy filtered resources.
[INFO] skip non existing resourceDirectory /home/jenkins/agent/workspace/m2e_master/m2e-core-tests/org.eclipse.m2e.tests/src/main/resources
[INFO] 
[INFO] --- tycho-compiler-plugin:2.3.0-SNAPSHOT:compile (default-compile) @ org.eclipse.m2e.tests ---
[INFO] Compiling 113 source files to /home/jenkins/agent/workspace/m2e_master/m2e-core-tests/org.eclipse.m2e.tests/target/classes
[INFO] 
[INFO] --- maven-resources-plugin:2.5:testResources (default-testResources) @ org.eclipse.m2e.tests ---
[debug] execute contextualize
[INFO] Using 'UTF-8' encoding to copy filtered resources.
[INFO] skip non existing resourceDirectory /home/jenkins/agent/workspace/m2e_master/m2e-core-tests/org.eclipse.m2e.tests/src/test/resources
[INFO] 
[INFO] --- tycho-source-plugin:2.3.0-SNAPSHOT:plugin-source (plugin-source) @ org.eclipse.m2e.tests ---
[INFO] Building jar: /home/jenkins/agent/workspace/m2e_master/m2e-core-tests/org.eclipse.m2e.tests/target/org.eclipse.m2e.tests-1.17.2-SNAPSHOT-sources.jar
[INFO] 
[INFO] --- target-platform-configuration:2.3.0-SNAPSHOT:target-platform (default-target-platform) @ org.eclipse.m2e.tests ---
[INFO] 
[INFO] --- tycho-packaging-plugin:2.3.0-SNAPSHOT:package-plugin (default-package-plugin) @ org.eclipse.m2e.tests ---
[INFO] Building jar: /home/jenkins/agent/workspace/m2e_master/m2e-core-tests/org.eclipse.m2e.tests/target/org.eclipse.m2e.tests-1.17.2-SNAPSHOT.jar
[INFO] 
[INFO] --- tycho-p2-plugin:2.3.0-SNAPSHOT:p2-metadata-default (default-p2-metadata-default) @ org.eclipse.m2e.tests ---
[INFO] 
[INFO] --- tycho-pack200a-plugin:2.3.0-SNAPSHOT:normalize (pack200-normalize) @ org.eclipse.m2e.tests ---
[INFO] Pack200 normalizing jar /home/jenkins/agent/workspace/m2e_master/m2e-core-tests/org.eclipse.m2e.tests/target/org.eclipse.m2e.tests-1.17.2-SNAPSHOT.jar
[INFO] 
[INFO] --- eclipse-jarsigner-plugin:1.1.7:sign (sign) @ org.eclipse.m2e.tests ---
[INFO] Signing of nested jars of '/home/jenkins/agent/workspace/m2e_master/m2e-core-tests/org.eclipse.m2e.tests/target/org.eclipse.m2e.tests-1.17.2-SNAPSHOT.jar' is disabled.
[INFO] Signing jar: /home/jenkins/agent/workspace/m2e_master/m2e-core-tests/org.eclipse.m2e.tests/target/org.eclipse.m2e.tests-1.17.2-SNAPSHOT.jar
[INFO] Signing of nested jars of '/home/jenkins/agent/workspace/m2e_master/m2e-core-tests/org.eclipse.m2e.tests/target/org.eclipse.m2e.tests-1.17.2-SNAPSHOT-sources.jar' is disabled.
[INFO] Signing jar: /home/jenkins/agent/workspace/m2e_master/m2e-core-tests/org.eclipse.m2e.tests/target/org.eclipse.m2e.tests-1.17.2-SNAPSHOT-sources.jar
[INFO] 
[INFO] --- tycho-pack200b-plugin:2.3.0-SNAPSHOT:pack (pack200-pack) @ org.eclipse.m2e.tests ---
[INFO] Pack200 packing jar /home/jenkins/agent/workspace/m2e_master/m2e-core-tests/org.eclipse.m2e.tests/target/org.eclipse.m2e.tests-1.17.2-SNAPSHOT.jar
[INFO] 
[INFO] --- tycho-p2-plugin:2.3.0-SNAPSHOT:p2-metadata (p2-metadata) @ org.eclipse.m2e.tests ---
[INFO] No baseline version MavenProject: org.eclipse.m2e:org.eclipse.m2e.tests:1.17.2-SNAPSHOT @ /home/jenkins/agent/workspace/m2e_master/m2e-core-tests/org.eclipse.m2e.tests/pom.xml
[INFO] 
[INFO] --- tycho-surefire-plugin:2.3.0-SNAPSHOT:test (default-test) @ org.eclipse.m2e.tests ---
[INFO] Executing Test Runtime with timeout 7200, logs (if any) will be placed at: /home/jenkins/agent/workspace/m2e_master/m2e-core-tests/org.eclipse.m2e.tests/target/work/data/.metadata/.log
[INFO] Command line:
	[/opt/tools/java/openjdk/jdk-11/11.0.2+9/bin/java, -Dosgi.noShutdown=false, -Dosgi.os=linux, -Dosgi.ws=gtk, -Dosgi.arch=x86_64, -javaagent:/home/jenkins/agent/workspace/m2e_master/.m2/repository/org/jacoco/org.jacoco.agent/0.8.5/org.jacoco.agent-0.8.5-runtime.jar=destfile=/home/jenkins/agent/workspace/m2e_master/m2e-core-tests/target/jacoco.exec,append=true,includes=org.eclipse.m2e*:org.apache.maven*:org.eclipse.aether*, -Xmx800m, -Dosgi.clean=true, -jar, /home/jenkins/agent/workspace/m2e_master/.m2/repository/p2/osgi/bundle/org.eclipse.equinox.launcher/1.6.0.v20200915-1508/org.eclipse.equinox.launcher-1.6.0.v20200915-1508.jar, -data, /home/jenkins/agent/workspace/m2e_master/m2e-core-tests/org.eclipse.m2e.tests/target/work/data, -install, /home/jenkins/agent/workspace/m2e_master/m2e-core-tests/org.eclipse.m2e.tests/target/work, -configuration, /home/jenkins/agent/workspace/m2e_master/m2e-core-tests/org.eclipse.m2e.tests/target/work/configuration, -application, org.eclipse.tycho.surefire.osgibooter.uitest, -testproperties, /home/jenkins/agent/workspace/m2e_master/m2e-core-tests/org.eclipse.m2e.tests/target/surefire.properties, -pluginCustomization, /home/jenkins/agent/workspace/m2e_master/m2e-core-tests/org.eclipse.m2e.tests/plugin_customization.ini, -timeout, 7200000]

(process:2635): Gtk-WARNING **: 18:47:27.104: Locale not supported by C library.
	Using the fallback 'C' locale.
SWT SessionManagerDBus: Failed to connect to org.gnome.SessionManager: Failed to execute child process ?dbus-launch? (No such file or directory)
SWT SessionManagerDBus: Failed to connect to org.xfce.SessionManager: Failed to execute child process ?dbus-launch? (No such file or directory)
SLF4J: Failed to load class "org.slf4j.impl.StaticLoggerBinder".
SLF4J: Defaulting to no-operation (NOP) logger implementation
SLF4J: See http://www.slf4j.org/codes.html#StaticLoggerBinder for further details.
SLF4J: Failed to load class "org.slf4j.impl.StaticLoggerBinder".
SLF4J: Defaulting to no-operation (NOP) logger implementation
SLF4J: See http://www.slf4j.org/codes.html#StaticLoggerBinder for further details.
Running org.eclipse.m2e.tests.internal.conversion.ProjectConversionParticipantSorterTest
Tests run: 6, Failures: 0, Errors: 0, Skipped: 0, Time elapsed: 0.076 s - in org.eclipse.m2e.tests.internal.conversion.ProjectConversionParticipantSorterTest
testSortConverters_AfterBefore(org.eclipse.m2e.tests.internal.conversion.ProjectConversionParticipantSorterTest)  Time elapsed: 0.004 s
testSortConverters_After2(org.eclipse.m2e.tests.internal.conversion.ProjectConversionParticipantSorterTest)  Time elapsed: 0 s
testSortConverters_After(org.eclipse.m2e.tests.internal.conversion.ProjectConversionParticipantSorterTest)  Time elapsed: 0 s
testSortConverters_Cycle_After(org.eclipse.m2e.tests.internal.conversion.ProjectConversionParticipantSorterTest)  Time elapsed: 0 s
testSortConverters_DuplicateConverters(org.eclipse.m2e.tests.internal.conversion.ProjectConversionParticipantSorterTest)  Time elapsed: 0.001 s
testSortConverters_Cycle_Before(org.eclipse.m2e.tests.internal.conversion.ProjectConversionParticipantSorterTest)  Time elapsed: 0 s
Running org.eclipse.m2e.tests.internal.index.NexusIndexManagerTest
Tests run: 14, Failures: 0, Errors: 0, Skipped: 0, Time elapsed: 77.551 s - in org.eclipse.m2e.tests.internal.index.NexusIndexManagerTest
testIndexedPublicArtifactGroups(org.eclipse.m2e.tests.internal.index.NexusIndexManagerTest)  Time elapsed: 7.04 s
test512006_nonProxyHost(org.eclipse.m2e.tests.internal.index.NexusIndexManagerTest)  Time elapsed: 4.619 s
testFetchIndexFromRepositoryWithAuthentication(org.eclipse.m2e.tests.internal.index.NexusIndexManagerTest)  Time elapsed: 3.878 s
testIndexedArtifactGroups(org.eclipse.m2e.tests.internal.index.NexusIndexManagerTest)  Time elapsed: 4.551 s
testWorkspaceIndex(org.eclipse.m2e.tests.internal.index.NexusIndexManagerTest)  Time elapsed: 4.89 s
testDisableIndex(org.eclipse.m2e.tests.internal.index.NexusIndexManagerTest)  Time elapsed: 2.89 s
testPublicNonMirrored(org.eclipse.m2e.tests.internal.index.NexusIndexManagerTest)  Time elapsed: 4.125 s
testMngEclipse1621(org.eclipse.m2e.tests.internal.index.NexusIndexManagerTest)  Time elapsed: 7.113 s
testMngEclipse1710(org.eclipse.m2e.tests.internal.index.NexusIndexManagerTest)  Time elapsed: 6.434 s
testMngEclipse1907(org.eclipse.m2e.tests.internal.index.NexusIndexManagerTest)  Time elapsed: 14.404 s
testProjectSpecificThenInSettings(org.eclipse.m2e.tests.internal.index.NexusIndexManagerTest)  Time elapsed: 4.572 s
testNoMirror(org.eclipse.m2e.tests.internal.index.NexusIndexManagerTest)  Time elapsed: 4.003 s
testPublicMirror(org.eclipse.m2e.tests.internal.index.NexusIndexManagerTest)  Time elapsed: 5.151 s
testProjectIndexes(org.eclipse.m2e.tests.internal.index.NexusIndexManagerTest)  Time elapsed: 3.876 s
Running org.eclipse.m2e.tests.internal.index.IndexedArtifactTest
Tests run: 3, Failures: 0, Errors: 0, Skipped: 0, Time elapsed: 0.002 s - in org.eclipse.m2e.tests.internal.index.IndexedArtifactTest
testHash(org.eclipse.m2e.tests.internal.index.IndexedArtifactTest)  Time elapsed: 0 s
testPackageName(org.eclipse.m2e.tests.internal.index.IndexedArtifactTest)  Time elapsed: 0 s
testEquals(org.eclipse.m2e.tests.internal.index.IndexedArtifactTest)  Time elapsed: 0.001 s
Running org.eclipse.m2e.tests.internal.index.filter.IndexFilterTest
Tests run: 3, Failures: 0, Errors: 0, Skipped: 0, Time elapsed: 0.004 s - in org.eclipse.m2e.tests.internal.index.filter.IndexFilterTest
testIndexedArtifactFileNodeAdapter(org.eclipse.m2e.tests.internal.index.filter.IndexFilterTest)  Time elapsed: 0.001 s
testFilteredIndex_nonEmptyResult(org.eclipse.m2e.tests.internal.index.filter.IndexFilterTest)  Time elapsed: 0.002 s
testFilteredIndex_emptyResult(org.eclipse.m2e.tests.internal.index.filter.IndexFilterTest)  Time elapsed: 0 s
Running org.eclipse.m2e.tests.internal.index.NexusIndexManagerSearchTest
Tests run: 9, Failures: 0, Errors: 0, Skipped: 0, Time elapsed: 37.714 s - in org.eclipse.m2e.tests.internal.index.NexusIndexManagerSearchTest
testPluginSearch(org.eclipse.m2e.tests.internal.index.NexusIndexManagerSearchTest)  Time elapsed: 4.283 s
testSearchGroups2(org.eclipse.m2e.tests.internal.index.NexusIndexManagerSearchTest)  Time elapsed: 4.751 s
testSearchGroups3(org.eclipse.m2e.tests.internal.index.NexusIndexManagerSearchTest)  Time elapsed: 3.982 s
testSha1Search(org.eclipse.m2e.tests.internal.index.NexusIndexManagerSearchTest)  Time elapsed: 4.141 s
testBogusSearchType(org.eclipse.m2e.tests.internal.index.NexusIndexManagerSearchTest)  Time elapsed: 4.491 s
testGroupSearch(org.eclipse.m2e.tests.internal.index.NexusIndexManagerSearchTest)  Time elapsed: 3.769 s
testSearchGroups(org.eclipse.m2e.tests.internal.index.NexusIndexManagerSearchTest)  Time elapsed: 4.21 s
testArtifactSearch(org.eclipse.m2e.tests.internal.index.NexusIndexManagerSearchTest)  Time elapsed: 4.033 s
testSorting(org.eclipse.m2e.tests.internal.index.NexusIndexManagerSearchTest)  Time elapsed: 4.053 s
Running org.eclipse.m2e.tests.internal.embedder.MavenEmbeddedRuntimeTest
Tests run: 1, Failures: 0, Errors: 0, Skipped: 0, Time elapsed: 0.055 s - in org.eclipse.m2e.tests.internal.embedder.MavenEmbeddedRuntimeTest
testGetVersion(org.eclipse.m2e.tests.internal.embedder.MavenEmbeddedRuntimeTest)  Time elapsed: 0.055 s
Running org.eclipse.m2e.tests.internal.lifecyclemapping.ProjectConfigurationElementSorterTest
Tests run: 6, Failures: 0, Errors: 0, Skipped: 0, Time elapsed: 0.004 s - in org.eclipse.m2e.tests.internal.lifecyclemapping.ProjectConfigurationElementSorterTest
testSortConfigurators_MissingPreviousConfigurator(org.eclipse.m2e.tests.internal.lifecyclemapping.ProjectConfigurationElementSorterTest)  Time elapsed: 0.002 s
testSortConfigurators_isRoot(org.eclipse.m2e.tests.internal.lifecyclemapping.ProjectConfigurationElementSorterTest)  Time elapsed: 0 s
testSortConfigurators_HappyPath(org.eclipse.m2e.tests.internal.lifecyclemapping.ProjectConfigurationElementSorterTest)  Time elapsed: 0 s
testSortConfigurators_MissingFollowingConfigurator(org.eclipse.m2e.tests.internal.lifecyclemapping.ProjectConfigurationElementSorterTest)  Time elapsed: 0 s
testSortConfigurators_CycleDetected(org.eclipse.m2e.tests.internal.lifecyclemapping.ProjectConfigurationElementSorterTest)  Time elapsed: 0.001 s
testSortConfigurators_471840(org.eclipse.m2e.tests.internal.lifecyclemapping.ProjectConfigurationElementSorterTest)  Time elapsed: 0 s
Running org.eclipse.m2e.tests.internal.wizard.MavenImportWizardPageTest
Tests run: 6, Failures: 0, Errors: 0, Skipped: 0, Time elapsed: 9.754 s - in org.eclipse.m2e.tests.internal.wizard.MavenImportWizardPageTest
test408042_multimoduleProject(org.eclipse.m2e.tests.internal.wizard.MavenImportWizardPageTest)  Time elapsed: 1.356 s
test408042_nestedproject(org.eclipse.m2e.tests.internal.wizard.MavenImportWizardPageTest)  Time elapsed: 2.022 s
test408042_noRootProject(org.eclipse.m2e.tests.internal.wizard.MavenImportWizardPageTest)  Time elapsed: 1.277 s
test533463_noArtifactId(org.eclipse.m2e.tests.internal.wizard.MavenImportWizardPageTest)  Time elapsed: 1.245 s
test408042_simpleProject(org.eclipse.m2e.tests.internal.wizard.MavenImportWizardPageTest)  Time elapsed: 1.578 s
test422008_preselectedWorkingSet(org.eclipse.m2e.tests.internal.wizard.MavenImportWizardPageTest)  Time elapsed: 2.271 s
Running org.eclipse.m2e.tests.internal.wizard.MappingDiscoveryJobTest
Tests run: 2, Failures: 0, Errors: 0, Skipped: 0, Time elapsed: 5.014 s - in org.eclipse.m2e.tests.internal.wizard.MappingDiscoveryJobTest
testDontOpenMappingDiscoveryWizard(org.eclipse.m2e.tests.internal.wizard.MappingDiscoveryJobTest)  Time elapsed: 2.19 s
testOpensMappingDiscoveryWizard(org.eclipse.m2e.tests.internal.wizard.MappingDiscoveryJobTest)  Time elapsed: 2.822 s
Running org.eclipse.m2e.tests.internal.wizard.MavenImportWizardTest
Tests run: 3, Failures: 0, Errors: 0, Skipped: 0, Time elapsed: 5.692 s - in org.eclipse.m2e.tests.internal.wizard.MavenImportWizardTest
testNoRenameOnMavenImport(org.eclipse.m2e.tests.internal.wizard.MavenImportWizardTest)  Time elapsed: 2.05 s
testRenameOnMavenImport(org.eclipse.m2e.tests.internal.wizard.MavenImportWizardTest)  Time elapsed: 1.704 s
testNoRenameOnMavenImportInWorkspaceRoot(org.eclipse.m2e.tests.internal.wizard.MavenImportWizardTest)  Time elapsed: 1.937 s
Running org.eclipse.m2e.tests.internal.project.MavenProjectChangedListenerExtensionTest
Tests run: 1, Failures: 0, Errors: 0, Skipped: 0, Time elapsed: 1.936 s - in org.eclipse.m2e.tests.internal.project.MavenProjectChangedListenerExtensionTest
testExtension(org.eclipse.m2e.tests.internal.project.MavenProjectChangedListenerExtensionTest)  Time elapsed: 1.934 s
Running org.eclipse.m2e.tests.internal.refactoring.ExcludeArtifactRefactoringTest
Warning: NLS missing message: MavenImpl_error_lookup in: org.eclipse.m2e.editor.internal.messages
Tests run: 12, Failures: 0, Errors: 0, Skipped: 0, Time elapsed: 30.458 s - in org.eclipse.m2e.tests.internal.refactoring.ExcludeArtifactRefactoringTest
testSingleArtifactKeyRemoteParent(org.eclipse.m2e.tests.internal.refactoring.ExcludeArtifactRefactoringTest)  Time elapsed: 3.732 s
testSingleArtifactMissing(org.eclipse.m2e.tests.internal.refactoring.ExcludeArtifactRefactoringTest)  Time elapsed: 1.643 s
testSingleArtifactKeyInWorkspaceParent(org.eclipse.m2e.tests.internal.refactoring.ExcludeArtifactRefactoringTest)  Time elapsed: 2.355 s
testStrangePomName(org.eclipse.m2e.tests.internal.refactoring.ExcludeArtifactRefactoringTest)  Time elapsed: 1.796 s
testArtifactsInMultiplePom(org.eclipse.m2e.tests.internal.refactoring.ExcludeArtifactRefactoringTest)  Time elapsed: 4.193 s
testCopyDown(org.eclipse.m2e.tests.internal.refactoring.ExcludeArtifactRefactoringTest)  Time elapsed: 3.04 s
testSingleArtifactKeyWorkspaceParent(org.eclipse.m2e.tests.internal.refactoring.ExcludeArtifactRefactoringTest)  Time elapsed: 4.277 s
testMultipleArtifactWithMissing(org.eclipse.m2e.tests.internal.refactoring.ExcludeArtifactRefactoringTest)  Time elapsed: 1.689 s
testSingleArtifactNoParentBadFormat(org.eclipse.m2e.tests.internal.refactoring.ExcludeArtifactRefactoringTest)  Time elapsed: 2.029 s
testMultipleArtifactKeySinglePom(org.eclipse.m2e.tests.internal.refactoring.ExcludeArtifactRefactoringTest)  Time elapsed: 2.231 s
testSingleArtifactNoParent(org.eclipse.m2e.tests.internal.refactoring.ExcludeArtifactRefactoringTest)  Time elapsed: 1.595 s
testPullUp(org.eclipse.m2e.tests.internal.refactoring.ExcludeArtifactRefactoringTest)  Time elapsed: 1.877 s
Running org.eclipse.m2e.tests.internal.repository.RepositoryRegistryTest
Tests run: 1, Failures: 0, Errors: 0, Skipped: 0, Time elapsed: 1.057 s - in org.eclipse.m2e.tests.internal.repository.RepositoryRegistryTest
testSettingsDecryption(org.eclipse.m2e.tests.internal.repository.RepositoryRegistryTest)  Time elapsed: 1.056 s
Running org.eclipse.m2e.tests.ui.OpenPomActionTest
Tests run: 1, Failures: 0, Errors: 0, Skipped: 0, Time elapsed: 10.758 s - in org.eclipse.m2e.tests.ui.OpenPomActionTest
test454759_openEditor(org.eclipse.m2e.tests.ui.OpenPomActionTest)  Time elapsed: 10.758 s
Running org.eclipse.m2e.tests.ui.editing.PomEditsTest
Tests run: 5, Failures: 0, Errors: 0, Skipped: 0, Time elapsed: 0.006 s - in org.eclipse.m2e.tests.ui.editing.PomEditsTest
testFindChildren(org.eclipse.m2e.tests.ui.editing.PomEditsTest)  Time elapsed: 0.001 s
testRemoveChild(org.eclipse.m2e.tests.ui.editing.PomEditsTest)  Time elapsed: 0.002 s
testMatchers(org.eclipse.m2e.tests.ui.editing.PomEditsTest)  Time elapsed: 0 s
testFindChild(org.eclipse.m2e.tests.ui.editing.PomEditsTest)  Time elapsed: 0.001 s
testRemoveIfNoChildElement(org.eclipse.m2e.tests.ui.editing.PomEditsTest)  Time elapsed: 0 s
Running org.eclipse.m2e.tests.ui.editing.PomHelperTest
Tests run: 7, Failures: 0, Errors: 0, Skipped: 0, Time elapsed: 0.017 s - in org.eclipse.m2e.tests.ui.editing.PomHelperTest
testCreateDependencyInEmptyList(org.eclipse.m2e.tests.ui.editing.PomHelperTest)  Time elapsed: 0.005 s
testCreatePlugin(org.eclipse.m2e.tests.ui.editing.PomHelperTest)  Time elapsed: 0.003 s
testFindDependencies(org.eclipse.m2e.tests.ui.editing.PomHelperTest)  Time elapsed: 0.001 s
testFindDependenciesMissing(org.eclipse.m2e.tests.ui.editing.PomHelperTest)  Time elapsed: 0 s
testCreatePluginInEmptyList(org.eclipse.m2e.tests.ui.editing.PomHelperTest)  Time elapsed: 0.004 s
testCreateDependency(org.eclipse.m2e.tests.ui.editing.PomHelperTest)  Time elapsed: 0.003 s
testFindDependency(org.eclipse.m2e.tests.ui.editing.PomHelperTest)  Time elapsed: 0.001 s
Running org.eclipse.m2e.tests.ui.editing.AddDependencyOperationTest
Tests run: 5, Failures: 0, Errors: 0, Skipped: 0, Time elapsed: 0.017 s - in org.eclipse.m2e.tests.ui.editing.AddDependencyOperationTest
testNoDependenciesElement(org.eclipse.m2e.tests.ui.editing.AddDependencyOperationTest)  Time elapsed: 0.003 s
testEmptyDependenciesElement(org.eclipse.m2e.tests.ui.editing.AddDependencyOperationTest)  Time elapsed: 0.003 s
testDuplicatedDependency(org.eclipse.m2e.tests.ui.editing.AddDependencyOperationTest)  Time elapsed: 0.001 s
testWithDependencies(org.eclipse.m2e.tests.ui.editing.AddDependencyOperationTest)  Time elapsed: 0.003 s
testExclusionsAdded(org.eclipse.m2e.tests.ui.editing.AddDependencyOperationTest)  Time elapsed: 0.005 s
Running org.eclipse.m2e.tests.ui.editing.AddExclusionOperationTest
Tests run: 6, Failures: 0, Errors: 0, Skipped: 0, Time elapsed: 0.007 s - in org.eclipse.m2e.tests.ui.editing.AddExclusionOperationTest
testAddExclusion(org.eclipse.m2e.tests.ui.editing.AddExclusionOperationTest)  Time elapsed: 0.003 s
testAddExclusion_existingExclusion(org.eclipse.m2e.tests.ui.editing.AddExclusionOperationTest)  Time elapsed: 0.003 s
testAddExclusion_duplicateExclusion(org.eclipse.m2e.tests.ui.editing.AddExclusionOperationTest)  Time elapsed: 0 s
testMissingDependency_withDependencies(org.eclipse.m2e.tests.ui.editing.AddExclusionOperationTest)  Time elapsed: 0.001 s
testMissingDependency_emptyDependenciesElement(org.eclipse.m2e.tests.ui.editing.AddExclusionOperationTest)  Time elapsed: 0 s
testMissingDependency_noDependenciesElement(org.eclipse.m2e.tests.ui.editing.AddExclusionOperationTest)  Time elapsed: 0 s
Running org.eclipse.m2e.tests.ui.editing.RemoveDependencyOperationTest
Tests run: 4, Failures: 0, Errors: 0, Skipped: 0, Time elapsed: 0.002 s - in org.eclipse.m2e.tests.ui.editing.RemoveDependencyOperationTest
testMissingDependency_withDependencies(org.eclipse.m2e.tests.ui.editing.RemoveDependencyOperationTest)  Time elapsed: 0.001 s
testRemoveDependency(org.eclipse.m2e.tests.ui.editing.RemoveDependencyOperationTest)  Time elapsed: 0.001 s
testMissingDependency_emptyDependenciesElement(org.eclipse.m2e.tests.ui.editing.RemoveDependencyOperationTest)  Time elapsed: 0 s
testMissingDependency_noDependenciesElement(org.eclipse.m2e.tests.ui.editing.RemoveDependencyOperationTest)  Time elapsed: 0 s
Running org.eclipse.m2e.tests.ui.MavenPropertyTesterTest
Tests run: 1, Failures: 0, Errors: 0, Skipped: 0, Time elapsed: 1.432 s - in org.eclipse.m2e.tests.ui.MavenPropertyTesterTest
testIsBuildDirectory(org.eclipse.m2e.tests.ui.MavenPropertyTesterTest)  Time elapsed: 1.43 s
Running org.eclipse.m2e.tests.ResourceChangeListenerTest
Tests run: 7, Failures: 0, Errors: 0, Skipped: 0, Time elapsed: 18.014 s - in org.eclipse.m2e.tests.ResourceChangeListenerTest
testPomChanges(org.eclipse.m2e.tests.ResourceChangeListenerTest)  Time elapsed: 4.709 s
testMarkerOnlyChange(org.eclipse.m2e.tests.ResourceChangeListenerTest)  Time elapsed: 2.15 s
testPomMove001(org.eclipse.m2e.tests.ResourceChangeListenerTest)  Time elapsed: 2.193 s
testPomMove002(org.eclipse.m2e.tests.ResourceChangeListenerTest)  Time elapsed: 2.515 s
testProjectDelete(org.eclipse.m2e.tests.ResourceChangeListenerTest)  Time elapsed: 1.912 s
testPomDelete(org.eclipse.m2e.tests.ResourceChangeListenerTest)  Time elapsed: 2.248 s
testPomRename(org.eclipse.m2e.tests.ResourceChangeListenerTest)  Time elapsed: 2.287 s
Running org.eclipse.m2e.tests.embedder.MavenRuntimeManagerTest
Tests run: 4, Failures: 0, Errors: 0, Skipped: 0, Time elapsed: 0.008 s - in org.eclipse.m2e.tests.embedder.MavenRuntimeManagerTest
testDefaultRuntime(org.eclipse.m2e.tests.embedder.MavenRuntimeManagerTest)  Time elapsed: 0.004 s
testSetDefaultRuntime(org.eclipse.m2e.tests.embedder.MavenRuntimeManagerTest)  Time elapsed: 0 s
testExternalRuntime(org.eclipse.m2e.tests.embedder.MavenRuntimeManagerTest)  Time elapsed: 0.004 s
testGetRuntime(org.eclipse.m2e.tests.embedder.MavenRuntimeManagerTest)  Time elapsed: 0 s
Running org.eclipse.m2e.tests.embedder.MavenModelEditTest
Tests run: 16, Failures: 0, Errors: 0, Skipped: 0, Time elapsed: 0.131 s - in org.eclipse.m2e.tests.embedder.MavenModelEditTest
testOneRemove(org.eclipse.m2e.tests.embedder.MavenModelEditTest)  Time elapsed: 0.015 s
testEncoding(org.eclipse.m2e.tests.embedder.MavenModelEditTest)  Time elapsed: 0.006 s
testAttributeChange(org.eclipse.m2e.tests.embedder.MavenModelEditTest)  Time elapsed: 0.004 s
testAttributeRoundtrip(org.eclipse.m2e.tests.embedder.MavenModelEditTest)  Time elapsed: 0.005 s
testAttributeRemove(org.eclipse.m2e.tests.embedder.MavenModelEditTest)  Time elapsed: 0.004 s
testManyRoundtrip(org.eclipse.m2e.tests.embedder.MavenModelEditTest)  Time elapsed: 0.006 s
testManybuildinRoundtrip(org.eclipse.m2e.tests.embedder.MavenModelEditTest)  Time elapsed: 0.005 s
testAttributeAdd(org.eclipse.m2e.tests.embedder.MavenModelEditTest)  Time elapsed: 0.005 s
testOneReplace(org.eclipse.m2e.tests.embedder.MavenModelEditTest)  Time elapsed: 0.004 s
testManyAdd(org.eclipse.m2e.tests.embedder.MavenModelEditTest)  Time elapsed: 0.031 s
testManybuildincommentRemove(org.eclipse.m2e.tests.embedder.MavenModelEditTest)  Time elapsed: 0.006 s
testManyChange(org.eclipse.m2e.tests.embedder.MavenModelEditTest)  Time elapsed: 0.005 s
testXpp3domRoundtrip(org.eclipse.m2e.tests.embedder.MavenModelEditTest)  Time elapsed: 0.015 s
testManyRemove(org.eclipse.m2e.tests.embedder.MavenModelEditTest)  Time elapsed: 0.006 s
testOneRoundtrip(org.eclipse.m2e.tests.embedder.MavenModelEditTest)  Time elapsed: 0.006 s
testManybuildinRemove(org.eclipse.m2e.tests.embedder.MavenModelEditTest)  Time elapsed: 0.006 s
Running org.eclipse.m2e.tests.embedder.ArtifactKeyTest
Tests run: 1, Failures: 0, Errors: 0, Skipped: 0, Time elapsed: 0 s - in org.eclipse.m2e.tests.embedder.ArtifactKeyTest
testPortableString(org.eclipse.m2e.tests.embedder.ArtifactKeyTest)  Time elapsed: 0 s
Running org.eclipse.m2e.tests.embedder.MavenModelManagerTest
Tests run: 2, Failures: 0, Errors: 0, Skipped: 0, Time elapsed: 2.334 s - in org.eclipse.m2e.tests.embedder.MavenModelManagerTest
test416882_dependencyTree(org.eclipse.m2e.tests.embedder.MavenModelManagerTest)  Time elapsed: 1.158 s
testCreateMavenModel(org.eclipse.m2e.tests.embedder.MavenModelManagerTest)  Time elapsed: 1.175 s
Running org.eclipse.m2e.tests.embedder.MavenImplTest
Tests run: 21, Failures: 0, Errors: 0, Skipped: 1, Time elapsed: 42.684 s - in org.eclipse.m2e.tests.embedder.MavenImplTest
test438454_guiceScopedComponentInjection(org.eclipse.m2e.tests.embedder.MavenImplTest)  Time elapsed: 6.324 s
testUnreadableSettings(org.eclipse.m2e.tests.embedder.MavenImplTest)  Time elapsed: 3.304 s
testGetProxy(org.eclipse.m2e.tests.embedder.MavenImplTest)  Time elapsed: 1.873 s
testMNGECLIPSE2556_settingsSystemPropertiesSubstiution(org.eclipse.m2e.tests.embedder.MavenImplTest)  Time elapsed: 1.8 s
testGetDefaultRepositories(org.eclipse.m2e.tests.embedder.MavenImplTest)  Time elapsed: 2.504 s
testGetRepositories(org.eclipse.m2e.tests.embedder.MavenImplTest)  Time elapsed: 1.97 s
testMissingArtifact(org.eclipse.m2e.tests.embedder.MavenImplTest)  Time elapsed: 1.489 s
testIsUnavailable(org.eclipse.m2e.tests.embedder.MavenImplTest)  Time elapsed: 1.233 s
testLocalRepositoryListener(org.eclipse.m2e.tests.embedder.MavenImplTest)  Time elapsed: 1.317 s
testGlobalSettings(org.eclipse.m2e.tests.embedder.MavenImplTest)  Time elapsed: 1.819 s
testReadNoParent(org.eclipse.m2e.tests.embedder.MavenImplTest)  Time elapsed: 1.15 s
test358620_reparse_changed_user_settings(org.eclipse.m2e.tests.embedder.MavenImplTest)  Time elapsed: 1.85 s
test366839_userAgent(org.eclipse.m2e.tests.embedder.MavenImplTest)  Time elapsed: 1.856 s
testReadLocalParent(org.eclipse.m2e.tests.embedder.MavenImplTest)  Time elapsed: 1.284 s
testReadProjectWithDependenciesFromMirror(org.eclipse.m2e.tests.embedder.MavenImplTest)  Time elapsed: 2.897 s
testGetMojoParameterValue(org.eclipse.m2e.tests.embedder.MavenImplTest)  Time elapsed: 1.303 s
testGetRepositoriesWithSettingsInjection(org.eclipse.m2e.tests.embedder.MavenImplTest)  Time elapsed: 1.97 s
test386196_ParallelDownloads(org.eclipse.m2e.tests.embedder.MavenImplTest)  Time elapsed: 1.825 s
testProxySupport(org.eclipse.m2e.tests.embedder.MavenImplTest)  Time elapsed: 3.788 s
DISABLED_testSslWithMutualHandshake(org.eclipse.m2e.tests.embedder.MavenImplTest) skipped
testReadRemoteParent(org.eclipse.m2e.tests.embedder.MavenImplTest)  Time elapsed: 1.123 s
Running org.eclipse.m2e.tests.embedder.MavenExecutionContextTest
Tests run: 6, Failures: 0, Errors: 0, Skipped: 0, Time elapsed: 7.393 s - in org.eclipse.m2e.tests.embedder.MavenExecutionContextTest
testBasic(org.eclipse.m2e.tests.embedder.MavenExecutionContextTest)  Time elapsed: 1.769 s
test496492_threadContextClassloaderLeak(org.eclipse.m2e.tests.embedder.MavenExecutionContextTest)  Time elapsed: 1.038 s
testExecutionRequestContainsSystemProperties(org.eclipse.m2e.tests.embedder.MavenExecutionContextTest)  Time elapsed: 1.266 s
testReenterShortcut(org.eclipse.m2e.tests.embedder.MavenExecutionContextTest)  Time elapsed: 1.017 s
testIllegalState(org.eclipse.m2e.tests.embedder.MavenExecutionContextTest)  Time elapsed: 1.061 s
testNested(org.eclipse.m2e.tests.embedder.MavenExecutionContextTest)  Time elapsed: 1.241 s
Running org.eclipse.m2e.tests.SourceLocationHelperTest
Tests run: 5, Failures: 0, Errors: 0, Skipped: 0, Time elapsed: 11.163 s - in org.eclipse.m2e.tests.SourceLocationHelperTest
testDependencyLocation(org.eclipse.m2e.tests.SourceLocationHelperTest)  Time elapsed: 2.335 s
testMojoExecutionLocationWithExecutions(org.eclipse.m2e.tests.SourceLocationHelperTest)  Time elapsed: 2.589 s
testPackagingLocation(org.eclipse.m2e.tests.SourceLocationHelperTest)  Time elapsed: 1.444 s
testMojoExecutionLocation(org.eclipse.m2e.tests.SourceLocationHelperTest)  Time elapsed: 3.424 s
testPluginAttributeLocation(org.eclipse.m2e.tests.SourceLocationHelperTest)  Time elapsed: 1.37 s
Running org.eclipse.m2e.tests.configurators.ResourcesEncodingConfiguratorTest
Tests run: 3, Failures: 0, Errors: 0, Skipped: 0, Time elapsed: 10.673 s - in org.eclipse.m2e.tests.configurators.ResourcesEncodingConfiguratorTest
test002_shouldConfigureEncodingForProjectWithSeveralResourceFolders(org.eclipse.m2e.tests.configurators.ResourcesEncodingConfiguratorTest)  Time elapsed: 2.559 s
test001_shouldConfigureEncodingForBasicProject(org.eclipse.m2e.tests.configurators.ResourcesEncodingConfiguratorTest)  Time elapsed: 3.395 s
test003_shouldResetToContainerDefinedEncoding(org.eclipse.m2e.tests.configurators.ResourcesEncodingConfiguratorTest)  Time elapsed: 4.718 s
Running org.eclipse.m2e.tests.configurators.CompilerSettingsWithEncodingConfiguratorTest
Tests run: 2, Failures: 0, Errors: 0, Skipped: 0, Time elapsed: 6.112 s - in org.eclipse.m2e.tests.configurators.CompilerSettingsWithEncodingConfiguratorTest
test002_shouldResetToContainerDefinedEncoding(org.eclipse.m2e.tests.configurators.CompilerSettingsWithEncodingConfiguratorTest)  Time elapsed: 3.734 s
test001_shouldSetEncodingForBasicProject(org.eclipse.m2e.tests.configurators.CompilerSettingsWithEncodingConfiguratorTest)  Time elapsed: 2.378 s
Running org.eclipse.m2e.tests.lifecycle.PluginExecutionMetadataPrioritiesTest
Tests run: 8, Failures: 0, Errors: 0, Skipped: 0, Time elapsed: 15.043 s - in org.eclipse.m2e.tests.lifecycle.PluginExecutionMetadataPrioritiesTest
testWorkspaceOverridesEclipseExtensions(org.eclipse.m2e.tests.lifecycle.PluginExecutionMetadataPrioritiesTest)  Time elapsed: 1.977 s
testEclipseExtension(org.eclipse.m2e.tests.lifecycle.PluginExecutionMetadataPrioritiesTest)  Time elapsed: 1.668 s
testDefaultMetadataSource(org.eclipse.m2e.tests.lifecycle.PluginExecutionMetadataPrioritiesTest)  Time elapsed: 1.771 s
testPomOverridesWorkspace(org.eclipse.m2e.tests.lifecycle.PluginExecutionMetadataPrioritiesTest)  Time elapsed: 2.474 s
testEmbeddedInPom(org.eclipse.m2e.tests.lifecycle.PluginExecutionMetadataPrioritiesTest)  Time elapsed: 1.601 s
testReferencedFromPom(org.eclipse.m2e.tests.lifecycle.PluginExecutionMetadataPrioritiesTest)  Time elapsed: 1.494 s
testParent(org.eclipse.m2e.tests.lifecycle.PluginExecutionMetadataPrioritiesTest)  Time elapsed: 2.588 s
testWorkspace(org.eclipse.m2e.tests.lifecycle.PluginExecutionMetadataPrioritiesTest)  Time elapsed: 1.47 s
Running org.eclipse.m2e.tests.lifecycle.LifecycleComparisonTest
Tests run: 3, Failures: 0, Errors: 0, Skipped: 0, Time elapsed: 3.567 s - in org.eclipse.m2e.tests.lifecycle.LifecycleComparisonTest
testPluginConfigurationChange(org.eclipse.m2e.tests.lifecycle.LifecycleComparisonTest)  Time elapsed: 1.114 s
testSameProject(org.eclipse.m2e.tests.lifecycle.LifecycleComparisonTest)  Time elapsed: 1.158 s
testPluginVersionChange(org.eclipse.m2e.tests.lifecycle.LifecycleComparisonTest)  Time elapsed: 1.295 s
Running org.eclipse.m2e.tests.lifecycle.PluginExecutionActionsTest
Tests run: 7, Failures: 0, Errors: 0, Skipped: 0, Time elapsed: 13.069 s - in org.eclipse.m2e.tests.lifecycle.PluginExecutionActionsTest
testMojoExecutionIgnore(org.eclipse.m2e.tests.lifecycle.PluginExecutionActionsTest)  Time elapsed: 2.322 s
testMojoExecutionErrorWithMessage(org.eclipse.m2e.tests.lifecycle.PluginExecutionActionsTest)  Time elapsed: 1.93 s
testMojoExecutionError(org.eclipse.m2e.tests.lifecycle.PluginExecutionActionsTest)  Time elapsed: 1.593 s
testMojoExecutionConfigurator(org.eclipse.m2e.tests.lifecycle.PluginExecutionActionsTest)  Time elapsed: 2.045 s
testMojoExecutionExecute(org.eclipse.m2e.tests.lifecycle.PluginExecutionActionsTest)  Time elapsed: 1.384 s
testMojoExecutionIgnoreWithMessage(org.eclipse.m2e.tests.lifecycle.PluginExecutionActionsTest)  Time elapsed: 1.494 s
testMojoExecutionExecuteWithMessage(org.eclipse.m2e.tests.lifecycle.PluginExecutionActionsTest)  Time elapsed: 2.298 s
Running org.eclipse.m2e.tests.lifecycle.LifecycleMappingTest
running TEST_SECONDARY3
running TEST_SECONDARY4
running TEST_SECONDARY6
running TEST_SECONDARY5
Tests run: 36, Failures: 0, Errors: 0, Skipped: 0, Time elapsed: 67.224 s - in org.eclipse.m2e.tests.lifecycle.LifecycleMappingTest
testGetLifecycleMappingMetadata(org.eclipse.m2e.tests.lifecycle.LifecycleMappingTest)  Time elapsed: 1.603 s
test387736_missingAction(org.eclipse.m2e.tests.lifecycle.LifecycleMappingTest)  Time elapsed: 2.208 s
testProfilesAndProperties(org.eclipse.m2e.tests.lifecycle.LifecycleMappingTest)  Time elapsed: 1.75 s
testConfiguratorsFollowPhaseOrder(org.eclipse.m2e.tests.lifecycle.LifecycleMappingTest)  Time elapsed: 1.633 s
testSecondaryConfiguratorsCustom(org.eclipse.m2e.tests.lifecycle.LifecycleMappingTest)  Time elapsed: 1.704 s
testDuplicatePluginExecution1(org.eclipse.m2e.tests.lifecycle.LifecycleMappingTest)  Time elapsed: 1.171 s
testDuplicatePluginExecution2(org.eclipse.m2e.tests.lifecycle.LifecycleMappingTest)  Time elapsed: 1.682 s
testNondeafaultLifecycles(org.eclipse.m2e.tests.lifecycle.LifecycleMappingTest)  Time elapsed: 1.522 s
testOrder(org.eclipse.m2e.tests.lifecycle.LifecycleMappingTest)  Time elapsed: 1.879 s
testSetNoopMappingDuringImport(org.eclipse.m2e.tests.lifecycle.LifecycleMappingTest)  Time elapsed: 1.686 s
testUseDefaultLifecycleMappingMetadataSource(org.eclipse.m2e.tests.lifecycle.LifecycleMappingTest)  Time elapsed: 1.097 s
testNotCoveredMojoExecutionIgnored(org.eclipse.m2e.tests.lifecycle.LifecycleMappingTest)  Time elapsed: 1.549 s
testNonresolvableExecutionPlan(org.eclipse.m2e.tests.lifecycle.LifecycleMappingTest)  Time elapsed: 1.565 s
testFailToGetPluginParameterValue(org.eclipse.m2e.tests.lifecycle.LifecycleMappingTest)  Time elapsed: 2.178 s
testSetCustomizableMappingDuringImport(org.eclipse.m2e.tests.lifecycle.LifecycleMappingTest)  Time elapsed: 2.362 s
testSameConfiguratorUsedTwice(org.eclipse.m2e.tests.lifecycle.LifecycleMappingTest)  Time elapsed: 1.792 s
testUnknownPackagingType(org.eclipse.m2e.tests.lifecycle.LifecycleMappingTest)  Time elapsed: 1.422 s
testGetLifecycleMappingMetadataMerge(org.eclipse.m2e.tests.lifecycle.LifecycleMappingTest)  Time elapsed: 1.8 s
testSecondaryConfiguratorsCustomizable(org.eclipse.m2e.tests.lifecycle.LifecycleMappingTest)  Time elapsed: 1.581 s
testIncompatibleVersion(org.eclipse.m2e.tests.lifecycle.LifecycleMappingTest)  Time elapsed: 2.003 s
testCompatibleVersion(org.eclipse.m2e.tests.lifecycle.LifecycleMappingTest)  Time elapsed: 1.945 s
testLifecycleMappingSpecifiedInMetadata(org.eclipse.m2e.tests.lifecycle.LifecycleMappingTest)  Time elapsed: 2.136 s
testPomPackagingType(org.eclipse.m2e.tests.lifecycle.LifecycleMappingTest)  Time elapsed: 1.582 s
testNotCoveredMojoExecutions(org.eclipse.m2e.tests.lifecycle.LifecycleMappingTest)  Time elapsed: 1.536 s
test494858ProcessingInstructions(org.eclipse.m2e.tests.lifecycle.LifecycleMappingTest)  Time elapsed: 7.183 s
testPackagingTypeMismatch(org.eclipse.m2e.tests.lifecycle.LifecycleMappingTest)  Time elapsed: 1.953 s
testGetLifecycleMappingMetadataOverride(org.eclipse.m2e.tests.lifecycle.LifecycleMappingTest)  Time elapsed: 1.542 s
testWorkspaceArtifacts(org.eclipse.m2e.tests.lifecycle.LifecycleMappingTest)  Time elapsed: 1.507 s
testMissingLifecycleMappingMetadata(org.eclipse.m2e.tests.lifecycle.LifecycleMappingTest)  Time elapsed: 2.198 s
testMissingMapping(org.eclipse.m2e.tests.lifecycle.LifecycleMappingTest)  Time elapsed: 1.542 s
testDefaultJarLifecycleMapping(org.eclipse.m2e.tests.lifecycle.LifecycleMappingTest)  Time elapsed: 2.649 s
testMissingVersionRangeInPluginExecutionFilter(org.eclipse.m2e.tests.lifecycle.LifecycleMappingTest)  Time elapsed: 1.254 s
testDuplicatePackagingTypeMetadata(org.eclipse.m2e.tests.lifecycle.LifecycleMappingTest)  Time elapsed: 1.115 s
test371618_NullLifecycleMappingPluginVersion(org.eclipse.m2e.tests.lifecycle.LifecycleMappingTest)  Time elapsed: 1.804 s
testNotCoveredMojoExecutionWarnings(org.eclipse.m2e.tests.lifecycle.LifecycleMappingTest)  Time elapsed: 1.645 s
testNotInterestingPhaseConfigurator(org.eclipse.m2e.tests.lifecycle.LifecycleMappingTest)  Time elapsed: 1.444 s
Running org.eclipse.m2e.tests.lifecycle.LifecycleMappingMetadataPrioritiesTest
Tests run: 5, Failures: 0, Errors: 0, Skipped: 0, Time elapsed: 9.634 s - in org.eclipse.m2e.tests.lifecycle.LifecycleMappingMetadataPrioritiesTest
testEclipseExtension(org.eclipse.m2e.tests.lifecycle.LifecycleMappingMetadataPrioritiesTest)  Time elapsed: 2.158 s
testDefaultMetadataSource(org.eclipse.m2e.tests.lifecycle.LifecycleMappingMetadataPrioritiesTest)  Time elapsed: 2.299 s
testEmbeddedInPom(org.eclipse.m2e.tests.lifecycle.LifecycleMappingMetadataPrioritiesTest)  Time elapsed: 1.444 s
testReferencedFromPom(org.eclipse.m2e.tests.lifecycle.LifecycleMappingMetadataPrioritiesTest)  Time elapsed: 1.493 s
testParent(org.eclipse.m2e.tests.lifecycle.LifecycleMappingMetadataPrioritiesTest)  Time elapsed: 2.239 s
Running org.eclipse.m2e.tests.lifecycle.MavenPluginMetadataSourceTest
Tests run: 2, Failures: 0, Errors: 0, Skipped: 0, Time elapsed: 4.927 s - in org.eclipse.m2e.tests.lifecycle.MavenPluginMetadataSourceTest
testBasic(org.eclipse.m2e.tests.lifecycle.MavenPluginMetadataSourceTest)  Time elapsed: 2.05 s
test422135_mavenPluginSourceWorkspaceResolution(org.eclipse.m2e.tests.lifecycle.MavenPluginMetadataSourceTest)  Time elapsed: 2.876 s
Running org.eclipse.m2e.tests.discovery.LifecycleMappingDiscoveryTest
Tests run: 11, Failures: 0, Errors: 0, Skipped: 0, Time elapsed: 20.611 s - in org.eclipse.m2e.tests.discovery.LifecycleMappingDiscoveryTest
testAutomaticSelectionOfSingleProposal(org.eclipse.m2e.tests.discovery.LifecycleMappingDiscoveryTest)  Time elapsed: 1.739 s
testPreselectedProposals(org.eclipse.m2e.tests.discovery.LifecycleMappingDiscoveryTest)  Time elapsed: 2.404 s
testIsMappingComplete(org.eclipse.m2e.tests.discovery.LifecycleMappingDiscoveryTest)  Time elapsed: 1.693 s
testProposalToReplaceDefaultMapping(org.eclipse.m2e.tests.discovery.LifecycleMappingDiscoveryTest)  Time elapsed: 1.455 s
testPackagingPom(org.eclipse.m2e.tests.discovery.LifecycleMappingDiscoveryTest)  Time elapsed: 1.894 s
testAutomaticSelectionWithAmbiguousProposals(org.eclipse.m2e.tests.discovery.LifecycleMappingDiscoveryTest)  Time elapsed: 2.078 s
testDiscoverProjectConfigurators(org.eclipse.m2e.tests.discovery.LifecycleMappingDiscoveryTest)  Time elapsed: 1.511 s
testNoProposals(org.eclipse.m2e.tests.discovery.LifecycleMappingDiscoveryTest)  Time elapsed: 3.104 s
testProposalMatching(org.eclipse.m2e.tests.discovery.LifecycleMappingDiscoveryTest)  Time elapsed: 1.57 s
testDiscoverLifecycleMappingStrategy(org.eclipse.m2e.tests.discovery.LifecycleMappingDiscoveryTest)  Time elapsed: 1.61 s
testDefaultNonConfiguratorMapping(org.eclipse.m2e.tests.discovery.LifecycleMappingDiscoveryTest)  Time elapsed: 1.553 s
Running org.eclipse.m2e.tests.discovery.MavenDiscoveryMarkerResolutionGeneratorTest
Tests run: 4, Failures: 0, Errors: 0, Skipped: 0, Time elapsed: 7.804 s - in org.eclipse.m2e.tests.discovery.MavenDiscoveryMarkerResolutionGeneratorTest
testCanResolveMojoExecutionMarker(org.eclipse.m2e.tests.discovery.MavenDiscoveryMarkerResolutionGeneratorTest)  Time elapsed: 1.573 s
testCanResolveConfiguratorMarker(org.eclipse.m2e.tests.discovery.MavenDiscoveryMarkerResolutionGeneratorTest)  Time elapsed: 1.562 s
testResolveMultipleMarkers(org.eclipse.m2e.tests.discovery.MavenDiscoveryMarkerResolutionGeneratorTest)  Time elapsed: 3.091 s
testCanResolveLifecycleIdMarker(org.eclipse.m2e.tests.discovery.MavenDiscoveryMarkerResolutionGeneratorTest)  Time elapsed: 1.577 s
Running org.eclipse.m2e.tests.discovery.MavenDiscoveryInstallOperationTest
Tests run: 5, Failures: 0, Errors: 0, Skipped: 0, Time elapsed: 0.525 s - in org.eclipse.m2e.tests.discovery.MavenDiscoveryInstallOperationTest
testMissingRepository(org.eclipse.m2e.tests.discovery.MavenDiscoveryInstallOperationTest)  Time elapsed: 0.157 s
testMatchNoVersion(org.eclipse.m2e.tests.discovery.MavenDiscoveryInstallOperationTest)  Time elapsed: 0.191 s
testMatchHighestVersion(org.eclipse.m2e.tests.discovery.MavenDiscoveryInstallOperationTest)  Time elapsed: 0.055 s
testMissingIU(org.eclipse.m2e.tests.discovery.MavenDiscoveryInstallOperationTest)  Time elapsed: 0.059 s
testMatchLowestVersion(org.eclipse.m2e.tests.discovery.MavenDiscoveryInstallOperationTest)  Time elapsed: 0.058 s
Running org.eclipse.m2e.tests.discovery.ConfigurationUpdateStartupTest
Tests run: 6, Failures: 0, Errors: 0, Skipped: 0, Time elapsed: 10.277 s - in org.eclipse.m2e.tests.discovery.ConfigurationUpdateStartupTest
testNoMavenProjects(org.eclipse.m2e.tests.discovery.ConfigurationUpdateStartupTest)  Time elapsed: 1.179 s
testToggleEarlyStartup(org.eclipse.m2e.tests.discovery.ConfigurationUpdateStartupTest)  Time elapsed: 1.149 s
testMavenProjectsErrors(org.eclipse.m2e.tests.discovery.ConfigurationUpdateStartupTest)  Time elapsed: 3.268 s
testConfigureSpecifiedProjects(org.eclipse.m2e.tests.discovery.ConfigurationUpdateStartupTest)  Time elapsed: 1.031 s
testMavenProjectsNoErrors(org.eclipse.m2e.tests.discovery.ConfigurationUpdateStartupTest)  Time elapsed: 2.09 s
testEmptyWorkspace(org.eclipse.m2e.tests.discovery.ConfigurationUpdateStartupTest)  Time elapsed: 1.559 s
Running org.eclipse.m2e.tests.discovery.MavenDiscoveryTest
Tests run: 9, Failures: 0, Errors: 0, Skipped: 0, Time elapsed: 0.52 s - in org.eclipse.m2e.tests.discovery.MavenDiscoveryTest
testCatalogSelectedByConfiguratorId(org.eclipse.m2e.tests.discovery.MavenDiscoveryTest)  Time elapsed: 0.091 s
testCatalogItemWithoutMappingMetadata(org.eclipse.m2e.tests.discovery.MavenDiscoveryTest)  Time elapsed: 0.002 s
testCatalogItemExtensionsMetadata(org.eclipse.m2e.tests.discovery.MavenDiscoveryTest)  Time elapsed: 0.002 s
testNotMatchPluginSelection(org.eclipse.m2e.tests.discovery.MavenDiscoveryTest)  Time elapsed: 0.064 s
testCatalogSelectedByLifecycleId(org.eclipse.m2e.tests.discovery.MavenDiscoveryTest)  Time elapsed: 0.075 s
testMultipleSelections(org.eclipse.m2e.tests.discovery.MavenDiscoveryTest)  Time elapsed: 0.082 s
testCatalogSelectedByPackaging(org.eclipse.m2e.tests.discovery.MavenDiscoveryTest)  Time elapsed: 0.072 s
testCatalogSelectedByMojoExecution(org.eclipse.m2e.tests.discovery.MavenDiscoveryTest)  Time elapsed: 0.074 s
testCatalogUnselected(org.eclipse.m2e.tests.discovery.MavenDiscoveryTest)  Time elapsed: 0.057 s
Running org.eclipse.m2e.tests.project.MavenProjectFacadeTest
Tests run: 9, Failures: 0, Errors: 0, Skipped: 0, Time elapsed: 16.457 s - in org.eclipse.m2e.tests.project.MavenProjectFacadeTest
testGetProjectConfiguratorsAfterWorkspaceRestart(org.eclipse.m2e.tests.project.MavenProjectFacadeTest)  Time elapsed: 1.66 s
testGetMojoExecutionAfterWorkspaceRestart(org.eclipse.m2e.tests.project.MavenProjectFacadeTest)  Time elapsed: 1.728 s
testGetMojoExecutionsWithoutMavenExecutionContext(org.eclipse.m2e.tests.project.MavenProjectFacadeTest)  Time elapsed: 1.502 s
testGetProjectConfigurators(org.eclipse.m2e.tests.project.MavenProjectFacadeTest)  Time elapsed: 1.62 s
test436668_EclipseProjectMetadataNotStale(org.eclipse.m2e.tests.project.MavenProjectFacadeTest)  Time elapsed: 1.561 s
testGetMojoExecution(org.eclipse.m2e.tests.project.MavenProjectFacadeTest)  Time elapsed: 2.375 s
testGetMojoExecutions(org.eclipse.m2e.tests.project.MavenProjectFacadeTest)  Time elapsed: 1.97 s
testIsStale(org.eclipse.m2e.tests.project.MavenProjectFacadeTest)  Time elapsed: 2.146 s
testGetMojoExecutionsAfterWorkspaceRestart(org.eclipse.m2e.tests.project.MavenProjectFacadeTest)  Time elapsed: 1.894 s
Running org.eclipse.m2e.tests.project.CompilerSettings18Test
Tests run: 1, Failures: 0, Errors: 0, Skipped: 0, Time elapsed: 1.849 s - in org.eclipse.m2e.tests.project.CompilerSettings18Test
testCompilerSettings18(org.eclipse.m2e.tests.project.CompilerSettings18Test)  Time elapsed: 1.849 s
Running org.eclipse.m2e.tests.project.MavenProjectInfoTest
Tests run: 1, Failures: 0, Errors: 0, Skipped: 0, Time elapsed: 0.001 s - in org.eclipse.m2e.tests.project.MavenProjectInfoTest
testTwoChildProjectInfosWithSameLabel(org.eclipse.m2e.tests.project.MavenProjectInfoTest)  Time elapsed: 0.001 s
Running org.eclipse.m2e.tests.project.CompilerSynonymTest
Tests run: 1, Failures: 0, Errors: 0, Skipped: 0, Time elapsed: 1.774 s - in org.eclipse.m2e.tests.project.CompilerSynonymTest
testSynonym(org.eclipse.m2e.tests.project.CompilerSynonymTest)  Time elapsed: 1.774 s
Running org.eclipse.m2e.tests.jdt.ProjectLayoutTest
Tests run: 1, Failures: 0, Errors: 0, Skipped: 0, Time elapsed: 3.344 s - in org.eclipse.m2e.tests.jdt.ProjectLayoutTest
test472726_basedirResources(org.eclipse.m2e.tests.jdt.ProjectLayoutTest)  Time elapsed: 3.344 s
Running org.eclipse.m2e.tests.jdt.internal.ClasspathEntryDescriptorTest
Tests run: 1, Failures: 0, Errors: 0, Skipped: 0, Time elapsed: 0.001 s - in org.eclipse.m2e.tests.jdt.internal.ClasspathEntryDescriptorTest
testArtifactKeyDeserialization(org.eclipse.m2e.tests.jdt.internal.ClasspathEntryDescriptorTest)  Time elapsed: 0 s
Running org.eclipse.m2e.tests.jdt.internal.MavenClasspathContainerSaveHelperTest
Tests run: 1, Failures: 0, Errors: 0, Skipped: 0, Time elapsed: 0.003 s - in org.eclipse.m2e.tests.jdt.internal.MavenClasspathContainerSaveHelperTest
testClasspathContainerSace(org.eclipse.m2e.tests.jdt.internal.MavenClasspathContainerSaveHelperTest)  Time elapsed: 0.003 s
Running org.eclipse.m2e.tests.jdt.JavaClasspathTest
Tests run: 22, Failures: 0, Errors: 0, Skipped: 0, Time elapsed: 53.089 s - in org.eclipse.m2e.tests.jdt.JavaClasspathTest
testStaleDerivedEntries(org.eclipse.m2e.tests.jdt.JavaClasspathTest)  Time elapsed: 2.99 s
test398121_PreserveOrderOfClasspathContainersOnUpdate(org.eclipse.m2e.tests.jdt.JavaClasspathTest)  Time elapsed: 2.479 s
test370685_PreserveResourcesOnUpdate(org.eclipse.m2e.tests.jdt.JavaClasspathTest)  Time elapsed: 2.269 s
test480137_addingResourceFoldersAreNotRemovedDuringConfigurationUpdate(org.eclipse.m2e.tests.jdt.JavaClasspathTest)  Time elapsed: 2.371 s
test537851_DisableTestClasspathFlag(org.eclipse.m2e.tests.jdt.JavaClasspathTest)  Time elapsed: 2.687 s
test526858_ProjectExportingTests(org.eclipse.m2e.tests.jdt.JavaClasspathTest)  Time elapsed: 3.423 s
test466518_classpathJREOrder(org.eclipse.m2e.tests.jdt.JavaClasspathTest)  Time elapsed: 2.89 s
test518218_configureMethodParametersGenerationWithCompilerArgs(org.eclipse.m2e.tests.jdt.JavaClasspathTest)  Time elapsed: 3.642 s
test518218_configureMethodParametersGenerationWithParameters(org.eclipse.m2e.tests.jdt.JavaClasspathTest)  Time elapsed: 1.645 s
test388541_KeepClasspathAttributes(org.eclipse.m2e.tests.jdt.JavaClasspathTest)  Time elapsed: 2.249 s
test526858_TestClasspathAttributeOnProject(org.eclipse.m2e.tests.jdt.JavaClasspathTest)  Time elapsed: 2.101 s
test526858_TestClasspathAttributeOnJar(org.eclipse.m2e.tests.jdt.JavaClasspathTest)  Time elapsed: 3.263 s
test518218_configureMethodParametersGenerationWithCompilerArgument(org.eclipse.m2e.tests.jdt.JavaClasspathTest)  Time elapsed: 1.561 s
testClasspathContainers(org.eclipse.m2e.tests.jdt.JavaClasspathTest)  Time elapsed: 1.753 s
test414645_TestClasspathAttributeOnRuntimeProjectDependencies(org.eclipse.m2e.tests.jdt.JavaClasspathTest)  Time elapsed: 1.911 s
test394042_ClasspathEntry4(org.eclipse.m2e.tests.jdt.JavaClasspathTest)  Time elapsed: 1.728 s
test414645_TestClasspathAttributeOnRuntimeJarDependencies(org.eclipse.m2e.tests.jdt.JavaClasspathTest)  Time elapsed: 1.82 s
test525880_JavaAccessRulesArePreservedOnUpdate(org.eclipse.m2e.tests.jdt.JavaClasspathTest)  Time elapsed: 2.772 s
test534049_SetReleaseFlag(org.eclipse.m2e.tests.jdt.JavaClasspathTest)  Time elapsed: 3.047 s
test549312_fallbackToLatestEE(org.eclipse.m2e.tests.jdt.JavaClasspathTest)  Time elapsed: 1.853 s
testImport(org.eclipse.m2e.tests.jdt.JavaClasspathTest)  Time elapsed: 2.214 s
test486739_PreserveExportedOnUpdate(org.eclipse.m2e.tests.jdt.JavaClasspathTest)  Time elapsed: 2.421 s
Running org.eclipse.m2e.tests.jdt.JavaCodeGenerationProjectConfiguratorTest
Tests run: 1, Failures: 0, Errors: 0, Skipped: 0, Time elapsed: 2.543 s - in org.eclipse.m2e.tests.jdt.JavaCodeGenerationProjectConfiguratorTest
test368333_generatedSourcesFoldersAreNotRemovedDuringConfigurationUpdate(org.eclipse.m2e.tests.jdt.JavaCodeGenerationProjectConfiguratorTest)  Time elapsed: 2.543 s
Running org.eclipse.m2e.tests.MutableProjectRegistryTest
Tests run: 8, Failures: 0, Errors: 0, Skipped: 0, Time elapsed: 10.135 s - in org.eclipse.m2e.tests.MutableProjectRegistryTest
testRemoveProject(org.eclipse.m2e.tests.MutableProjectRegistryTest)  Time elapsed: 1.244 s
testReplaceProject(org.eclipse.m2e.tests.MutableProjectRegistryTest)  Time elapsed: 1.169 s
testIllegalStateMerge(org.eclipse.m2e.tests.MutableProjectRegistryTest)  Time elapsed: 1.051 s
testForeignClassesInSerializedProjectRegistry(org.eclipse.m2e.tests.MutableProjectRegistryTest)  Time elapsed: 1.857 s
testDetectNoLongerExistingProjectsInWorkspaceState(org.eclipse.m2e.tests.MutableProjectRegistryTest)  Time elapsed: 1.271 s
testAddProject(org.eclipse.m2e.tests.MutableProjectRegistryTest)  Time elapsed: 1.03 s
testSaveParticipant(org.eclipse.m2e.tests.MutableProjectRegistryTest)  Time elapsed: 1.207 s
testRemoveUnknownProject(org.eclipse.m2e.tests.MutableProjectRegistryTest)  Time elapsed: 1.306 s
Running org.eclipse.m2e.tests.BuildPathManagerTest
[INFO] ----------------------------------------------------------------------------
[INFO] Using following parameters for creating project from Old (1.x) Archetype: maven-archetype-quickstart:1.1
[INFO] ----------------------------------------------------------------------------
[INFO] Parameter: basedir, Value: /home/jenkins/agent/workspace/m2e_master/m2e-core-tests/org.eclipse.m2e.tests/target/work/data
[INFO] Parameter: package, Value: jar
[INFO] Parameter: groupId, Value: archetype-project
[INFO] Parameter: artifactId, Value: archetype-project
[INFO] Parameter: packageName, Value: jar
[INFO] Parameter: version, Value: 0.0.1-SNAPSHOT
[INFO] project created from Old (1.x) Archetype in dir: /home/jenkins/agent/workspace/m2e_master/m2e-core-tests/org.eclipse.m2e.tests/target/work/data/archetype-project
[INFO] ----------------------------------------------------------------------------
[INFO] Using following parameters for creating project from Old (1.x) Archetype: maven-archetype-quickstart:1.1
[INFO] ----------------------------------------------------------------------------
[INFO] Parameter: basedir, Value: /tmp/m2eclipse9523394799625114684test/external-archetype-project-1
[INFO] Parameter: package, Value: jar
[INFO] Parameter: groupId, Value: external-archetype-project-1
[INFO] Parameter: artifactId, Value: external-archetype-project-1
[INFO] Parameter: packageName, Value: jar
[INFO] Parameter: version, Value: 0.0.1-SNAPSHOT
[INFO] project created from Old (1.x) Archetype in dir: /tmp/m2eclipse9523394799625114684test/external-archetype-project-1/external-archetype-project-1
[INFO] ----------------------------------------------------------------------------
[INFO] Using following parameters for creating project from Old (1.x) Archetype: maven-archetype-quickstart:1.1
[INFO] ----------------------------------------------------------------------------
[INFO] Parameter: basedir, Value: /tmp/m2eclipse9523394799625114684test/external-archetype-project-2
[INFO] Parameter: package, Value: jar
[INFO] Parameter: groupId, Value: external-archetype-project-2
[INFO] Parameter: artifactId, Value: external-archetype-project-2
[INFO] Parameter: packageName, Value: jar
[INFO] Parameter: version, Value: 0.0.1-SNAPSHOT
Tests run: 45, Failures: 0, Errors: 1, Skipped: 1, Time elapsed: 110.958 s <<< FAILURE! - in org.eclipse.m2e.tests.BuildPathManagerTest
testDownloadSources_001_workspaceRestart(org.eclipse.m2e.tests.BuildPathManagerTest)  Time elapsed: 3.153 s
testEnableMavenNatureWithNoWorkspace(org.eclipse.m2e.tests.BuildPathManagerTest)  Time elapsed: 2.373 s
test385391_keepCustomSourceEncoding(org.eclipse.m2e.tests.BuildPathManagerTest)  Time elapsed: 3.174 s
testProjectImportWithProfile1(org.eclipse.m2e.tests.BuildPathManagerTest)  Time elapsed: 2.814 s
testProjectImportWithProfile2(org.eclipse.m2e.tests.BuildPathManagerTest)  Time elapsed: 2.305 s
testProjectNameWithNameTemplate(org.eclipse.m2e.tests.BuildPathManagerTest)  Time elapsed: 1.787 s
testProjectImport001_useMavenOutputFolders(org.eclipse.m2e.tests.BuildPathManagerTest)  Time elapsed: 1.807 s
testArchetypeProject(org.eclipse.m2e.tests.BuildPathManagerTest)  Time elapsed: 2.911 s
testClasspathOrderWorkspace001(org.eclipse.m2e.tests.BuildPathManagerTest)  Time elapsed: 4.459 s
testClasspathOrderWorkspace003(org.eclipse.m2e.tests.BuildPathManagerTest)  Time elapsed: 2.204 s
testDownloadSources_001_sourceAttachment(org.eclipse.m2e.tests.BuildPathManagerTest)  Time elapsed: 1.691 s
testMNGECLIPSE_2367_same_sources_resources(org.eclipse.m2e.tests.BuildPathManagerTest)  Time elapsed: 2.324 s
test360962_forbiddenReferencePreference(org.eclipse.m2e.tests.BuildPathManagerTest)  Time elapsed: 2.503 s
test388596_expandedSnapshotDependency(org.eclipse.m2e.tests.BuildPathManagerTest)  Time elapsed: 3.123 s
test359725_resourcesWorkspaceRoot(org.eclipse.m2e.tests.BuildPathManagerTest)  Time elapsed: 2.012 s
testClassifiers(org.eclipse.m2e.tests.BuildPathManagerTest)  Time elapsed: 3.174 s
test486721_overlappingResourceFolders(org.eclipse.m2e.tests.BuildPathManagerTest)  Time elapsed: 1.903 s
test005_dependencyAvailableFromLocalRepoAndWorkspace(org.eclipse.m2e.tests.BuildPathManagerTest)  Time elapsed: 4.409 s
testDisableMavenNature(org.eclipse.m2e.tests.BuildPathManagerTest)  Time elapsed: 2.032 s
testDownloadSources_001_basic(org.eclipse.m2e.tests.BuildPathManagerTest)  Time elapsed: 4.987 s
testDownloadSources_003_customRemoteRepository(org.eclipse.m2e.tests.BuildPathManagerTest)  Time elapsed: 2.158 s
_testProjectImport002_useMavenOutputFolders(org.eclipse.m2e.tests.BuildPathManagerTest) skipped
testMNGECLIPSE_2367_sources_encloses_resources(org.eclipse.m2e.tests.BuildPathManagerTest)  Time elapsed: 1.853 s
testDownloadSources_006_nonMavenProject(org.eclipse.m2e.tests.BuildPathManagerTest)  Time elapsed: 2.835 s  <<< ERROR!
org.eclipse.core.runtime.CoreException: Reindexing error
	at org.eclipse.m2e.tests.BuildPathManagerTest.testDownloadSources_006_nonMavenProject(BuildPathManagerTest.java:656)
Caused by: java.nio.channels.OverlappingFileLockException
	at org.eclipse.m2e.tests.BuildPathManagerTest.testDownloadSources_006_nonMavenProject(BuildPathManagerTest.java:656)

testCompilerSettings14(org.eclipse.m2e.tests.BuildPathManagerTest)  Time elapsed: 1.571 s
testSimpleProjectInExternalLocation(org.eclipse.m2e.tests.BuildPathManagerTest)  Time elapsed: 2.356 s
testDownloadSources_007_missingTestsSources(org.eclipse.m2e.tests.BuildPathManagerTest)  Time elapsed: 2.679 s
testMNGECLIPSE_696_compiler_includes_excludes(org.eclipse.m2e.tests.BuildPathManagerTest)  Time elapsed: 2.214 s
test431080_flatDirectoryLayout(org.eclipse.m2e.tests.BuildPathManagerTest)  Time elapsed: 1.56 s
testDownloadSources_005_classifier(org.eclipse.m2e.tests.BuildPathManagerTest)  Time elapsed: 2.055 s
testDownloadSources_008_fallbackToJavadocWhenMissingSources(org.eclipse.m2e.tests.BuildPathManagerTest)  Time elapsed: 2.956 s
testArchetypeProjectInExternalLocation(org.eclipse.m2e.tests.BuildPathManagerTest)  Time elapsed: 2.545 s
testMNGECLIPSE_2367_testSources_encloses_resources(org.eclipse.m2e.tests.BuildPathManagerTest)  Time elapsed: 1.705 s
testCompilerSettingsJsr14(org.eclipse.m2e.tests.BuildPathManagerTest)  Time elapsed: 2.028 s
testProjectNameTemplateWithProperties(org.eclipse.m2e.tests.BuildPathManagerTest)  Time elapsed: 2.704 s
testDownloadSources_002_javadoconly(org.eclipse.m2e.tests.BuildPathManagerTest)  Time elapsed: 2.281 s
testMavenBuilderOrder(org.eclipse.m2e.tests.BuildPathManagerTest)  Time elapsed: 3.965 s
testDownloadSources_004_testsClassifier(org.eclipse.m2e.tests.BuildPathManagerTest)  Time elapsed: 2.58 s
testEnableMavenNature(org.eclipse.m2e.tests.BuildPathManagerTest)  Time elapsed: 2.479 s
testProjectNameTemplate(org.eclipse.m2e.tests.BuildPathManagerTest)  Time elapsed: 2.581 s
testMNGECLIPSE_1047_localRepoPath(org.eclipse.m2e.tests.BuildPathManagerTest)  Time elapsed: 1.637 s
testCreateSimpleProject(org.eclipse.m2e.tests.BuildPathManagerTest)  Time elapsed: 1.687 s
testMNGECLIPSE_2433_resourcesOutsideBasdir(org.eclipse.m2e.tests.BuildPathManagerTest)  Time elapsed: 2.588 s
testUpdateProjectConfigurationWithWorkspace(org.eclipse.m2e.tests.BuildPathManagerTest)  Time elapsed: 2.974 s
test486721_sourceAndResourceUnderSameNonDefaultFolder(org.eclipse.m2e.tests.BuildPathManagerTest)  Time elapsed: 1.819 s
Running org.eclipse.m2e.tests.ProjectConfigurationManagerTest
[INFO] ----------------------------------------------------------------------------
[INFO] Using following parameters for creating project from Archetype: mngeclipse-2110:1.0
[INFO] ----------------------------------------------------------------------------
[INFO] Parameter: groupId, Value: mngeclipse-2110
[INFO] Parameter: artifactId, Value: mngeclipse-2110
[INFO] Parameter: version, Value: 0.0.1-SNAPSHOT
[INFO] Parameter: package, Value: jar
[INFO] Parameter: packageInPathFormat, Value: jar
[INFO] project created from Archetype in dir: /home/jenkins/agent/workspace/m2e_master/m2e-core-tests/org.eclipse.m2e.tests/target/work/data/mngeclipse-2110
[INFO] ----------------------------------------------------------------------------
[INFO] Using following parameters for creating project from Old (1.x) Archetype: maven-archetype-quickstart:1.1
[INFO] ----------------------------------------------------------------------------
[INFO] Parameter: basedir, Value: /home/jenkins/agent/workspace/m2e_master/m2e-core-tests/org.eclipse.m2e.tests/target/work/data/parent002
[INFO] Parameter: package, Value: jar
[INFO] Parameter: groupId, Value: archetyped
[INFO] Parameter: artifactId, Value: archetyped
[INFO] Parameter: packageName, Value: jar
[INFO] Parameter: version, Value: 0.0.1-SNAPSHOT
[INFO] project created from Old (1.x) Archetype in dir: /home/jenkins/agent/workspace/m2e_master/m2e-core-tests/org.eclipse.m2e.tests/target/work/data/parent002/archetyped
Tests run: 23, Failures: 0, Errors: 0, Skipped: 0, Time elapsed: 73.49 s - in org.eclipse.m2e.tests.ProjectConfigurationManagerTest
testAddRemoveMavenBuilder(org.eclipse.m2e.tests.ProjectConfigurationManagerTest)  Time elapsed: 1.127 s
testImportJavaProjectWithUnknownPackaging(org.eclipse.m2e.tests.ProjectConfigurationManagerTest)  Time elapsed: 4.208 s
testHiddenFolderForSimpleModule(org.eclipse.m2e.tests.ProjectConfigurationManagerTest)  Time elapsed: 3.13 s
testConfigureProjectEncodingForBasicProject(org.eclipse.m2e.tests.ProjectConfigurationManagerTest)  Time elapsed: 2.58 s
testAddRemoveMavenBuilderDisabled(org.eclipse.m2e.tests.ProjectConfigurationManagerTest)  Time elapsed: 1.173 s
testExtractionOfCompilerSettingsDespiteErrorsInExecutionPlan(org.eclipse.m2e.tests.ProjectConfigurationManagerTest)  Time elapsed: 1.532 s
testRevertToContainerDefinedEncoding(org.eclipse.m2e.tests.ProjectConfigurationManagerTest)  Time elapsed: 2.306 s
testIgnoreStaleProjectConfiguration(org.eclipse.m2e.tests.ProjectConfigurationManagerTest)  Time elapsed: 1.794 s
test397251_forcePluginResolutionUpdate(org.eclipse.m2e.tests.ProjectConfigurationManagerTest)  Time elapsed: 11.139 s
testResolutionOfArchetypeFromRepository(org.eclipse.m2e.tests.ProjectConfigurationManagerTest)  Time elapsed: 11.347 s
testStaleProjectConfigurationMarkerAfterFixingMissingBuildExtension(org.eclipse.m2e.tests.ProjectConfigurationManagerTest)  Time elapsed: 3.023 s
test447460MultipleUpdateConfiguration(org.eclipse.m2e.tests.ProjectConfigurationManagerTest)  Time elapsed: 2.045 s
testHiddenFolderForArchetypeModule(org.eclipse.m2e.tests.ProjectConfigurationManagerTest)  Time elapsed: 2.654 s
testStaleProjectConfigurationMarkerAfterWorkspaceRestart(org.eclipse.m2e.tests.ProjectConfigurationManagerTest)  Time elapsed: 2.655 s
testStaleProjectConfigurationWarningMarker(org.eclipse.m2e.tests.ProjectConfigurationManagerTest)  Time elapsed: 2.713 s
testAutomaticUpdateProjectConfigurationMarker(org.eclipse.m2e.tests.ProjectConfigurationManagerTest)  Time elapsed: 2.679 s
test473953_ProjectCreationListener(org.eclipse.m2e.tests.ProjectConfigurationManagerTest)  Time elapsed: 2.471 s
testWorkspaceResolutionOfInterModuleDependenciesDuringImport(org.eclipse.m2e.tests.ProjectConfigurationManagerTest)  Time elapsed: 3.901 s
testBasedirRenameRequired(org.eclipse.m2e.tests.ProjectConfigurationManagerTest)  Time elapsed: 2.821 s
testStaleProjectConfigurationMarker(org.eclipse.m2e.tests.ProjectConfigurationManagerTest)  Time elapsed: 2.865 s
testKeepEncodingSetByUserForSubfoldersAndFiles(org.eclipse.m2e.tests.ProjectConfigurationManagerTest)  Time elapsed: 1.852 s
testBasedirRenameNo(org.eclipse.m2e.tests.ProjectConfigurationManagerTest)  Time elapsed: 1.645 s
testBasicUpdateConfiguration(org.eclipse.m2e.tests.ProjectConfigurationManagerTest)  Time elapsed: 1.828 s
Running org.eclipse.m2e.tests.ProjectRegistryRefreshJobTest
Tests run: 10, Failures: 0, Errors: 0, Skipped: 0, Time elapsed: 36.534 s - in org.eclipse.m2e.tests.ProjectRegistryRefreshJobTest
test436679_NoRefreshWhenImport(org.eclipse.m2e.tests.ProjectRegistryRefreshJobTest)  Time elapsed: 2.767 s
test445675_autobuild(org.eclipse.m2e.tests.ProjectRegistryRefreshJobTest)  Time elapsed: 3.532 s
testMultiProject(org.eclipse.m2e.tests.ProjectRegistryRefreshJobTest)  Time elapsed: 5.079 s
testRefreshAfterOpen(org.eclipse.m2e.tests.ProjectRegistryRefreshJobTest)  Time elapsed: 2.686 s
testUpdateForced(org.eclipse.m2e.tests.ProjectRegistryRefreshJobTest)  Time elapsed: 3.651 s
test416050_ignoreNonMavenProjectChanges(org.eclipse.m2e.tests.ProjectRegistryRefreshJobTest)  Time elapsed: 1.877 s
testDependencyAdded_NoUpdate(org.eclipse.m2e.tests.ProjectRegistryRefreshJobTest)  Time elapsed: 4.42 s
testXXXX_projectRenameRefresh(org.eclipse.m2e.tests.ProjectRegistryRefreshJobTest)  Time elapsed: 3.609 s
test437493_NoRefreshWhenInitClasspathContainer(org.eclipse.m2e.tests.ProjectRegistryRefreshJobTest)  Time elapsed: 5.112 s
testUpdateNotForced(org.eclipse.m2e.tests.ProjectRegistryRefreshJobTest)  Time elapsed: 3.801 s
Running org.eclipse.m2e.tests.conversion.ProjectConversionManagerTest
Tests run: 3, Failures: 0, Errors: 0, Skipped: 0, Time elapsed: 3.673 s - in org.eclipse.m2e.tests.conversion.ProjectConversionManagerTest
test393613_SortConversionParticipants(org.eclipse.m2e.tests.conversion.ProjectConversionManagerTest)  Time elapsed: 1.133 s
testConversionParticipantsPerProject(org.eclipse.m2e.tests.conversion.ProjectConversionManagerTest)  Time elapsed: 1.33 s
testRestrictedPackagings(org.eclipse.m2e.tests.conversion.ProjectConversionManagerTest)  Time elapsed: 1.209 s
Running org.eclipse.m2e.tests.conversion.ProjectConversionTest
Tests run: 7, Failures: 0, Errors: 0, Skipped: 0, Time elapsed: 19.561 s - in org.eclipse.m2e.tests.conversion.ProjectConversionTest
testMultipleSourcesProjectConversion(org.eclipse.m2e.tests.conversion.ProjectConversionTest)  Time elapsed: 2.985 s
testProjectConversionWithSvn(org.eclipse.m2e.tests.conversion.ProjectConversionTest)  Time elapsed: 2.287 s
testJavaMixedWithResourcesProjectConversion(org.eclipse.m2e.tests.conversion.ProjectConversionTest)  Time elapsed: 2.553 s
testInheritJavaSettingsDuringConversion(org.eclipse.m2e.tests.conversion.ProjectConversionTest)  Time elapsed: 3.373 s
testOptionalSourceProjectConversion(org.eclipse.m2e.tests.conversion.ProjectConversionTest)  Time elapsed: 2.746 s
testNoCustomizationNeededProjectConversion(org.eclipse.m2e.tests.conversion.ProjectConversionTest)  Time elapsed: 2.828 s
testMavenLayoutProjectConversion(org.eclipse.m2e.tests.conversion.ProjectConversionTest)  Time elapsed: 2.789 s
Running org.eclipse.m2e.tests.conversion.ProjectConversionEnablerTest
Tests run: 3, Failures: 0, Errors: 0, Skipped: 0, Time elapsed: 3.947 s - in org.eclipse.m2e.tests.conversion.ProjectConversionEnablerTest
testProjectCanBeConverted(org.eclipse.m2e.tests.conversion.ProjectConversionEnablerTest)  Time elapsed: 1.554 s
testProjectCannotBeConverted(org.eclipse.m2e.tests.conversion.ProjectConversionEnablerTest)  Time elapsed: 1.219 s
testEnablerNotFound(org.eclipse.m2e.tests.conversion.ProjectConversionEnablerTest)  Time elapsed: 1.174 s
Running org.eclipse.m2e.tests.launch.MavenRuntimeClasspathProviderTest
Tests run: 7, Failures: 0, Errors: 0, Skipped: 0, Time elapsed: 21.322 s - in org.eclipse.m2e.tests.launch.MavenRuntimeClasspathProviderTest
testAddJUnit5DependenciesWithEngine(org.eclipse.m2e.tests.launch.MavenRuntimeClasspathProviderTest)  Time elapsed: 3.672 s
testClasspathScopeRuntime(org.eclipse.m2e.tests.launch.MavenRuntimeClasspathProviderTest)  Time elapsed: 2.856 s
testAddJUnit5DependenciesAPIOnlyDisabled(org.eclipse.m2e.tests.launch.MavenRuntimeClasspathProviderTest)  Time elapsed: 2.981 s
testAddJUnit5DependenciesWithLauncher(org.eclipse.m2e.tests.launch.MavenRuntimeClasspathProviderTest)  Time elapsed: 1.719 s
testClasspathScopeTest(org.eclipse.m2e.tests.launch.MavenRuntimeClasspathProviderTest)  Time elapsed: 3.858 s
testAddJUnit5DependenciesAggregator(org.eclipse.m2e.tests.launch.MavenRuntimeClasspathProviderTest)  Time elapsed: 4.624 s
testAddJUnit5DependenciesAPIOnly(org.eclipse.m2e.tests.launch.MavenRuntimeClasspathProviderTest)  Time elapsed: 1.611 s
Running org.eclipse.m2e.tests.launch.MavenLaunchDelegateTest
Tests run: 6, Failures: 0, Errors: 0, Skipped: 0, Time elapsed: 0.024 s - in org.eclipse.m2e.tests.launch.MavenLaunchDelegateTest
testGetVMArguments332WithParent(org.eclipse.m2e.tests.launch.MavenLaunchDelegateTest)  Time elapsed: 0.003 s
testGetVMArgumentsSubstituteMultiModuleDir(org.eclipse.m2e.tests.launch.MavenLaunchDelegateTest)  Time elapsed: 0.002 s
testUserSettingsProgramArguments(org.eclipse.m2e.tests.launch.MavenLaunchDelegateTest)  Time elapsed: 0.01 s
testGlobalSettingsProgramArguments(org.eclipse.m2e.tests.launch.MavenLaunchDelegateTest)  Time elapsed: 0.008 s
testGetVMArguments325(org.eclipse.m2e.tests.launch.MavenLaunchDelegateTest)  Time elapsed: 0 s
testGetVMArguments331(org.eclipse.m2e.tests.launch.MavenLaunchDelegateTest)  Time elapsed: 0 s
Running org.eclipse.m2e.tests.launch.LaunchingUtilsTest
Tests run: 1, Failures: 0, Errors: 0, Skipped: 0, Time elapsed: 1.305 s - in org.eclipse.m2e.tests.launch.LaunchingUtilsTest
testGenerateProjectLocationVariableExpression(org.eclipse.m2e.tests.launch.LaunchingUtilsTest)  Time elapsed: 1.305 s
Running org.eclipse.m2e.tests.launch.MavenLauncherConfigurationHandlerTest
Tests run: 1, Failures: 0, Errors: 0, Skipped: 0, Time elapsed: 1.995 s - in org.eclipse.m2e.tests.launch.MavenLauncherConfigurationHandlerTest
test421015_workspaceProjectLibraryClasspathEntries(org.eclipse.m2e.tests.launch.MavenLauncherConfigurationHandlerTest)  Time elapsed: 1.995 s
Running org.eclipse.m2e.tests.archetype.ArchetypeManagerTest
Tests run: 12, Failures: 0, Errors: 0, Skipped: 0, Time elapsed: 1.336 s - in org.eclipse.m2e.tests.archetype.ArchetypeManagerTest
test371775_archetypeRepoAuthentication(org.eclipse.m2e.tests.archetype.ArchetypeManagerTest)  Time elapsed: 0.006 s
testEmbeddedLocalArchetypeCatalogFactory(org.eclipse.m2e.tests.archetype.ArchetypeManagerTest)  Time elapsed: 0.001 s
testArchetypeManagerSaveRestore(org.eclipse.m2e.tests.archetype.ArchetypeManagerTest)  Time elapsed: 0.643 s
testRepositoryUrlFromRemoteArchetypeCatalogs(org.eclipse.m2e.tests.archetype.ArchetypeManagerTest)  Time elapsed: 0.004 s
testArchetypeManager(org.eclipse.m2e.tests.archetype.ArchetypeManagerTest)  Time elapsed: 0.555 s
testAddRemoteCatalog(org.eclipse.m2e.tests.archetype.ArchetypeManagerTest)  Time elapsed: 0.004 s
testActiveArchetypeCatalogs(org.eclipse.m2e.tests.archetype.ArchetypeManagerTest)  Time elapsed: 0.005 s
testBadLocalArchetypeCatalogFactory(org.eclipse.m2e.tests.archetype.ArchetypeManagerTest)  Time elapsed: 0 s
testRemoteArchetypeCatalogFactory(org.eclipse.m2e.tests.archetype.ArchetypeManagerTest)  Time elapsed: 0 s
test359855_localArchetypeWithProperties(org.eclipse.m2e.tests.archetype.ArchetypeManagerTest)  Time elapsed: 0.032 s
testLocalArchetypeCatalogFactory(org.eclipse.m2e.tests.archetype.ArchetypeManagerTest)  Time elapsed: 0 s
test387784_remoteArchetypeWithProperties(org.eclipse.m2e.tests.archetype.ArchetypeManagerTest)  Time elapsed: 0.086 s
Running org.eclipse.m2e.tests.archetype.ArchetypeUtilTest
Tests run: 2, Failures: 0, Errors: 0, Skipped: 0, Time elapsed: 0 s - in org.eclipse.m2e.tests.archetype.ArchetypeUtilTest
testAreEqual(org.eclipse.m2e.tests.archetype.ArchetypeUtilTest)  Time elapsed: 0 s
testGetHashCode(org.eclipse.m2e.tests.archetype.ArchetypeUtilTest)  Time elapsed: 0 s
Running org.eclipse.m2e.tests.builder.BuildContextLifecycleTest
Tests run: 1, Failures: 0, Errors: 0, Skipped: 0, Time elapsed: 3.801 s - in org.eclipse.m2e.tests.builder.BuildContextLifecycleTest
testBuildContextRefreshProject(org.eclipse.m2e.tests.builder.BuildContextLifecycleTest)  Time elapsed: 3.8 s
Running org.eclipse.m2e.tests.builder.MavenBuilderTest
Tests run: 14, Failures: 0, Errors: 0, Skipped: 2, Time elapsed: 30.812 s - in org.eclipse.m2e.tests.builder.MavenBuilderTest
test005_pomChanged(org.eclipse.m2e.tests.builder.MavenBuilderTest)  Time elapsed: 2.212 s
test007_refreshChangedPom(org.eclipse.m2e.tests.builder.MavenBuilderTest)  Time elapsed: 2.451 s
_test006_testPluginProperties(org.eclipse.m2e.tests.builder.MavenBuilderTest) skipped
test397251_malformedPom(org.eclipse.m2e.tests.builder.MavenBuilderTest)  Time elapsed: 1.537 s
test422106_legacyPlexusUtils(org.eclipse.m2e.tests.builder.MavenBuilderTest)  Time elapsed: 2.353 s
test004_useMavenOutputFolders(org.eclipse.m2e.tests.builder.MavenBuilderTest)  Time elapsed: 2.171 s
test002_customResourceLocation(org.eclipse.m2e.tests.builder.MavenBuilderTest)  Time elapsed: 3.28 s
test001_standardLayout(org.eclipse.m2e.tests.builder.MavenBuilderTest)  Time elapsed: 1.844 s
test_crossproject(org.eclipse.m2e.tests.builder.MavenBuilderTest)  Time elapsed: 4.491 s
test380096_cleanProjectWithLifecycleMappingProblemsAfterWorkspaceRestart(org.eclipse.m2e.tests.builder.MavenBuilderTest)  Time elapsed: 2.019 s
test010_properties(org.eclipse.m2e.tests.builder.MavenBuilderTest)  Time elapsed: 2.838 s
_test008_classpathChange(org.eclipse.m2e.tests.builder.MavenBuilderTest) skipped
test368380_buildContextDeepRefreshFromLocal(org.eclipse.m2e.tests.builder.MavenBuilderTest)  Time elapsed: 2.212 s
test013_refreshFixedPom(org.eclipse.m2e.tests.builder.MavenBuilderTest)  Time elapsed: 3.403 s
Running org.eclipse.m2e.tests.builder.EclipseIncrementalBuildContextTest
Tests run: 1, Failures: 0, Errors: 0, Skipped: 0, Time elapsed: 1.952 s - in org.eclipse.m2e.tests.builder.EclipseIncrementalBuildContextTest
testScanner(org.eclipse.m2e.tests.builder.EclipseIncrementalBuildContextTest)  Time elapsed: 1.952 s
Running org.eclipse.m2e.tests.builder.EclipseBuildContextTest
Tests run: 2, Failures: 0, Errors: 0, Skipped: 0, Time elapsed: 3.956 s - in org.eclipse.m2e.tests.builder.EclipseBuildContextTest
testScanner(org.eclipse.m2e.tests.builder.EclipseBuildContextTest)  Time elapsed: 1.877 s
test361038_buildContext_scan_nonExistingFolder(org.eclipse.m2e.tests.builder.EclipseBuildContextTest)  Time elapsed: 2.079 s
Running org.eclipse.m2e.tests.ProfileSupportTest
Tests run: 1, Failures: 0, Errors: 0, Skipped: 0, Time elapsed: 2.016 s - in org.eclipse.m2e.tests.ProfileSupportTest
test337353_deactivateProfile(org.eclipse.m2e.tests.ProfileSupportTest)  Time elapsed: 2.016 s
Running org.eclipse.m2e.tests.ProjectRegistryManagerTest
Tests run: 50, Failures: 0, Errors: 0, Skipped: 1, Time elapsed: 60.073 s - in org.eclipse.m2e.tests.ProjectRegistryManagerTest
test020_moduleWithPomErrors(org.eclipse.m2e.tests.ProjectRegistryManagerTest)  Time elapsed: 1.134 s
test356645_redundantSnapshotResolution(org.eclipse.m2e.tests.ProjectRegistryManagerTest)  Time elapsed: 1.433 s
test000_pom_simple(org.eclipse.m2e.tests.ProjectRegistryManagerTest)  Time elapsed: 1.249 s
test008_staleMissingParent(org.eclipse.m2e.tests.ProjectRegistryManagerTest)  Time elapsed: 1.156 s
_testExtensionPluginResolution(org.eclipse.m2e.tests.ProjectRegistryManagerTest) skipped
test435692_affected_changes(org.eclipse.m2e.tests.ProjectRegistryManagerTest)  Time elapsed: 1.189 s
test007_staleDependencies(org.eclipse.m2e.tests.ProjectRegistryManagerTest)  Time elapsed: 1.246 s
test001_missingParent(org.eclipse.m2e.tests.ProjectRegistryManagerTest)  Time elapsed: 2.196 s
testWorkspaceDependencyVersionRange(org.eclipse.m2e.tests.ProjectRegistryManagerTest)  Time elapsed: 1.161 s
test000_removeClosed(org.eclipse.m2e.tests.ProjectRegistryManagerTest)  Time elapsed: 1.117 s
test013_missingDependencyMarker(org.eclipse.m2e.tests.ProjectRegistryManagerTest)  Time elapsed: 1.044 s
test436929_import_refresh(org.eclipse.m2e.tests.ProjectRegistryManagerTest)  Time elapsed: 1.124 s
testGlobalUpdatePolicyNever(org.eclipse.m2e.tests.ProjectRegistryManagerTest)  Time elapsed: 1.174 s
testRepositoryMetadataCacheUsed(org.eclipse.m2e.tests.ProjectRegistryManagerTest)  Time elapsed: 1.206 s
test008_staleMissingParent2(org.eclipse.m2e.tests.ProjectRegistryManagerTest)  Time elapsed: 1.04 s
test015_refreshOffline(org.eclipse.m2e.tests.ProjectRegistryManagerTest)  Time elapsed: 1.056 s
test017_moduleRefresh(org.eclipse.m2e.tests.ProjectRegistryManagerTest)  Time elapsed: 1.163 s
test000_simple(org.eclipse.m2e.tests.ProjectRegistryManagerTest)  Time elapsed: 1.253 s
test005_dependencyAvailableFromLocalRepoAndWorkspace(org.eclipse.m2e.tests.ProjectRegistryManagerTest)  Time elapsed: 1.26 s
test463075_extensionAndPluginRealm(org.eclipse.m2e.tests.ProjectRegistryManagerTest)  Time elapsed: 1.124 s
testPropertiesSubstitution(org.eclipse.m2e.tests.ProjectRegistryManagerTest)  Time elapsed: 1.125 s
test000_deletePom(org.eclipse.m2e.tests.ProjectRegistryManagerTest)  Time elapsed: 1.255 s
test006_parentAvailableFromLocalRepoAndWorkspace(org.eclipse.m2e.tests.ProjectRegistryManagerTest)  Time elapsed: 1.37 s
test005_snapshotAvailableFromLocalRepoAndWorkspace(org.eclipse.m2e.tests.ProjectRegistryManagerTest)  Time elapsed: 1.135 s
test007_changedVersion(org.eclipse.m2e.tests.ProjectRegistryManagerTest)  Time elapsed: 1.104 s
test000_eventMerge(org.eclipse.m2e.tests.ProjectRegistryManagerTest)  Time elapsed: 1.209 s
testWorkspaceResolutionApi(org.eclipse.m2e.tests.ProjectRegistryManagerTest)  Time elapsed: 1.175 s
testOptionalDependencies(org.eclipse.m2e.tests.ProjectRegistryManagerTest)  Time elapsed: 1.525 s
test460983_parentVersionRange(org.eclipse.m2e.tests.ProjectRegistryManagerTest)  Time elapsed: 1.208 s
test009_noworkspaceResolution(org.eclipse.m2e.tests.ProjectRegistryManagerTest)  Time elapsed: 1.35 s
test001_dependencyOnModuleWithInheritedGroupAndVersion(org.eclipse.m2e.tests.ProjectRegistryManagerTest)  Time elapsed: 1.508 s
testDependencyScopeChanged(org.eclipse.m2e.tests.ProjectRegistryManagerTest)  Time elapsed: 1.569 s
test007_newTransitiveDependency(org.eclipse.m2e.tests.ProjectRegistryManagerTest)  Time elapsed: 1.083 s
testCorrelatedMissingDependency(org.eclipse.m2e.tests.ProjectRegistryManagerTest)  Time elapsed: 1.108 s
test013_cantParsePomMarker(org.eclipse.m2e.tests.ProjectRegistryManagerTest)  Time elapsed: 1.543 s
test006_parentAvailableFromLocalRepoAndWorkspace01(org.eclipse.m2e.tests.ProjectRegistryManagerTest)  Time elapsed: 1.07 s
testPluginMainArtifactNotResolvedFromWorkspace(org.eclipse.m2e.tests.ProjectRegistryManagerTest)  Time elapsed: 1.1 s
test000_removeDeleted(org.eclipse.m2e.tests.ProjectRegistryManagerTest)  Time elapsed: 1.199 s
testEnvironmentVariablesConsidered(org.eclipse.m2e.tests.ProjectRegistryManagerTest)  Time elapsed: 1.153 s
test441257_stalePluginRealms(org.eclipse.m2e.tests.ProjectRegistryManagerTest)  Time elapsed: 1.202 s
test418674_ChecksumPolicyFail(org.eclipse.m2e.tests.ProjectRegistryManagerTest)  Time elapsed: 1.221 s
test418674_ChecksumPolicyWarn(org.eclipse.m2e.tests.ProjectRegistryManagerTest)  Time elapsed: 1.075 s
test021_dependencyVersionRange(org.eclipse.m2e.tests.ProjectRegistryManagerTest)  Time elapsed: 1.273 s
test405090_staleBuildExtensionsResolutionError(org.eclipse.m2e.tests.ProjectRegistryManagerTest)  Time elapsed: 1.075 s
test007_dependentRefreshAfterWorkspaceRestart(org.eclipse.m2e.tests.ProjectRegistryManagerTest)  Time elapsed: 1.151 s
testJdkProfileActivation(org.eclipse.m2e.tests.ProjectRegistryManagerTest)  Time elapsed: 1.522 s
test022_noChangeReloadWithUnrelatedRemoveProject(org.eclipse.m2e.tests.ProjectRegistryManagerTest)  Time elapsed: 1.085 s
test012_downloadExternalDependency(org.eclipse.m2e.tests.ProjectRegistryManagerTest)  Time elapsed: 1.08 s
test441257_stalePluginRealms_withParent(org.eclipse.m2e.tests.ProjectRegistryManagerTest)  Time elapsed: 1.122 s
test453995_dependencyManagementVersionless(org.eclipse.m2e.tests.ProjectRegistryManagerTest)  Time elapsed: 1.151 s
Running org.eclipse.m2e.tests.scm.ScmHandlerFactoryTest
Tests run: 1, Failures: 0, Errors: 0, Skipped: 0, Time elapsed: 0.003 s - in org.eclipse.m2e.tests.scm.ScmHandlerFactoryTest
testScmHandlerFactory(org.eclipse.m2e.tests.scm.ScmHandlerFactoryTest)  Time elapsed: 0.003 s
Running org.eclipse.m2e.tests.LocalProjectScannerTest
Tests run: 11, Failures: 0, Errors: 0, Skipped: 0, Time elapsed: 0.006 s - in org.eclipse.m2e.tests.LocalProjectScannerTest
testDeepNesting002(org.eclipse.m2e.tests.LocalProjectScannerTest)  Time elapsed: 0.001 s
testOutsideWorkspace(org.eclipse.m2e.tests.LocalProjectScannerTest)  Time elapsed: 0 s
testModuleCorrelationInverse(org.eclipse.m2e.tests.LocalProjectScannerTest)  Time elapsed: 0.001 s
testCircleRefs(org.eclipse.m2e.tests.LocalProjectScannerTest)  Time elapsed: 0 s
testSkipNested(org.eclipse.m2e.tests.LocalProjectScannerTest)  Time elapsed: 0 s
testNoMetadata(org.eclipse.m2e.tests.LocalProjectScannerTest)  Time elapsed: 0.001 s
testStackOverflow(org.eclipse.m2e.tests.LocalProjectScannerTest)  Time elapsed: 0.001 s
testMNGECLIPSE614_ImportModulesOutsideOfParent(org.eclipse.m2e.tests.LocalProjectScannerTest)  Time elapsed: 0.001 s
testDeepNesting(org.eclipse.m2e.tests.LocalProjectScannerTest)  Time elapsed: 0 s
testRenameInWorkspace(org.eclipse.m2e.tests.LocalProjectScannerTest)  Time elapsed: 0 s
testModuleReferencedByFile(org.eclipse.m2e.tests.LocalProjectScannerTest)  Time elapsed: 0.001 s
Running org.eclipse.m2e.tests.profiles.MavenProfileManagerTest
Tests run: 5, Failures: 0, Errors: 0, Skipped: 0, Time elapsed: 17.331 s - in org.eclipse.m2e.tests.profiles.MavenProfileManagerTest
testGetAvailableSettingsProfiles(org.eclipse.m2e.tests.profiles.MavenProfileManagerTest)  Time elapsed: 1.883 s
test441112_InheritParentActiveProfiles(org.eclipse.m2e.tests.profiles.MavenProfileManagerTest)  Time elapsed: 4.059 s
testUserSelectedProfiles(org.eclipse.m2e.tests.profiles.MavenProfileManagerTest)  Time elapsed: 4.939 s
testParentFromRemote(org.eclipse.m2e.tests.profiles.MavenProfileManagerTest)  Time elapsed: 3.088 s
testDisabledProfiles(org.eclipse.m2e.tests.profiles.MavenProfileManagerTest)  Time elapsed: 3.359 s
Running org.eclipse.m2e.tests.MarkerTest
Tests run: 10, Failures: 0, Errors: 0, Skipped: 0, Time elapsed: 25.451 s - in org.eclipse.m2e.tests.MarkerTest
testBuildContextWithTwoProjectConfigurators(org.eclipse.m2e.tests.MarkerTest)  Time elapsed: 2.279 s
test512825_missingArtifactVersion(org.eclipse.m2e.tests.MarkerTest)  Time elapsed: 2.253 s
testManagedTransitive(org.eclipse.m2e.tests.MarkerTest)  Time elapsed: 2.797 s
testBuildContextWithSameProjectConfiguratorTwice(org.eclipse.m2e.tests.MarkerTest)  Time elapsed: 2.036 s
testNoDuplicateMarker(org.eclipse.m2e.tests.MarkerTest)  Time elapsed: 1.289 s
test(org.eclipse.m2e.tests.MarkerTest)  Time elapsed: 5.054 s
testMarkerResolutions(org.eclipse.m2e.tests.MarkerTest)  Time elapsed: 2.097 s
test361445_missingArtifactMarkerAttributes(org.eclipse.m2e.tests.MarkerTest)  Time elapsed: 2.348 s
testBuildContextWithOneProjectConfigurator(org.eclipse.m2e.tests.MarkerTest)  Time elapsed: 2.676 s
testBuildCantReadPom(org.eclipse.m2e.tests.MarkerTest)  Time elapsed: 2.622 s
Running org.eclipse.m2e.tests.MavenProjectMutableStateTest
Tests run: 3, Failures: 0, Errors: 0, Skipped: 0, Time elapsed: 5.58 s - in org.eclipse.m2e.tests.MavenProjectMutableStateTest
testExecuteMojo(org.eclipse.m2e.tests.MavenProjectMutableStateTest)  Time elapsed: 1.855 s
testMavenBuilder(org.eclipse.m2e.tests.MavenProjectMutableStateTest)  Time elapsed: 2.127 s
testImport(org.eclipse.m2e.tests.MavenProjectMutableStateTest)  Time elapsed: 1.597 s
Running org.eclipse.m2e.tests.JavaUtilTest
Tests run: 1, Failures: 0, Errors: 0, Skipped: 0, Time elapsed: 0.002 s - in org.eclipse.m2e.tests.JavaUtilTest
testGetDefaultJavaPackage(org.eclipse.m2e.tests.JavaUtilTest)  Time elapsed: 0.002 s
Running org.eclipse.m2e.tests.ClasspathProviderTest
Tests run: 20, Failures: 0, Errors: 0, Skipped: 0, Time elapsed: 24.688 s - in org.eclipse.m2e.tests.ClasspathProviderTest
testTestClassesTestScopeAndTestType(org.eclipse.m2e.tests.ClasspathProviderTest)  Time elapsed: 1.268 s
testSourcePath(org.eclipse.m2e.tests.ClasspathProviderTest)  Time elapsed: 1.206 s
testCustomClasspath(org.eclipse.m2e.tests.ClasspathProviderTest)  Time elapsed: 1.24 s
test368230_unknownClassifier(org.eclipse.m2e.tests.ClasspathProviderTest)  Time elapsed: 1.154 s
testTestClassesDefaultClassifier(org.eclipse.m2e.tests.ClasspathProviderTest)  Time elapsed: 1.379 s
testJunitClasspathOrder(org.eclipse.m2e.tests.ClasspathProviderTest)  Time elapsed: 1.208 s
testProvidedScopeTestApp(org.eclipse.m2e.tests.ClasspathProviderTest)  Time elapsed: 1.09 s
testNoFilterResources(org.eclipse.m2e.tests.ClasspathProviderTest)  Time elapsed: 1.139 s
testProvidedScopeApp(org.eclipse.m2e.tests.ClasspathProviderTest)  Time elapsed: 1.133 s
testLaunchConfigListener(org.eclipse.m2e.tests.ClasspathProviderTest)  Time elapsed: 1.225 s
testProvidedScopeAppTest(org.eclipse.m2e.tests.ClasspathProviderTest)  Time elapsed: 1.236 s
testTestClassesTestsClassifier(org.eclipse.m2e.tests.ClasspathProviderTest)  Time elapsed: 1.322 s
test(org.eclipse.m2e.tests.ClasspathProviderTest)  Time elapsed: 1.15 s
testNonDefaultTestSource(org.eclipse.m2e.tests.ClasspathProviderTest)  Time elapsed: 1.273 s
testCustomProjectEntry(org.eclipse.m2e.tests.ClasspathProviderTest)  Time elapsed: 1.125 s
testCustomBuildpath(org.eclipse.m2e.tests.ClasspathProviderTest)  Time elapsed: 1.101 s
testNotMavenProject(org.eclipse.m2e.tests.ClasspathProviderTest)  Time elapsed: 1.711 s
testTestClassesDefaultAndTestsClassifier(org.eclipse.m2e.tests.ClasspathProviderTest)  Time elapsed: 1.147 s
testSystemScope(org.eclipse.m2e.tests.ClasspathProviderTest)  Time elapsed: 1.492 s
test368230_FancyClassifier(org.eclipse.m2e.tests.ClasspathProviderTest)  Time elapsed: 1.089 s
Running org.eclipse.m2e.tests.properties.MavenPropertiesTest
Tests run: 2, Failures: 0, Errors: 0, Skipped: 0, Time elapsed: 4.955 s - in org.eclipse.m2e.tests.properties.MavenPropertiesTest
testBuildingProjectWithProperties(org.eclipse.m2e.tests.properties.MavenPropertiesTest)  Time elapsed: 3.409 s
testReadResolverConfigurationProperties(org.eclipse.m2e.tests.properties.MavenPropertiesTest)  Time elapsed: 1.545 s
Running org.eclipse.m2e.tests.util.search.IndexSearchEngineTest
Tests run: 1, Failures: 0, Errors: 0, Skipped: 0, Time elapsed: 1.322 s - in org.eclipse.m2e.tests.util.search.IndexSearchEngineTest
testGroupIDProposal(org.eclipse.m2e.tests.util.search.IndexSearchEngineTest)  Time elapsed: 1.322 s

Results:

Errors: 
  BuildPathManagerTest.testDownloadSources_006_nonMavenProject:656 ? Core Reinde...

Tests run: 548, Failures: 0, Errors: 1, Skipped: 5

SWT SessionManagerDBus: Failed to connect to org.gnome.SessionManager: Failed to execute child process ?dbus-launch? (No such file or directory)
SWT SessionManagerDBus: Failed to connect to org.xfce.SessionManager: Failed to execute child process ?dbus-launch? (No such file or directory)
[ERROR] There are test failures.

Please refer to /home/jenkins/agent/workspace/m2e_master/m2e-core-tests/org.eclipse.m2e.tests/target/surefire-reports for the individual test results.
[INFO] 
[INFO] --- tycho-p2-extras-plugin:2.3.0-SNAPSHOT:compare-version-with-baselines (check-no-version-regression) @ org.eclipse.m2e.tests ---
[INFO] 
[INFO] ------------< org.eclipse.m2e:org.eclipse.m2e.editor.tests >------------
[INFO] Building Maven Integration for Eclipse POM Editor tests 1.16.0-SNAPSHOT [42/43]
[INFO] ------------------------[ eclipse-test-plugin ]-------------------------
[INFO] 
[INFO] --- maven-clean-plugin:2.4.1:clean (default-clean) @ org.eclipse.m2e.editor.tests ---
[INFO] 
[INFO] --- tycho-packaging-plugin:2.3.0-SNAPSHOT:build-qualifier (default-build-qualifier) @ org.eclipse.m2e.editor.tests ---
[INFO] The project's OSGi version is 1.16.0.20210115-0841
[INFO] 
[INFO] --- tycho-packaging-plugin:2.3.0-SNAPSHOT:validate-id (default-validate-id) @ org.eclipse.m2e.editor.tests ---
[INFO] 
[INFO] --- tycho-packaging-plugin:2.3.0-SNAPSHOT:validate-version (default-validate-version) @ org.eclipse.m2e.editor.tests ---
[INFO] 
[INFO] --- jacoco-maven-plugin:0.8.5:prepare-agent (default) @ org.eclipse.m2e.editor.tests ---
[INFO] tycho.testArgLine set to -javaagent:/home/jenkins/agent/workspace/m2e_master/.m2/repository/org/jacoco/org.jacoco.agent/0.8.5/org.jacoco.agent-0.8.5-runtime.jar=destfile=/home/jenkins/agent/workspace/m2e_master/m2e-core-tests/target/jacoco.exec,append=true,includes=org.eclipse.m2e*:org.apache.maven*:org.eclipse.aether* -Xmx800m
[INFO] 
[INFO] --- maven-resources-plugin:2.5:resources (default-resources) @ org.eclipse.m2e.editor.tests ---
[debug] execute contextualize
[INFO] Using 'UTF-8' encoding to copy filtered resources.
[INFO] skip non existing resourceDirectory /home/jenkins/agent/workspace/m2e_master/m2e-core-tests/org.eclipse.m2e.editor.tests/src/main/resources
[INFO] 
[INFO] --- tycho-compiler-plugin:2.3.0-SNAPSHOT:compile (default-compile) @ org.eclipse.m2e.editor.tests ---
[INFO] Compiling 3 source files to /home/jenkins/agent/workspace/m2e_master/m2e-core-tests/org.eclipse.m2e.editor.tests/target/classes
[INFO] 
[INFO] --- maven-resources-plugin:2.5:testResources (default-testResources) @ org.eclipse.m2e.editor.tests ---
[debug] execute contextualize
[INFO] Using 'UTF-8' encoding to copy filtered resources.
[INFO] skip non existing resourceDirectory /home/jenkins/agent/workspace/m2e_master/m2e-core-tests/org.eclipse.m2e.editor.tests/src/test/resources
[INFO] 
[INFO] --- tycho-source-plugin:2.3.0-SNAPSHOT:plugin-source (plugin-source) @ org.eclipse.m2e.editor.tests ---
[INFO] Building jar: /home/jenkins/agent/workspace/m2e_master/m2e-core-tests/org.eclipse.m2e.editor.tests/target/org.eclipse.m2e.editor.tests-1.16.0-SNAPSHOT-sources.jar
[INFO] 
[INFO] --- target-platform-configuration:2.3.0-SNAPSHOT:target-platform (default-target-platform) @ org.eclipse.m2e.editor.tests ---
[INFO] 
[INFO] --- tycho-packaging-plugin:2.3.0-SNAPSHOT:package-plugin (default-package-plugin) @ org.eclipse.m2e.editor.tests ---
[INFO] Building jar: /home/jenkins/agent/workspace/m2e_master/m2e-core-tests/org.eclipse.m2e.editor.tests/target/org.eclipse.m2e.editor.tests-1.16.0-SNAPSHOT.jar
[INFO] 
[INFO] --- tycho-p2-plugin:2.3.0-SNAPSHOT:p2-metadata-default (default-p2-metadata-default) @ org.eclipse.m2e.editor.tests ---
[INFO] 
[INFO] --- tycho-pack200a-plugin:2.3.0-SNAPSHOT:normalize (pack200-normalize) @ org.eclipse.m2e.editor.tests ---
[INFO] Pack200 normalizing jar /home/jenkins/agent/workspace/m2e_master/m2e-core-tests/org.eclipse.m2e.editor.tests/target/org.eclipse.m2e.editor.tests-1.16.0-SNAPSHOT.jar
[INFO] 
[INFO] --- eclipse-jarsigner-plugin:1.1.7:sign (sign) @ org.eclipse.m2e.editor.tests ---
[INFO] Signing of nested jars of '/home/jenkins/agent/workspace/m2e_master/m2e-core-tests/org.eclipse.m2e.editor.tests/target/org.eclipse.m2e.editor.tests-1.16.0-SNAPSHOT.jar' is disabled.
[INFO] Signing jar: /home/jenkins/agent/workspace/m2e_master/m2e-core-tests/org.eclipse.m2e.editor.tests/target/org.eclipse.m2e.editor.tests-1.16.0-SNAPSHOT.jar
[INFO] Signing of nested jars of '/home/jenkins/agent/workspace/m2e_master/m2e-core-tests/org.eclipse.m2e.editor.tests/target/org.eclipse.m2e.editor.tests-1.16.0-SNAPSHOT-sources.jar' is disabled.
[INFO] Signing jar: /home/jenkins/agent/workspace/m2e_master/m2e-core-tests/org.eclipse.m2e.editor.tests/target/org.eclipse.m2e.editor.tests-1.16.0-SNAPSHOT-sources.jar
[INFO] 
[INFO] --- tycho-pack200b-plugin:2.3.0-SNAPSHOT:pack (pack200-pack) @ org.eclipse.m2e.editor.tests ---
[INFO] Pack200 packing jar /home/jenkins/agent/workspace/m2e_master/m2e-core-tests/org.eclipse.m2e.editor.tests/target/org.eclipse.m2e.editor.tests-1.16.0-SNAPSHOT.jar
[INFO] 
[INFO] --- tycho-p2-plugin:2.3.0-SNAPSHOT:p2-metadata (p2-metadata) @ org.eclipse.m2e.editor.tests ---
[INFO] No baseline version MavenProject: org.eclipse.m2e:org.eclipse.m2e.editor.tests:1.16.0-SNAPSHOT @ /home/jenkins/agent/workspace/m2e_master/m2e-core-tests/org.eclipse.m2e.editor.tests/pom.xml
[INFO] 
[INFO] --- tycho-surefire-plugin:2.3.0-SNAPSHOT:test (default-test) @ org.eclipse.m2e.editor.tests ---
[INFO] Executing Test Runtime with timeout 7200, logs (if any) will be placed at: /home/jenkins/agent/workspace/m2e_master/m2e-core-tests/org.eclipse.m2e.editor.tests/target/work/data/.metadata/.log
[INFO] Command line:
	[/opt/tools/java/openjdk/jdk-11/11.0.2+9/bin/java, -Dosgi.noShutdown=false, -Dosgi.os=linux, -Dosgi.ws=gtk, -Dosgi.arch=x86_64, -javaagent:/home/jenkins/agent/workspace/m2e_master/.m2/repository/org/jacoco/org.jacoco.agent/0.8.5/org.jacoco.agent-0.8.5-runtime.jar=destfile=/home/jenkins/agent/workspace/m2e_master/m2e-core-tests/target/jacoco.exec,append=true,includes=org.eclipse.m2e*:org.apache.maven*:org.eclipse.aether*, -Xmx800m, -Dosgi.clean=true, -jar, /home/jenkins/agent/workspace/m2e_master/.m2/repository/p2/osgi/bundle/org.eclipse.equinox.launcher/1.6.0.v20200915-1508/org.eclipse.equinox.launcher-1.6.0.v20200915-1508.jar, -data, /home/jenkins/agent/workspace/m2e_master/m2e-core-tests/org.eclipse.m2e.editor.tests/target/work/data, -install, /home/jenkins/agent/workspace/m2e_master/m2e-core-tests/org.eclipse.m2e.editor.tests/target/work, -configuration, /home/jenkins/agent/workspace/m2e_master/m2e-core-tests/org.eclipse.m2e.editor.tests/target/work/configuration, -application, org.eclipse.tycho.surefire.osgibooter.uitest, -testproperties, /home/jenkins/agent/workspace/m2e_master/m2e-core-tests/org.eclipse.m2e.editor.tests/target/surefire.properties, -pluginCustomization, /home/jenkins/agent/workspace/m2e_master/m2e-core-tests/org.eclipse.m2e.editor.tests/plugin_customization.ini, -timeout, 7200000]

(process:5166): Gtk-WARNING **: 19:03:58.303: Locale not supported by C library.
	Using the fallback 'C' locale.
SWT SessionManagerDBus: Failed to connect to org.gnome.SessionManager: Failed to execute child process ?dbus-launch? (No such file or directory)
SWT SessionManagerDBus: Failed to connect to org.xfce.SessionManager: Failed to execute child process ?dbus-launch? (No such file or directory)
Running org.eclipse.m2e.editor.MavenPomEditorDirtyTest
SLF4J: Failed to load class "org.slf4j.impl.StaticLoggerBinder".
SLF4J: Defaulting to no-operation (NOP) logger implementation
SLF4J: See http://www.slf4j.org/codes.html#StaticLoggerBinder for further details.
SLF4J: Failed to load class "org.slf4j.impl.StaticLoggerBinder".
SLF4J: Defaulting to no-operation (NOP) logger implementation
SLF4J: See http://www.slf4j.org/codes.html#StaticLoggerBinder for further details.
Warning: NLS missing message: MavenImpl_error_lookup in: org.eclipse.m2e.editor.internal.messages
Tests run: 1, Failures: 0, Errors: 0, Skipped: 0, Time elapsed: 5.627 s - in org.eclipse.m2e.editor.MavenPomEditorDirtyTest
test358656_dirtyStateAfterFSModification(org.eclipse.m2e.editor.MavenPomEditorDirtyTest)  Time elapsed: 5.211 s
Running org.eclipse.m2e.editor.dialogs.ManageDependenciesDialogTest
Tests run: 9, Failures: 0, Errors: 0, Skipped: 0, Time elapsed: 16.545 s - in org.eclipse.m2e.editor.dialogs.ManageDependenciesDialogTest
testDepLabelProvider(org.eclipse.m2e.editor.dialogs.ManageDependenciesDialogTest)  Time elapsed: 5.519 s
testBrokenSource(org.eclipse.m2e.editor.dialogs.ManageDependenciesDialogTest)  Time elapsed: 0.76 s
testBrokenTarget(org.eclipse.m2e.editor.dialogs.ManageDependenciesDialogTest)  Time elapsed: 0.643 s
testDepExistsDiffVersionDiffPOMs(org.eclipse.m2e.editor.dialogs.ManageDependenciesDialogTest)  Time elapsed: 3.091 s
testDepExists(org.eclipse.m2e.editor.dialogs.ManageDependenciesDialogTest)  Time elapsed: 0.877 s
testMultipleDependencies(org.eclipse.m2e.editor.dialogs.ManageDependenciesDialogTest)  Time elapsed: 1.578 s
testDiffPOMs(org.eclipse.m2e.editor.dialogs.ManageDependenciesDialogTest)  Time elapsed: 1.52 s
testDepExistsDiffVersion(org.eclipse.m2e.editor.dialogs.ManageDependenciesDialogTest)  Time elapsed: 0.894 s
testSamePOM(org.eclipse.m2e.editor.dialogs.ManageDependenciesDialogTest)  Time elapsed: 1.662 s
Running org.eclipse.m2e.editor.dialogs.MavenModuleSelectionDialogTest
Tests run: 1, Failures: 0, Errors: 0, Skipped: 0, Time elapsed: 1.752 s - in org.eclipse.m2e.editor.dialogs.MavenModuleSelectionDialogTest
testModuleSelection(org.eclipse.m2e.editor.dialogs.MavenModuleSelectionDialogTest)  Time elapsed: 1.752 s

Results:

Tests run: 11, Failures: 0, Errors: 0, Skipped: 0

[INFO] All tests passed!
[INFO] 
[INFO] --- tycho-p2-extras-plugin:2.3.0-SNAPSHOT:compare-version-with-baselines (check-no-version-regression) @ org.eclipse.m2e.editor.tests ---
[INFO] 
[INFO] ----------< org.eclipse.m2e:org.eclipse.m2e.editor.xml.tests >----------
[INFO] Building Maven POM XML Editor Tests 1.17.2-SNAPSHOT              [43/43]
[INFO] ------------------------[ eclipse-test-plugin ]-------------------------
[INFO] 
[INFO] --- maven-clean-plugin:2.4.1:clean (default-clean) @ org.eclipse.m2e.editor.xml.tests ---
[INFO] 
[INFO] --- tycho-packaging-plugin:2.3.0-SNAPSHOT:build-qualifier (default-build-qualifier) @ org.eclipse.m2e.editor.xml.tests ---
[INFO] The project's OSGi version is 1.17.2.20210219-1803
[INFO] 
[INFO] --- tycho-packaging-plugin:2.3.0-SNAPSHOT:validate-id (default-validate-id) @ org.eclipse.m2e.editor.xml.tests ---
[INFO] 
[INFO] --- tycho-packaging-plugin:2.3.0-SNAPSHOT:validate-version (default-validate-version) @ org.eclipse.m2e.editor.xml.tests ---
[INFO] 
[INFO] --- jacoco-maven-plugin:0.8.5:prepare-agent (default) @ org.eclipse.m2e.editor.xml.tests ---
[INFO] tycho.testArgLine set to -javaagent:/home/jenkins/agent/workspace/m2e_master/.m2/repository/org/jacoco/org.jacoco.agent/0.8.5/org.jacoco.agent-0.8.5-runtime.jar=destfile=/home/jenkins/agent/workspace/m2e_master/m2e-core-tests/target/jacoco.exec,append=true,includes=org.eclipse.m2e*:org.apache.maven*:org.eclipse.aether* -Xmx800m
[INFO] 
[INFO] --- maven-resources-plugin:2.5:resources (default-resources) @ org.eclipse.m2e.editor.xml.tests ---
[debug] execute contextualize
[INFO] Using 'UTF-8' encoding to copy filtered resources.
[INFO] skip non existing resourceDirectory /home/jenkins/agent/workspace/m2e_master/m2e-core-tests/org.eclipse.m2e.editor.xml.tests/src/main/resources
[INFO] 
[INFO] --- tycho-compiler-plugin:2.3.0-SNAPSHOT:compile (default-compile) @ org.eclipse.m2e.editor.xml.tests ---
[WARNING] Parameter 'useProjectSettings' is set to true, but preferences file '/home/jenkins/agent/workspace/m2e_master/m2e-core-tests/org.eclipse.m2e.editor.xml.tests/.settings/org.eclipse.jdt.core.prefs' could not be found!
[INFO] Compiling 22 source files to /home/jenkins/agent/workspace/m2e_master/m2e-core-tests/org.eclipse.m2e.editor.xml.tests/target/classes
[INFO] 
[INFO] --- maven-resources-plugin:2.5:testResources (default-testResources) @ org.eclipse.m2e.editor.xml.tests ---
[debug] execute contextualize
[INFO] Using 'UTF-8' encoding to copy filtered resources.
[INFO] skip non existing resourceDirectory /home/jenkins/agent/workspace/m2e_master/m2e-core-tests/org.eclipse.m2e.editor.xml.tests/src/test/resources
[INFO] 
[INFO] --- tycho-source-plugin:2.3.0-SNAPSHOT:plugin-source (plugin-source) @ org.eclipse.m2e.editor.xml.tests ---
[INFO] Building jar: /home/jenkins/agent/workspace/m2e_master/m2e-core-tests/org.eclipse.m2e.editor.xml.tests/target/org.eclipse.m2e.editor.xml.tests-1.17.2-SNAPSHOT-sources.jar
[INFO] 
[INFO] --- target-platform-configuration:2.3.0-SNAPSHOT:target-platform (default-target-platform) @ org.eclipse.m2e.editor.xml.tests ---
[INFO] 
[INFO] --- tycho-packaging-plugin:2.3.0-SNAPSHOT:package-plugin (default-package-plugin) @ org.eclipse.m2e.editor.xml.tests ---
[INFO] Building jar: /home/jenkins/agent/workspace/m2e_master/m2e-core-tests/org.eclipse.m2e.editor.xml.tests/target/org.eclipse.m2e.editor.xml.tests-1.17.2-SNAPSHOT.jar
[INFO] 
[INFO] --- tycho-p2-plugin:2.3.0-SNAPSHOT:p2-metadata-default (default-p2-metadata-default) @ org.eclipse.m2e.editor.xml.tests ---
[INFO] 
[INFO] --- tycho-pack200a-plugin:2.3.0-SNAPSHOT:normalize (pack200-normalize) @ org.eclipse.m2e.editor.xml.tests ---
[INFO] Pack200 normalizing jar /home/jenkins/agent/workspace/m2e_master/m2e-core-tests/org.eclipse.m2e.editor.xml.tests/target/org.eclipse.m2e.editor.xml.tests-1.17.2-SNAPSHOT.jar
[INFO] 
[INFO] --- eclipse-jarsigner-plugin:1.1.7:sign (sign) @ org.eclipse.m2e.editor.xml.tests ---
[INFO] Signing of nested jars of '/home/jenkins/agent/workspace/m2e_master/m2e-core-tests/org.eclipse.m2e.editor.xml.tests/target/org.eclipse.m2e.editor.xml.tests-1.17.2-SNAPSHOT.jar' is disabled.
[INFO] Signing jar: /home/jenkins/agent/workspace/m2e_master/m2e-core-tests/org.eclipse.m2e.editor.xml.tests/target/org.eclipse.m2e.editor.xml.tests-1.17.2-SNAPSHOT.jar
[INFO] Signing of nested jars of '/home/jenkins/agent/workspace/m2e_master/m2e-core-tests/org.eclipse.m2e.editor.xml.tests/target/org.eclipse.m2e.editor.xml.tests-1.17.2-SNAPSHOT-sources.jar' is disabled.
[INFO] Signing jar: /home/jenkins/agent/workspace/m2e_master/m2e-core-tests/org.eclipse.m2e.editor.xml.tests/target/org.eclipse.m2e.editor.xml.tests-1.17.2-SNAPSHOT-sources.jar
[INFO] 
[INFO] --- tycho-pack200b-plugin:2.3.0-SNAPSHOT:pack (pack200-pack) @ org.eclipse.m2e.editor.xml.tests ---
[INFO] Pack200 packing jar /home/jenkins/agent/workspace/m2e_master/m2e-core-tests/org.eclipse.m2e.editor.xml.tests/target/org.eclipse.m2e.editor.xml.tests-1.17.2-SNAPSHOT.jar
[INFO] 
[INFO] --- tycho-p2-plugin:2.3.0-SNAPSHOT:p2-metadata (p2-metadata) @ org.eclipse.m2e.editor.xml.tests ---
[INFO] No baseline version MavenProject: org.eclipse.m2e:org.eclipse.m2e.editor.xml.tests:1.17.2-SNAPSHOT @ /home/jenkins/agent/workspace/m2e_master/m2e-core-tests/org.eclipse.m2e.editor.xml.tests/pom.xml
[INFO] 
[INFO] --- tycho-surefire-plugin:2.3.0-SNAPSHOT:test (default-test) @ org.eclipse.m2e.editor.xml.tests ---
[INFO] Executing Test Runtime with timeout 7200, logs (if any) will be placed at: /home/jenkins/agent/workspace/m2e_master/m2e-core-tests/org.eclipse.m2e.editor.xml.tests/target/work/data/.metadata/.log
[INFO] Command line:
	[/opt/tools/java/openjdk/jdk-11/11.0.2+9/bin/java, -Dosgi.noShutdown=false, -Dosgi.os=linux, -Dosgi.ws=gtk, -Dosgi.arch=x86_64, -javaagent:/home/jenkins/agent/workspace/m2e_master/.m2/repository/org/jacoco/org.jacoco.agent/0.8.5/org.jacoco.agent-0.8.5-runtime.jar=destfile=/home/jenkins/agent/workspace/m2e_master/m2e-core-tests/target/jacoco.exec,append=true,includes=org.eclipse.m2e*:org.apache.maven*:org.eclipse.aether*, -Xmx800m, -Dosgi.clean=true, -jar, /home/jenkins/agent/workspace/m2e_master/.m2/repository/p2/osgi/bundle/org.eclipse.equinox.launcher/1.6.0.v20200915-1508/org.eclipse.equinox.launcher-1.6.0.v20200915-1508.jar, -data, /home/jenkins/agent/workspace/m2e_master/m2e-core-tests/org.eclipse.m2e.editor.xml.tests/target/work/data, -install, /home/jenkins/agent/workspace/m2e_master/m2e-core-tests/org.eclipse.m2e.editor.xml.tests/target/work, -configuration, /home/jenkins/agent/workspace/m2e_master/m2e-core-tests/org.eclipse.m2e.editor.xml.tests/target/work/configuration, -application, org.eclipse.tycho.surefire.osgibooter.uitest, -testproperties, /home/jenkins/agent/workspace/m2e_master/m2e-core-tests/org.eclipse.m2e.editor.xml.tests/target/surefire.properties, -pluginCustomization, /home/jenkins/agent/workspace/m2e_master/m2e-core-tests/org.eclipse.m2e.editor.xml.tests/plugin_customization.ini, -timeout, 7200000]

(process:5310): Gtk-WARNING **: 19:04:33.010: Locale not supported by C library.
	Using the fallback 'C' locale.
SWT SessionManagerDBus: Failed to connect to org.gnome.SessionManager: Failed to execute child process ?dbus-launch? (No such file or directory)
SWT SessionManagerDBus: Failed to connect to org.xfce.SessionManager: Failed to execute child process ?dbus-launch? (No such file or directory)
SLF4J: Failed to load class "org.slf4j.impl.StaticLoggerBinder".
SLF4J: Defaulting to no-operation (NOP) logger implementation
SLF4J: See http://www.slf4j.org/codes.html#StaticLoggerBinder for further details.
Running org.eclipse.m2e.editor.xml.PomEditsTest
SLF4J: Failed to load class "org.slf4j.impl.StaticLoggerBinder".
SLF4J: Defaulting to no-operation (NOP) logger implementation
SLF4J: See http://www.slf4j.org/codes.html#StaticLoggerBinder for further details.
Tests run: 2, Failures: 0, Errors: 0, Skipped: 0, Time elapsed: 6.245 s - in org.eclipse.m2e.editor.xml.PomEditsTest
test371438_insertAt_insideEmptyElement(org.eclipse.m2e.editor.xml.PomEditsTest)  Time elapsed: 4.718 s
test467590_emptyPom(org.eclipse.m2e.editor.xml.PomEditsTest)  Time elapsed: 1.299 s
Running org.eclipse.m2e.editor.xml.MissingSchemaMarkerTest
Tests run: 1, Failures: 0, Errors: 0, Skipped: 0, Time elapsed: 8.897 s - in org.eclipse.m2e.editor.xml.MissingSchemaMarkerTest
testMissingSchemaMarker(org.eclipse.m2e.editor.xml.MissingSchemaMarkerTest)  Time elapsed: 8.896 s
Running org.eclipse.m2e.editor.xml.ExtractProject2Test
Tests run: 1, Failures: 0, Errors: 0, Skipped: 0, Time elapsed: 2.392 s - in org.eclipse.m2e.editor.xml.ExtractProject2Test
testExtractProject(org.eclipse.m2e.editor.xml.ExtractProject2Test)  Time elapsed: 2.384 s
Running org.eclipse.m2e.editor.xml.ExtractProjectTest
Tests run: 1, Failures: 0, Errors: 0, Skipped: 0, Time elapsed: 1.789 s - in org.eclipse.m2e.editor.xml.ExtractProjectTest
testExtractProject(org.eclipse.m2e.editor.xml.ExtractProjectTest)  Time elapsed: 1.788 s
Running org.eclipse.m2e.editor.xml.PluginConfigCompletionTest
Warning: NLS missing message: MavenImpl_error_lookup in: org.eclipse.m2e.editor.internal.messages
Tests run: 12, Failures: 0, Errors: 0, Skipped: 0, Time elapsed: 27.384 s - in org.eclipse.m2e.editor.xml.PluginConfigCompletionTest
testMetadataExtension(org.eclipse.m2e.editor.xml.PluginConfigCompletionTest)  Time elapsed: 9.185 s
testAllMojosCompletion(org.eclipse.m2e.editor.xml.PluginConfigCompletionTest)  Time elapsed: 3.016 s
testListItemNameCompletion(org.eclipse.m2e.editor.xml.PluginConfigCompletionTest)  Time elapsed: 2.515 s
testImplementationListItemNameCompletion(org.eclipse.m2e.editor.xml.PluginConfigCompletionTest)  Time elapsed: 1.703 s
testListItemParameterCompletion(org.eclipse.m2e.editor.xml.PluginConfigCompletionTest)  Time elapsed: 1.218 s
testM2ELifecycleMappingConfiguration(org.eclipse.m2e.editor.xml.PluginConfigCompletionTest)  Time elapsed: 1.265 s
testImplementationContentCompletion(org.eclipse.m2e.editor.xml.PluginConfigCompletionTest)  Time elapsed: 1.076 s
testSubclassListItems(org.eclipse.m2e.editor.xml.PluginConfigCompletionTest)  Time elapsed: 2.532 s
testNestedParameterCompletion(org.eclipse.m2e.editor.xml.PluginConfigCompletionTest)  Time elapsed: 1.183 s
testSingleMojoCompletion(org.eclipse.m2e.editor.xml.PluginConfigCompletionTest)  Time elapsed: 1.286 s
testAnyListItemNameParameterCompletion(org.eclipse.m2e.editor.xml.PluginConfigCompletionTest)  Time elapsed: 1.318 s
testUnknownContentCompletion(org.eclipse.m2e.editor.xml.PluginConfigCompletionTest)  Time elapsed: 1.085 s
Running org.eclipse.m2e.editor.xml.RelativePath2Test
Tests run: 1, Failures: 0, Errors: 0, Skipped: 0, Time elapsed: 1.22 s - in org.eclipse.m2e.editor.xml.RelativePath2Test
testRelativePath(org.eclipse.m2e.editor.xml.RelativePath2Test)  Time elapsed: 1.22 s
Running org.eclipse.m2e.editor.xml.ManagedArtifactMarkerTest
Tests run: 7, Failures: 0, Errors: 0, Skipped: 0, Time elapsed: 17.116 s - in org.eclipse.m2e.editor.xml.ManagedArtifactMarkerTest
test439309_errorOnManagedVersionOverride(org.eclipse.m2e.editor.xml.ManagedArtifactMarkerTest)  Time elapsed: 4.396 s
test439309_ignoreManagedVersionOverride(org.eclipse.m2e.editor.xml.ManagedArtifactMarkerTest)  Time elapsed: 1.918 s
test355882_noMarkerOnDifferentClassifier(org.eclipse.m2e.editor.xml.ManagedArtifactMarkerTest)  Time elapsed: 3.004 s
test553839_noErrorCausedByPluginVersionFromSuperPom(org.eclipse.m2e.editor.xml.ManagedArtifactMarkerTest)  Time elapsed: 2.296 s
testMNGEclipse2559Second(org.eclipse.m2e.editor.xml.ManagedArtifactMarkerTest)  Time elapsed: 1.587 s
test355882_MarkerOnClassifierVersionOverride(org.eclipse.m2e.editor.xml.ManagedArtifactMarkerTest)  Time elapsed: 1.519 s
testMNGEclipse2559(org.eclipse.m2e.editor.xml.ManagedArtifactMarkerTest)  Time elapsed: 2.395 s
Running org.eclipse.m2e.editor.xml.PomContentAssistProcessorTest
Tests run: 1, Failures: 0, Errors: 0, Skipped: 0, Time elapsed: 0.002 s - in org.eclipse.m2e.editor.xml.PomContentAssistProcessorTest
testExtractPrefix(org.eclipse.m2e.editor.xml.PomContentAssistProcessorTest)  Time elapsed: 0.002 s
Running org.eclipse.m2e.editor.xml.PropertyCompletionTest
Tests run: 1, Failures: 0, Errors: 0, Skipped: 0, Time elapsed: 1.677 s - in org.eclipse.m2e.editor.xml.PropertyCompletionTest
testCompletion(org.eclipse.m2e.editor.xml.PropertyCompletionTest)  Time elapsed: 1.677 s
Running org.eclipse.m2e.editor.xml.RelativePath3Test
Tests run: 1, Failures: 0, Errors: 0, Skipped: 0, Time elapsed: 2.036 s - in org.eclipse.m2e.editor.xml.RelativePath3Test
testRelativePath(org.eclipse.m2e.editor.xml.RelativePath3Test)  Time elapsed: 2.035 s
Running org.eclipse.m2e.editor.xml.FileCompletionTest
Tests run: 1, Failures: 0, Errors: 0, Skipped: 1, Time elapsed: 0.001 s - in org.eclipse.m2e.editor.xml.FileCompletionTest
org.eclipse.m2e.editor.xml.FileCompletionTest skipped
Running org.eclipse.m2e.editor.xml.HyperlinkTest
true
Tests run: 1, Failures: 0, Errors: 0, Skipped: 0, Time elapsed: 1.949 s - in org.eclipse.m2e.editor.xml.HyperlinkTest
testHasLink(org.eclipse.m2e.editor.xml.HyperlinkTest)  Time elapsed: 1.949 s
Running org.eclipse.m2e.editor.xml.PomTemplateContextTest
Tests run: 11, Failures: 0, Errors: 0, Skipped: 0, Time elapsed: 9.4 s - in org.eclipse.m2e.editor.xml.PomTemplateContextTest
testGetTemplatesArtifactId_WithGroupId(org.eclipse.m2e.editor.xml.PomTemplateContextTest)  Time elapsed: 0.765 s
testGetTemplatesDependencyScope(org.eclipse.m2e.editor.xml.PomTemplateContextTest)  Time elapsed: 0.735 s
test439251_GetTemplatesConfigurationFromMojoWithEmptyParameters(org.eclipse.m2e.editor.xml.PomTemplateContextTest)  Time elapsed: 1.178 s
testGetTemplatesPackaging(org.eclipse.m2e.editor.xml.PomTemplateContextTest)  Time elapsed: 0.793 s
testGetTemplatesVersion_WithoutGroupId(org.eclipse.m2e.editor.xml.PomTemplateContextTest)  Time elapsed: 0.843 s
testGetTemplatesArtifactId_WithoutGroupId(org.eclipse.m2e.editor.xml.PomTemplateContextTest)  Time elapsed: 0.734 s
testGetTemplatesConfiguration(org.eclipse.m2e.editor.xml.PomTemplateContextTest)  Time elapsed: 1.135 s
testGetTemplatesDependencyManagementScope(org.eclipse.m2e.editor.xml.PomTemplateContextTest)  Time elapsed: 0.743 s
testGetTemplatesVersion_WithGroupId(org.eclipse.m2e.editor.xml.PomTemplateContextTest)  Time elapsed: 0.702 s
testGetTemplatesPhase(org.eclipse.m2e.editor.xml.PomTemplateContextTest)  Time elapsed: 0.743 s
testGetTemplatesGoal(org.eclipse.m2e.editor.xml.PomTemplateContextTest)  Time elapsed: 1.028 s
Running org.eclipse.m2e.editor.xml.WarnIfGroupSameThanParentTest
Tests run: 1, Failures: 0, Errors: 0, Skipped: 0, Time elapsed: 3.205 s - in org.eclipse.m2e.editor.xml.WarnIfGroupSameThanParentTest
testMNGEclipse2552(org.eclipse.m2e.editor.xml.WarnIfGroupSameThanParentTest)  Time elapsed: 3.204 s
Running org.eclipse.m2e.editor.xml.RelativePath1Test
Tests run: 1, Failures: 0, Errors: 0, Skipped: 0, Time elapsed: 1.524 s - in org.eclipse.m2e.editor.xml.RelativePath1Test
testRelativePath(org.eclipse.m2e.editor.xml.RelativePath1Test)  Time elapsed: 1.524 s
Running org.eclipse.m2e.editor.xml.HoverTest
Tests run: 1, Failures: 0, Errors: 0, Skipped: 0, Time elapsed: 1.878 s - in org.eclipse.m2e.editor.xml.HoverTest
testHasHover(org.eclipse.m2e.editor.xml.HoverTest)  Time elapsed: 1.876 s
Running org.eclipse.m2e.editor.xml.HoverDependencyManagedTest
Tests run: 1, Failures: 0, Errors: 0, Skipped: 0, Time elapsed: 1.526 s - in org.eclipse.m2e.editor.xml.HoverDependencyManagedTest
testHasHover(org.eclipse.m2e.editor.xml.HoverDependencyManagedTest)  Time elapsed: 1.526 s

Results:

Tests run: 45, Failures: 0, Errors: 0, Skipped: 1

[INFO] All tests passed!
[INFO] 
[INFO] --- tycho-p2-extras-plugin:2.3.0-SNAPSHOT:compare-version-with-baselines (check-no-version-regression) @ org.eclipse.m2e.editor.xml.tests ---
[INFO] ------------------------------------------------------------------------
[INFO] Reactor Summary:
[INFO] 
[INFO] Maven Integration for Eclipse (parent) 1.16.0-SNAPSHOT SUCCESS [  6.709 s]
[INFO] Maven Project Model Edit Bundle 1.16.1-SNAPSHOT .... SUCCESS [ 14.632 s]
[INFO] Maven Integration for Eclipse Core Plug-in 1.17.2-SNAPSHOT SUCCESS [ 13.525 s]
[INFO] Maven Integration for Eclipse UI Plug-in 1.17.2-SNAPSHOT SUCCESS [  6.317 s]
[INFO] Maven Integration for Eclipse Launching 1.17.1-SNAPSHOT SUCCESS [  3.924 s]
[INFO] Maven Integration for Eclipse JDT 1.17.1-SNAPSHOT .. SUCCESS [  3.786 s]
[INFO] Maven Integration for Eclipse JDT UI 1.17.1-SNAPSHOT SUCCESS [  3.217 s]
[INFO] Maven POM Refactoring 1.17.0-SNAPSHOT .............. SUCCESS [  3.930 s]
[INFO] m2e Marketplace 1.17.1-SNAPSHOT .................... SUCCESS [  3.481 s]
[INFO] org.eclipse.m2e.editor 1.17.2-SNAPSHOT ............. SUCCESS [  4.821 s]
[INFO] Maven POM XML Editor 1.17.1-SNAPSHOT ............... SUCCESS [  3.760 s]
[INFO] org.eclipse.m2e.lifecyclemapping.defaults 1.17.1-SNAPSHOT SUCCESS [  4.553 s]
[INFO] org.eclipse.m2e.scm 1.17.1-SNAPSHOT ................ SUCCESS [  3.413 s]
[INFO] Maven Profile Manager Core 1.17.0-SNAPSHOT ......... SUCCESS [  3.330 s]
[INFO] Maven Profile Manager UI 1.17.1-SNAPSHOT ........... SUCCESS [  3.185 s]
[INFO] Maven Integration for Eclipse Importer framework 1.17.1-SNAPSHOT SUCCESS [  3.023 s]
[INFO] org.eclipse.m2e.sourcelookup 1.17.1-SNAPSHOT ....... SUCCESS [  3.215 s]
[INFO] org.eclipse.m2e.binaryproject 1.17.1-SNAPSHOT ...... SUCCESS [  3.293 s]
[INFO] org.eclipse.m2e.binaryproject.ui 1.17.1-SNAPSHOT ... SUCCESS [  3.222 s]
[INFO] org.eclipse.m2e.sourcelookup.ui 1.17.1-SNAPSHOT .... SUCCESS [  3.294 s]
[INFO] org.eclipse.m2e.editor.lemminx 1.17.2-SNAPSHOT ..... SUCCESS [ 18.325 s]
[INFO] Maven PDE Integration 1.17.2-SNAPSHOT .............. SUCCESS [  3.330 s]
[INFO] Maven PDE UI Integration 1.17.2-SNAPSHOT ........... SUCCESS [  3.186 s]
[INFO] M2E Testing Helpers 1.17.1-SNAPSHOT ................ SUCCESS [  3.730 s]
[INFO] org.eclipse.m2e.logback.appender 1.17.0-SNAPSHOT ... SUCCESS [  3.176 s]
[INFO] org.eclipse.m2e.logback.configuration 1.16.0-SNAPSHOT SUCCESS [  3.070 s]
[INFO] org.eclipse.m2e.sse.ui.feature 1.17.1-SNAPSHOT ..... SUCCESS [  1.740 s]
[INFO] Maven Integration for Eclipse 1.17.2-SNAPSHOT ...... SUCCESS [  1.588 s]
[INFO] org.eclipse.m2e.lemminx.feature 1.17.1-SNAPSHOT .... SUCCESS [  1.197 s]
[INFO] m2e extensions development support (Optional) 1.17.2-SNAPSHOT SUCCESS [  1.654 s]
[INFO] Maven Integration for Eclipse slf4j over logback logging (Optional) 1.17.0-SNAPSHOT SUCCESS [  1.378 s]
[INFO] org.eclipse.m2e.pde.feature 1.17.2-SNAPSHOT ........ SUCCESS [  2.257 s]
[INFO] Maven Integration for Eclipse Update Site 1.16.0-SNAPSHOT SUCCESS [ 16.005 s]
[INFO] org.eclipse.m2e.core.tests 1.16.0-SNAPSHOT ......... SUCCESS [ 53.669 s]
[INFO] Tests for Maven Integration for Eclipse Importer framework 1.16.0-SNAPSHOT SUCCESS [ 22.176 s]
[INFO] org.eclipse.m2e.binaryproject.tests 1.16.0-SNAPSHOT  SUCCESS [ 28.733 s]
[INFO] org.eclipse.m2e.editor.lemminx.tests 1.16.0-SNAPSHOT SUCCESS [ 17.140 s]
[INFO] org.eclipse.m2e.jdt.tests 1.16.0-SNAPSHOT .......... SUCCESS [ 28.823 s]
[INFO] org.eclipse.m2e.editor.xml.sse.tests 1.16.0-SNAPSHOT SUCCESS [ 10.696 s]
[INFO] m2e-core-tests 1.16.0-SNAPSHOT ..................... SUCCESS [  0.006 s]
[INFO] Maven Integration for Eclipse tests 1.17.2-SNAPSHOT  SUCCESS [16:33 min]
[INFO] Maven Integration for Eclipse POM Editor tests 1.16.0-SNAPSHOT SUCCESS [ 34.414 s]
[INFO] Maven POM XML Editor Tests 1.17.2-SNAPSHOT ......... SUCCESS [01:38 min]
[INFO] ------------------------------------------------------------------------
[INFO] BUILD SUCCESS
[INFO] ------------------------------------------------------------------------
[INFO] Total time:  25:48 min
[INFO] Finished at: 2021-02-25T19:06:05Z
[INFO] ------------------------------------------------------------------------