UnstableConsole Output

Skipping 456 KB.. Full Log
inaryproject.tests/target/surefire.properties, -timeout, 7200000]

(process:1787): Gtk-WARNING **: 15:10:00.222: Locale not supported by C library.
	Using the fallback 'C' locale.
SWT SessionManagerDBus: Failed to connect to org.gnome.SessionManager: Failed to execute child process ?dbus-launch? (No such file or directory)
SWT SessionManagerDBus: Failed to connect to org.xfce.SessionManager: Failed to execute child process ?dbus-launch? (No such file or directory)
Running org.eclipse.m2e.binaryproject.tests.BinaryProjectTest
SLF4J: Failed to load class "org.slf4j.impl.StaticLoggerBinder".
SLF4J: Defaulting to no-operation (NOP) logger implementation
SLF4J: See http://www.slf4j.org/codes.html#StaticLoggerBinder for further details.
SLF4J: Failed to load class "org.slf4j.impl.StaticLoggerBinder".
SLF4J: Defaulting to no-operation (NOP) logger implementation
SLF4J: See http://www.slf4j.org/codes.html#StaticLoggerBinder for further details.
Tests run: 1, Failures: 0, Errors: 0, Skipped: 0, Time elapsed: 17.426 s - in org.eclipse.m2e.binaryproject.tests.BinaryProjectTest
testBasic(org.eclipse.m2e.binaryproject.tests.BinaryProjectTest)  Time elapsed: 17.217 s

Results:

Tests run: 1, Failures: 0, Errors: 0, Skipped: 0

[INFO] All tests passed!
[INFO] 
[INFO] --- tycho-p2-extras-plugin:2.1.0:compare-version-with-baselines (check-no-version-regression) @ org.eclipse.m2e.binaryproject.tests ---
[INFO] 
[INFO] --------< org.eclipse.m2e:org.eclipse.m2e.editor.lemminx.tests >--------
[INFO] Building org.eclipse.m2e.editor.lemminx.tests 1.16.0-SNAPSHOT    [37/43]
[INFO] ------------------------[ eclipse-test-plugin ]-------------------------
[INFO] 
[INFO] --- maven-clean-plugin:2.4.1:clean (default-clean) @ org.eclipse.m2e.editor.lemminx.tests ---
[INFO] 
[INFO] --- tycho-packaging-plugin:2.1.0:build-qualifier (default-build-qualifier) @ org.eclipse.m2e.editor.lemminx.tests ---
[INFO] The project's OSGi version is 1.16.0.20210115-1536
[INFO] 
[INFO] --- tycho-packaging-plugin:2.1.0:validate-id (default-validate-id) @ org.eclipse.m2e.editor.lemminx.tests ---
[INFO] 
[INFO] --- tycho-packaging-plugin:2.1.0:validate-version (default-validate-version) @ org.eclipse.m2e.editor.lemminx.tests ---
[INFO] 
[INFO] --- jacoco-maven-plugin:0.8.5:prepare-agent (default) @ org.eclipse.m2e.editor.lemminx.tests ---
[INFO] tycho.testArgLine set to -javaagent:/home/jenkins/agent/workspace/m2e_master/.m2/repository/org/jacoco/org.jacoco.agent/0.8.5/org.jacoco.agent-0.8.5-runtime.jar=destfile=/home/jenkins/agent/workspace/m2e_master/target/jacoco.exec,append=true,includes=org.eclipse.m2e*:org.apache.maven*:org.eclipse.aether* -Xmx800m
[INFO] 
[INFO] --- maven-resources-plugin:2.5:resources (default-resources) @ org.eclipse.m2e.editor.lemminx.tests ---
[debug] execute contextualize
[INFO] Using 'UTF-8' encoding to copy filtered resources.
[INFO] skip non existing resourceDirectory /home/jenkins/agent/workspace/m2e_master/org.eclipse.m2e.editor.lemminx.tests/src/main/resources
[INFO] 
[INFO] --- tycho-compiler-plugin:2.1.0:compile (default-compile) @ org.eclipse.m2e.editor.lemminx.tests ---
[WARNING] Parameter 'useProjectSettings' is set to true, but preferences file '/home/jenkins/agent/workspace/m2e_master/org.eclipse.m2e.editor.lemminx.tests/.settings/org.eclipse.jdt.core.prefs' could not be found!
[INFO] Compiling 1 source file to /home/jenkins/agent/workspace/m2e_master/org.eclipse.m2e.editor.lemminx.tests/target/classes
[INFO] 
[INFO] --- maven-resources-plugin:2.5:testResources (default-testResources) @ org.eclipse.m2e.editor.lemminx.tests ---
[debug] execute contextualize
[INFO] Using 'UTF-8' encoding to copy filtered resources.
[INFO] skip non existing resourceDirectory /home/jenkins/agent/workspace/m2e_master/org.eclipse.m2e.editor.lemminx.tests/src/test/resources
[INFO] 
[INFO] --- tycho-source-plugin:2.1.0:plugin-source (plugin-source) @ org.eclipse.m2e.editor.lemminx.tests ---
[INFO] Building jar: /home/jenkins/agent/workspace/m2e_master/org.eclipse.m2e.editor.lemminx.tests/target/org.eclipse.m2e.editor.lemminx.tests-1.16.0-SNAPSHOT-sources.jar
[INFO] 
[INFO] --- target-platform-configuration:2.1.0:target-platform (default-target-platform) @ org.eclipse.m2e.editor.lemminx.tests ---
[INFO] 
[INFO] --- tycho-packaging-plugin:2.1.0:package-plugin (default-package-plugin) @ org.eclipse.m2e.editor.lemminx.tests ---
[INFO] Building jar: /home/jenkins/agent/workspace/m2e_master/org.eclipse.m2e.editor.lemminx.tests/target/org.eclipse.m2e.editor.lemminx.tests-1.16.0-SNAPSHOT.jar
[INFO] 
[INFO] --- tycho-p2-plugin:2.1.0:p2-metadata-default (default-p2-metadata-default) @ org.eclipse.m2e.editor.lemminx.tests ---
[INFO] 
[INFO] --- tycho-pack200a-plugin:2.1.0:normalize (pack200-normalize) @ org.eclipse.m2e.editor.lemminx.tests ---
[INFO] Pack200 normalizing jar /home/jenkins/agent/workspace/m2e_master/org.eclipse.m2e.editor.lemminx.tests/target/org.eclipse.m2e.editor.lemminx.tests-1.16.0-SNAPSHOT.jar
[INFO] 
[INFO] --- eclipse-jarsigner-plugin:1.1.7:sign (sign) @ org.eclipse.m2e.editor.lemminx.tests ---
[INFO] Signing of nested jars of '/home/jenkins/agent/workspace/m2e_master/org.eclipse.m2e.editor.lemminx.tests/target/org.eclipse.m2e.editor.lemminx.tests-1.16.0-SNAPSHOT.jar' is disabled.
[INFO] Signing jar: /home/jenkins/agent/workspace/m2e_master/org.eclipse.m2e.editor.lemminx.tests/target/org.eclipse.m2e.editor.lemminx.tests-1.16.0-SNAPSHOT.jar
[INFO] Signing of nested jars of '/home/jenkins/agent/workspace/m2e_master/org.eclipse.m2e.editor.lemminx.tests/target/org.eclipse.m2e.editor.lemminx.tests-1.16.0-SNAPSHOT-sources.jar' is disabled.
[INFO] Signing jar: /home/jenkins/agent/workspace/m2e_master/org.eclipse.m2e.editor.lemminx.tests/target/org.eclipse.m2e.editor.lemminx.tests-1.16.0-SNAPSHOT-sources.jar
[INFO] 
[INFO] --- tycho-pack200b-plugin:2.1.0:pack (pack200-pack) @ org.eclipse.m2e.editor.lemminx.tests ---
[INFO] Pack200 packing jar /home/jenkins/agent/workspace/m2e_master/org.eclipse.m2e.editor.lemminx.tests/target/org.eclipse.m2e.editor.lemminx.tests-1.16.0-SNAPSHOT.jar
[INFO] 
[INFO] --- tycho-p2-plugin:2.1.0:p2-metadata (p2-metadata) @ org.eclipse.m2e.editor.lemminx.tests ---
[INFO] No baseline version MavenProject: org.eclipse.m2e:org.eclipse.m2e.editor.lemminx.tests:1.16.0-SNAPSHOT @ /home/jenkins/agent/workspace/m2e_master/org.eclipse.m2e.editor.lemminx.tests/pom.xml
[INFO] 
[INFO] --- tycho-surefire-plugin:2.1.0:test (default-test) @ org.eclipse.m2e.editor.lemminx.tests ---
[INFO] Executing Test Runtime with timeout 7200, logs (if any) will be placed at: /home/jenkins/agent/workspace/m2e_master/org.eclipse.m2e.editor.lemminx.tests/target/work/data/.metadata/.log
[INFO] Command line:
	[/opt/tools/java/openjdk/jdk-11/11.0.2+9/bin/java, -Dosgi.noShutdown=false, -Dosgi.os=linux, -Dosgi.ws=gtk, -Dosgi.arch=x86_64, -javaagent:/home/jenkins/agent/workspace/m2e_master/.m2/repository/org/jacoco/org.jacoco.agent/0.8.5/org.jacoco.agent-0.8.5-runtime.jar=destfile=/home/jenkins/agent/workspace/m2e_master/target/jacoco.exec,append=true,includes=org.eclipse.m2e*:org.apache.maven*:org.eclipse.aether*, -Xmx800m, -Dosgi.clean=true, -jar, /home/jenkins/agent/workspace/m2e_master/.m2/repository/p2/osgi/bundle/org.eclipse.equinox.launcher/1.6.0.v20200915-1508/org.eclipse.equinox.launcher-1.6.0.v20200915-1508.jar, -data, /home/jenkins/agent/workspace/m2e_master/org.eclipse.m2e.editor.lemminx.tests/target/work/data, -install, /home/jenkins/agent/workspace/m2e_master/org.eclipse.m2e.editor.lemminx.tests/target/work, -configuration, /home/jenkins/agent/workspace/m2e_master/org.eclipse.m2e.editor.lemminx.tests/target/work/configuration, -application, org.eclipse.tycho.surefire.osgibooter.uitest, -testproperties, /home/jenkins/agent/workspace/m2e_master/org.eclipse.m2e.editor.lemminx.tests/target/surefire.properties, -timeout, 7200000]

(process:1926): Gtk-WARNING **: 15:10:25.975: Locale not supported by C library.
	Using the fallback 'C' locale.
SWT SessionManagerDBus: Failed to connect to org.gnome.SessionManager: Failed to execute child process ?dbus-launch? (No such file or directory)
SWT SessionManagerDBus: Failed to connect to org.xfce.SessionManager: Failed to execute child process ?dbus-launch? (No such file or directory)
Running org.eclipse.m2e.editor.lemminx.tests.EditorTest
SLF4J: Failed to load class "org.slf4j.impl.StaticLoggerBinder".
SLF4J: Defaulting to no-operation (NOP) logger implementation
SLF4J: See http://www.slf4j.org/codes.html#StaticLoggerBinder for further details.
Warning: NLS missing message: MavenImpl_error_lookup in: org.eclipse.m2e.editor.internal.messages
Tests run: 2, Failures: 0, Errors: 0, Skipped: 0, Time elapsed: 6.491 s - in org.eclipse.m2e.editor.lemminx.tests.EditorTest
testEditorOpenOnSourcePage(org.eclipse.m2e.editor.lemminx.tests.EditorTest)  Time elapsed: 2.791 s
testGenericEditorHasMavenExtensionEnabled(org.eclipse.m2e.editor.lemminx.tests.EditorTest)  Time elapsed: 3.681 s

Results:

Tests run: 2, Failures: 0, Errors: 0, Skipped: 0

[INFO] All tests passed!
[INFO] 
[INFO] --- tycho-p2-extras-plugin:2.1.0:compare-version-with-baselines (check-no-version-regression) @ org.eclipse.m2e.editor.lemminx.tests ---
[INFO] 
[INFO] -------------< org.eclipse.m2e:org.eclipse.m2e.jdt.tests >--------------
[INFO] Building org.eclipse.m2e.jdt.tests 1.16.0-SNAPSHOT               [38/43]
[INFO] ------------------------[ eclipse-test-plugin ]-------------------------
[INFO] 
[INFO] --- maven-clean-plugin:2.4.1:clean (default-clean) @ org.eclipse.m2e.jdt.tests ---
[INFO] 
[INFO] --- tycho-packaging-plugin:2.1.0:build-qualifier (default-build-qualifier) @ org.eclipse.m2e.jdt.tests ---
[INFO] The project's OSGi version is 1.16.0.20210115-1536
[INFO] 
[INFO] --- tycho-packaging-plugin:2.1.0:validate-id (default-validate-id) @ org.eclipse.m2e.jdt.tests ---
[INFO] 
[INFO] --- tycho-packaging-plugin:2.1.0:validate-version (default-validate-version) @ org.eclipse.m2e.jdt.tests ---
[INFO] 
[INFO] --- jacoco-maven-plugin:0.8.5:prepare-agent (default) @ org.eclipse.m2e.jdt.tests ---
[INFO] tycho.testArgLine set to -javaagent:/home/jenkins/agent/workspace/m2e_master/.m2/repository/org/jacoco/org.jacoco.agent/0.8.5/org.jacoco.agent-0.8.5-runtime.jar=destfile=/home/jenkins/agent/workspace/m2e_master/target/jacoco.exec,append=true,includes=org.eclipse.m2e*:org.apache.maven*:org.eclipse.aether* -Xmx800m
[INFO] 
[INFO] --- maven-resources-plugin:2.5:resources (default-resources) @ org.eclipse.m2e.jdt.tests ---
[debug] execute contextualize
[INFO] Using 'UTF-8' encoding to copy filtered resources.
[INFO] skip non existing resourceDirectory /home/jenkins/agent/workspace/m2e_master/org.eclipse.m2e.jdt.tests/src/main/resources
[INFO] 
[INFO] --- tycho-compiler-plugin:2.1.0:compile (default-compile) @ org.eclipse.m2e.jdt.tests ---
[WARNING] Parameter 'useProjectSettings' is set to true, but preferences file '/home/jenkins/agent/workspace/m2e_master/org.eclipse.m2e.jdt.tests/.settings/org.eclipse.jdt.core.prefs' could not be found!
[INFO] Compiling 1 source file to /home/jenkins/agent/workspace/m2e_master/org.eclipse.m2e.jdt.tests/target/classes
[INFO] 
[INFO] --- maven-resources-plugin:2.5:testResources (default-testResources) @ org.eclipse.m2e.jdt.tests ---
[debug] execute contextualize
[INFO] Using 'UTF-8' encoding to copy filtered resources.
[INFO] skip non existing resourceDirectory /home/jenkins/agent/workspace/m2e_master/org.eclipse.m2e.jdt.tests/src/test/resources
[INFO] 
[INFO] --- tycho-source-plugin:2.1.0:plugin-source (plugin-source) @ org.eclipse.m2e.jdt.tests ---
[WARNING] Bundle-Name header not found in /home/jenkins/agent/workspace/m2e_master/org.eclipse.m2e.jdt.tests/META-INF/MANIFEST.MF, fallback to Bundle-SymbolicName for source bundle
[WARNING] Bundle-Vendor header not found in /home/jenkins/agent/workspace/m2e_master/org.eclipse.m2e.jdt.tests/META-INF/MANIFEST.MF, fallback to 'unknown' for source bundle
[INFO] Building jar: /home/jenkins/agent/workspace/m2e_master/org.eclipse.m2e.jdt.tests/target/org.eclipse.m2e.jdt.tests-1.16.0-SNAPSHOT-sources.jar
[INFO] 
[INFO] --- target-platform-configuration:2.1.0:target-platform (default-target-platform) @ org.eclipse.m2e.jdt.tests ---
[INFO] 
[INFO] --- tycho-packaging-plugin:2.1.0:package-plugin (default-package-plugin) @ org.eclipse.m2e.jdt.tests ---
[INFO] Building jar: /home/jenkins/agent/workspace/m2e_master/org.eclipse.m2e.jdt.tests/target/org.eclipse.m2e.jdt.tests-1.16.0-SNAPSHOT.jar
[INFO] 
[INFO] --- tycho-p2-plugin:2.1.0:p2-metadata-default (default-p2-metadata-default) @ org.eclipse.m2e.jdt.tests ---
[INFO] 
[INFO] --- tycho-pack200a-plugin:2.1.0:normalize (pack200-normalize) @ org.eclipse.m2e.jdt.tests ---
[INFO] Pack200 normalizing jar /home/jenkins/agent/workspace/m2e_master/org.eclipse.m2e.jdt.tests/target/org.eclipse.m2e.jdt.tests-1.16.0-SNAPSHOT.jar
[INFO] 
[INFO] --- eclipse-jarsigner-plugin:1.1.7:sign (sign) @ org.eclipse.m2e.jdt.tests ---
[INFO] Signing of nested jars of '/home/jenkins/agent/workspace/m2e_master/org.eclipse.m2e.jdt.tests/target/org.eclipse.m2e.jdt.tests-1.16.0-SNAPSHOT.jar' is disabled.
[INFO] Signing jar: /home/jenkins/agent/workspace/m2e_master/org.eclipse.m2e.jdt.tests/target/org.eclipse.m2e.jdt.tests-1.16.0-SNAPSHOT.jar
[INFO] Signing of nested jars of '/home/jenkins/agent/workspace/m2e_master/org.eclipse.m2e.jdt.tests/target/org.eclipse.m2e.jdt.tests-1.16.0-SNAPSHOT-sources.jar' is disabled.
[INFO] Signing jar: /home/jenkins/agent/workspace/m2e_master/org.eclipse.m2e.jdt.tests/target/org.eclipse.m2e.jdt.tests-1.16.0-SNAPSHOT-sources.jar
[INFO] 
[INFO] --- tycho-pack200b-plugin:2.1.0:pack (pack200-pack) @ org.eclipse.m2e.jdt.tests ---
[INFO] Pack200 packing jar /home/jenkins/agent/workspace/m2e_master/org.eclipse.m2e.jdt.tests/target/org.eclipse.m2e.jdt.tests-1.16.0-SNAPSHOT.jar
[INFO] 
[INFO] --- tycho-p2-plugin:2.1.0:p2-metadata (p2-metadata) @ org.eclipse.m2e.jdt.tests ---
[INFO] No baseline version MavenProject: org.eclipse.m2e:org.eclipse.m2e.jdt.tests:1.16.0-SNAPSHOT @ /home/jenkins/agent/workspace/m2e_master/org.eclipse.m2e.jdt.tests/pom.xml
[INFO] 
[INFO] --- tycho-surefire-plugin:2.1.0:test (default-test) @ org.eclipse.m2e.jdt.tests ---
[INFO] Executing Test Runtime with timeout 7200, logs (if any) will be placed at: /home/jenkins/agent/workspace/m2e_master/org.eclipse.m2e.jdt.tests/target/work/data/.metadata/.log
[INFO] Command line:
	[/opt/tools/java/openjdk/jdk-11/11.0.2+9/bin/java, -Dosgi.noShutdown=false, -Dosgi.os=linux, -Dosgi.ws=gtk, -Dosgi.arch=x86_64, -javaagent:/home/jenkins/agent/workspace/m2e_master/.m2/repository/org/jacoco/org.jacoco.agent/0.8.5/org.jacoco.agent-0.8.5-runtime.jar=destfile=/home/jenkins/agent/workspace/m2e_master/target/jacoco.exec,append=true,includes=org.eclipse.m2e*:org.apache.maven*:org.eclipse.aether*, -Xmx800m, -Dosgi.clean=true, -jar, /home/jenkins/agent/workspace/m2e_master/.m2/repository/p2/osgi/bundle/org.eclipse.equinox.launcher/1.6.0.v20200915-1508/org.eclipse.equinox.launcher-1.6.0.v20200915-1508.jar, -data, /home/jenkins/agent/workspace/m2e_master/org.eclipse.m2e.jdt.tests/target/work/data, -install, /home/jenkins/agent/workspace/m2e_master/org.eclipse.m2e.jdt.tests/target/work, -configuration, /home/jenkins/agent/workspace/m2e_master/org.eclipse.m2e.jdt.tests/target/work/configuration, -application, org.eclipse.tycho.surefire.osgibooter.uitest, -testproperties, /home/jenkins/agent/workspace/m2e_master/org.eclipse.m2e.jdt.tests/target/surefire.properties, -timeout, 7200000]

(process:2158): Gtk-WARNING **: 15:10:39.879: Locale not supported by C library.
	Using the fallback 'C' locale.
SWT SessionManagerDBus: Failed to connect to org.gnome.SessionManager: Failed to execute child process ?dbus-launch? (No such file or directory)
SWT SessionManagerDBus: Failed to connect to org.xfce.SessionManager: Failed to execute child process ?dbus-launch? (No such file or directory)
Running org.eclipse.m2e.jdt.tests.JavaConfigurationTest
SLF4J: Failed to load class "org.slf4j.impl.StaticLoggerBinder".
SLF4J: Defaulting to no-operation (NOP) logger implementation
SLF4J: See http://www.slf4j.org/codes.html#StaticLoggerBinder for further details.
SLF4J: Failed to load class "org.slf4j.impl.StaticLoggerBinder".
SLF4J: Defaulting to no-operation (NOP) logger implementation
SLF4J: See http://www.slf4j.org/codes.html#StaticLoggerBinder for further details.
Tests run: 1, Failures: 0, Errors: 0, Skipped: 0, Time elapsed: 14.71 s - in org.eclipse.m2e.jdt.tests.JavaConfigurationTest
testFileChangeUpdatesJDTSettings(org.eclipse.m2e.jdt.tests.JavaConfigurationTest)  Time elapsed: 14.305 s

Results:

Tests run: 1, Failures: 0, Errors: 0, Skipped: 0

[INFO] All tests passed!
[INFO] 
[INFO] --- tycho-p2-extras-plugin:2.1.0:compare-version-with-baselines (check-no-version-regression) @ org.eclipse.m2e.jdt.tests ---
[INFO] 
[INFO] --------< org.eclipse.m2e:org.eclipse.m2e.editor.xml.sse.tests >--------
[INFO] Building org.eclipse.m2e.editor.xml.sse.tests 1.16.0-SNAPSHOT    [39/43]
[INFO] ------------------------[ eclipse-test-plugin ]-------------------------
[INFO] 
[INFO] --- maven-clean-plugin:2.4.1:clean (default-clean) @ org.eclipse.m2e.editor.xml.sse.tests ---
[INFO] 
[INFO] --- tycho-packaging-plugin:2.1.0:build-qualifier (default-build-qualifier) @ org.eclipse.m2e.editor.xml.sse.tests ---
[INFO] The project's OSGi version is 1.16.0.20210115-1536
[INFO] 
[INFO] --- tycho-packaging-plugin:2.1.0:validate-id (default-validate-id) @ org.eclipse.m2e.editor.xml.sse.tests ---
[INFO] 
[INFO] --- tycho-packaging-plugin:2.1.0:validate-version (default-validate-version) @ org.eclipse.m2e.editor.xml.sse.tests ---
[INFO] 
[INFO] --- jacoco-maven-plugin:0.8.5:prepare-agent (default) @ org.eclipse.m2e.editor.xml.sse.tests ---
[INFO] tycho.testArgLine set to -javaagent:/home/jenkins/agent/workspace/m2e_master/.m2/repository/org/jacoco/org.jacoco.agent/0.8.5/org.jacoco.agent-0.8.5-runtime.jar=destfile=/home/jenkins/agent/workspace/m2e_master/target/jacoco.exec,append=true,includes=org.eclipse.m2e*:org.apache.maven*:org.eclipse.aether* -Xmx800m
[INFO] 
[INFO] --- maven-resources-plugin:2.5:resources (default-resources) @ org.eclipse.m2e.editor.xml.sse.tests ---
[debug] execute contextualize
[INFO] Using 'UTF-8' encoding to copy filtered resources.
[INFO] skip non existing resourceDirectory /home/jenkins/agent/workspace/m2e_master/org.eclipse.m2e.editor.xml.sse.tests/src/main/resources
[INFO] 
[INFO] --- tycho-compiler-plugin:2.1.0:compile (default-compile) @ org.eclipse.m2e.editor.xml.sse.tests ---
[WARNING] Parameter 'useProjectSettings' is set to true, but preferences file '/home/jenkins/agent/workspace/m2e_master/org.eclipse.m2e.editor.xml.sse.tests/.settings/org.eclipse.jdt.core.prefs' could not be found!
[INFO] Compiling 1 source file to /home/jenkins/agent/workspace/m2e_master/org.eclipse.m2e.editor.xml.sse.tests/target/classes
[INFO] 
[INFO] --- maven-resources-plugin:2.5:testResources (default-testResources) @ org.eclipse.m2e.editor.xml.sse.tests ---
[debug] execute contextualize
[INFO] Using 'UTF-8' encoding to copy filtered resources.
[INFO] skip non existing resourceDirectory /home/jenkins/agent/workspace/m2e_master/org.eclipse.m2e.editor.xml.sse.tests/src/test/resources
[INFO] 
[INFO] --- tycho-source-plugin:2.1.0:plugin-source (plugin-source) @ org.eclipse.m2e.editor.xml.sse.tests ---
[INFO] Building jar: /home/jenkins/agent/workspace/m2e_master/org.eclipse.m2e.editor.xml.sse.tests/target/org.eclipse.m2e.editor.xml.sse.tests-1.16.0-SNAPSHOT-sources.jar
[INFO] 
[INFO] --- target-platform-configuration:2.1.0:target-platform (default-target-platform) @ org.eclipse.m2e.editor.xml.sse.tests ---
[INFO] 
[INFO] --- tycho-packaging-plugin:2.1.0:package-plugin (default-package-plugin) @ org.eclipse.m2e.editor.xml.sse.tests ---
[INFO] Building jar: /home/jenkins/agent/workspace/m2e_master/org.eclipse.m2e.editor.xml.sse.tests/target/org.eclipse.m2e.editor.xml.sse.tests-1.16.0-SNAPSHOT.jar
[INFO] 
[INFO] --- tycho-p2-plugin:2.1.0:p2-metadata-default (default-p2-metadata-default) @ org.eclipse.m2e.editor.xml.sse.tests ---
[INFO] 
[INFO] --- tycho-pack200a-plugin:2.1.0:normalize (pack200-normalize) @ org.eclipse.m2e.editor.xml.sse.tests ---
[INFO] Pack200 normalizing jar /home/jenkins/agent/workspace/m2e_master/org.eclipse.m2e.editor.xml.sse.tests/target/org.eclipse.m2e.editor.xml.sse.tests-1.16.0-SNAPSHOT.jar
[INFO] 
[INFO] --- eclipse-jarsigner-plugin:1.1.7:sign (sign) @ org.eclipse.m2e.editor.xml.sse.tests ---
[INFO] Signing of nested jars of '/home/jenkins/agent/workspace/m2e_master/org.eclipse.m2e.editor.xml.sse.tests/target/org.eclipse.m2e.editor.xml.sse.tests-1.16.0-SNAPSHOT.jar' is disabled.
[INFO] Signing jar: /home/jenkins/agent/workspace/m2e_master/org.eclipse.m2e.editor.xml.sse.tests/target/org.eclipse.m2e.editor.xml.sse.tests-1.16.0-SNAPSHOT.jar
[INFO] Signing of nested jars of '/home/jenkins/agent/workspace/m2e_master/org.eclipse.m2e.editor.xml.sse.tests/target/org.eclipse.m2e.editor.xml.sse.tests-1.16.0-SNAPSHOT-sources.jar' is disabled.
[INFO] Signing jar: /home/jenkins/agent/workspace/m2e_master/org.eclipse.m2e.editor.xml.sse.tests/target/org.eclipse.m2e.editor.xml.sse.tests-1.16.0-SNAPSHOT-sources.jar
[INFO] 
[INFO] --- tycho-pack200b-plugin:2.1.0:pack (pack200-pack) @ org.eclipse.m2e.editor.xml.sse.tests ---
[INFO] Pack200 packing jar /home/jenkins/agent/workspace/m2e_master/org.eclipse.m2e.editor.xml.sse.tests/target/org.eclipse.m2e.editor.xml.sse.tests-1.16.0-SNAPSHOT.jar
[INFO] 
[INFO] --- tycho-p2-plugin:2.1.0:p2-metadata (p2-metadata) @ org.eclipse.m2e.editor.xml.sse.tests ---
[INFO] No baseline version MavenProject: org.eclipse.m2e:org.eclipse.m2e.editor.xml.sse.tests:1.16.0-SNAPSHOT @ /home/jenkins/agent/workspace/m2e_master/org.eclipse.m2e.editor.xml.sse.tests/pom.xml
[INFO] 
[INFO] --- tycho-surefire-plugin:2.1.0:test (default-test) @ org.eclipse.m2e.editor.xml.sse.tests ---
[INFO] Executing Test Runtime with timeout 7200, logs (if any) will be placed at: /home/jenkins/agent/workspace/m2e_master/org.eclipse.m2e.editor.xml.sse.tests/target/work/data/.metadata/.log
[INFO] Command line:
	[/opt/tools/java/openjdk/jdk-11/11.0.2+9/bin/java, -Dosgi.noShutdown=false, -Dosgi.os=linux, -Dosgi.ws=gtk, -Dosgi.arch=x86_64, -javaagent:/home/jenkins/agent/workspace/m2e_master/.m2/repository/org/jacoco/org.jacoco.agent/0.8.5/org.jacoco.agent-0.8.5-runtime.jar=destfile=/home/jenkins/agent/workspace/m2e_master/target/jacoco.exec,append=true,includes=org.eclipse.m2e*:org.apache.maven*:org.eclipse.aether*, -Xmx800m, -Dosgi.clean=true, -jar, /home/jenkins/agent/workspace/m2e_master/.m2/repository/p2/osgi/bundle/org.eclipse.equinox.launcher/1.6.0.v20200915-1508/org.eclipse.equinox.launcher-1.6.0.v20200915-1508.jar, -data, /home/jenkins/agent/workspace/m2e_master/org.eclipse.m2e.editor.xml.sse.tests/target/work/data, -install, /home/jenkins/agent/workspace/m2e_master/org.eclipse.m2e.editor.xml.sse.tests/target/work, -configuration, /home/jenkins/agent/workspace/m2e_master/org.eclipse.m2e.editor.xml.sse.tests/target/work/configuration, -application, org.eclipse.tycho.surefire.osgibooter.uitest, -testproperties, /home/jenkins/agent/workspace/m2e_master/org.eclipse.m2e.editor.xml.sse.tests/target/surefire.properties, -timeout, 7200000]

(process:2254): Gtk-WARNING **: 15:11:04.972: Locale not supported by C library.
	Using the fallback 'C' locale.
SWT SessionManagerDBus: Failed to connect to org.gnome.SessionManager: Failed to execute child process ?dbus-launch? (No such file or directory)
SWT SessionManagerDBus: Failed to connect to org.xfce.SessionManager: Failed to execute child process ?dbus-launch? (No such file or directory)
Running org.eclipse.m2e.editor.xml.sse.tests.WTPEditorTest
SLF4J: Failed to load class "org.slf4j.impl.StaticLoggerBinder".
SLF4J: Defaulting to no-operation (NOP) logger implementation
SLF4J: See http://www.slf4j.org/codes.html#StaticLoggerBinder for further details.
Warning: NLS missing message: MavenImpl_error_lookup in: org.eclipse.m2e.editor.internal.messages
Warning: NLS unused message: MarkerHoverControl_openDiscoveryPrefs in: org.eclipse.m2e.editor.xml.internal.messages
Warning: NLS unused message: MarkerHoverControl_openLifecyclePrefs in: org.eclipse.m2e.editor.xml.internal.messages
Warning: NLS unused message: MarkerHoverControl_openParentDefinition in: org.eclipse.m2e.editor.xml.internal.messages
Warning: NLS unused message: MarkerHoverControl_openWarningsPrefs in: org.eclipse.m2e.editor.xml.internal.messages
Warning: NLS unused message: MavenMarkerResolution_error in: org.eclipse.m2e.editor.xml.internal.messages
Warning: NLS unused message: MavenMarkerResolution_error_title in: org.eclipse.m2e.editor.xml.internal.messages
Warning: NLS unused message: MavenMarkerResolution_schema_label in: org.eclipse.m2e.editor.xml.internal.messages
Tests run: 1, Failures: 0, Errors: 0, Skipped: 0, Time elapsed: 2.421 s - in org.eclipse.m2e.editor.xml.sse.tests.WTPEditorTest
testXSDCompletion(org.eclipse.m2e.editor.xml.sse.tests.WTPEditorTest)  Time elapsed: 2.403 s

Results:

Tests run: 1, Failures: 0, Errors: 0, Skipped: 0

[INFO] All tests passed!
[INFO] 
[INFO] --- tycho-p2-extras-plugin:2.1.0:compare-version-with-baselines (check-no-version-regression) @ org.eclipse.m2e.editor.xml.sse.tests ---
[INFO] 
[INFO] -------------------< org.eclipse.m2e:m2e-core-tests >-------------------
[INFO] Building m2e-core-tests 1.16.0-SNAPSHOT                          [40/43]
[INFO] --------------------------------[ pom ]---------------------------------
[INFO] 
[INFO] --- maven-clean-plugin:2.4.1:clean (default-clean) @ m2e-core-tests ---
[INFO] 
[INFO] --- jacoco-maven-plugin:0.8.5:prepare-agent (default) @ m2e-core-tests ---
[INFO] argLine set to -javaagent:/home/jenkins/agent/workspace/m2e_master/.m2/repository/org/jacoco/org.jacoco.agent/0.8.5/org.jacoco.agent-0.8.5-runtime.jar=destfile=/home/jenkins/agent/workspace/m2e_master/target/jacoco.exec,append=true,includes=org.eclipse.m2e*:org.apache.maven*:org.eclipse.aether*
[INFO] 
[INFO] --- tycho-source-plugin:2.1.0:plugin-source (plugin-source) @ m2e-core-tests ---
[INFO] 
[INFO] --- tycho-pack200a-plugin:2.1.0:normalize (pack200-normalize) @ m2e-core-tests ---
[INFO] 
[INFO] --- eclipse-jarsigner-plugin:1.1.7:sign (sign) @ m2e-core-tests ---
[INFO] 
[INFO] --- tycho-pack200b-plugin:2.1.0:pack (pack200-pack) @ m2e-core-tests ---
[INFO] 
[INFO] --- tycho-p2-plugin:2.1.0:p2-metadata (p2-metadata) @ m2e-core-tests ---
[INFO] 
[INFO] --- tycho-p2-extras-plugin:2.1.0:compare-version-with-baselines (check-no-version-regression) @ m2e-core-tests ---
[INFO] 
[INFO] ---------------< org.eclipse.m2e:org.eclipse.m2e.tests >----------------
[INFO] Building Maven Integration for Eclipse tests 1.16.0-SNAPSHOT     [41/43]
[INFO] ------------------------[ eclipse-test-plugin ]-------------------------
[INFO] 
[INFO] --- maven-clean-plugin:2.4.1:clean (default-clean) @ org.eclipse.m2e.tests ---
[INFO] 
[INFO] --- tycho-packaging-plugin:2.1.0:build-qualifier (default-build-qualifier) @ org.eclipse.m2e.tests ---
[INFO] The project's OSGi version is 1.16.0.20210115-0841
[INFO] 
[INFO] --- tycho-packaging-plugin:2.1.0:validate-id (default-validate-id) @ org.eclipse.m2e.tests ---
[INFO] 
[INFO] --- tycho-packaging-plugin:2.1.0:validate-version (default-validate-version) @ org.eclipse.m2e.tests ---
[INFO] 
[INFO] --- jacoco-maven-plugin:0.8.5:prepare-agent (default) @ org.eclipse.m2e.tests ---
[INFO] tycho.testArgLine set to -javaagent:/home/jenkins/agent/workspace/m2e_master/.m2/repository/org/jacoco/org.jacoco.agent/0.8.5/org.jacoco.agent-0.8.5-runtime.jar=destfile=/home/jenkins/agent/workspace/m2e_master/m2e-core-tests/target/jacoco.exec,append=true,includes=org.eclipse.m2e*:org.apache.maven*:org.eclipse.aether* -Xmx800m
[INFO] 
[INFO] --- maven-resources-plugin:2.5:resources (default-resources) @ org.eclipse.m2e.tests ---
[debug] execute contextualize
[INFO] Using 'UTF-8' encoding to copy filtered resources.
[INFO] skip non existing resourceDirectory /home/jenkins/agent/workspace/m2e_master/m2e-core-tests/org.eclipse.m2e.tests/src/main/resources
[INFO] 
[INFO] --- tycho-compiler-plugin:2.1.0:compile (default-compile) @ org.eclipse.m2e.tests ---
[INFO] Compiling 113 source files to /home/jenkins/agent/workspace/m2e_master/m2e-core-tests/org.eclipse.m2e.tests/target/classes
[INFO] 
[INFO] --- maven-resources-plugin:2.5:testResources (default-testResources) @ org.eclipse.m2e.tests ---
[debug] execute contextualize
[INFO] Using 'UTF-8' encoding to copy filtered resources.
[INFO] skip non existing resourceDirectory /home/jenkins/agent/workspace/m2e_master/m2e-core-tests/org.eclipse.m2e.tests/src/test/resources
[INFO] 
[INFO] --- tycho-source-plugin:2.1.0:plugin-source (plugin-source) @ org.eclipse.m2e.tests ---
[INFO] Building jar: /home/jenkins/agent/workspace/m2e_master/m2e-core-tests/org.eclipse.m2e.tests/target/org.eclipse.m2e.tests-1.16.0-SNAPSHOT-sources.jar
[INFO] 
[INFO] --- target-platform-configuration:2.1.0:target-platform (default-target-platform) @ org.eclipse.m2e.tests ---
[INFO] 
[INFO] --- tycho-packaging-plugin:2.1.0:package-plugin (default-package-plugin) @ org.eclipse.m2e.tests ---
[INFO] Building jar: /home/jenkins/agent/workspace/m2e_master/m2e-core-tests/org.eclipse.m2e.tests/target/org.eclipse.m2e.tests-1.16.0-SNAPSHOT.jar
[INFO] 
[INFO] --- tycho-p2-plugin:2.1.0:p2-metadata-default (default-p2-metadata-default) @ org.eclipse.m2e.tests ---
[INFO] 
[INFO] --- tycho-pack200a-plugin:2.1.0:normalize (pack200-normalize) @ org.eclipse.m2e.tests ---
[INFO] Pack200 normalizing jar /home/jenkins/agent/workspace/m2e_master/m2e-core-tests/org.eclipse.m2e.tests/target/org.eclipse.m2e.tests-1.16.0-SNAPSHOT.jar
[INFO] 
[INFO] --- eclipse-jarsigner-plugin:1.1.7:sign (sign) @ org.eclipse.m2e.tests ---
[INFO] Signing of nested jars of '/home/jenkins/agent/workspace/m2e_master/m2e-core-tests/org.eclipse.m2e.tests/target/org.eclipse.m2e.tests-1.16.0-SNAPSHOT.jar' is disabled.
[INFO] Signing jar: /home/jenkins/agent/workspace/m2e_master/m2e-core-tests/org.eclipse.m2e.tests/target/org.eclipse.m2e.tests-1.16.0-SNAPSHOT.jar
[INFO] Signing of nested jars of '/home/jenkins/agent/workspace/m2e_master/m2e-core-tests/org.eclipse.m2e.tests/target/org.eclipse.m2e.tests-1.16.0-SNAPSHOT-sources.jar' is disabled.
[INFO] Signing jar: /home/jenkins/agent/workspace/m2e_master/m2e-core-tests/org.eclipse.m2e.tests/target/org.eclipse.m2e.tests-1.16.0-SNAPSHOT-sources.jar
[INFO] 
[INFO] --- tycho-pack200b-plugin:2.1.0:pack (pack200-pack) @ org.eclipse.m2e.tests ---
[INFO] Pack200 packing jar /home/jenkins/agent/workspace/m2e_master/m2e-core-tests/org.eclipse.m2e.tests/target/org.eclipse.m2e.tests-1.16.0-SNAPSHOT.jar
[INFO] 
[INFO] --- tycho-p2-plugin:2.1.0:p2-metadata (p2-metadata) @ org.eclipse.m2e.tests ---
[INFO] No baseline version MavenProject: org.eclipse.m2e:org.eclipse.m2e.tests:1.16.0-SNAPSHOT @ /home/jenkins/agent/workspace/m2e_master/m2e-core-tests/org.eclipse.m2e.tests/pom.xml
[INFO] 
[INFO] --- tycho-surefire-plugin:2.1.0:test (default-test) @ org.eclipse.m2e.tests ---
[INFO] Executing Test Runtime with timeout 7200, logs (if any) will be placed at: /home/jenkins/agent/workspace/m2e_master/m2e-core-tests/org.eclipse.m2e.tests/target/work/data/.metadata/.log
[INFO] Command line:
	[/opt/tools/java/openjdk/jdk-11/11.0.2+9/bin/java, -Dosgi.noShutdown=false, -Dosgi.os=linux, -Dosgi.ws=gtk, -Dosgi.arch=x86_64, -javaagent:/home/jenkins/agent/workspace/m2e_master/.m2/repository/org/jacoco/org.jacoco.agent/0.8.5/org.jacoco.agent-0.8.5-runtime.jar=destfile=/home/jenkins/agent/workspace/m2e_master/m2e-core-tests/target/jacoco.exec,append=true,includes=org.eclipse.m2e*:org.apache.maven*:org.eclipse.aether*, -Xmx800m, -Dosgi.clean=true, -jar, /home/jenkins/agent/workspace/m2e_master/.m2/repository/p2/osgi/bundle/org.eclipse.equinox.launcher/1.6.0.v20200915-1508/org.eclipse.equinox.launcher-1.6.0.v20200915-1508.jar, -data, /home/jenkins/agent/workspace/m2e_master/m2e-core-tests/org.eclipse.m2e.tests/target/work/data, -install, /home/jenkins/agent/workspace/m2e_master/m2e-core-tests/org.eclipse.m2e.tests/target/work, -configuration, /home/jenkins/agent/workspace/m2e_master/m2e-core-tests/org.eclipse.m2e.tests/target/work/configuration, -application, org.eclipse.tycho.surefire.osgibooter.uitest, -testproperties, /home/jenkins/agent/workspace/m2e_master/m2e-core-tests/org.eclipse.m2e.tests/target/surefire.properties, -pluginCustomization, /home/jenkins/agent/workspace/m2e_master/m2e-core-tests/org.eclipse.m2e.tests/plugin_customization.ini, -timeout, 7200000]

(process:2336): Gtk-WARNING **: 15:11:17.323: Locale not supported by C library.
	Using the fallback 'C' locale.
SWT SessionManagerDBus: Failed to connect to org.gnome.SessionManager: Failed to execute child process ?dbus-launch? (No such file or directory)
SWT SessionManagerDBus: Failed to connect to org.xfce.SessionManager: Failed to execute child process ?dbus-launch? (No such file or directory)
SLF4J: Failed to load class "org.slf4j.impl.StaticLoggerBinder".
SLF4J: Defaulting to no-operation (NOP) logger implementation
SLF4J: See http://www.slf4j.org/codes.html#StaticLoggerBinder for further details.
SLF4J: Failed to load class "org.slf4j.impl.StaticLoggerBinder".
SLF4J: Defaulting to no-operation (NOP) logger implementation
SLF4J: See http://www.slf4j.org/codes.html#StaticLoggerBinder for further details.
Running org.eclipse.m2e.tests.internal.conversion.ProjectConversionParticipantSorterTest
Tests run: 6, Failures: 0, Errors: 0, Skipped: 0, Time elapsed: 0.078 s - in org.eclipse.m2e.tests.internal.conversion.ProjectConversionParticipantSorterTest
testSortConverters_AfterBefore(org.eclipse.m2e.tests.internal.conversion.ProjectConversionParticipantSorterTest)  Time elapsed: 0.002 s
testSortConverters_After2(org.eclipse.m2e.tests.internal.conversion.ProjectConversionParticipantSorterTest)  Time elapsed: 0.001 s
testSortConverters_After(org.eclipse.m2e.tests.internal.conversion.ProjectConversionParticipantSorterTest)  Time elapsed: 0 s
testSortConverters_Cycle_After(org.eclipse.m2e.tests.internal.conversion.ProjectConversionParticipantSorterTest)  Time elapsed: 0.052 s
testSortConverters_DuplicateConverters(org.eclipse.m2e.tests.internal.conversion.ProjectConversionParticipantSorterTest)  Time elapsed: 0.001 s
testSortConverters_Cycle_Before(org.eclipse.m2e.tests.internal.conversion.ProjectConversionParticipantSorterTest)  Time elapsed: 0 s
Running org.eclipse.m2e.tests.internal.index.NexusIndexManagerTest
Tests run: 14, Failures: 0, Errors: 0, Skipped: 0, Time elapsed: 61.409 s - in org.eclipse.m2e.tests.internal.index.NexusIndexManagerTest
testIndexedPublicArtifactGroups(org.eclipse.m2e.tests.internal.index.NexusIndexManagerTest)  Time elapsed: 5.619 s
test512006_nonProxyHost(org.eclipse.m2e.tests.internal.index.NexusIndexManagerTest)  Time elapsed: 3.301 s
testFetchIndexFromRepositoryWithAuthentication(org.eclipse.m2e.tests.internal.index.NexusIndexManagerTest)  Time elapsed: 3.954 s
testIndexedArtifactGroups(org.eclipse.m2e.tests.internal.index.NexusIndexManagerTest)  Time elapsed: 4.007 s
testWorkspaceIndex(org.eclipse.m2e.tests.internal.index.NexusIndexManagerTest)  Time elapsed: 4.288 s
testDisableIndex(org.eclipse.m2e.tests.internal.index.NexusIndexManagerTest)  Time elapsed: 2.229 s
testPublicNonMirrored(org.eclipse.m2e.tests.internal.index.NexusIndexManagerTest)  Time elapsed: 2.756 s
testMngEclipse1621(org.eclipse.m2e.tests.internal.index.NexusIndexManagerTest)  Time elapsed: 4.606 s
testMngEclipse1710(org.eclipse.m2e.tests.internal.index.NexusIndexManagerTest)  Time elapsed: 3.466 s
testMngEclipse1907(org.eclipse.m2e.tests.internal.index.NexusIndexManagerTest)  Time elapsed: 12.636 s
testProjectSpecificThenInSettings(org.eclipse.m2e.tests.internal.index.NexusIndexManagerTest)  Time elapsed: 4.184 s
testNoMirror(org.eclipse.m2e.tests.internal.index.NexusIndexManagerTest)  Time elapsed: 2.875 s
testPublicMirror(org.eclipse.m2e.tests.internal.index.NexusIndexManagerTest)  Time elapsed: 4.348 s
testProjectIndexes(org.eclipse.m2e.tests.internal.index.NexusIndexManagerTest)  Time elapsed: 3.082 s
Running org.eclipse.m2e.tests.internal.index.IndexedArtifactTest
Tests run: 3, Failures: 0, Errors: 0, Skipped: 0, Time elapsed: 0.001 s - in org.eclipse.m2e.tests.internal.index.IndexedArtifactTest
testHash(org.eclipse.m2e.tests.internal.index.IndexedArtifactTest)  Time elapsed: 0 s
testPackageName(org.eclipse.m2e.tests.internal.index.IndexedArtifactTest)  Time elapsed: 0 s
testEquals(org.eclipse.m2e.tests.internal.index.IndexedArtifactTest)  Time elapsed: 0 s
Running org.eclipse.m2e.tests.internal.index.filter.IndexFilterTest
Tests run: 3, Failures: 0, Errors: 0, Skipped: 0, Time elapsed: 0.003 s - in org.eclipse.m2e.tests.internal.index.filter.IndexFilterTest
testIndexedArtifactFileNodeAdapter(org.eclipse.m2e.tests.internal.index.filter.IndexFilterTest)  Time elapsed: 0.001 s
testFilteredIndex_nonEmptyResult(org.eclipse.m2e.tests.internal.index.filter.IndexFilterTest)  Time elapsed: 0.002 s
testFilteredIndex_emptyResult(org.eclipse.m2e.tests.internal.index.filter.IndexFilterTest)  Time elapsed: 0 s
Running org.eclipse.m2e.tests.internal.index.NexusIndexManagerSearchTest
Tests run: 9, Failures: 0, Errors: 0, Skipped: 0, Time elapsed: 34.625 s - in org.eclipse.m2e.tests.internal.index.NexusIndexManagerSearchTest
testPluginSearch(org.eclipse.m2e.tests.internal.index.NexusIndexManagerSearchTest)  Time elapsed: 3.752 s
testSearchGroups2(org.eclipse.m2e.tests.internal.index.NexusIndexManagerSearchTest)  Time elapsed: 3.973 s
testSearchGroups3(org.eclipse.m2e.tests.internal.index.NexusIndexManagerSearchTest)  Time elapsed: 3.798 s
testSha1Search(org.eclipse.m2e.tests.internal.index.NexusIndexManagerSearchTest)  Time elapsed: 3.664 s
testBogusSearchType(org.eclipse.m2e.tests.internal.index.NexusIndexManagerSearchTest)  Time elapsed: 3.656 s
testGroupSearch(org.eclipse.m2e.tests.internal.index.NexusIndexManagerSearchTest)  Time elapsed: 3.698 s
testSearchGroups(org.eclipse.m2e.tests.internal.index.NexusIndexManagerSearchTest)  Time elapsed: 4.073 s
testArtifactSearch(org.eclipse.m2e.tests.internal.index.NexusIndexManagerSearchTest)  Time elapsed: 3.981 s
testSorting(org.eclipse.m2e.tests.internal.index.NexusIndexManagerSearchTest)  Time elapsed: 4.03 s
Running org.eclipse.m2e.tests.internal.embedder.MavenEmbeddedRuntimeTest
Tests run: 1, Failures: 0, Errors: 0, Skipped: 0, Time elapsed: 0.055 s - in org.eclipse.m2e.tests.internal.embedder.MavenEmbeddedRuntimeTest
testGetVersion(org.eclipse.m2e.tests.internal.embedder.MavenEmbeddedRuntimeTest)  Time elapsed: 0.055 s
Running org.eclipse.m2e.tests.internal.lifecyclemapping.ProjectConfigurationElementSorterTest
Tests run: 6, Failures: 0, Errors: 0, Skipped: 0, Time elapsed: 0.003 s - in org.eclipse.m2e.tests.internal.lifecyclemapping.ProjectConfigurationElementSorterTest
testSortConfigurators_MissingPreviousConfigurator(org.eclipse.m2e.tests.internal.lifecyclemapping.ProjectConfigurationElementSorterTest)  Time elapsed: 0.003 s
testSortConfigurators_isRoot(org.eclipse.m2e.tests.internal.lifecyclemapping.ProjectConfigurationElementSorterTest)  Time elapsed: 0 s
testSortConfigurators_HappyPath(org.eclipse.m2e.tests.internal.lifecyclemapping.ProjectConfigurationElementSorterTest)  Time elapsed: 0 s
testSortConfigurators_MissingFollowingConfigurator(org.eclipse.m2e.tests.internal.lifecyclemapping.ProjectConfigurationElementSorterTest)  Time elapsed: 0 s
testSortConfigurators_CycleDetected(org.eclipse.m2e.tests.internal.lifecyclemapping.ProjectConfigurationElementSorterTest)  Time elapsed: 0 s
testSortConfigurators_471840(org.eclipse.m2e.tests.internal.lifecyclemapping.ProjectConfigurationElementSorterTest)  Time elapsed: 0 s
Running org.eclipse.m2e.tests.internal.wizard.MavenImportWizardPageTest
Tests run: 6, Failures: 0, Errors: 0, Skipped: 0, Time elapsed: 8.13 s - in org.eclipse.m2e.tests.internal.wizard.MavenImportWizardPageTest
test408042_multimoduleProject(org.eclipse.m2e.tests.internal.wizard.MavenImportWizardPageTest)  Time elapsed: 1.156 s
test408042_nestedproject(org.eclipse.m2e.tests.internal.wizard.MavenImportWizardPageTest)  Time elapsed: 1.869 s
test408042_noRootProject(org.eclipse.m2e.tests.internal.wizard.MavenImportWizardPageTest)  Time elapsed: 1.086 s
test533463_noArtifactId(org.eclipse.m2e.tests.internal.wizard.MavenImportWizardPageTest)  Time elapsed: 1.001 s
test408042_simpleProject(org.eclipse.m2e.tests.internal.wizard.MavenImportWizardPageTest)  Time elapsed: 1.078 s
test422008_preselectedWorkingSet(org.eclipse.m2e.tests.internal.wizard.MavenImportWizardPageTest)  Time elapsed: 1.936 s
Running org.eclipse.m2e.tests.internal.wizard.MappingDiscoveryJobTest
Tests run: 2, Failures: 0, Errors: 0, Skipped: 0, Time elapsed: 4.089 s - in org.eclipse.m2e.tests.internal.wizard.MappingDiscoveryJobTest
testDontOpenMappingDiscoveryWizard(org.eclipse.m2e.tests.internal.wizard.MappingDiscoveryJobTest)  Time elapsed: 1.416 s
testOpensMappingDiscoveryWizard(org.eclipse.m2e.tests.internal.wizard.MappingDiscoveryJobTest)  Time elapsed: 2.672 s
Running org.eclipse.m2e.tests.internal.wizard.MavenImportWizardTest
Tests run: 3, Failures: 0, Errors: 0, Skipped: 0, Time elapsed: 4.79 s - in org.eclipse.m2e.tests.internal.wizard.MavenImportWizardTest
testNoRenameOnMavenImport(org.eclipse.m2e.tests.internal.wizard.MavenImportWizardTest)  Time elapsed: 1.501 s
testRenameOnMavenImport(org.eclipse.m2e.tests.internal.wizard.MavenImportWizardTest)  Time elapsed: 1.561 s
testNoRenameOnMavenImportInWorkspaceRoot(org.eclipse.m2e.tests.internal.wizard.MavenImportWizardTest)  Time elapsed: 1.728 s
Running org.eclipse.m2e.tests.internal.project.MavenProjectChangedListenerExtensionTest
Tests run: 1, Failures: 0, Errors: 0, Skipped: 0, Time elapsed: 1.468 s - in org.eclipse.m2e.tests.internal.project.MavenProjectChangedListenerExtensionTest
testExtension(org.eclipse.m2e.tests.internal.project.MavenProjectChangedListenerExtensionTest)  Time elapsed: 1.467 s
Running org.eclipse.m2e.tests.internal.refactoring.ExcludeArtifactRefactoringTest
Warning: NLS missing message: MavenImpl_error_lookup in: org.eclipse.m2e.editor.internal.messages
Tests run: 12, Failures: 0, Errors: 0, Skipped: 0, Time elapsed: 24.109 s - in org.eclipse.m2e.tests.internal.refactoring.ExcludeArtifactRefactoringTest
testSingleArtifactKeyRemoteParent(org.eclipse.m2e.tests.internal.refactoring.ExcludeArtifactRefactoringTest)  Time elapsed: 3.619 s
testSingleArtifactMissing(org.eclipse.m2e.tests.internal.refactoring.ExcludeArtifactRefactoringTest)  Time elapsed: 1.558 s
testSingleArtifactKeyInWorkspaceParent(org.eclipse.m2e.tests.internal.refactoring.ExcludeArtifactRefactoringTest)  Time elapsed: 2.12 s
testStrangePomName(org.eclipse.m2e.tests.internal.refactoring.ExcludeArtifactRefactoringTest)  Time elapsed: 1.379 s
testArtifactsInMultiplePom(org.eclipse.m2e.tests.internal.refactoring.ExcludeArtifactRefactoringTest)  Time elapsed: 3.803 s
testCopyDown(org.eclipse.m2e.tests.internal.refactoring.ExcludeArtifactRefactoringTest)  Time elapsed: 2.029 s
testSingleArtifactKeyWorkspaceParent(org.eclipse.m2e.tests.internal.refactoring.ExcludeArtifactRefactoringTest)  Time elapsed: 1.762 s
testMultipleArtifactWithMissing(org.eclipse.m2e.tests.internal.refactoring.ExcludeArtifactRefactoringTest)  Time elapsed: 1.597 s
testSingleArtifactNoParentBadFormat(org.eclipse.m2e.tests.internal.refactoring.ExcludeArtifactRefactoringTest)  Time elapsed: 1.444 s
testMultipleArtifactKeySinglePom(org.eclipse.m2e.tests.internal.refactoring.ExcludeArtifactRefactoringTest)  Time elapsed: 1.619 s
testSingleArtifactNoParent(org.eclipse.m2e.tests.internal.refactoring.ExcludeArtifactRefactoringTest)  Time elapsed: 1.528 s
testPullUp(org.eclipse.m2e.tests.internal.refactoring.ExcludeArtifactRefactoringTest)  Time elapsed: 1.651 s
Running org.eclipse.m2e.tests.internal.repository.RepositoryRegistryTest
Tests run: 1, Failures: 0, Errors: 0, Skipped: 0, Time elapsed: 0.875 s - in org.eclipse.m2e.tests.internal.repository.RepositoryRegistryTest
testSettingsDecryption(org.eclipse.m2e.tests.internal.repository.RepositoryRegistryTest)  Time elapsed: 0.874 s
Running org.eclipse.m2e.tests.ui.OpenPomActionTest
Tests run: 1, Failures: 0, Errors: 0, Skipped: 0, Time elapsed: 10.217 s - in org.eclipse.m2e.tests.ui.OpenPomActionTest
test454759_openEditor(org.eclipse.m2e.tests.ui.OpenPomActionTest)  Time elapsed: 10.217 s
Running org.eclipse.m2e.tests.ui.editing.PomEditsTest
Tests run: 5, Failures: 0, Errors: 0, Skipped: 0, Time elapsed: 0.006 s - in org.eclipse.m2e.tests.ui.editing.PomEditsTest
testFindChildren(org.eclipse.m2e.tests.ui.editing.PomEditsTest)  Time elapsed: 0.001 s
testRemoveChild(org.eclipse.m2e.tests.ui.editing.PomEditsTest)  Time elapsed: 0.003 s
testMatchers(org.eclipse.m2e.tests.ui.editing.PomEditsTest)  Time elapsed: 0.001 s
testFindChild(org.eclipse.m2e.tests.ui.editing.PomEditsTest)  Time elapsed: 0 s
testRemoveIfNoChildElement(org.eclipse.m2e.tests.ui.editing.PomEditsTest)  Time elapsed: 0 s
Running org.eclipse.m2e.tests.ui.editing.PomHelperTest
Tests run: 7, Failures: 0, Errors: 0, Skipped: 0, Time elapsed: 0.014 s - in org.eclipse.m2e.tests.ui.editing.PomHelperTest
testCreateDependencyInEmptyList(org.eclipse.m2e.tests.ui.editing.PomHelperTest)  Time elapsed: 0.004 s
testCreatePlugin(org.eclipse.m2e.tests.ui.editing.PomHelperTest)  Time elapsed: 0.003 s
testFindDependencies(org.eclipse.m2e.tests.ui.editing.PomHelperTest)  Time elapsed: 0.001 s
testFindDependenciesMissing(org.eclipse.m2e.tests.ui.editing.PomHelperTest)  Time elapsed: 0 s
testCreatePluginInEmptyList(org.eclipse.m2e.tests.ui.editing.PomHelperTest)  Time elapsed: 0.003 s
testCreateDependency(org.eclipse.m2e.tests.ui.editing.PomHelperTest)  Time elapsed: 0.003 s
testFindDependency(org.eclipse.m2e.tests.ui.editing.PomHelperTest)  Time elapsed: 0 s
Running org.eclipse.m2e.tests.ui.editing.AddDependencyOperationTest
Tests run: 5, Failures: 0, Errors: 0, Skipped: 0, Time elapsed: 0.016 s - in org.eclipse.m2e.tests.ui.editing.AddDependencyOperationTest
testNoDependenciesElement(org.eclipse.m2e.tests.ui.editing.AddDependencyOperationTest)  Time elapsed: 0.004 s
testEmptyDependenciesElement(org.eclipse.m2e.tests.ui.editing.AddDependencyOperationTest)  Time elapsed: 0.003 s
testDuplicatedDependency(org.eclipse.m2e.tests.ui.editing.AddDependencyOperationTest)  Time elapsed: 0.001 s
testWithDependencies(org.eclipse.m2e.tests.ui.editing.AddDependencyOperationTest)  Time elapsed: 0.002 s
testExclusionsAdded(org.eclipse.m2e.tests.ui.editing.AddDependencyOperationTest)  Time elapsed: 0.006 s
Running org.eclipse.m2e.tests.ui.editing.AddExclusionOperationTest
Tests run: 6, Failures: 0, Errors: 0, Skipped: 0, Time elapsed: 0.007 s - in org.eclipse.m2e.tests.ui.editing.AddExclusionOperationTest
testAddExclusion(org.eclipse.m2e.tests.ui.editing.AddExclusionOperationTest)  Time elapsed: 0.003 s
testAddExclusion_existingExclusion(org.eclipse.m2e.tests.ui.editing.AddExclusionOperationTest)  Time elapsed: 0.003 s
testAddExclusion_duplicateExclusion(org.eclipse.m2e.tests.ui.editing.AddExclusionOperationTest)  Time elapsed: 0 s
testMissingDependency_withDependencies(org.eclipse.m2e.tests.ui.editing.AddExclusionOperationTest)  Time elapsed: 0.001 s
testMissingDependency_emptyDependenciesElement(org.eclipse.m2e.tests.ui.editing.AddExclusionOperationTest)  Time elapsed: 0 s
testMissingDependency_noDependenciesElement(org.eclipse.m2e.tests.ui.editing.AddExclusionOperationTest)  Time elapsed: 0 s
Running org.eclipse.m2e.tests.ui.editing.RemoveDependencyOperationTest
Tests run: 4, Failures: 0, Errors: 0, Skipped: 0, Time elapsed: 0.002 s - in org.eclipse.m2e.tests.ui.editing.RemoveDependencyOperationTest
testMissingDependency_withDependencies(org.eclipse.m2e.tests.ui.editing.RemoveDependencyOperationTest)  Time elapsed: 0 s
testRemoveDependency(org.eclipse.m2e.tests.ui.editing.RemoveDependencyOperationTest)  Time elapsed: 0.001 s
testMissingDependency_emptyDependenciesElement(org.eclipse.m2e.tests.ui.editing.RemoveDependencyOperationTest)  Time elapsed: 0 s
testMissingDependency_noDependenciesElement(org.eclipse.m2e.tests.ui.editing.RemoveDependencyOperationTest)  Time elapsed: 0 s
Running org.eclipse.m2e.tests.ui.MavenPropertyTesterTest
Tests run: 1, Failures: 0, Errors: 0, Skipped: 0, Time elapsed: 0.908 s - in org.eclipse.m2e.tests.ui.MavenPropertyTesterTest
testIsBuildDirectory(org.eclipse.m2e.tests.ui.MavenPropertyTesterTest)  Time elapsed: 0.907 s
Running org.eclipse.m2e.tests.ResourceChangeListenerTest
Tests run: 7, Failures: 0, Errors: 0, Skipped: 0, Time elapsed: 14.269 s - in org.eclipse.m2e.tests.ResourceChangeListenerTest
testPomChanges(org.eclipse.m2e.tests.ResourceChangeListenerTest)  Time elapsed: 3.293 s
testMarkerOnlyChange(org.eclipse.m2e.tests.ResourceChangeListenerTest)  Time elapsed: 1.674 s
testPomMove001(org.eclipse.m2e.tests.ResourceChangeListenerTest)  Time elapsed: 1.972 s
testPomMove002(org.eclipse.m2e.tests.ResourceChangeListenerTest)  Time elapsed: 1.981 s
testProjectDelete(org.eclipse.m2e.tests.ResourceChangeListenerTest)  Time elapsed: 1.715 s
testPomDelete(org.eclipse.m2e.tests.ResourceChangeListenerTest)  Time elapsed: 1.973 s
testPomRename(org.eclipse.m2e.tests.ResourceChangeListenerTest)  Time elapsed: 1.66 s
Running org.eclipse.m2e.tests.embedder.MavenRuntimeManagerTest
Tests run: 4, Failures: 0, Errors: 0, Skipped: 0, Time elapsed: 0.008 s - in org.eclipse.m2e.tests.embedder.MavenRuntimeManagerTest
testDefaultRuntime(org.eclipse.m2e.tests.embedder.MavenRuntimeManagerTest)  Time elapsed: 0.003 s
testSetDefaultRuntime(org.eclipse.m2e.tests.embedder.MavenRuntimeManagerTest)  Time elapsed: 0.001 s
testExternalRuntime(org.eclipse.m2e.tests.embedder.MavenRuntimeManagerTest)  Time elapsed: 0.004 s
testGetRuntime(org.eclipse.m2e.tests.embedder.MavenRuntimeManagerTest)  Time elapsed: 0 s
Running org.eclipse.m2e.tests.embedder.MavenModelEditTest
Tests run: 16, Failures: 0, Errors: 0, Skipped: 0, Time elapsed: 0.103 s - in org.eclipse.m2e.tests.embedder.MavenModelEditTest
testOneRemove(org.eclipse.m2e.tests.embedder.MavenModelEditTest)  Time elapsed: 0.015 s
testEncoding(org.eclipse.m2e.tests.embedder.MavenModelEditTest)  Time elapsed: 0.006 s
testAttributeChange(org.eclipse.m2e.tests.embedder.MavenModelEditTest)  Time elapsed: 0.005 s
testAttributeRoundtrip(org.eclipse.m2e.tests.embedder.MavenModelEditTest)  Time elapsed: 0.005 s
testAttributeRemove(org.eclipse.m2e.tests.embedder.MavenModelEditTest)  Time elapsed: 0.004 s
testManyRoundtrip(org.eclipse.m2e.tests.embedder.MavenModelEditTest)  Time elapsed: 0.005 s
testManybuildinRoundtrip(org.eclipse.m2e.tests.embedder.MavenModelEditTest)  Time elapsed: 0.005 s
testAttributeAdd(org.eclipse.m2e.tests.embedder.MavenModelEditTest)  Time elapsed: 0.004 s
testOneReplace(org.eclipse.m2e.tests.embedder.MavenModelEditTest)  Time elapsed: 0.004 s
testManyAdd(org.eclipse.m2e.tests.embedder.MavenModelEditTest)  Time elapsed: 0.006 s
testManybuildincommentRemove(org.eclipse.m2e.tests.embedder.MavenModelEditTest)  Time elapsed: 0.005 s
testManyChange(org.eclipse.m2e.tests.embedder.MavenModelEditTest)  Time elapsed: 0.015 s
testXpp3domRoundtrip(org.eclipse.m2e.tests.embedder.MavenModelEditTest)  Time elapsed: 0.01 s
testManyRemove(org.eclipse.m2e.tests.embedder.MavenModelEditTest)  Time elapsed: 0.005 s
testOneRoundtrip(org.eclipse.m2e.tests.embedder.MavenModelEditTest)  Time elapsed: 0.004 s
testManybuildinRemove(org.eclipse.m2e.tests.embedder.MavenModelEditTest)  Time elapsed: 0.004 s
Running org.eclipse.m2e.tests.embedder.ArtifactKeyTest
Tests run: 1, Failures: 0, Errors: 0, Skipped: 0, Time elapsed: 0 s - in org.eclipse.m2e.tests.embedder.ArtifactKeyTest
testPortableString(org.eclipse.m2e.tests.embedder.ArtifactKeyTest)  Time elapsed: 0 s
Running org.eclipse.m2e.tests.embedder.MavenModelManagerTest
Tests run: 2, Failures: 0, Errors: 0, Skipped: 0, Time elapsed: 2.039 s - in org.eclipse.m2e.tests.embedder.MavenModelManagerTest
test416882_dependencyTree(org.eclipse.m2e.tests.embedder.MavenModelManagerTest)  Time elapsed: 1.008 s
testCreateMavenModel(org.eclipse.m2e.tests.embedder.MavenModelManagerTest)  Time elapsed: 1.03 s
Running org.eclipse.m2e.tests.embedder.MavenImplTest
Tests run: 21, Failures: 0, Errors: 0, Skipped: 1, Time elapsed: 41.254 s - in org.eclipse.m2e.tests.embedder.MavenImplTest
test438454_guiceScopedComponentInjection(org.eclipse.m2e.tests.embedder.MavenImplTest)  Time elapsed: 4.964 s
testUnreadableSettings(org.eclipse.m2e.tests.embedder.MavenImplTest)  Time elapsed: 2.576 s
testGetProxy(org.eclipse.m2e.tests.embedder.MavenImplTest)  Time elapsed: 1.663 s
testMNGECLIPSE2556_settingsSystemPropertiesSubstiution(org.eclipse.m2e.tests.embedder.MavenImplTest)  Time elapsed: 2.11 s
testGetDefaultRepositories(org.eclipse.m2e.tests.embedder.MavenImplTest)  Time elapsed: 1.68 s
testGetRepositories(org.eclipse.m2e.tests.embedder.MavenImplTest)  Time elapsed: 1.574 s
testMissingArtifact(org.eclipse.m2e.tests.embedder.MavenImplTest)  Time elapsed: 1.653 s
testIsUnavailable(org.eclipse.m2e.tests.embedder.MavenImplTest)  Time elapsed: 1.189 s
testLocalRepositoryListener(org.eclipse.m2e.tests.embedder.MavenImplTest)  Time elapsed: 1.167 s
testGlobalSettings(org.eclipse.m2e.tests.embedder.MavenImplTest)  Time elapsed: 2.089 s
testReadNoParent(org.eclipse.m2e.tests.embedder.MavenImplTest)  Time elapsed: 0.914 s
test358620_reparse_changed_user_settings(org.eclipse.m2e.tests.embedder.MavenImplTest)  Time elapsed: 1.743 s
test366839_userAgent(org.eclipse.m2e.tests.embedder.MavenImplTest)  Time elapsed: 1.685 s
testReadLocalParent(org.eclipse.m2e.tests.embedder.MavenImplTest)  Time elapsed: 1.497 s
testReadProjectWithDependenciesFromMirror(org.eclipse.m2e.tests.embedder.MavenImplTest)  Time elapsed: 3.142 s
testGetMojoParameterValue(org.eclipse.m2e.tests.embedder.MavenImplTest)  Time elapsed: 1.239 s
testGetRepositoriesWithSettingsInjection(org.eclipse.m2e.tests.embedder.MavenImplTest)  Time elapsed: 1.744 s
test386196_ParallelDownloads(org.eclipse.m2e.tests.embedder.MavenImplTest)  Time elapsed: 3.576 s
testProxySupport(org.eclipse.m2e.tests.embedder.MavenImplTest)  Time elapsed: 3.531 s
DISABLED_testSslWithMutualHandshake(org.eclipse.m2e.tests.embedder.MavenImplTest) skipped
testReadRemoteParent(org.eclipse.m2e.tests.embedder.MavenImplTest)  Time elapsed: 1.514 s
Running org.eclipse.m2e.tests.embedder.MavenExecutionContextTest
Tests run: 6, Failures: 0, Errors: 0, Skipped: 0, Time elapsed: 5.978 s - in org.eclipse.m2e.tests.embedder.MavenExecutionContextTest
testBasic(org.eclipse.m2e.tests.embedder.MavenExecutionContextTest)  Time elapsed: 0.919 s
test496492_threadContextClassloaderLeak(org.eclipse.m2e.tests.embedder.MavenExecutionContextTest)  Time elapsed: 0.992 s
testExecutionRequestContainsSystemProperties(org.eclipse.m2e.tests.embedder.MavenExecutionContextTest)  Time elapsed: 1.053 s
testReenterShortcut(org.eclipse.m2e.tests.embedder.MavenExecutionContextTest)  Time elapsed: 1.04 s
testIllegalState(org.eclipse.m2e.tests.embedder.MavenExecutionContextTest)  Time elapsed: 0.96 s
testNested(org.eclipse.m2e.tests.embedder.MavenExecutionContextTest)  Time elapsed: 1.014 s
Running org.eclipse.m2e.tests.SourceLocationHelperTest
Tests run: 5, Failures: 0, Errors: 0, Skipped: 0, Time elapsed: 10.137 s - in org.eclipse.m2e.tests.SourceLocationHelperTest
testDependencyLocation(org.eclipse.m2e.tests.SourceLocationHelperTest)  Time elapsed: 2.069 s
testMojoExecutionLocationWithExecutions(org.eclipse.m2e.tests.SourceLocationHelperTest)  Time elapsed: 2.289 s
testPackagingLocation(org.eclipse.m2e.tests.SourceLocationHelperTest)  Time elapsed: 1.454 s
testMojoExecutionLocation(org.eclipse.m2e.tests.SourceLocationHelperTest)  Time elapsed: 3.014 s
testPluginAttributeLocation(org.eclipse.m2e.tests.SourceLocationHelperTest)  Time elapsed: 1.311 s
Running org.eclipse.m2e.tests.configurators.ResourcesEncodingConfiguratorTest
Tests run: 3, Failures: 0, Errors: 0, Skipped: 0, Time elapsed: 8.541 s - in org.eclipse.m2e.tests.configurators.ResourcesEncodingConfiguratorTest
test002_shouldConfigureEncodingForProjectWithSeveralResourceFolders(org.eclipse.m2e.tests.configurators.ResourcesEncodingConfiguratorTest)  Time elapsed: 2.828 s
test001_shouldConfigureEncodingForBasicProject(org.eclipse.m2e.tests.configurators.ResourcesEncodingConfiguratorTest)  Time elapsed: 2.797 s
test003_shouldResetToContainerDefinedEncoding(org.eclipse.m2e.tests.configurators.ResourcesEncodingConfiguratorTest)  Time elapsed: 2.915 s
Running org.eclipse.m2e.tests.configurators.CompilerSettingsWithEncodingConfiguratorTest
Tests run: 2, Failures: 0, Errors: 0, Skipped: 0, Time elapsed: 5.859 s - in org.eclipse.m2e.tests.configurators.CompilerSettingsWithEncodingConfiguratorTest
test002_shouldResetToContainerDefinedEncoding(org.eclipse.m2e.tests.configurators.CompilerSettingsWithEncodingConfiguratorTest)  Time elapsed: 2.937 s
test001_shouldSetEncodingForBasicProject(org.eclipse.m2e.tests.configurators.CompilerSettingsWithEncodingConfiguratorTest)  Time elapsed: 2.922 s
Running org.eclipse.m2e.tests.lifecycle.PluginExecutionMetadataPrioritiesTest
Tests run: 8, Failures: 0, Errors: 0, Skipped: 0, Time elapsed: 13.875 s - in org.eclipse.m2e.tests.lifecycle.PluginExecutionMetadataPrioritiesTest
testWorkspaceOverridesEclipseExtensions(org.eclipse.m2e.tests.lifecycle.PluginExecutionMetadataPrioritiesTest)  Time elapsed: 1.978 s
testEclipseExtension(org.eclipse.m2e.tests.lifecycle.PluginExecutionMetadataPrioritiesTest)  Time elapsed: 1.498 s
testDefaultMetadataSource(org.eclipse.m2e.tests.lifecycle.PluginExecutionMetadataPrioritiesTest)  Time elapsed: 1.543 s
testPomOverridesWorkspace(org.eclipse.m2e.tests.lifecycle.PluginExecutionMetadataPrioritiesTest)  Time elapsed: 1.838 s
testEmbeddedInPom(org.eclipse.m2e.tests.lifecycle.PluginExecutionMetadataPrioritiesTest)  Time elapsed: 1.53 s
testReferencedFromPom(org.eclipse.m2e.tests.lifecycle.PluginExecutionMetadataPrioritiesTest)  Time elapsed: 1.444 s
testParent(org.eclipse.m2e.tests.lifecycle.PluginExecutionMetadataPrioritiesTest)  Time elapsed: 2.355 s
testWorkspace(org.eclipse.m2e.tests.lifecycle.PluginExecutionMetadataPrioritiesTest)  Time elapsed: 1.688 s
Running org.eclipse.m2e.tests.lifecycle.LifecycleComparisonTest
Tests run: 3, Failures: 0, Errors: 0, Skipped: 0, Time elapsed: 3.282 s - in org.eclipse.m2e.tests.lifecycle.LifecycleComparisonTest
testPluginConfigurationChange(org.eclipse.m2e.tests.lifecycle.LifecycleComparisonTest)  Time elapsed: 0.975 s
testSameProject(org.eclipse.m2e.tests.lifecycle.LifecycleComparisonTest)  Time elapsed: 1.015 s
testPluginVersionChange(org.eclipse.m2e.tests.lifecycle.LifecycleComparisonTest)  Time elapsed: 1.292 s
Running org.eclipse.m2e.tests.lifecycle.PluginExecutionActionsTest
Tests run: 7, Failures: 0, Errors: 0, Skipped: 0, Time elapsed: 10.904 s - in org.eclipse.m2e.tests.lifecycle.PluginExecutionActionsTest
testMojoExecutionIgnore(org.eclipse.m2e.tests.lifecycle.PluginExecutionActionsTest)  Time elapsed: 1.865 s
testMojoExecutionErrorWithMessage(org.eclipse.m2e.tests.lifecycle.PluginExecutionActionsTest)  Time elapsed: 1.629 s
testMojoExecutionError(org.eclipse.m2e.tests.lifecycle.PluginExecutionActionsTest)  Time elapsed: 1.345 s
testMojoExecutionConfigurator(org.eclipse.m2e.tests.lifecycle.PluginExecutionActionsTest)  Time elapsed: 1.72 s
testMojoExecutionExecute(org.eclipse.m2e.tests.lifecycle.PluginExecutionActionsTest)  Time elapsed: 1.403 s
testMojoExecutionIgnoreWithMessage(org.eclipse.m2e.tests.lifecycle.PluginExecutionActionsTest)  Time elapsed: 1.387 s
testMojoExecutionExecuteWithMessage(org.eclipse.m2e.tests.lifecycle.PluginExecutionActionsTest)  Time elapsed: 1.553 s
Running org.eclipse.m2e.tests.lifecycle.LifecycleMappingTest
running TEST_SECONDARY3
running TEST_SECONDARY4
running TEST_SECONDARY6
running TEST_SECONDARY5
Tests run: 36, Failures: 0, Errors: 0, Skipped: 0, Time elapsed: 69.686 s - in org.eclipse.m2e.tests.lifecycle.LifecycleMappingTest
testGetLifecycleMappingMetadata(org.eclipse.m2e.tests.lifecycle.LifecycleMappingTest)  Time elapsed: 2.154 s
test387736_missingAction(org.eclipse.m2e.tests.lifecycle.LifecycleMappingTest)  Time elapsed: 2.167 s
testProfilesAndProperties(org.eclipse.m2e.tests.lifecycle.LifecycleMappingTest)  Time elapsed: 1.651 s
testConfiguratorsFollowPhaseOrder(org.eclipse.m2e.tests.lifecycle.LifecycleMappingTest)  Time elapsed: 1.43 s
testSecondaryConfiguratorsCustom(org.eclipse.m2e.tests.lifecycle.LifecycleMappingTest)  Time elapsed: 1.602 s
testDuplicatePluginExecution1(org.eclipse.m2e.tests.lifecycle.LifecycleMappingTest)  Time elapsed: 1.139 s
testDuplicatePluginExecution2(org.eclipse.m2e.tests.lifecycle.LifecycleMappingTest)  Time elapsed: 0.977 s
testNondeafaultLifecycles(org.eclipse.m2e.tests.lifecycle.LifecycleMappingTest)  Time elapsed: 1.542 s
testOrder(org.eclipse.m2e.tests.lifecycle.LifecycleMappingTest)  Time elapsed: 2.403 s
testSetNoopMappingDuringImport(org.eclipse.m2e.tests.lifecycle.LifecycleMappingTest)  Time elapsed: 2.02 s
testUseDefaultLifecycleMappingMetadataSource(org.eclipse.m2e.tests.lifecycle.LifecycleMappingTest)  Time elapsed: 1.197 s
testNotCoveredMojoExecutionIgnored(org.eclipse.m2e.tests.lifecycle.LifecycleMappingTest)  Time elapsed: 1.938 s
testNonresolvableExecutionPlan(org.eclipse.m2e.tests.lifecycle.LifecycleMappingTest)  Time elapsed: 2.387 s
testFailToGetPluginParameterValue(org.eclipse.m2e.tests.lifecycle.LifecycleMappingTest)  Time elapsed: 2.182 s
testSetCustomizableMappingDuringImport(org.eclipse.m2e.tests.lifecycle.LifecycleMappingTest)  Time elapsed: 3.088 s
testSameConfiguratorUsedTwice(org.eclipse.m2e.tests.lifecycle.LifecycleMappingTest)  Time elapsed: 2.42 s
testUnknownPackagingType(org.eclipse.m2e.tests.lifecycle.LifecycleMappingTest)  Time elapsed: 3.113 s
testGetLifecycleMappingMetadataMerge(org.eclipse.m2e.tests.lifecycle.LifecycleMappingTest)  Time elapsed: 2.467 s
testSecondaryConfiguratorsCustomizable(org.eclipse.m2e.tests.lifecycle.LifecycleMappingTest)  Time elapsed: 2.243 s
testIncompatibleVersion(org.eclipse.m2e.tests.lifecycle.LifecycleMappingTest)  Time elapsed: 1.694 s
testCompatibleVersion(org.eclipse.m2e.tests.lifecycle.LifecycleMappingTest)  Time elapsed: 1.518 s
testLifecycleMappingSpecifiedInMetadata(org.eclipse.m2e.tests.lifecycle.LifecycleMappingTest)  Time elapsed: 2.106 s
testPomPackagingType(org.eclipse.m2e.tests.lifecycle.LifecycleMappingTest)  Time elapsed: 1.503 s
testNotCoveredMojoExecutions(org.eclipse.m2e.tests.lifecycle.LifecycleMappingTest)  Time elapsed: 1.43 s
test494858ProcessingInstructions(org.eclipse.m2e.tests.lifecycle.LifecycleMappingTest)  Time elapsed: 5.918 s
testPackagingTypeMismatch(org.eclipse.m2e.tests.lifecycle.LifecycleMappingTest)  Time elapsed: 1.821 s
testGetLifecycleMappingMetadataOverride(org.eclipse.m2e.tests.lifecycle.LifecycleMappingTest)  Time elapsed: 1.621 s
testWorkspaceArtifacts(org.eclipse.m2e.tests.lifecycle.LifecycleMappingTest)  Time elapsed: 1.414 s
testMissingLifecycleMappingMetadata(org.eclipse.m2e.tests.lifecycle.LifecycleMappingTest)  Time elapsed: 1.451 s
testMissingMapping(org.eclipse.m2e.tests.lifecycle.LifecycleMappingTest)  Time elapsed: 1.817 s
testDefaultJarLifecycleMapping(org.eclipse.m2e.tests.lifecycle.LifecycleMappingTest)  Time elapsed: 2.32 s
testMissingVersionRangeInPluginExecutionFilter(org.eclipse.m2e.tests.lifecycle.LifecycleMappingTest)  Time elapsed: 1.081 s
testDuplicatePackagingTypeMetadata(org.eclipse.m2e.tests.lifecycle.LifecycleMappingTest)  Time elapsed: 1.159 s
test371618_NullLifecycleMappingPluginVersion(org.eclipse.m2e.tests.lifecycle.LifecycleMappingTest)  Time elapsed: 1.713 s
testNotCoveredMojoExecutionWarnings(org.eclipse.m2e.tests.lifecycle.LifecycleMappingTest)  Time elapsed: 1.412 s
testNotInterestingPhaseConfigurator(org.eclipse.m2e.tests.lifecycle.LifecycleMappingTest)  Time elapsed: 1.586 s
Running org.eclipse.m2e.tests.lifecycle.LifecycleMappingMetadataPrioritiesTest
Tests run: 5, Failures: 0, Errors: 0, Skipped: 0, Time elapsed: 8.679 s - in org.eclipse.m2e.tests.lifecycle.LifecycleMappingMetadataPrioritiesTest
testEclipseExtension(org.eclipse.m2e.tests.lifecycle.LifecycleMappingMetadataPrioritiesTest)  Time elapsed: 2.037 s
testDefaultMetadataSource(org.eclipse.m2e.tests.lifecycle.LifecycleMappingMetadataPrioritiesTest)  Time elapsed: 1.37 s
testEmbeddedInPom(org.eclipse.m2e.tests.lifecycle.LifecycleMappingMetadataPrioritiesTest)  Time elapsed: 1.629 s
testReferencedFromPom(org.eclipse.m2e.tests.lifecycle.LifecycleMappingMetadataPrioritiesTest)  Time elapsed: 1.361 s
testParent(org.eclipse.m2e.tests.lifecycle.LifecycleMappingMetadataPrioritiesTest)  Time elapsed: 2.28 s
Running org.eclipse.m2e.tests.lifecycle.MavenPluginMetadataSourceTest
Tests run: 2, Failures: 0, Errors: 0, Skipped: 0, Time elapsed: 4.024 s - in org.eclipse.m2e.tests.lifecycle.MavenPluginMetadataSourceTest
testBasic(org.eclipse.m2e.tests.lifecycle.MavenPluginMetadataSourceTest)  Time elapsed: 2.096 s
test422135_mavenPluginSourceWorkspaceResolution(org.eclipse.m2e.tests.lifecycle.MavenPluginMetadataSourceTest)  Time elapsed: 1.928 s
Running org.eclipse.m2e.tests.discovery.LifecycleMappingDiscoveryTest
Tests run: 11, Failures: 0, Errors: 0, Skipped: 0, Time elapsed: 18.009 s - in org.eclipse.m2e.tests.discovery.LifecycleMappingDiscoveryTest
testAutomaticSelectionOfSingleProposal(org.eclipse.m2e.tests.discovery.LifecycleMappingDiscoveryTest)  Time elapsed: 1.46 s
testPreselectedProposals(org.eclipse.m2e.tests.discovery.LifecycleMappingDiscoveryTest)  Time elapsed: 1.638 s
testIsMappingComplete(org.eclipse.m2e.tests.discovery.LifecycleMappingDiscoveryTest)  Time elapsed: 1.647 s
testProposalToReplaceDefaultMapping(org.eclipse.m2e.tests.discovery.LifecycleMappingDiscoveryTest)  Time elapsed: 1.436 s
testPackagingPom(org.eclipse.m2e.tests.discovery.LifecycleMappingDiscoveryTest)  Time elapsed: 1.796 s
testAutomaticSelectionWithAmbiguousProposals(org.eclipse.m2e.tests.discovery.LifecycleMappingDiscoveryTest)  Time elapsed: 2.036 s
testDiscoverProjectConfigurators(org.eclipse.m2e.tests.discovery.LifecycleMappingDiscoveryTest)  Time elapsed: 1.32 s
testNoProposals(org.eclipse.m2e.tests.discovery.LifecycleMappingDiscoveryTest)  Time elapsed: 2.004 s
testProposalMatching(org.eclipse.m2e.tests.discovery.LifecycleMappingDiscoveryTest)  Time elapsed: 1.488 s
testDiscoverLifecycleMappingStrategy(org.eclipse.m2e.tests.discovery.LifecycleMappingDiscoveryTest)  Time elapsed: 1.42 s
testDefaultNonConfiguratorMapping(org.eclipse.m2e.tests.discovery.LifecycleMappingDiscoveryTest)  Time elapsed: 1.764 s
Running org.eclipse.m2e.tests.discovery.MavenDiscoveryMarkerResolutionGeneratorTest
Tests run: 4, Failures: 0, Errors: 0, Skipped: 0, Time elapsed: 7.059 s - in org.eclipse.m2e.tests.discovery.MavenDiscoveryMarkerResolutionGeneratorTest
testCanResolveMojoExecutionMarker(org.eclipse.m2e.tests.discovery.MavenDiscoveryMarkerResolutionGeneratorTest)  Time elapsed: 1.458 s
testCanResolveConfiguratorMarker(org.eclipse.m2e.tests.discovery.MavenDiscoveryMarkerResolutionGeneratorTest)  Time elapsed: 1.49 s
testResolveMultipleMarkers(org.eclipse.m2e.tests.discovery.MavenDiscoveryMarkerResolutionGeneratorTest)  Time elapsed: 2.565 s
testCanResolveLifecycleIdMarker(org.eclipse.m2e.tests.discovery.MavenDiscoveryMarkerResolutionGeneratorTest)  Time elapsed: 1.546 s
Running org.eclipse.m2e.tests.discovery.MavenDiscoveryInstallOperationTest
Tests run: 5, Failures: 0, Errors: 0, Skipped: 0, Time elapsed: 0.643 s - in org.eclipse.m2e.tests.discovery.MavenDiscoveryInstallOperationTest
testMissingRepository(org.eclipse.m2e.tests.discovery.MavenDiscoveryInstallOperationTest)  Time elapsed: 0.221 s
testMatchNoVersion(org.eclipse.m2e.tests.discovery.MavenDiscoveryInstallOperationTest)  Time elapsed: 0.204 s
testMatchHighestVersion(org.eclipse.m2e.tests.discovery.MavenDiscoveryInstallOperationTest)  Time elapsed: 0.072 s
testMissingIU(org.eclipse.m2e.tests.discovery.MavenDiscoveryInstallOperationTest)  Time elapsed: 0.072 s
testMatchLowestVersion(org.eclipse.m2e.tests.discovery.MavenDiscoveryInstallOperationTest)  Time elapsed: 0.069 s
Running org.eclipse.m2e.tests.discovery.ConfigurationUpdateStartupTest
Tests run: 6, Failures: 0, Errors: 0, Skipped: 0, Time elapsed: 8.42 s - in org.eclipse.m2e.tests.discovery.ConfigurationUpdateStartupTest
testNoMavenProjects(org.eclipse.m2e.tests.discovery.ConfigurationUpdateStartupTest)  Time elapsed: 1.076 s
testToggleEarlyStartup(org.eclipse.m2e.tests.discovery.ConfigurationUpdateStartupTest)  Time elapsed: 1.255 s
testMavenProjectsErrors(org.eclipse.m2e.tests.discovery.ConfigurationUpdateStartupTest)  Time elapsed: 2.275 s
testConfigureSpecifiedProjects(org.eclipse.m2e.tests.discovery.ConfigurationUpdateStartupTest)  Time elapsed: 1.005 s
testMavenProjectsNoErrors(org.eclipse.m2e.tests.discovery.ConfigurationUpdateStartupTest)  Time elapsed: 1.749 s
testEmptyWorkspace(org.eclipse.m2e.tests.discovery.ConfigurationUpdateStartupTest)  Time elapsed: 1.059 s
Running org.eclipse.m2e.tests.discovery.MavenDiscoveryTest
Tests run: 9, Failures: 0, Errors: 0, Skipped: 0, Time elapsed: 0.6 s - in org.eclipse.m2e.tests.discovery.MavenDiscoveryTest
testCatalogSelectedByConfiguratorId(org.eclipse.m2e.tests.discovery.MavenDiscoveryTest)  Time elapsed: 0.104 s
testCatalogItemWithoutMappingMetadata(org.eclipse.m2e.tests.discovery.MavenDiscoveryTest)  Time elapsed: 0.002 s
testCatalogItemExtensionsMetadata(org.eclipse.m2e.tests.discovery.MavenDiscoveryTest)  Time elapsed: 0.002 s
testNotMatchPluginSelection(org.eclipse.m2e.tests.discovery.MavenDiscoveryTest)  Time elapsed: 0.075 s
testCatalogSelectedByLifecycleId(org.eclipse.m2e.tests.discovery.MavenDiscoveryTest)  Time elapsed: 0.081 s
testMultipleSelections(org.eclipse.m2e.tests.discovery.MavenDiscoveryTest)  Time elapsed: 0.097 s
testCatalogSelectedByPackaging(org.eclipse.m2e.tests.discovery.MavenDiscoveryTest)  Time elapsed: 0.083 s
testCatalogSelectedByMojoExecution(org.eclipse.m2e.tests.discovery.MavenDiscoveryTest)  Time elapsed: 0.085 s
testCatalogUnselected(org.eclipse.m2e.tests.discovery.MavenDiscoveryTest)  Time elapsed: 0.07 s
Running org.eclipse.m2e.tests.project.MavenProjectFacadeTest
Tests run: 9, Failures: 0, Errors: 0, Skipped: 0, Time elapsed: 15.738 s - in org.eclipse.m2e.tests.project.MavenProjectFacadeTest
testGetProjectConfiguratorsAfterWorkspaceRestart(org.eclipse.m2e.tests.project.MavenProjectFacadeTest)  Time elapsed: 1.565 s
testGetMojoExecutionAfterWorkspaceRestart(org.eclipse.m2e.tests.project.MavenProjectFacadeTest)  Time elapsed: 1.837 s
testGetMojoExecutionsWithoutMavenExecutionContext(org.eclipse.m2e.tests.project.MavenProjectFacadeTest)  Time elapsed: 2.095 s
testGetProjectConfigurators(org.eclipse.m2e.tests.project.MavenProjectFacadeTest)  Time elapsed: 1.561 s
test436668_EclipseProjectMetadataNotStale(org.eclipse.m2e.tests.project.MavenProjectFacadeTest)  Time elapsed: 1.737 s
testGetMojoExecution(org.eclipse.m2e.tests.project.MavenProjectFacadeTest)  Time elapsed: 1.502 s
testGetMojoExecutions(org.eclipse.m2e.tests.project.MavenProjectFacadeTest)  Time elapsed: 1.704 s
testIsStale(org.eclipse.m2e.tests.project.MavenProjectFacadeTest)  Time elapsed: 2.041 s
testGetMojoExecutionsAfterWorkspaceRestart(org.eclipse.m2e.tests.project.MavenProjectFacadeTest)  Time elapsed: 1.695 s
Running org.eclipse.m2e.tests.project.CompilerSettings18Test
Tests run: 1, Failures: 0, Errors: 0, Skipped: 0, Time elapsed: 1.477 s - in org.eclipse.m2e.tests.project.CompilerSettings18Test
testCompilerSettings18(org.eclipse.m2e.tests.project.CompilerSettings18Test)  Time elapsed: 1.477 s
Running org.eclipse.m2e.tests.project.MavenProjectInfoTest
Tests run: 1, Failures: 0, Errors: 0, Skipped: 0, Time elapsed: 0 s - in org.eclipse.m2e.tests.project.MavenProjectInfoTest
testTwoChildProjectInfosWithSameLabel(org.eclipse.m2e.tests.project.MavenProjectInfoTest)  Time elapsed: 0 s
Running org.eclipse.m2e.tests.project.CompilerSynonymTest
Tests run: 1, Failures: 0, Errors: 0, Skipped: 0, Time elapsed: 1.625 s - in org.eclipse.m2e.tests.project.CompilerSynonymTest
testSynonym(org.eclipse.m2e.tests.project.CompilerSynonymTest)  Time elapsed: 1.625 s
Running org.eclipse.m2e.tests.jdt.ProjectLayoutTest
Tests run: 1, Failures: 0, Errors: 0, Skipped: 0, Time elapsed: 1.734 s - in org.eclipse.m2e.tests.jdt.ProjectLayoutTest
test472726_basedirResources(org.eclipse.m2e.tests.jdt.ProjectLayoutTest)  Time elapsed: 1.734 s
Running org.eclipse.m2e.tests.jdt.internal.ClasspathEntryDescriptorTest
Tests run: 1, Failures: 0, Errors: 0, Skipped: 0, Time elapsed: 0 s - in org.eclipse.m2e.tests.jdt.internal.ClasspathEntryDescriptorTest
testArtifactKeyDeserialization(org.eclipse.m2e.tests.jdt.internal.ClasspathEntryDescriptorTest)  Time elapsed: 0 s
Running org.eclipse.m2e.tests.jdt.internal.MavenClasspathContainerSaveHelperTest
Tests run: 1, Failures: 0, Errors: 0, Skipped: 0, Time elapsed: 0.003 s - in org.eclipse.m2e.tests.jdt.internal.MavenClasspathContainerSaveHelperTest
testClasspathContainerSace(org.eclipse.m2e.tests.jdt.internal.MavenClasspathContainerSaveHelperTest)  Time elapsed: 0.003 s
Running org.eclipse.m2e.tests.jdt.JavaClasspathTest
Tests run: 22, Failures: 0, Errors: 0, Skipped: 0, Time elapsed: 47.363 s - in org.eclipse.m2e.tests.jdt.JavaClasspathTest
testStaleDerivedEntries(org.eclipse.m2e.tests.jdt.JavaClasspathTest)  Time elapsed: 2.695 s
test398121_PreserveOrderOfClasspathContainersOnUpdate(org.eclipse.m2e.tests.jdt.JavaClasspathTest)  Time elapsed: 2.304 s
test370685_PreserveResourcesOnUpdate(org.eclipse.m2e.tests.jdt.JavaClasspathTest)  Time elapsed: 2.223 s
test480137_addingResourceFoldersAreNotRemovedDuringConfigurationUpdate(org.eclipse.m2e.tests.jdt.JavaClasspathTest)  Time elapsed: 2.104 s
test537851_DisableTestClasspathFlag(org.eclipse.m2e.tests.jdt.JavaClasspathTest)  Time elapsed: 2.146 s
test526858_ProjectExportingTests(org.eclipse.m2e.tests.jdt.JavaClasspathTest)  Time elapsed: 3.356 s
test466518_classpathJREOrder(org.eclipse.m2e.tests.jdt.JavaClasspathTest)  Time elapsed: 1.912 s
test518218_configureMethodParametersGenerationWithCompilerArgs(org.eclipse.m2e.tests.jdt.JavaClasspathTest)  Time elapsed: 3.702 s
test518218_configureMethodParametersGenerationWithParameters(org.eclipse.m2e.tests.jdt.JavaClasspathTest)  Time elapsed: 1.846 s
test388541_KeepClasspathAttributes(org.eclipse.m2e.tests.jdt.JavaClasspathTest)  Time elapsed: 1.929 s
test526858_TestClasspathAttributeOnProject(org.eclipse.m2e.tests.jdt.JavaClasspathTest)  Time elapsed: 1.888 s
test526858_TestClasspathAttributeOnJar(org.eclipse.m2e.tests.jdt.JavaClasspathTest)  Time elapsed: 1.728 s
test518218_configureMethodParametersGenerationWithCompilerArgument(org.eclipse.m2e.tests.jdt.JavaClasspathTest)  Time elapsed: 1.721 s
testClasspathContainers(org.eclipse.m2e.tests.jdt.JavaClasspathTest)  Time elapsed: 1.738 s
test414645_TestClasspathAttributeOnRuntimeProjectDependencies(org.eclipse.m2e.tests.jdt.JavaClasspathTest)  Time elapsed: 2.087 s
test394042_ClasspathEntry4(org.eclipse.m2e.tests.jdt.JavaClasspathTest)  Time elapsed: 1.662 s
test414645_TestClasspathAttributeOnRuntimeJarDependencies(org.eclipse.m2e.tests.jdt.JavaClasspathTest)  Time elapsed: 1.555 s
test525880_JavaAccessRulesArePreservedOnUpdate(org.eclipse.m2e.tests.jdt.JavaClasspathTest)  Time elapsed: 2.731 s
test534049_SetReleaseFlag(org.eclipse.m2e.tests.jdt.JavaClasspathTest)  Time elapsed: 2.07 s
test549312_fallbackToLatestEE(org.eclipse.m2e.tests.jdt.JavaClasspathTest)  Time elapsed: 1.921 s
testImport(org.eclipse.m2e.tests.jdt.JavaClasspathTest)  Time elapsed: 1.887 s
test486739_PreserveExportedOnUpdate(org.eclipse.m2e.tests.jdt.JavaClasspathTest)  Time elapsed: 2.156 s
Running org.eclipse.m2e.tests.jdt.JavaCodeGenerationProjectConfiguratorTest
Tests run: 1, Failures: 0, Errors: 0, Skipped: 0, Time elapsed: 2.203 s - in org.eclipse.m2e.tests.jdt.JavaCodeGenerationProjectConfiguratorTest
test368333_generatedSourcesFoldersAreNotRemovedDuringConfigurationUpdate(org.eclipse.m2e.tests.jdt.JavaCodeGenerationProjectConfiguratorTest)  Time elapsed: 2.203 s
Running org.eclipse.m2e.tests.MutableProjectRegistryTest
Tests run: 8, Failures: 0, Errors: 0, Skipped: 0, Time elapsed: 8.594 s - in org.eclipse.m2e.tests.MutableProjectRegistryTest
testRemoveProject(org.eclipse.m2e.tests.MutableProjectRegistryTest)  Time elapsed: 1.23 s
testReplaceProject(org.eclipse.m2e.tests.MutableProjectRegistryTest)  Time elapsed: 1.051 s
testIllegalStateMerge(org.eclipse.m2e.tests.MutableProjectRegistryTest)  Time elapsed: 1.032 s
testForeignClassesInSerializedProjectRegistry(org.eclipse.m2e.tests.MutableProjectRegistryTest)  Time elapsed: 1.057 s
testDetectNoLongerExistingProjectsInWorkspaceState(org.eclipse.m2e.tests.MutableProjectRegistryTest)  Time elapsed: 1.046 s
testAddProject(org.eclipse.m2e.tests.MutableProjectRegistryTest)  Time elapsed: 1.033 s
testSaveParticipant(org.eclipse.m2e.tests.MutableProjectRegistryTest)  Time elapsed: 1.044 s
testRemoveUnknownProject(org.eclipse.m2e.tests.MutableProjectRegistryTest)  Time elapsed: 1.1 s
Running org.eclipse.m2e.tests.BuildPathManagerTest
[INFO] ----------------------------------------------------------------------------
[INFO] Using following parameters for creating project from Old (1.x) Archetype: maven-archetype-quickstart:1.1
[INFO] ----------------------------------------------------------------------------
[INFO] Parameter: basedir, Value: /home/jenkins/agent/workspace/m2e_master/m2e-core-tests/org.eclipse.m2e.tests/target/work/data
[INFO] Parameter: package, Value: jar
[INFO] Parameter: groupId, Value: archetype-project
[INFO] Parameter: artifactId, Value: archetype-project
[INFO] Parameter: packageName, Value: jar
[INFO] Parameter: version, Value: 0.0.1-SNAPSHOT
[INFO] project created from Old (1.x) Archetype in dir: /home/jenkins/agent/workspace/m2e_master/m2e-core-tests/org.eclipse.m2e.tests/target/work/data/archetype-project
[INFO] ----------------------------------------------------------------------------
[INFO] Using following parameters for creating project from Old (1.x) Archetype: maven-archetype-quickstart:1.1
[INFO] ----------------------------------------------------------------------------
[INFO] Parameter: basedir, Value: /tmp/m2eclipse5343615023210958954test/external-archetype-project-1
[INFO] Parameter: package, Value: jar
[INFO] Parameter: groupId, Value: external-archetype-project-1
[INFO] Parameter: artifactId, Value: external-archetype-project-1
[INFO] Parameter: packageName, Value: jar
[INFO] Parameter: version, Value: 0.0.1-SNAPSHOT
[INFO] project created from Old (1.x) Archetype in dir: /tmp/m2eclipse5343615023210958954test/external-archetype-project-1/external-archetype-project-1
[INFO] ----------------------------------------------------------------------------
[INFO] Using following parameters for creating project from Old (1.x) Archetype: maven-archetype-quickstart:1.1
[INFO] ----------------------------------------------------------------------------
[INFO] Parameter: basedir, Value: /tmp/m2eclipse5343615023210958954test/external-archetype-project-2
[INFO] Parameter: package, Value: jar
[INFO] Parameter: groupId, Value: external-archetype-project-2
[INFO] Parameter: artifactId, Value: external-archetype-project-2
[INFO] Parameter: packageName, Value: jar
[INFO] Parameter: version, Value: 0.0.1-SNAPSHOT
Tests run: 45, Failures: 0, Errors: 1, Skipped: 1, Time elapsed: 105.195 s <<< FAILURE! - in org.eclipse.m2e.tests.BuildPathManagerTest
testDownloadSources_001_workspaceRestart(org.eclipse.m2e.tests.BuildPathManagerTest)  Time elapsed: 2.948 s
testEnableMavenNatureWithNoWorkspace(org.eclipse.m2e.tests.BuildPathManagerTest)  Time elapsed: 2.505 s
test385391_keepCustomSourceEncoding(org.eclipse.m2e.tests.BuildPathManagerTest)  Time elapsed: 2.899 s
testProjectImportWithProfile1(org.eclipse.m2e.tests.BuildPathManagerTest)  Time elapsed: 2.323 s
testProjectImportWithProfile2(org.eclipse.m2e.tests.BuildPathManagerTest)  Time elapsed: 2.255 s
testProjectNameWithNameTemplate(org.eclipse.m2e.tests.BuildPathManagerTest)  Time elapsed: 1.913 s
testProjectImport001_useMavenOutputFolders(org.eclipse.m2e.tests.BuildPathManagerTest)  Time elapsed: 2.154 s
testArchetypeProject(org.eclipse.m2e.tests.BuildPathManagerTest)  Time elapsed: 2.762 s
testClasspathOrderWorkspace001(org.eclipse.m2e.tests.BuildPathManagerTest)  Time elapsed: 3.124 s
testClasspathOrderWorkspace003(org.eclipse.m2e.tests.BuildPathManagerTest)  Time elapsed: 1.914 s
testDownloadSources_001_sourceAttachment(org.eclipse.m2e.tests.BuildPathManagerTest)  Time elapsed: 1.666 s
testMNGECLIPSE_2367_same_sources_resources(org.eclipse.m2e.tests.BuildPathManagerTest)  Time elapsed: 1.892 s
test360962_forbiddenReferencePreference(org.eclipse.m2e.tests.BuildPathManagerTest)  Time elapsed: 2.347 s
test388596_expandedSnapshotDependency(org.eclipse.m2e.tests.BuildPathManagerTest)  Time elapsed: 2.356 s
test359725_resourcesWorkspaceRoot(org.eclipse.m2e.tests.BuildPathManagerTest)  Time elapsed: 2.206 s
testClassifiers(org.eclipse.m2e.tests.BuildPathManagerTest)  Time elapsed: 2.347 s
test486721_overlappingResourceFolders(org.eclipse.m2e.tests.BuildPathManagerTest)  Time elapsed: 1.928 s
test005_dependencyAvailableFromLocalRepoAndWorkspace(org.eclipse.m2e.tests.BuildPathManagerTest)  Time elapsed: 3.747 s
testDisableMavenNature(org.eclipse.m2e.tests.BuildPathManagerTest)  Time elapsed: 2.266 s
testDownloadSources_001_basic(org.eclipse.m2e.tests.BuildPathManagerTest)  Time elapsed: 3.822 s
testDownloadSources_003_customRemoteRepository(org.eclipse.m2e.tests.BuildPathManagerTest)  Time elapsed: 1.989 s
_testProjectImport002_useMavenOutputFolders(org.eclipse.m2e.tests.BuildPathManagerTest) skipped
testMNGECLIPSE_2367_sources_encloses_resources(org.eclipse.m2e.tests.BuildPathManagerTest)  Time elapsed: 1.786 s
testDownloadSources_006_nonMavenProject(org.eclipse.m2e.tests.BuildPathManagerTest)  Time elapsed: 2.569 s  <<< ERROR!
org.eclipse.core.runtime.CoreException: Reindexing error
	at org.eclipse.m2e.tests.BuildPathManagerTest.testDownloadSources_006_nonMavenProject(BuildPathManagerTest.java:656)
Caused by: java.nio.channels.OverlappingFileLockException
	at org.eclipse.m2e.tests.BuildPathManagerTest.testDownloadSources_006_nonMavenProject(BuildPathManagerTest.java:656)

testCompilerSettings14(org.eclipse.m2e.tests.BuildPathManagerTest)  Time elapsed: 1.574 s
testSimpleProjectInExternalLocation(org.eclipse.m2e.tests.BuildPathManagerTest)  Time elapsed: 1.896 s
testDownloadSources_007_missingTestsSources(org.eclipse.m2e.tests.BuildPathManagerTest)  Time elapsed: 2.638 s
testMNGECLIPSE_696_compiler_includes_excludes(org.eclipse.m2e.tests.BuildPathManagerTest)  Time elapsed: 2.364 s
test431080_flatDirectoryLayout(org.eclipse.m2e.tests.BuildPathManagerTest)  Time elapsed: 2.805 s
testDownloadSources_005_classifier(org.eclipse.m2e.tests.BuildPathManagerTest)  Time elapsed: 3.737 s
testDownloadSources_008_fallbackToJavadocWhenMissingSources(org.eclipse.m2e.tests.BuildPathManagerTest)  Time elapsed: 3.491 s
testArchetypeProjectInExternalLocation(org.eclipse.m2e.tests.BuildPathManagerTest)  Time elapsed: 4.499 s
testMNGECLIPSE_2367_testSources_encloses_resources(org.eclipse.m2e.tests.BuildPathManagerTest)  Time elapsed: 1.611 s
testCompilerSettingsJsr14(org.eclipse.m2e.tests.BuildPathManagerTest)  Time elapsed: 1.42 s
testProjectNameTemplateWithProperties(org.eclipse.m2e.tests.BuildPathManagerTest)  Time elapsed: 1.703 s
testDownloadSources_002_javadoconly(org.eclipse.m2e.tests.BuildPathManagerTest)  Time elapsed: 2.179 s
testMavenBuilderOrder(org.eclipse.m2e.tests.BuildPathManagerTest)  Time elapsed: 2.971 s
testDownloadSources_004_testsClassifier(org.eclipse.m2e.tests.BuildPathManagerTest)  Time elapsed: 2.565 s
testEnableMavenNature(org.eclipse.m2e.tests.BuildPathManagerTest)  Time elapsed: 2.245 s
testProjectNameTemplate(org.eclipse.m2e.tests.BuildPathManagerTest)  Time elapsed: 2.166 s
testMNGECLIPSE_1047_localRepoPath(org.eclipse.m2e.tests.BuildPathManagerTest)  Time elapsed: 1.136 s
testCreateSimpleProject(org.eclipse.m2e.tests.BuildPathManagerTest)  Time elapsed: 1.653 s
testMNGECLIPSE_2433_resourcesOutsideBasdir(org.eclipse.m2e.tests.BuildPathManagerTest)  Time elapsed: 2.597 s
testUpdateProjectConfigurationWithWorkspace(org.eclipse.m2e.tests.BuildPathManagerTest)  Time elapsed: 2.488 s
test486721_sourceAndResourceUnderSameNonDefaultFolder(org.eclipse.m2e.tests.BuildPathManagerTest)  Time elapsed: 1.738 s
Running org.eclipse.m2e.tests.ProjectConfigurationManagerTest
[INFO] ----------------------------------------------------------------------------
[INFO] Using following parameters for creating project from Archetype: mngeclipse-2110:1.0
[INFO] ----------------------------------------------------------------------------
[INFO] Parameter: groupId, Value: mngeclipse-2110
[INFO] Parameter: artifactId, Value: mngeclipse-2110
[INFO] Parameter: version, Value: 0.0.1-SNAPSHOT
[INFO] Parameter: package, Value: jar
[INFO] Parameter: packageInPathFormat, Value: jar
[INFO] project created from Archetype in dir: /home/jenkins/agent/workspace/m2e_master/m2e-core-tests/org.eclipse.m2e.tests/target/work/data/mngeclipse-2110
[INFO] ----------------------------------------------------------------------------
[INFO] Using following parameters for creating project from Old (1.x) Archetype: maven-archetype-quickstart:1.1
[INFO] ----------------------------------------------------------------------------
[INFO] Parameter: basedir, Value: /home/jenkins/agent/workspace/m2e_master/m2e-core-tests/org.eclipse.m2e.tests/target/work/data/parent002
[INFO] Parameter: package, Value: jar
[INFO] Parameter: groupId, Value: archetyped
[INFO] Parameter: artifactId, Value: archetyped
[INFO] Parameter: packageName, Value: jar
[INFO] Parameter: version, Value: 0.0.1-SNAPSHOT
[INFO] project created from Old (1.x) Archetype in dir: /home/jenkins/agent/workspace/m2e_master/m2e-core-tests/org.eclipse.m2e.tests/target/work/data/parent002/archetyped
Tests run: 23, Failures: 0, Errors: 0, Skipped: 0, Time elapsed: 62.217 s - in org.eclipse.m2e.tests.ProjectConfigurationManagerTest
testAddRemoveMavenBuilder(org.eclipse.m2e.tests.ProjectConfigurationManagerTest)  Time elapsed: 1.809 s
testImportJavaProjectWithUnknownPackaging(org.eclipse.m2e.tests.ProjectConfigurationManagerTest)  Time elapsed: 2.718 s
testHiddenFolderForSimpleModule(org.eclipse.m2e.tests.ProjectConfigurationManagerTest)  Time elapsed: 3.173 s
testConfigureProjectEncodingForBasicProject(org.eclipse.m2e.tests.ProjectConfigurationManagerTest)  Time elapsed: 2.104 s
testAddRemoveMavenBuilderDisabled(org.eclipse.m2e.tests.ProjectConfigurationManagerTest)  Time elapsed: 1.042 s
testExtractionOfCompilerSettingsDespiteErrorsInExecutionPlan(org.eclipse.m2e.tests.ProjectConfigurationManagerTest)  Time elapsed: 1.388 s
testRevertToContainerDefinedEncoding(org.eclipse.m2e.tests.ProjectConfigurationManagerTest)  Time elapsed: 1.779 s
testIgnoreStaleProjectConfiguration(org.eclipse.m2e.tests.ProjectConfigurationManagerTest)  Time elapsed: 1.762 s
test397251_forcePluginResolutionUpdate(org.eclipse.m2e.tests.ProjectConfigurationManagerTest)  Time elapsed: 11.743 s
testResolutionOfArchetypeFromRepository(org.eclipse.m2e.tests.ProjectConfigurationManagerTest)  Time elapsed: 4.7 s
testStaleProjectConfigurationMarkerAfterFixingMissingBuildExtension(org.eclipse.m2e.tests.ProjectConfigurationManagerTest)  Time elapsed: 2.663 s
test447460MultipleUpdateConfiguration(org.eclipse.m2e.tests.ProjectConfigurationManagerTest)  Time elapsed: 1.762 s
testHiddenFolderForArchetypeModule(org.eclipse.m2e.tests.ProjectConfigurationManagerTest)  Time elapsed: 2.371 s
testStaleProjectConfigurationMarkerAfterWorkspaceRestart(org.eclipse.m2e.tests.ProjectConfigurationManagerTest)  Time elapsed: 2.315 s
testStaleProjectConfigurationWarningMarker(org.eclipse.m2e.tests.ProjectConfigurationManagerTest)  Time elapsed: 2.178 s
testAutomaticUpdateProjectConfigurationMarker(org.eclipse.m2e.tests.ProjectConfigurationManagerTest)  Time elapsed: 2.354 s
test473953_ProjectCreationListener(org.eclipse.m2e.tests.ProjectConfigurationManagerTest)  Time elapsed: 2.179 s
testWorkspaceResolutionOfInterModuleDependenciesDuringImport(org.eclipse.m2e.tests.ProjectConfigurationManagerTest)  Time elapsed: 4.192 s
testBasedirRenameRequired(org.eclipse.m2e.tests.ProjectConfigurationManagerTest)  Time elapsed: 1.903 s
testStaleProjectConfigurationMarker(org.eclipse.m2e.tests.ProjectConfigurationManagerTest)  Time elapsed: 2.279 s
testKeepEncodingSetByUserForSubfoldersAndFiles(org.eclipse.m2e.tests.ProjectConfigurationManagerTest)  Time elapsed: 1.728 s
testBasedirRenameNo(org.eclipse.m2e.tests.ProjectConfigurationManagerTest)  Time elapsed: 1.614 s
testBasicUpdateConfiguration(org.eclipse.m2e.tests.ProjectConfigurationManagerTest)  Time elapsed: 2.461 s
Running org.eclipse.m2e.tests.ProjectRegistryRefreshJobTest
Tests run: 10, Failures: 0, Errors: 0, Skipped: 0, Time elapsed: 31.114 s - in org.eclipse.m2e.tests.ProjectRegistryRefreshJobTest
test436679_NoRefreshWhenImport(org.eclipse.m2e.tests.ProjectRegistryRefreshJobTest)  Time elapsed: 2.518 s
test445675_autobuild(org.eclipse.m2e.tests.ProjectRegistryRefreshJobTest)  Time elapsed: 3.146 s
testMultiProject(org.eclipse.m2e.tests.ProjectRegistryRefreshJobTest)  Time elapsed: 3.891 s
testRefreshAfterOpen(org.eclipse.m2e.tests.ProjectRegistryRefreshJobTest)  Time elapsed: 2.556 s
testUpdateForced(org.eclipse.m2e.tests.ProjectRegistryRefreshJobTest)  Time elapsed: 3.381 s
test416050_ignoreNonMavenProjectChanges(org.eclipse.m2e.tests.ProjectRegistryRefreshJobTest)  Time elapsed: 1.939 s
testDependencyAdded_NoUpdate(org.eclipse.m2e.tests.ProjectRegistryRefreshJobTest)  Time elapsed: 3.43 s
testXXXX_projectRenameRefresh(org.eclipse.m2e.tests.ProjectRegistryRefreshJobTest)  Time elapsed: 3.065 s
test437493_NoRefreshWhenInitClasspathContainer(org.eclipse.m2e.tests.ProjectRegistryRefreshJobTest)  Time elapsed: 3.657 s
testUpdateNotForced(org.eclipse.m2e.tests.ProjectRegistryRefreshJobTest)  Time elapsed: 3.53 s
Running org.eclipse.m2e.tests.conversion.ProjectConversionManagerTest
Tests run: 3, Failures: 0, Errors: 0, Skipped: 0, Time elapsed: 3.383 s - in org.eclipse.m2e.tests.conversion.ProjectConversionManagerTest
test393613_SortConversionParticipants(org.eclipse.m2e.tests.conversion.ProjectConversionManagerTest)  Time elapsed: 1.106 s
testConversionParticipantsPerProject(org.eclipse.m2e.tests.conversion.ProjectConversionManagerTest)  Time elapsed: 1.162 s
testRestrictedPackagings(org.eclipse.m2e.tests.conversion.ProjectConversionManagerTest)  Time elapsed: 1.115 s
Running org.eclipse.m2e.tests.conversion.ProjectConversionTest
Tests run: 7, Failures: 0, Errors: 0, Skipped: 0, Time elapsed: 16.235 s - in org.eclipse.m2e.tests.conversion.ProjectConversionTest
testMultipleSourcesProjectConversion(org.eclipse.m2e.tests.conversion.ProjectConversionTest)  Time elapsed: 2.62 s
testProjectConversionWithSvn(org.eclipse.m2e.tests.conversion.ProjectConversionTest)  Time elapsed: 1.885 s
testJavaMixedWithResourcesProjectConversion(org.eclipse.m2e.tests.conversion.ProjectConversionTest)  Time elapsed: 2.43 s
testInheritJavaSettingsDuringConversion(org.eclipse.m2e.tests.conversion.ProjectConversionTest)  Time elapsed: 2.42 s
testOptionalSourceProjectConversion(org.eclipse.m2e.tests.conversion.ProjectConversionTest)  Time elapsed: 2.363 s
testNoCustomizationNeededProjectConversion(org.eclipse.m2e.tests.conversion.ProjectConversionTest)  Time elapsed: 2.421 s
testMavenLayoutProjectConversion(org.eclipse.m2e.tests.conversion.ProjectConversionTest)  Time elapsed: 2.095 s
Running org.eclipse.m2e.tests.conversion.ProjectConversionEnablerTest
Tests run: 3, Failures: 0, Errors: 0, Skipped: 0, Time elapsed: 3.782 s - in org.eclipse.m2e.tests.conversion.ProjectConversionEnablerTest
testProjectCanBeConverted(org.eclipse.m2e.tests.conversion.ProjectConversionEnablerTest)  Time elapsed: 1.39 s
testProjectCannotBeConverted(org.eclipse.m2e.tests.conversion.ProjectConversionEnablerTest)  Time elapsed: 1.224 s
testEnablerNotFound(org.eclipse.m2e.tests.conversion.ProjectConversionEnablerTest)  Time elapsed: 1.168 s
Running org.eclipse.m2e.tests.launch.MavenRuntimeClasspathProviderTest
Tests run: 7, Failures: 0, Errors: 0, Skipped: 0, Time elapsed: 17.096 s - in org.eclipse.m2e.tests.launch.MavenRuntimeClasspathProviderTest
testAddJUnit5DependenciesWithEngine(org.eclipse.m2e.tests.launch.MavenRuntimeClasspathProviderTest)  Time elapsed: 3.339 s
testClasspathScopeRuntime(org.eclipse.m2e.tests.launch.MavenRuntimeClasspathProviderTest)  Time elapsed: 3.821 s
testAddJUnit5DependenciesAPIOnlyDisabled(org.eclipse.m2e.tests.launch.MavenRuntimeClasspathProviderTest)  Time elapsed: 1.744 s
testAddJUnit5DependenciesWithLauncher(org.eclipse.m2e.tests.launch.MavenRuntimeClasspathProviderTest)  Time elapsed: 1.627 s
testClasspathScopeTest(org.eclipse.m2e.tests.launch.MavenRuntimeClasspathProviderTest)  Time elapsed: 2.631 s
testAddJUnit5DependenciesAggregator(org.eclipse.m2e.tests.launch.MavenRuntimeClasspathProviderTest)  Time elapsed: 2.396 s
testAddJUnit5DependenciesAPIOnly(org.eclipse.m2e.tests.launch.MavenRuntimeClasspathProviderTest)  Time elapsed: 1.537 s
Running org.eclipse.m2e.tests.launch.MavenLaunchDelegateTest
Tests run: 6, Failures: 0, Errors: 0, Skipped: 0, Time elapsed: 0.022 s - in org.eclipse.m2e.tests.launch.MavenLaunchDelegateTest
testGetVMArguments332WithParent(org.eclipse.m2e.tests.launch.MavenLaunchDelegateTest)  Time elapsed: 0.003 s
testGetVMArgumentsSubstituteMultiModuleDir(org.eclipse.m2e.tests.launch.MavenLaunchDelegateTest)  Time elapsed: 0.002 s
testUserSettingsProgramArguments(org.eclipse.m2e.tests.launch.MavenLaunchDelegateTest)  Time elapsed: 0.011 s
testGlobalSettingsProgramArguments(org.eclipse.m2e.tests.launch.MavenLaunchDelegateTest)  Time elapsed: 0.005 s
testGetVMArguments325(org.eclipse.m2e.tests.launch.MavenLaunchDelegateTest)  Time elapsed: 0 s
testGetVMArguments331(org.eclipse.m2e.tests.launch.MavenLaunchDelegateTest)  Time elapsed: 0 s
Running org.eclipse.m2e.tests.launch.LaunchingUtilsTest
Tests run: 1, Failures: 0, Errors: 0, Skipped: 0, Time elapsed: 1.089 s - in org.eclipse.m2e.tests.launch.LaunchingUtilsTest
testGenerateProjectLocationVariableExpression(org.eclipse.m2e.tests.launch.LaunchingUtilsTest)  Time elapsed: 1.088 s
Running org.eclipse.m2e.tests.launch.MavenLauncherConfigurationHandlerTest
Tests run: 1, Failures: 0, Errors: 0, Skipped: 0, Time elapsed: 1.497 s - in org.eclipse.m2e.tests.launch.MavenLauncherConfigurationHandlerTest
test421015_workspaceProjectLibraryClasspathEntries(org.eclipse.m2e.tests.launch.MavenLauncherConfigurationHandlerTest)  Time elapsed: 1.497 s
Running org.eclipse.m2e.tests.archetype.ArchetypeManagerTest
Tests run: 12, Failures: 0, Errors: 0, Skipped: 0, Time elapsed: 1.524 s - in org.eclipse.m2e.tests.archetype.ArchetypeManagerTest
test371775_archetypeRepoAuthentication(org.eclipse.m2e.tests.archetype.ArchetypeManagerTest)  Time elapsed: 0.002 s
testEmbeddedLocalArchetypeCatalogFactory(org.eclipse.m2e.tests.archetype.ArchetypeManagerTest)  Time elapsed: 0.001 s
testArchetypeManagerSaveRestore(org.eclipse.m2e.tests.archetype.ArchetypeManagerTest)  Time elapsed: 0.708 s
testRepositoryUrlFromRemoteArchetypeCatalogs(org.eclipse.m2e.tests.archetype.ArchetypeManagerTest)  Time elapsed: 0.005 s
testArchetypeManager(org.eclipse.m2e.tests.archetype.ArchetypeManagerTest)  Time elapsed: 0.66 s
testAddRemoteCatalog(org.eclipse.m2e.tests.archetype.ArchetypeManagerTest)  Time elapsed: 0.006 s
testActiveArchetypeCatalogs(org.eclipse.m2e.tests.archetype.ArchetypeManagerTest)  Time elapsed: 0.01 s
testBadLocalArchetypeCatalogFactory(org.eclipse.m2e.tests.archetype.ArchetypeManagerTest)  Time elapsed: 0.001 s
testRemoteArchetypeCatalogFactory(org.eclipse.m2e.tests.archetype.ArchetypeManagerTest)  Time elapsed: 0 s
test359855_localArchetypeWithProperties(org.eclipse.m2e.tests.archetype.ArchetypeManagerTest)  Time elapsed: 0.025 s
testLocalArchetypeCatalogFactory(org.eclipse.m2e.tests.archetype.ArchetypeManagerTest)  Time elapsed: 0.001 s
test387784_remoteArchetypeWithProperties(org.eclipse.m2e.tests.archetype.ArchetypeManagerTest)  Time elapsed: 0.104 s
Running org.eclipse.m2e.tests.archetype.ArchetypeUtilTest
Tests run: 2, Failures: 0, Errors: 0, Skipped: 0, Time elapsed: 0 s - in org.eclipse.m2e.tests.archetype.ArchetypeUtilTest
testAreEqual(org.eclipse.m2e.tests.archetype.ArchetypeUtilTest)  Time elapsed: 0 s
testGetHashCode(org.eclipse.m2e.tests.archetype.ArchetypeUtilTest)  Time elapsed: 0 s
Running org.eclipse.m2e.tests.builder.BuildContextLifecycleTest
Tests run: 1, Failures: 0, Errors: 0, Skipped: 0, Time elapsed: 3.656 s - in org.eclipse.m2e.tests.builder.BuildContextLifecycleTest
testBuildContextRefreshProject(org.eclipse.m2e.tests.builder.BuildContextLifecycleTest)  Time elapsed: 3.655 s
Running org.eclipse.m2e.tests.builder.MavenBuilderTest
Tests run: 14, Failures: 0, Errors: 0, Skipped: 2, Time elapsed: 23.724 s - in org.eclipse.m2e.tests.builder.MavenBuilderTest
test005_pomChanged(org.eclipse.m2e.tests.builder.MavenBuilderTest)  Time elapsed: 2.002 s
test007_refreshChangedPom(org.eclipse.m2e.tests.builder.MavenBuilderTest)  Time elapsed: 2.238 s
_test006_testPluginProperties(org.eclipse.m2e.tests.builder.MavenBuilderTest) skipped
test397251_malformedPom(org.eclipse.m2e.tests.builder.MavenBuilderTest)  Time elapsed: 1.289 s
test422106_legacyPlexusUtils(org.eclipse.m2e.tests.builder.MavenBuilderTest)  Time elapsed: 1.967 s
test004_useMavenOutputFolders(org.eclipse.m2e.tests.builder.MavenBuilderTest)  Time elapsed: 1.512 s
test002_customResourceLocation(org.eclipse.m2e.tests.builder.MavenBuilderTest)  Time elapsed: 2.286 s
test001_standardLayout(org.eclipse.m2e.tests.builder.MavenBuilderTest)  Time elapsed: 1.904 s
test_crossproject(org.eclipse.m2e.tests.builder.MavenBuilderTest)  Time elapsed: 2.154 s
test380096_cleanProjectWithLifecycleMappingProblemsAfterWorkspaceRestart(org.eclipse.m2e.tests.builder.MavenBuilderTest)  Time elapsed: 1.803 s
test010_properties(org.eclipse.m2e.tests.builder.MavenBuilderTest)  Time elapsed: 1.914 s
_test008_classpathChange(org.eclipse.m2e.tests.builder.MavenBuilderTest) skipped
test368380_buildContextDeepRefreshFromLocal(org.eclipse.m2e.tests.builder.MavenBuilderTest)  Time elapsed: 1.968 s
test013_refreshFixedPom(org.eclipse.m2e.tests.builder.MavenBuilderTest)  Time elapsed: 2.687 s
Running org.eclipse.m2e.tests.builder.EclipseIncrementalBuildContextTest
Tests run: 1, Failures: 0, Errors: 0, Skipped: 0, Time elapsed: 1.851 s - in org.eclipse.m2e.tests.builder.EclipseIncrementalBuildContextTest
testScanner(org.eclipse.m2e.tests.builder.EclipseIncrementalBuildContextTest)  Time elapsed: 1.851 s
Running org.eclipse.m2e.tests.builder.EclipseBuildContextTest
Tests run: 2, Failures: 0, Errors: 0, Skipped: 0, Time elapsed: 4.12 s - in org.eclipse.m2e.tests.builder.EclipseBuildContextTest
testScanner(org.eclipse.m2e.tests.builder.EclipseBuildContextTest)  Time elapsed: 1.584 s
test361038_buildContext_scan_nonExistingFolder(org.eclipse.m2e.tests.builder.EclipseBuildContextTest)  Time elapsed: 2.536 s
Running org.eclipse.m2e.tests.ProfileSupportTest
Tests run: 1, Failures: 0, Errors: 0, Skipped: 0, Time elapsed: 1.593 s - in org.eclipse.m2e.tests.ProfileSupportTest
test337353_deactivateProfile(org.eclipse.m2e.tests.ProfileSupportTest)  Time elapsed: 1.592 s
Running org.eclipse.m2e.tests.ProjectRegistryManagerTest
Tests run: 50, Failures: 0, Errors: 0, Skipped: 1, Time elapsed: 55.339 s - in org.eclipse.m2e.tests.ProjectRegistryManagerTest
test020_moduleWithPomErrors(org.eclipse.m2e.tests.ProjectRegistryManagerTest)  Time elapsed: 1.074 s
test356645_redundantSnapshotResolution(org.eclipse.m2e.tests.ProjectRegistryManagerTest)  Time elapsed: 1.159 s
test000_pom_simple(org.eclipse.m2e.tests.ProjectRegistryManagerTest)  Time elapsed: 1.055 s
test008_staleMissingParent(org.eclipse.m2e.tests.ProjectRegistryManagerTest)  Time elapsed: 0.985 s
_testExtensionPluginResolution(org.eclipse.m2e.tests.ProjectRegistryManagerTest) skipped
test435692_affected_changes(org.eclipse.m2e.tests.ProjectRegistryManagerTest)  Time elapsed: 1.079 s
test007_staleDependencies(org.eclipse.m2e.tests.ProjectRegistryManagerTest)  Time elapsed: 1.111 s
test001_missingParent(org.eclipse.m2e.tests.ProjectRegistryManagerTest)  Time elapsed: 1.087 s
testWorkspaceDependencyVersionRange(org.eclipse.m2e.tests.ProjectRegistryManagerTest)  Time elapsed: 1.354 s
test000_removeClosed(org.eclipse.m2e.tests.ProjectRegistryManagerTest)  Time elapsed: 1.031 s
test013_missingDependencyMarker(org.eclipse.m2e.tests.ProjectRegistryManagerTest)  Time elapsed: 0.95 s
test436929_import_refresh(org.eclipse.m2e.tests.ProjectRegistryManagerTest)  Time elapsed: 0.997 s
testGlobalUpdatePolicyNever(org.eclipse.m2e.tests.ProjectRegistryManagerTest)  Time elapsed: 1.008 s
testRepositoryMetadataCacheUsed(org.eclipse.m2e.tests.ProjectRegistryManagerTest)  Time elapsed: 1.069 s
test008_staleMissingParent2(org.eclipse.m2e.tests.ProjectRegistryManagerTest)  Time elapsed: 0.963 s
test015_refreshOffline(org.eclipse.m2e.tests.ProjectRegistryManagerTest)  Time elapsed: 1.771 s
test017_moduleRefresh(org.eclipse.m2e.tests.ProjectRegistryManagerTest)  Time elapsed: 1.044 s
test000_simple(org.eclipse.m2e.tests.ProjectRegistryManagerTest)  Time elapsed: 0.945 s
test005_dependencyAvailableFromLocalRepoAndWorkspace(org.eclipse.m2e.tests.ProjectRegistryManagerTest)  Time elapsed: 1.057 s
test463075_extensionAndPluginRealm(org.eclipse.m2e.tests.ProjectRegistryManagerTest)  Time elapsed: 1.031 s
testPropertiesSubstitution(org.eclipse.m2e.tests.ProjectRegistryManagerTest)  Time elapsed: 1.089 s
test000_deletePom(org.eclipse.m2e.tests.ProjectRegistryManagerTest)  Time elapsed: 0.93 s
test006_parentAvailableFromLocalRepoAndWorkspace(org.eclipse.m2e.tests.ProjectRegistryManagerTest)  Time elapsed: 1.009 s
test005_snapshotAvailableFromLocalRepoAndWorkspace(org.eclipse.m2e.tests.ProjectRegistryManagerTest)  Time elapsed: 0.977 s
test007_changedVersion(org.eclipse.m2e.tests.ProjectRegistryManagerTest)  Time elapsed: 1.079 s
test000_eventMerge(org.eclipse.m2e.tests.ProjectRegistryManagerTest)  Time elapsed: 1.116 s
testWorkspaceResolutionApi(org.eclipse.m2e.tests.ProjectRegistryManagerTest)  Time elapsed: 1.02 s
testOptionalDependencies(org.eclipse.m2e.tests.ProjectRegistryManagerTest)  Time elapsed: 1.019 s
test460983_parentVersionRange(org.eclipse.m2e.tests.ProjectRegistryManagerTest)  Time elapsed: 1.068 s
test009_noworkspaceResolution(org.eclipse.m2e.tests.ProjectRegistryManagerTest)  Time elapsed: 0.966 s
test001_dependencyOnModuleWithInheritedGroupAndVersion(org.eclipse.m2e.tests.ProjectRegistryManagerTest)  Time elapsed: 1.045 s
testDependencyScopeChanged(org.eclipse.m2e.tests.ProjectRegistryManagerTest)  Time elapsed: 0.942 s
test007_newTransitiveDependency(org.eclipse.m2e.tests.ProjectRegistryManagerTest)  Time elapsed: 1.065 s
testCorrelatedMissingDependency(org.eclipse.m2e.tests.ProjectRegistryManagerTest)  Time elapsed: 0.969 s
test013_cantParsePomMarker(org.eclipse.m2e.tests.ProjectRegistryManagerTest)  Time elapsed: 1.035 s
test006_parentAvailableFromLocalRepoAndWorkspace01(org.eclipse.m2e.tests.ProjectRegistryManagerTest)  Time elapsed: 1.208 s
testPluginMainArtifactNotResolvedFromWorkspace(org.eclipse.m2e.tests.ProjectRegistryManagerTest)  Time elapsed: 2.37 s
test000_removeDeleted(org.eclipse.m2e.tests.ProjectRegistryManagerTest)  Time elapsed: 1.803 s
testEnvironmentVariablesConsidered(org.eclipse.m2e.tests.ProjectRegistryManagerTest)  Time elapsed: 1.633 s
test441257_stalePluginRealms(org.eclipse.m2e.tests.ProjectRegistryManagerTest)  Time elapsed: 1.017 s
test418674_ChecksumPolicyFail(org.eclipse.m2e.tests.ProjectRegistryManagerTest)  Time elapsed: 1.372 s
test418674_ChecksumPolicyWarn(org.eclipse.m2e.tests.ProjectRegistryManagerTest)  Time elapsed: 1.216 s
test021_dependencyVersionRange(org.eclipse.m2e.tests.ProjectRegistryManagerTest)  Time elapsed: 1.044 s
test405090_staleBuildExtensionsResolutionError(org.eclipse.m2e.tests.ProjectRegistryManagerTest)  Time elapsed: 1.031 s
test007_dependentRefreshAfterWorkspaceRestart(org.eclipse.m2e.tests.ProjectRegistryManagerTest)  Time elapsed: 0.974 s
testJdkProfileActivation(org.eclipse.m2e.tests.ProjectRegistryManagerTest)  Time elapsed: 1.039 s
test022_noChangeReloadWithUnrelatedRemoveProject(org.eclipse.m2e.tests.ProjectRegistryManagerTest)  Time elapsed: 1.306 s
test012_downloadExternalDependency(org.eclipse.m2e.tests.ProjectRegistryManagerTest)  Time elapsed: 1.028 s
test441257_stalePluginRealms_withParent(org.eclipse.m2e.tests.ProjectRegistryManagerTest)  Time elapsed: 0.99 s
test453995_dependencyManagementVersionless(org.eclipse.m2e.tests.ProjectRegistryManagerTest)  Time elapsed: 1.208 s
Running org.eclipse.m2e.tests.scm.ScmHandlerFactoryTest
Tests run: 1, Failures: 0, Errors: 0, Skipped: 0, Time elapsed: 0.003 s - in org.eclipse.m2e.tests.scm.ScmHandlerFactoryTest
testScmHandlerFactory(org.eclipse.m2e.tests.scm.ScmHandlerFactoryTest)  Time elapsed: 0.003 s
Running org.eclipse.m2e.tests.LocalProjectScannerTest
Tests run: 11, Failures: 0, Errors: 0, Skipped: 0, Time elapsed: 0.006 s - in org.eclipse.m2e.tests.LocalProjectScannerTest
testDeepNesting002(org.eclipse.m2e.tests.LocalProjectScannerTest)  Time elapsed: 0.001 s
testOutsideWorkspace(org.eclipse.m2e.tests.LocalProjectScannerTest)  Time elapsed: 0 s
testModuleCorrelationInverse(org.eclipse.m2e.tests.LocalProjectScannerTest)  Time elapsed: 0 s
testCircleRefs(org.eclipse.m2e.tests.LocalProjectScannerTest)  Time elapsed: 0.001 s
testSkipNested(org.eclipse.m2e.tests.LocalProjectScannerTest)  Time elapsed: 0.001 s
testNoMetadata(org.eclipse.m2e.tests.LocalProjectScannerTest)  Time elapsed: 0 s
testStackOverflow(org.eclipse.m2e.tests.LocalProjectScannerTest)  Time elapsed: 0.001 s
testMNGECLIPSE614_ImportModulesOutsideOfParent(org.eclipse.m2e.tests.LocalProjectScannerTest)  Time elapsed: 0 s
testDeepNesting(org.eclipse.m2e.tests.LocalProjectScannerTest)  Time elapsed: 0 s
testRenameInWorkspace(org.eclipse.m2e.tests.LocalProjectScannerTest)  Time elapsed: 0 s
testModuleReferencedByFile(org.eclipse.m2e.tests.LocalProjectScannerTest)  Time elapsed: 0 s
Running org.eclipse.m2e.tests.profiles.MavenProfileManagerTest
Tests run: 5, Failures: 0, Errors: 0, Skipped: 0, Time elapsed: 19.07 s - in org.eclipse.m2e.tests.profiles.MavenProfileManagerTest
testGetAvailableSettingsProfiles(org.eclipse.m2e.tests.profiles.MavenProfileManagerTest)  Time elapsed: 1.741 s
test441112_InheritParentActiveProfiles(org.eclipse.m2e.tests.profiles.MavenProfileManagerTest)  Time elapsed: 3.807 s
testUserSelectedProfiles(org.eclipse.m2e.tests.profiles.MavenProfileManagerTest)  Time elapsed: 4.578 s
testParentFromRemote(org.eclipse.m2e.tests.profiles.MavenProfileManagerTest)  Time elapsed: 3.622 s
testDisabledProfiles(org.eclipse.m2e.tests.profiles.MavenProfileManagerTest)  Time elapsed: 5.318 s
Running org.eclipse.m2e.tests.MarkerTest
Tests run: 10, Failures: 0, Errors: 0, Skipped: 0, Time elapsed: 32.764 s - in org.eclipse.m2e.tests.MarkerTest
testBuildContextWithTwoProjectConfigurators(org.eclipse.m2e.tests.MarkerTest)  Time elapsed: 2.193 s
test512825_missingArtifactVersion(org.eclipse.m2e.tests.MarkerTest)  Time elapsed: 1.737 s
testManagedTransitive(org.eclipse.m2e.tests.MarkerTest)  Time elapsed: 6.822 s
testBuildContextWithSameProjectConfiguratorTwice(org.eclipse.m2e.tests.MarkerTest)  Time elapsed: 1.77 s
testNoDuplicateMarker(org.eclipse.m2e.tests.MarkerTest)  Time elapsed: 1.161 s
test(org.eclipse.m2e.tests.MarkerTest)  Time elapsed: 11.764 s
testMarkerResolutions(org.eclipse.m2e.tests.MarkerTest)  Time elapsed: 1.69 s
test361445_missingArtifactMarkerAttributes(org.eclipse.m2e.tests.MarkerTest)  Time elapsed: 1.444 s
testBuildContextWithOneProjectConfigurator(org.eclipse.m2e.tests.MarkerTest)  Time elapsed: 1.669 s
testBuildCantReadPom(org.eclipse.m2e.tests.MarkerTest)  Time elapsed: 2.513 s
Running org.eclipse.m2e.tests.MavenProjectMutableStateTest
Tests run: 3, Failures: 0, Errors: 0, Skipped: 0, Time elapsed: 4.823 s - in org.eclipse.m2e.tests.MavenProjectMutableStateTest
testExecuteMojo(org.eclipse.m2e.tests.MavenProjectMutableStateTest)  Time elapsed: 1.409 s
testMavenBuilder(org.eclipse.m2e.tests.MavenProjectMutableStateTest)  Time elapsed: 1.902 s
testImport(org.eclipse.m2e.tests.MavenProjectMutableStateTest)  Time elapsed: 1.512 s
Running org.eclipse.m2e.tests.JavaUtilTest
Tests run: 1, Failures: 0, Errors: 0, Skipped: 0, Time elapsed: 0.003 s - in org.eclipse.m2e.tests.JavaUtilTest
testGetDefaultJavaPackage(org.eclipse.m2e.tests.JavaUtilTest)  Time elapsed: 0.003 s
Running org.eclipse.m2e.tests.ClasspathProviderTest
Tests run: 20, Failures: 0, Errors: 0, Skipped: 0, Time elapsed: 22.981 s - in org.eclipse.m2e.tests.ClasspathProviderTest
testTestClassesTestScopeAndTestType(org.eclipse.m2e.tests.ClasspathProviderTest)  Time elapsed: 1.022 s
testSourcePath(org.eclipse.m2e.tests.ClasspathProviderTest)  Time elapsed: 1.023 s
testCustomClasspath(org.eclipse.m2e.tests.ClasspathProviderTest)  Time elapsed: 1.14 s
test368230_unknownClassifier(org.eclipse.m2e.tests.ClasspathProviderTest)  Time elapsed: 1.025 s
testTestClassesDefaultClassifier(org.eclipse.m2e.tests.ClasspathProviderTest)  Time elapsed: 1.031 s
testJunitClasspathOrder(org.eclipse.m2e.tests.ClasspathProviderTest)  Time elapsed: 1.057 s
testProvidedScopeTestApp(org.eclipse.m2e.tests.ClasspathProviderTest)  Time elapsed: 1.075 s
testNoFilterResources(org.eclipse.m2e.tests.ClasspathProviderTest)  Time elapsed: 0.979 s
testProvidedScopeApp(org.eclipse.m2e.tests.ClasspathProviderTest)  Time elapsed: 1.53 s
testLaunchConfigListener(org.eclipse.m2e.tests.ClasspathProviderTest)  Time elapsed: 1.146 s
testProvidedScopeAppTest(org.eclipse.m2e.tests.ClasspathProviderTest)  Time elapsed: 1.609 s
testTestClassesTestsClassifier(org.eclipse.m2e.tests.ClasspathProviderTest)  Time elapsed: 1.271 s
test(org.eclipse.m2e.tests.ClasspathProviderTest)  Time elapsed: 1.122 s
testNonDefaultTestSource(org.eclipse.m2e.tests.ClasspathProviderTest)  Time elapsed: 1.07 s
testCustomProjectEntry(org.eclipse.m2e.tests.ClasspathProviderTest)  Time elapsed: 1.334 s
testCustomBuildpath(org.eclipse.m2e.tests.ClasspathProviderTest)  Time elapsed: 1.336 s
testNotMavenProject(org.eclipse.m2e.tests.ClasspathProviderTest)  Time elapsed: 1.047 s
testTestClassesDefaultAndTestsClassifier(org.eclipse.m2e.tests.ClasspathProviderTest)  Time elapsed: 1.116 s
testSystemScope(org.eclipse.m2e.tests.ClasspathProviderTest)  Time elapsed: 1.041 s
test368230_FancyClassifier(org.eclipse.m2e.tests.ClasspathProviderTest)  Time elapsed: 1.004 s
Running org.eclipse.m2e.tests.properties.MavenPropertiesTest
Tests run: 2, Failures: 0, Errors: 0, Skipped: 0, Time elapsed: 4.535 s - in org.eclipse.m2e.tests.properties.MavenPropertiesTest
testBuildingProjectWithProperties(org.eclipse.m2e.tests.properties.MavenPropertiesTest)  Time elapsed: 3.115 s
testReadResolverConfigurationProperties(org.eclipse.m2e.tests.properties.MavenPropertiesTest)  Time elapsed: 1.42 s
Running org.eclipse.m2e.tests.util.search.IndexSearchEngineTest
Tests run: 1, Failures: 0, Errors: 0, Skipped: 0, Time elapsed: 1.189 s - in org.eclipse.m2e.tests.util.search.IndexSearchEngineTest
testGroupIDProposal(org.eclipse.m2e.tests.util.search.IndexSearchEngineTest)  Time elapsed: 1.189 s

Results:

Errors: 
  BuildPathManagerTest.testDownloadSources_006_nonMavenProject:656 ? Core Reinde...

Tests run: 548, Failures: 0, Errors: 1, Skipped: 5

SWT SessionManagerDBus: Failed to connect to org.gnome.SessionManager: Failed to execute child process ?dbus-launch? (No such file or directory)
SWT SessionManagerDBus: Failed to connect to org.xfce.SessionManager: Failed to execute child process ?dbus-launch? (No such file or directory)
[ERROR] There are test failures.

Please refer to /home/jenkins/agent/workspace/m2e_master/m2e-core-tests/org.eclipse.m2e.tests/target/surefire-reports for the individual test results.
[INFO] 
[INFO] --- tycho-p2-extras-plugin:2.1.0:compare-version-with-baselines (check-no-version-regression) @ org.eclipse.m2e.tests ---
[INFO] 
[INFO] ------------< org.eclipse.m2e:org.eclipse.m2e.editor.tests >------------
[INFO] Building Maven Integration for Eclipse POM Editor tests 1.16.0-SNAPSHOT [42/43]
[INFO] ------------------------[ eclipse-test-plugin ]-------------------------
[INFO] 
[INFO] --- maven-clean-plugin:2.4.1:clean (default-clean) @ org.eclipse.m2e.editor.tests ---
[INFO] 
[INFO] --- tycho-packaging-plugin:2.1.0:build-qualifier (default-build-qualifier) @ org.eclipse.m2e.editor.tests ---
[INFO] The project's OSGi version is 1.16.0.20210115-0841
[INFO] 
[INFO] --- tycho-packaging-plugin:2.1.0:validate-id (default-validate-id) @ org.eclipse.m2e.editor.tests ---
[INFO] 
[INFO] --- tycho-packaging-plugin:2.1.0:validate-version (default-validate-version) @ org.eclipse.m2e.editor.tests ---
[INFO] 
[INFO] --- jacoco-maven-plugin:0.8.5:prepare-agent (default) @ org.eclipse.m2e.editor.tests ---
[INFO] tycho.testArgLine set to -javaagent:/home/jenkins/agent/workspace/m2e_master/.m2/repository/org/jacoco/org.jacoco.agent/0.8.5/org.jacoco.agent-0.8.5-runtime.jar=destfile=/home/jenkins/agent/workspace/m2e_master/m2e-core-tests/target/jacoco.exec,append=true,includes=org.eclipse.m2e*:org.apache.maven*:org.eclipse.aether* -Xmx800m
[INFO] 
[INFO] --- maven-resources-plugin:2.5:resources (default-resources) @ org.eclipse.m2e.editor.tests ---
[debug] execute contextualize
[INFO] Using 'UTF-8' encoding to copy filtered resources.
[INFO] skip non existing resourceDirectory /home/jenkins/agent/workspace/m2e_master/m2e-core-tests/org.eclipse.m2e.editor.tests/src/main/resources
[INFO] 
[INFO] --- tycho-compiler-plugin:2.1.0:compile (default-compile) @ org.eclipse.m2e.editor.tests ---
[INFO] Compiling 3 source files to /home/jenkins/agent/workspace/m2e_master/m2e-core-tests/org.eclipse.m2e.editor.tests/target/classes
[INFO] 
[INFO] --- maven-resources-plugin:2.5:testResources (default-testResources) @ org.eclipse.m2e.editor.tests ---
[debug] execute contextualize
[INFO] Using 'UTF-8' encoding to copy filtered resources.
[INFO] skip non existing resourceDirectory /home/jenkins/agent/workspace/m2e_master/m2e-core-tests/org.eclipse.m2e.editor.tests/src/test/resources
[INFO] 
[INFO] --- tycho-source-plugin:2.1.0:plugin-source (plugin-source) @ org.eclipse.m2e.editor.tests ---
[INFO] Building jar: /home/jenkins/agent/workspace/m2e_master/m2e-core-tests/org.eclipse.m2e.editor.tests/target/org.eclipse.m2e.editor.tests-1.16.0-SNAPSHOT-sources.jar
[INFO] 
[INFO] --- target-platform-configuration:2.1.0:target-platform (default-target-platform) @ org.eclipse.m2e.editor.tests ---
[INFO] 
[INFO] --- tycho-packaging-plugin:2.1.0:package-plugin (default-package-plugin) @ org.eclipse.m2e.editor.tests ---
[INFO] Building jar: /home/jenkins/agent/workspace/m2e_master/m2e-core-tests/org.eclipse.m2e.editor.tests/target/org.eclipse.m2e.editor.tests-1.16.0-SNAPSHOT.jar
[INFO] 
[INFO] --- tycho-p2-plugin:2.1.0:p2-metadata-default (default-p2-metadata-default) @ org.eclipse.m2e.editor.tests ---
[INFO] 
[INFO] --- tycho-pack200a-plugin:2.1.0:normalize (pack200-normalize) @ org.eclipse.m2e.editor.tests ---
[INFO] Pack200 normalizing jar /home/jenkins/agent/workspace/m2e_master/m2e-core-tests/org.eclipse.m2e.editor.tests/target/org.eclipse.m2e.editor.tests-1.16.0-SNAPSHOT.jar
[INFO] 
[INFO] --- eclipse-jarsigner-plugin:1.1.7:sign (sign) @ org.eclipse.m2e.editor.tests ---
[INFO] Signing of nested jars of '/home/jenkins/agent/workspace/m2e_master/m2e-core-tests/org.eclipse.m2e.editor.tests/target/org.eclipse.m2e.editor.tests-1.16.0-SNAPSHOT.jar' is disabled.
[INFO] Signing jar: /home/jenkins/agent/workspace/m2e_master/m2e-core-tests/org.eclipse.m2e.editor.tests/target/org.eclipse.m2e.editor.tests-1.16.0-SNAPSHOT.jar
[INFO] Signing of nested jars of '/home/jenkins/agent/workspace/m2e_master/m2e-core-tests/org.eclipse.m2e.editor.tests/target/org.eclipse.m2e.editor.tests-1.16.0-SNAPSHOT-sources.jar' is disabled.
[INFO] Signing jar: /home/jenkins/agent/workspace/m2e_master/m2e-core-tests/org.eclipse.m2e.editor.tests/target/org.eclipse.m2e.editor.tests-1.16.0-SNAPSHOT-sources.jar
[INFO] 
[INFO] --- tycho-pack200b-plugin:2.1.0:pack (pack200-pack) @ org.eclipse.m2e.editor.tests ---
[INFO] Pack200 packing jar /home/jenkins/agent/workspace/m2e_master/m2e-core-tests/org.eclipse.m2e.editor.tests/target/org.eclipse.m2e.editor.tests-1.16.0-SNAPSHOT.jar
[INFO] 
[INFO] --- tycho-p2-plugin:2.1.0:p2-metadata (p2-metadata) @ org.eclipse.m2e.editor.tests ---
[INFO] No baseline version MavenProject: org.eclipse.m2e:org.eclipse.m2e.editor.tests:1.16.0-SNAPSHOT @ /home/jenkins/agent/workspace/m2e_master/m2e-core-tests/org.eclipse.m2e.editor.tests/pom.xml
[INFO] 
[INFO] --- tycho-surefire-plugin:2.1.0:test (default-test) @ org.eclipse.m2e.editor.tests ---
[INFO] Executing Test Runtime with timeout 7200, logs (if any) will be placed at: /home/jenkins/agent/workspace/m2e_master/m2e-core-tests/org.eclipse.m2e.editor.tests/target/work/data/.metadata/.log
[INFO] Command line:
	[/opt/tools/java/openjdk/jdk-11/11.0.2+9/bin/java, -Dosgi.noShutdown=false, -Dosgi.os=linux, -Dosgi.ws=gtk, -Dosgi.arch=x86_64, -javaagent:/home/jenkins/agent/workspace/m2e_master/.m2/repository/org/jacoco/org.jacoco.agent/0.8.5/org.jacoco.agent-0.8.5-runtime.jar=destfile=/home/jenkins/agent/workspace/m2e_master/m2e-core-tests/target/jacoco.exec,append=true,includes=org.eclipse.m2e*:org.apache.maven*:org.eclipse.aether*, -Xmx800m, -Dosgi.clean=true, -jar, /home/jenkins/agent/workspace/m2e_master/.m2/repository/p2/osgi/bundle/org.eclipse.equinox.launcher/1.6.0.v20200915-1508/org.eclipse.equinox.launcher-1.6.0.v20200915-1508.jar, -data, /home/jenkins/agent/workspace/m2e_master/m2e-core-tests/org.eclipse.m2e.editor.tests/target/work/data, -install, /home/jenkins/agent/workspace/m2e_master/m2e-core-tests/org.eclipse.m2e.editor.tests/target/work, -configuration, /home/jenkins/agent/workspace/m2e_master/m2e-core-tests/org.eclipse.m2e.editor.tests/target/work/configuration, -application, org.eclipse.tycho.surefire.osgibooter.uitest, -testproperties, /home/jenkins/agent/workspace/m2e_master/m2e-core-tests/org.eclipse.m2e.editor.tests/target/surefire.properties, -pluginCustomization, /home/jenkins/agent/workspace/m2e_master/m2e-core-tests/org.eclipse.m2e.editor.tests/plugin_customization.ini, -timeout, 7200000]

(process:4752): Gtk-WARNING **: 15:26:11.781: Locale not supported by C library.
	Using the fallback 'C' locale.
SWT SessionManagerDBus: Failed to connect to org.gnome.SessionManager: Failed to execute child process ?dbus-launch? (No such file or directory)
SWT SessionManagerDBus: Failed to connect to org.xfce.SessionManager: Failed to execute child process ?dbus-launch? (No such file or directory)
Running org.eclipse.m2e.editor.MavenPomEditorDirtyTest
SLF4J: Failed to load class "org.slf4j.impl.StaticLoggerBinder".
SLF4J: Defaulting to no-operation (NOP) logger implementation
SLF4J: See http://www.slf4j.org/codes.html#StaticLoggerBinder for further details.
SLF4J: Failed to load class "org.slf4j.impl.StaticLoggerBinder".
SLF4J: Defaulting to no-operation (NOP) logger implementation
SLF4J: See http://www.slf4j.org/codes.html#StaticLoggerBinder for further details.
Warning: NLS missing message: MavenImpl_error_lookup in: org.eclipse.m2e.editor.internal.messages
Tests run: 1, Failures: 0, Errors: 0, Skipped: 0, Time elapsed: 4.797 s - in org.eclipse.m2e.editor.MavenPomEditorDirtyTest
test358656_dirtyStateAfterFSModification(org.eclipse.m2e.editor.MavenPomEditorDirtyTest)  Time elapsed: 4.396 s
Running org.eclipse.m2e.editor.dialogs.ManageDependenciesDialogTest
Tests run: 9, Failures: 0, Errors: 0, Skipped: 0, Time elapsed: 15.77 s - in org.eclipse.m2e.editor.dialogs.ManageDependenciesDialogTest
testDepLabelProvider(org.eclipse.m2e.editor.dialogs.ManageDependenciesDialogTest)  Time elapsed: 5.941 s
testBrokenSource(org.eclipse.m2e.editor.dialogs.ManageDependenciesDialogTest)  Time elapsed: 0.643 s
testBrokenTarget(org.eclipse.m2e.editor.dialogs.ManageDependenciesDialogTest)  Time elapsed: 0.642 s
testDepExistsDiffVersionDiffPOMs(org.eclipse.m2e.editor.dialogs.ManageDependenciesDialogTest)  Time elapsed: 2.347 s
testDepExists(org.eclipse.m2e.editor.dialogs.ManageDependenciesDialogTest)  Time elapsed: 0.901 s
testMultipleDependencies(org.eclipse.m2e.editor.dialogs.ManageDependenciesDialogTest)  Time elapsed: 1.57 s
testDiffPOMs(org.eclipse.m2e.editor.dialogs.ManageDependenciesDialogTest)  Time elapsed: 1.286 s
testDepExistsDiffVersion(org.eclipse.m2e.editor.dialogs.ManageDependenciesDialogTest)  Time elapsed: 0.91 s
testSamePOM(org.eclipse.m2e.editor.dialogs.ManageDependenciesDialogTest)  Time elapsed: 1.528 s
Running org.eclipse.m2e.editor.dialogs.MavenModuleSelectionDialogTest
Tests run: 1, Failures: 0, Errors: 0, Skipped: 0, Time elapsed: 1.741 s - in org.eclipse.m2e.editor.dialogs.MavenModuleSelectionDialogTest
testModuleSelection(org.eclipse.m2e.editor.dialogs.MavenModuleSelectionDialogTest)  Time elapsed: 1.741 s

Results:

Tests run: 11, Failures: 0, Errors: 0, Skipped: 0

[INFO] All tests passed!
[INFO] 
[INFO] --- tycho-p2-extras-plugin:2.1.0:compare-version-with-baselines (check-no-version-regression) @ org.eclipse.m2e.editor.tests ---
[INFO] 
[INFO] ----------< org.eclipse.m2e:org.eclipse.m2e.editor.xml.tests >----------
[INFO] Building Maven POM XML Editor Tests 1.16.0-SNAPSHOT              [43/43]
[INFO] ------------------------[ eclipse-test-plugin ]-------------------------
[INFO] 
[INFO] --- maven-clean-plugin:2.4.1:clean (default-clean) @ org.eclipse.m2e.editor.xml.tests ---
[INFO] 
[INFO] --- tycho-packaging-plugin:2.1.0:build-qualifier (default-build-qualifier) @ org.eclipse.m2e.editor.xml.tests ---
[INFO] The project's OSGi version is 1.16.0.20210115-0951
[INFO] 
[INFO] --- tycho-packaging-plugin:2.1.0:validate-id (default-validate-id) @ org.eclipse.m2e.editor.xml.tests ---
[INFO] 
[INFO] --- tycho-packaging-plugin:2.1.0:validate-version (default-validate-version) @ org.eclipse.m2e.editor.xml.tests ---
[INFO] 
[INFO] --- jacoco-maven-plugin:0.8.5:prepare-agent (default) @ org.eclipse.m2e.editor.xml.tests ---
[INFO] tycho.testArgLine set to -javaagent:/home/jenkins/agent/workspace/m2e_master/.m2/repository/org/jacoco/org.jacoco.agent/0.8.5/org.jacoco.agent-0.8.5-runtime.jar=destfile=/home/jenkins/agent/workspace/m2e_master/m2e-core-tests/target/jacoco.exec,append=true,includes=org.eclipse.m2e*:org.apache.maven*:org.eclipse.aether* -Xmx800m
[INFO] 
[INFO] --- maven-resources-plugin:2.5:resources (default-resources) @ org.eclipse.m2e.editor.xml.tests ---
[debug] execute contextualize
[INFO] Using 'UTF-8' encoding to copy filtered resources.
[INFO] skip non existing resourceDirectory /home/jenkins/agent/workspace/m2e_master/m2e-core-tests/org.eclipse.m2e.editor.xml.tests/src/main/resources
[INFO] 
[INFO] --- tycho-compiler-plugin:2.1.0:compile (default-compile) @ org.eclipse.m2e.editor.xml.tests ---
[WARNING] Parameter 'useProjectSettings' is set to true, but preferences file '/home/jenkins/agent/workspace/m2e_master/m2e-core-tests/org.eclipse.m2e.editor.xml.tests/.settings/org.eclipse.jdt.core.prefs' could not be found!
[INFO] Compiling 22 source files to /home/jenkins/agent/workspace/m2e_master/m2e-core-tests/org.eclipse.m2e.editor.xml.tests/target/classes
[INFO] 
[INFO] --- maven-resources-plugin:2.5:testResources (default-testResources) @ org.eclipse.m2e.editor.xml.tests ---
[debug] execute contextualize
[INFO] Using 'UTF-8' encoding to copy filtered resources.
[INFO] skip non existing resourceDirectory /home/jenkins/agent/workspace/m2e_master/m2e-core-tests/org.eclipse.m2e.editor.xml.tests/src/test/resources
[INFO] 
[INFO] --- tycho-source-plugin:2.1.0:plugin-source (plugin-source) @ org.eclipse.m2e.editor.xml.tests ---
[INFO] Building jar: /home/jenkins/agent/workspace/m2e_master/m2e-core-tests/org.eclipse.m2e.editor.xml.tests/target/org.eclipse.m2e.editor.xml.tests-1.16.0-SNAPSHOT-sources.jar
[INFO] 
[INFO] --- target-platform-configuration:2.1.0:target-platform (default-target-platform) @ org.eclipse.m2e.editor.xml.tests ---
[INFO] 
[INFO] --- tycho-packaging-plugin:2.1.0:package-plugin (default-package-plugin) @ org.eclipse.m2e.editor.xml.tests ---
[INFO] Building jar: /home/jenkins/agent/workspace/m2e_master/m2e-core-tests/org.eclipse.m2e.editor.xml.tests/target/org.eclipse.m2e.editor.xml.tests-1.16.0-SNAPSHOT.jar
[INFO] 
[INFO] --- tycho-p2-plugin:2.1.0:p2-metadata-default (default-p2-metadata-default) @ org.eclipse.m2e.editor.xml.tests ---
[INFO] 
[INFO] --- tycho-pack200a-plugin:2.1.0:normalize (pack200-normalize) @ org.eclipse.m2e.editor.xml.tests ---
[INFO] Pack200 normalizing jar /home/jenkins/agent/workspace/m2e_master/m2e-core-tests/org.eclipse.m2e.editor.xml.tests/target/org.eclipse.m2e.editor.xml.tests-1.16.0-SNAPSHOT.jar
[INFO] 
[INFO] --- eclipse-jarsigner-plugin:1.1.7:sign (sign) @ org.eclipse.m2e.editor.xml.tests ---
[INFO] Signing of nested jars of '/home/jenkins/agent/workspace/m2e_master/m2e-core-tests/org.eclipse.m2e.editor.xml.tests/target/org.eclipse.m2e.editor.xml.tests-1.16.0-SNAPSHOT.jar' is disabled.
[INFO] Signing jar: /home/jenkins/agent/workspace/m2e_master/m2e-core-tests/org.eclipse.m2e.editor.xml.tests/target/org.eclipse.m2e.editor.xml.tests-1.16.0-SNAPSHOT.jar
[INFO] Signing of nested jars of '/home/jenkins/agent/workspace/m2e_master/m2e-core-tests/org.eclipse.m2e.editor.xml.tests/target/org.eclipse.m2e.editor.xml.tests-1.16.0-SNAPSHOT-sources.jar' is disabled.
[INFO] Signing jar: /home/jenkins/agent/workspace/m2e_master/m2e-core-tests/org.eclipse.m2e.editor.xml.tests/target/org.eclipse.m2e.editor.xml.tests-1.16.0-SNAPSHOT-sources.jar
[INFO] 
[INFO] --- tycho-pack200b-plugin:2.1.0:pack (pack200-pack) @ org.eclipse.m2e.editor.xml.tests ---
[INFO] Pack200 packing jar /home/jenkins/agent/workspace/m2e_master/m2e-core-tests/org.eclipse.m2e.editor.xml.tests/target/org.eclipse.m2e.editor.xml.tests-1.16.0-SNAPSHOT.jar
[INFO] 
[INFO] --- tycho-p2-plugin:2.1.0:p2-metadata (p2-metadata) @ org.eclipse.m2e.editor.xml.tests ---
[INFO] No baseline version MavenProject: org.eclipse.m2e:org.eclipse.m2e.editor.xml.tests:1.16.0-SNAPSHOT @ /home/jenkins/agent/workspace/m2e_master/m2e-core-tests/org.eclipse.m2e.editor.xml.tests/pom.xml
[INFO] 
[INFO] --- tycho-surefire-plugin:2.1.0:test (default-test) @ org.eclipse.m2e.editor.xml.tests ---
[INFO] Executing Test Runtime with timeout 7200, logs (if any) will be placed at: /home/jenkins/agent/workspace/m2e_master/m2e-core-tests/org.eclipse.m2e.editor.xml.tests/target/work/data/.metadata/.log
[INFO] Command line:
	[/opt/tools/java/openjdk/jdk-11/11.0.2+9/bin/java, -Dosgi.noShutdown=false, -Dosgi.os=linux, -Dosgi.ws=gtk, -Dosgi.arch=x86_64, -javaagent:/home/jenkins/agent/workspace/m2e_master/.m2/repository/org/jacoco/org.jacoco.agent/0.8.5/org.jacoco.agent-0.8.5-runtime.jar=destfile=/home/jenkins/agent/workspace/m2e_master/m2e-core-tests/target/jacoco.exec,append=true,includes=org.eclipse.m2e*:org.apache.maven*:org.eclipse.aether*, -Xmx800m, -Dosgi.clean=true, -jar, /home/jenkins/agent/workspace/m2e_master/.m2/repository/p2/osgi/bundle/org.eclipse.equinox.launcher/1.6.0.v20200915-1508/org.eclipse.equinox.launcher-1.6.0.v20200915-1508.jar, -data, /home/jenkins/agent/workspace/m2e_master/m2e-core-tests/org.eclipse.m2e.editor.xml.tests/target/work/data, -install, /home/jenkins/agent/workspace/m2e_master/m2e-core-tests/org.eclipse.m2e.editor.xml.tests/target/work, -configuration, /home/jenkins/agent/workspace/m2e_master/m2e-core-tests/org.eclipse.m2e.editor.xml.tests/target/work/configuration, -application, org.eclipse.tycho.surefire.osgibooter.uitest, -testproperties, /home/jenkins/agent/workspace/m2e_master/m2e-core-tests/org.eclipse.m2e.editor.xml.tests/target/surefire.properties, -pluginCustomization, /home/jenkins/agent/workspace/m2e_master/m2e-core-tests/org.eclipse.m2e.editor.xml.tests/plugin_customization.ini, -timeout, 7200000]

(process:4881): Gtk-WARNING **: 15:26:43.312: Locale not supported by C library.
	Using the fallback 'C' locale.
SWT SessionManagerDBus: Failed to connect to org.gnome.SessionManager: Failed to execute child process ?dbus-launch? (No such file or directory)
SWT SessionManagerDBus: Failed to connect to org.xfce.SessionManager: Failed to execute child process ?dbus-launch? (No such file or directory)
SLF4J: Failed to load class "org.slf4j.impl.StaticLoggerBinder".
SLF4J: Defaulting to no-operation (NOP) logger implementation
SLF4J: See http://www.slf4j.org/codes.html#StaticLoggerBinder for further details.
Running org.eclipse.m2e.editor.xml.PomEditsTest
SLF4J: Failed to load class "org.slf4j.impl.StaticLoggerBinder".
SLF4J: Defaulting to no-operation (NOP) logger implementation
SLF4J: See http://www.slf4j.org/codes.html#StaticLoggerBinder for further details.
Tests run: 2, Failures: 0, Errors: 0, Skipped: 0, Time elapsed: 6.343 s - in org.eclipse.m2e.editor.xml.PomEditsTest
test371438_insertAt_insideEmptyElement(org.eclipse.m2e.editor.xml.PomEditsTest)  Time elapsed: 4.279 s
test467590_emptyPom(org.eclipse.m2e.editor.xml.PomEditsTest)  Time elapsed: 1.85 s
Running org.eclipse.m2e.editor.xml.MissingSchemaMarkerTest
Tests run: 1, Failures: 0, Errors: 0, Skipped: 0, Time elapsed: 10.086 s - in org.eclipse.m2e.editor.xml.MissingSchemaMarkerTest
testMissingSchemaMarker(org.eclipse.m2e.editor.xml.MissingSchemaMarkerTest)  Time elapsed: 10.085 s
Running org.eclipse.m2e.editor.xml.ExtractProject2Test
Tests run: 1, Failures: 0, Errors: 0, Skipped: 0, Time elapsed: 1.76 s - in org.eclipse.m2e.editor.xml.ExtractProject2Test
testExtractProject(org.eclipse.m2e.editor.xml.ExtractProject2Test)  Time elapsed: 1.753 s
Running org.eclipse.m2e.editor.xml.ExtractProjectTest
Tests run: 1, Failures: 0, Errors: 0, Skipped: 0, Time elapsed: 1.563 s - in org.eclipse.m2e.editor.xml.ExtractProjectTest
testExtractProject(org.eclipse.m2e.editor.xml.ExtractProjectTest)  Time elapsed: 1.562 s
Running org.eclipse.m2e.editor.xml.PluginConfigCompletionTest
Warning: NLS missing message: MavenImpl_error_lookup in: org.eclipse.m2e.editor.internal.messages
Tests run: 12, Failures: 0, Errors: 0, Skipped: 0, Time elapsed: 24.828 s - in org.eclipse.m2e.editor.xml.PluginConfigCompletionTest
testMetadataExtension(org.eclipse.m2e.editor.xml.PluginConfigCompletionTest)  Time elapsed: 8.569 s
testAllMojosCompletion(org.eclipse.m2e.editor.xml.PluginConfigCompletionTest)  Time elapsed: 2.714 s
testListItemNameCompletion(org.eclipse.m2e.editor.xml.PluginConfigCompletionTest)  Time elapsed: 1.277 s
testImplementationListItemNameCompletion(org.eclipse.m2e.editor.xml.PluginConfigCompletionTest)  Time elapsed: 1.477 s
testListItemParameterCompletion(org.eclipse.m2e.editor.xml.PluginConfigCompletionTest)  Time elapsed: 1.043 s
testM2ELifecycleMappingConfiguration(org.eclipse.m2e.editor.xml.PluginConfigCompletionTest)  Time elapsed: 1.977 s
testImplementationContentCompletion(org.eclipse.m2e.editor.xml.PluginConfigCompletionTest)  Time elapsed: 1.16 s
testSubclassListItems(org.eclipse.m2e.editor.xml.PluginConfigCompletionTest)  Time elapsed: 2.064 s
testNestedParameterCompletion(org.eclipse.m2e.editor.xml.PluginConfigCompletionTest)  Time elapsed: 1.074 s
testSingleMojoCompletion(org.eclipse.m2e.editor.xml.PluginConfigCompletionTest)  Time elapsed: 1.319 s
testAnyListItemNameParameterCompletion(org.eclipse.m2e.editor.xml.PluginConfigCompletionTest)  Time elapsed: 1.117 s
testUnknownContentCompletion(org.eclipse.m2e.editor.xml.PluginConfigCompletionTest)  Time elapsed: 1.036 s
Running org.eclipse.m2e.editor.xml.RelativePath2Test
Tests run: 1, Failures: 0, Errors: 0, Skipped: 0, Time elapsed: 1.181 s - in org.eclipse.m2e.editor.xml.RelativePath2Test
testRelativePath(org.eclipse.m2e.editor.xml.RelativePath2Test)  Time elapsed: 1.179 s
Running org.eclipse.m2e.editor.xml.ManagedArtifactMarkerTest
Tests run: 7, Failures: 0, Errors: 0, Skipped: 0, Time elapsed: 16.325 s - in org.eclipse.m2e.editor.xml.ManagedArtifactMarkerTest
test439309_errorOnManagedVersionOverride(org.eclipse.m2e.editor.xml.ManagedArtifactMarkerTest)  Time elapsed: 4.765 s
test439309_ignoreManagedVersionOverride(org.eclipse.m2e.editor.xml.ManagedArtifactMarkerTest)  Time elapsed: 1.995 s
test355882_noMarkerOnDifferentClassifier(org.eclipse.m2e.editor.xml.ManagedArtifactMarkerTest)  Time elapsed: 2.522 s
test553839_noErrorCausedByPluginVersionFromSuperPom(org.eclipse.m2e.editor.xml.ManagedArtifactMarkerTest)  Time elapsed: 2.302 s
testMNGEclipse2559Second(org.eclipse.m2e.editor.xml.ManagedArtifactMarkerTest)  Time elapsed: 1.66 s
test355882_MarkerOnClassifierVersionOverride(org.eclipse.m2e.editor.xml.ManagedArtifactMarkerTest)  Time elapsed: 1.503 s
testMNGEclipse2559(org.eclipse.m2e.editor.xml.ManagedArtifactMarkerTest)  Time elapsed: 1.578 s
Running org.eclipse.m2e.editor.xml.PomContentAssistProcessorTest
Tests run: 1, Failures: 0, Errors: 0, Skipped: 0, Time elapsed: 0.002 s - in org.eclipse.m2e.editor.xml.PomContentAssistProcessorTest
testExtractPrefix(org.eclipse.m2e.editor.xml.PomContentAssistProcessorTest)  Time elapsed: 0.001 s
Running org.eclipse.m2e.editor.xml.PropertyCompletionTest
Tests run: 1, Failures: 0, Errors: 0, Skipped: 0, Time elapsed: 1.798 s - in org.eclipse.m2e.editor.xml.PropertyCompletionTest
testCompletion(org.eclipse.m2e.editor.xml.PropertyCompletionTest)  Time elapsed: 1.798 s
Running org.eclipse.m2e.editor.xml.RelativePath3Test
Tests run: 1, Failures: 0, Errors: 0, Skipped: 0, Time elapsed: 2.311 s - in org.eclipse.m2e.editor.xml.RelativePath3Test
testRelativePath(org.eclipse.m2e.editor.xml.RelativePath3Test)  Time elapsed: 2.311 s
Running org.eclipse.m2e.editor.xml.FileCompletionTest
Tests run: 1, Failures: 0, Errors: 0, Skipped: 1, Time elapsed: 0.001 s - in org.eclipse.m2e.editor.xml.FileCompletionTest
org.eclipse.m2e.editor.xml.FileCompletionTest skipped
Running org.eclipse.m2e.editor.xml.HyperlinkTest
true
Tests run: 1, Failures: 0, Errors: 0, Skipped: 0, Time elapsed: 1.842 s - in org.eclipse.m2e.editor.xml.HyperlinkTest
testHasLink(org.eclipse.m2e.editor.xml.HyperlinkTest)  Time elapsed: 1.842 s
Running org.eclipse.m2e.editor.xml.PomTemplateContextTest
Tests run: 11, Failures: 0, Errors: 0, Skipped: 0, Time elapsed: 8.719 s - in org.eclipse.m2e.editor.xml.PomTemplateContextTest
testGetTemplatesArtifactId_WithGroupId(org.eclipse.m2e.editor.xml.PomTemplateContextTest)  Time elapsed: 0.647 s
testGetTemplatesDependencyScope(org.eclipse.m2e.editor.xml.PomTemplateContextTest)  Time elapsed: 0.702 s
test439251_GetTemplatesConfigurationFromMojoWithEmptyParameters(org.eclipse.m2e.editor.xml.PomTemplateContextTest)  Time elapsed: 0.976 s
testGetTemplatesPackaging(org.eclipse.m2e.editor.xml.PomTemplateContextTest)  Time elapsed: 0.743 s
testGetTemplatesVersion_WithoutGroupId(org.eclipse.m2e.editor.xml.PomTemplateContextTest)  Time elapsed: 0.718 s
testGetTemplatesArtifactId_WithoutGroupId(org.eclipse.m2e.editor.xml.PomTemplateContextTest)  Time elapsed: 0.984 s
testGetTemplatesConfiguration(org.eclipse.m2e.editor.xml.PomTemplateContextTest)  Time elapsed: 1.094 s
testGetTemplatesDependencyManagementScope(org.eclipse.m2e.editor.xml.PomTemplateContextTest)  Time elapsed: 0.701 s
testGetTemplatesVersion_WithGroupId(org.eclipse.m2e.editor.xml.PomTemplateContextTest)  Time elapsed: 0.717 s
testGetTemplatesPhase(org.eclipse.m2e.editor.xml.PomTemplateContextTest)  Time elapsed: 0.701 s
testGetTemplatesGoal(org.eclipse.m2e.editor.xml.PomTemplateContextTest)  Time elapsed: 0.735 s
Running org.eclipse.m2e.editor.xml.WarnIfGroupSameThanParentTest
Tests run: 1, Failures: 0, Errors: 0, Skipped: 0, Time elapsed: 3.034 s - in org.eclipse.m2e.editor.xml.WarnIfGroupSameThanParentTest
testMNGEclipse2552(org.eclipse.m2e.editor.xml.WarnIfGroupSameThanParentTest)  Time elapsed: 3.033 s
Running org.eclipse.m2e.editor.xml.RelativePath1Test
Tests run: 1, Failures: 0, Errors: 0, Skipped: 0, Time elapsed: 1.367 s - in org.eclipse.m2e.editor.xml.RelativePath1Test
testRelativePath(org.eclipse.m2e.editor.xml.RelativePath1Test)  Time elapsed: 1.366 s
Running org.eclipse.m2e.editor.xml.HoverTest
Tests run: 1, Failures: 0, Errors: 0, Skipped: 0, Time elapsed: 1.676 s - in org.eclipse.m2e.editor.xml.HoverTest
testHasHover(org.eclipse.m2e.editor.xml.HoverTest)  Time elapsed: 1.676 s
Running org.eclipse.m2e.editor.xml.HoverDependencyManagedTest
Tests run: 1, Failures: 0, Errors: 0, Skipped: 0, Time elapsed: 1.458 s - in org.eclipse.m2e.editor.xml.HoverDependencyManagedTest
testHasHover(org.eclipse.m2e.editor.xml.HoverDependencyManagedTest)  Time elapsed: 1.458 s

Results:

Tests run: 45, Failures: 0, Errors: 0, Skipped: 1

[INFO] All tests passed!
[INFO] 
[INFO] --- tycho-p2-extras-plugin:2.1.0:compare-version-with-baselines (check-no-version-regression) @ org.eclipse.m2e.editor.xml.tests ---
[INFO] ------------------------------------------------------------------------
[INFO] Reactor Summary:
[INFO] 
[INFO] Maven Integration for Eclipse (parent) 1.16.0-SNAPSHOT SUCCESS [  5.534 s]
[INFO] Maven Project Model Edit Bundle 1.16.1-SNAPSHOT .... SUCCESS [ 14.853 s]
[INFO] Maven Integration for Eclipse Core Plug-in 1.17.2-SNAPSHOT SUCCESS [  9.976 s]
[INFO] Maven Integration for Eclipse UI Plug-in 1.17.2-SNAPSHOT SUCCESS [  5.979 s]
[INFO] Maven Integration for Eclipse Launching 1.17.1-SNAPSHOT SUCCESS [  3.840 s]
[INFO] Maven Integration for Eclipse JDT 1.17.1-SNAPSHOT .. SUCCESS [  3.984 s]
[INFO] Maven Integration for Eclipse JDT UI 1.17.1-SNAPSHOT SUCCESS [  3.413 s]
[INFO] Maven POM Refactoring 1.17.0-SNAPSHOT .............. SUCCESS [  3.802 s]
[INFO] m2e Marketplace 1.17.1-SNAPSHOT .................... SUCCESS [  3.812 s]
[INFO] Maven POM Editor 1.17.1-SNAPSHOT ................... SUCCESS [  4.781 s]
[INFO] Maven POM XML Editor 1.17.1-SNAPSHOT ............... SUCCESS [  3.861 s]
[INFO] org.eclipse.m2e.lifecyclemapping.defaults 1.17.1-SNAPSHOT SUCCESS [  3.800 s]
[INFO] org.eclipse.m2e.scm 1.17.1-SNAPSHOT ................ SUCCESS [  3.210 s]
[INFO] Maven Profile Manager Core 1.17.0-SNAPSHOT ......... SUCCESS [  2.930 s]
[INFO] Maven Profile Manager UI 1.17.1-SNAPSHOT ........... SUCCESS [  3.057 s]
[INFO] Maven Integration for Eclipse Importer framework 1.17.1-SNAPSHOT SUCCESS [  2.672 s]
[INFO] org.eclipse.m2e.sourcelookup 1.17.1-SNAPSHOT ....... SUCCESS [  3.035 s]
[INFO] org.eclipse.m2e.binaryproject 1.17.1-SNAPSHOT ...... SUCCESS [  2.952 s]
[INFO] org.eclipse.m2e.binaryproject.ui 1.17.1-SNAPSHOT ... SUCCESS [  3.297 s]
[INFO] org.eclipse.m2e.sourcelookup.ui 1.17.1-SNAPSHOT .... SUCCESS [  3.567 s]
[INFO] org.eclipse.m2e.editor.lemminx 1.17.0-SNAPSHOT ..... SUCCESS [ 18.145 s]
[INFO] Maven PDE Integration 1.17.2-SNAPSHOT .............. SUCCESS [  6.472 s]
[INFO] Maven PDE UI Integration 1.17.2-SNAPSHOT ........... SUCCESS [  3.393 s]
[INFO] M2E Testing Helpers 1.17.1-SNAPSHOT ................ SUCCESS [  3.970 s]
[INFO] org.eclipse.m2e.logback.appender 1.17.0-SNAPSHOT ... SUCCESS [  3.198 s]
[INFO] org.eclipse.m2e.logback.configuration 1.16.0-SNAPSHOT SUCCESS [  2.969 s]
[INFO] org.eclipse.m2e.sse.ui.feature 1.17.1-SNAPSHOT ..... SUCCESS [  1.428 s]
[INFO] Maven Integration for Eclipse 1.17.2-SNAPSHOT ...... SUCCESS [  1.793 s]
[INFO] org.eclipse.m2e.lemminx.feature 1.17.0-SNAPSHOT .... SUCCESS [  1.657 s]
[INFO] m2e extensions development support (Optional) 1.17.2-SNAPSHOT SUCCESS [  1.465 s]
[INFO] Maven Integration for Eclipse slf4j over logback logging (Optional) 1.17.0-SNAPSHOT SUCCESS [  1.377 s]
[INFO] org.eclipse.m2e.pde.feature 1.17.2-SNAPSHOT ........ SUCCESS [  1.486 s]
[INFO] Maven Integration for Eclipse Update Site 1.16.0-SNAPSHOT SUCCESS [  3.946 s]
[INFO] org.eclipse.m2e.core.tests 1.16.0-SNAPSHOT ......... SUCCESS [ 42.781 s]
[INFO] Tests for Maven Integration for Eclipse Importer framework 1.16.0-SNAPSHOT SUCCESS [ 28.162 s]
[INFO] org.eclipse.m2e.binaryproject.tests 1.16.0-SNAPSHOT  SUCCESS [ 25.832 s]
[INFO] org.eclipse.m2e.editor.lemminx.tests 1.16.0-SNAPSHOT SUCCESS [ 14.220 s]
[INFO] org.eclipse.m2e.jdt.tests 1.16.0-SNAPSHOT .......... SUCCESS [ 24.886 s]
[INFO] org.eclipse.m2e.editor.xml.sse.tests 1.16.0-SNAPSHOT SUCCESS [ 10.181 s]
[INFO] m2e-core-tests 1.16.0-SNAPSHOT ..................... SUCCESS [  0.005 s]
[INFO] Maven Integration for Eclipse tests 1.16.0-SNAPSHOT  SUCCESS [14:56 min]
[INFO] Maven Integration for Eclipse POM Editor tests 1.16.0-SNAPSHOT SUCCESS [ 31.899 s]
[INFO] Maven POM XML Editor Tests 1.16.0-SNAPSHOT ......... SUCCESS [01:33 min]
[INFO] ------------------------------------------------------------------------
[INFO] BUILD SUCCESS
[INFO] ------------------------------------------------------------------------
[INFO] Total time:  23:23 min
[INFO] Finished at: 2021-01-19T15:28:11Z
[INFO] ------------------------------------------------------------------------
[Pipeline] }
Terminating xvnc.

Tue Jan 19 15:28:13 2021
 ComparingUpdateTracker: 0 pixels in / 0 pixels out
 ComparingUpdateTracker: (1:-nan ratio)
[Pipeline] // wrap
Post stage
[Pipeline] archiveArtifacts
Archiving artifacts
[Pipeline] junit
Recording test results
[Pipeline] }
[Pipeline] // withEnv
[Pipeline] }
[Pipeline] // stage
[Pipeline] stage
[Pipeline] { (Deploy Snapshot)
[Pipeline] tool
[Pipeline] envVarsForTool
[Pipeline] tool
[Pipeline] envVarsForTool
[Pipeline] withEnv
[Pipeline] {
[Pipeline] sshagent
[ssh-agent] Using credentials genie.m2e (ssh://genie.m2e@projects-storage.eclipse.org)
[ssh-agent] Looking for ssh-agent implementation...
[ssh-agent]   Exec ssh-agent (binary ssh-agent on a remote machine)
$ ssh-agent
SSH_AUTH_SOCK=/tmp/ssh-1WCP29XEKeGt/agent.5372
SSH_AGENT_PID=5374
Running ssh-add (command line suppressed)
Identity added: /home/jenkins/agent/workspace/m2e_master@tmp/private_key_3511745598564615847.key (/home/jenkins/agent/workspace/m2e_master@tmp/private_key_3511745598564615847.key)
[ssh-agent] Started.
[Pipeline] {
[Pipeline] sh
++ grep '<m2e.version>.*</m2e.version>' pom.xml
++ sed -e 's/.*<m2e.version>\(.*\)<\/m2e.version>.*/\1/'
+ M2E_VERSION=1.17.2
+ DOWNLOAD_AREA=/home/data/httpd/download.eclipse.org/technology/m2e/snapshots/1.17.2/latest
+ echo M2E_VERSION=1.17.2
M2E_VERSION=1.17.2
+ echo DOWNLOAD_AREA=/home/data/httpd/download.eclipse.org/technology/m2e/snapshots/1.17.2/latest
DOWNLOAD_AREA=/home/data/httpd/download.eclipse.org/technology/m2e/snapshots/1.17.2/latest
+ ssh genie.m2e@build.eclipse.org '							rm -rf  /home/data/httpd/download.eclipse.org/technology/m2e/snapshots/1.17.2/latest/* && 							mkdir -p /home/data/httpd/download.eclipse.org/technology/m2e/snapshots/1.17.2/latest'
+ scp -r org.eclipse.m2e.site/target/repository/artifacts.jar org.eclipse.m2e.site/target/repository/artifacts.xml.xz org.eclipse.m2e.site/target/repository/content.jar org.eclipse.m2e.site/target/repository/content.xml.xz org.eclipse.m2e.site/target/repository/features org.eclipse.m2e.site/target/repository/p2.index org.eclipse.m2e.site/target/repository/plugins genie.m2e@build.eclipse.org:/home/data/httpd/download.eclipse.org/technology/m2e/snapshots/1.17.2/latest
[Pipeline] }
$ ssh-agent -k
unset SSH_AUTH_SOCK;
unset SSH_AGENT_PID;
echo Agent pid 5374 killed;
[ssh-agent] Stopped.
[Pipeline] // sshagent
[Pipeline] }
[Pipeline] // withEnv
[Pipeline] }
[Pipeline] // stage
[Pipeline] }
[Pipeline] // withEnv
[Pipeline] }
[Pipeline] // timeout
[Pipeline] }
[Pipeline] // withEnv
[Pipeline] }
[Pipeline] // node
[Pipeline] End of Pipeline

GitHub has been notified of this commit’s build result

Finished: UNSTABLE