FailedConsole Output

Started by an SCM change
Checkout:workspace / /home/hudson/genie.m2e/.hudson/jobs/m2e-wtp-1.3.x/workspace - hudson.remoting.LocalChannel@138f2df5
Using strategy: Default
Last Built Revision: Revision e05aafc4ec7597c2ce32df85de011b25cc3245e9 (origin/master)
Checkout:m2e-wtp-jpa / /home/hudson/genie.m2e/.hudson/jobs/m2e-wtp-1.3.x/workspace/m2e-wtp-jpa - hudson.remoting.LocalChannel@138f2df5
Fetching changes from the remote Git repository
Fetching upstream changes from https://git.eclipse.org/r/m2e-wtp/org.eclipse.m2e.wtp.jpa
Seen branch in repository origin1/1.0.x-e42
Seen branch in repository origin1/1.0.x-e43
Seen branch in repository origin1/1.2.x
Seen branch in repository origin1/graduation
Seen branch in repository origin1/juno
Seen branch in repository origin1/master
Nothing to do
Checkout:m2e-wtp / /home/hudson/genie.m2e/.hudson/jobs/m2e-wtp-1.3.x/workspace/m2e-wtp - hudson.remoting.LocalChannel@138f2df5
Fetching changes from the remote Git repository
Fetching upstream changes from https://git.eclipse.org/r/m2e-wtp/org.eclipse.m2e.wtp
Seen branch in repository origin/1.0.x
Seen branch in repository origin/1.1.x
Seen branch in repository origin/1.2.x
Seen branch in repository origin/graduation
Seen branch in repository origin/master
Commencing build of Revision ae6b8da5e5d1dea26d1600e3880a7f8dc73c0700 (origin/master)
Checking out Revision ae6b8da5e5d1dea26d1600e3880a7f8dc73c0700 (origin/master)
[INFO] Using Maven 3 installation: Maven 3.3.1
[INFO] Checking Maven 3 installation environment
[workspace] $ /shared/common/apache-maven-3.3.1/bin/mvn --help
[INFO] Checking Maven 3 installation version
[INFO] Detected Maven 3 installation version: 3.3.1
[workspace] $ /shared/common/apache-maven-3.3.1/bin/mvn clean install -V -B -Dtycho.disableP2Mirrors=true -Declipse.target=neon -Dmaven.ext.class.path=/home/hudson/genie.m2e/.hudson/maven/slavebundle/resources:/home/hudson/genie.m2e/.hudson/maven/slavebundle/lib/maven3-eventspy-3.1.jar:/home/hudson/genie.m2e/.hudson/war/webapp/WEB-INF/lib/hudson-remoting-3.0.3.jar -Dhudson.eventspy.port=53511 -Dmaven.repo.local=/home/hudson/genie.m2e/.hudson/jobs/m2e-wtp-1.3.x/workspace/.maven/repo -f m2e-wtp/pom.xml -P eclipse-sign -fae
[DEBUG] Waiting for connection on port: 53511
Apache Maven 3.3.1 (cab6659f9874fa96462afef40fcf6bc033d58c1c; 2015-03-13T16:10:27-04:00)
Maven home: /shared/common/apache-maven-3.3.1
Java version: 1.7.0_80, vendor: Oracle Corporation
Java home: /opt/public/common/jdk1.7.0_80/jre
Default locale: en_US, platform encoding: UTF-8
OS name: "linux", version: "3.0.101-0.46-default", arch: "amd64", family: "unix"
SLF4J: Class path contains multiple SLF4J bindings.
SLF4J: Found binding in [jar:file:/home/hudson/genie.m2e/.hudson/maven/slavebundle/lib/maven3-eventspy-runtime.jar!/org/slf4j/impl/StaticLoggerBinder.class]
SLF4J: Found binding in [jar:file:/shared/common/apache-maven-3.3.1/lib/slf4j-simple-1.7.5.jar!/org/slf4j/impl/StaticLoggerBinder.class]
SLF4J: See http://www.slf4j.org/codes.html#multiple_bindings for an explanation.
[DEBUG] Connected to remote
[WARN] o.h.m.e.EventSpyProcessor - Unhandled event: org.apache.maven.toolchain.building.DefaultToolchainsBuildingRequest@1879c4e3 (org.apache.maven.toolchain.building.DefaultToolchainsBuildingRequest)
[WARN] o.h.m.e.EventSpyProcessor - Unhandled event: org.apache.maven.toolchain.building.DefaultToolchainsBuildingRequest@1879c4e3 (org.apache.maven.toolchain.building.DefaultToolchainsBuildingRequest)
[INFO] Scanning for projects...
[WARNING] No explicit target runtime environment configuration. Build is platform dependent.
[WARNING] No explicit target runtime environment configuration. Build is platform dependent.
[WARNING] No explicit target runtime environment configuration. Build is platform dependent.
[WARNING] No explicit target runtime environment configuration. Build is platform dependent.
[WARNING] No explicit target runtime environment configuration. Build is platform dependent.
[WARNING] No explicit target runtime environment configuration. Build is platform dependent.
[WARNING] No explicit target runtime environment configuration. Build is platform dependent.
[WARNING] No explicit target runtime environment configuration. Build is platform dependent.
[WARNING] No explicit target runtime environment configuration. Build is platform dependent.
[WARNING] No explicit target runtime environment configuration. Build is platform dependent.
[INFO] Computing target platform for MavenProject: org.eclipse.m2e.wtp:org.eclipse.m2e.wtp.overlay:1.3.0-SNAPSHOT @ /jobs/genie.m2e/m2e-wtp-1.3.x/workspace/m2e-wtp/org.eclipse.m2e.wtp.overlay/pom.xml
[INFO] Adding repository http://download.eclipse.org/technology/m2e/milestones/1.7
[INFO] Fetching p2.index from http://download.eclipse.org/releases/neon/ (0B of 128B at 0B/s)
[INFO] Adding repository http://download.eclipse.org/releases/neon
[INFO] Fetching p2.index from http://download.eclipse.org/technology/epp/packages/neon/ (0B of 128B at 0B/s)
[INFO] Fetching p2.index from http://download.eclipse.org/technology/epp/packages/neon/M1/ (0B of 142B at 0B/s)
[INFO] Fetching p2.index from http://download.eclipse.org/technology/epp/packages/neon/M2/ (0B of 142B at 0B/s)
[INFO] Fetching p2.index from http://download.eclipse.org/releases/neon/201508211000/ (0B of 142B at 0B/s)
[INFO] Fetching p2.index from http://download.eclipse.org/releases/neon/201510021100/ (0B of 142B at 0B/s)
[INFO] Fetching p2.index from http://download.eclipse.org/tools/orbit/downloads/drops/R20140525021250/repository/ (0B of 142B at 0B/s)
[INFO] Adding repository http://download.eclipse.org/tools/orbit/downloads/drops/R20140525021250/repository
[INFO] Fetching p2.index from http://download.eclipse.org/cbi/updates/license/ (0B of 128B at 0B/s)
[INFO] Adding repository http://download.eclipse.org/cbi/updates/license
[INFO] Adding repository http://download.eclipse.org/m2e-wtp/signed/mavenarchiver/0.17.0
[INFO] Resolving dependencies of MavenProject: org.eclipse.m2e.wtp:org.eclipse.m2e.wtp.overlay:1.3.0-SNAPSHOT @ /jobs/genie.m2e/m2e-wtp-1.3.x/workspace/m2e-wtp/org.eclipse.m2e.wtp.overlay/pom.xml
[INFO] Unpacking org.eclipse.core.jobs_3.8.0.v20150911-1658...
[INFO] Unpacking org.eclipse.jface_3.12.0.v20150914-1638...
[ERROR] The following artifacts could not be downloaded: 
[ERROR]   osgi.bundle,org.eclipse.core.jobs,3.8.0.v20150911-1658
[ERROR]   osgi.bundle,org.eclipse.jface,3.12.0.v20150914-1638
[INFO] o.h.m.e.h.MavenExecutionResultHandler - Build failed with exception(s)
[INFO] o.h.m.e.h.MavenExecutionResultHandler - [1] org.apache.maven.InternalErrorException: Internal error: java.lang.RuntimeException: Some required artifacts could not be downloaded. See log output for details.
[DEBUG] Closing connection to remote
[ERROR] Internal error: java.lang.RuntimeException: Some required artifacts could not be downloaded. See log output for details. -> [Help 1]
org.apache.maven.InternalErrorException: Internal error: java.lang.RuntimeException: Some required artifacts could not be downloaded. See log output for details.
	at org.apache.maven.DefaultMaven.execute(DefaultMaven.java:121)
	at org.apache.maven.cli.MavenCli.execute(MavenCli.java:862)
	at org.apache.maven.cli.MavenCli.doMain(MavenCli.java:286)
	at org.apache.maven.cli.MavenCli.main(MavenCli.java:197)
	at sun.reflect.NativeMethodAccessorImpl.invoke0(Native Method)
	at sun.reflect.NativeMethodAccessorImpl.invoke(NativeMethodAccessorImpl.java:57)
	at sun.reflect.DelegatingMethodAccessorImpl.invoke(DelegatingMethodAccessorImpl.java:43)
	at java.lang.reflect.Method.invoke(Method.java:606)
	at org.codehaus.plexus.classworlds.launcher.Launcher.launchEnhanced(Launcher.java:289)
	at org.codehaus.plexus.classworlds.launcher.Launcher.launch(Launcher.java:229)
	at org.codehaus.plexus.classworlds.launcher.Launcher.mainWithExitCode(Launcher.java:415)
	at org.codehaus.plexus.classworlds.launcher.Launcher.main(Launcher.java:356)
Caused by: java.lang.RuntimeException: Some required artifacts could not be downloaded. See log output for details.
	at org.eclipse.tycho.p2.resolver.P2ResolverImpl.failIfArtifactsMissing(P2ResolverImpl.java:271)
	at org.eclipse.tycho.p2.resolver.P2ResolverImpl.toResolutionResult(P2ResolverImpl.java:225)
	at org.eclipse.tycho.p2.resolver.P2ResolverImpl.resolveDependencies(P2ResolverImpl.java:209)
	at org.eclipse.tycho.p2.resolver.P2ResolverImpl.resolveDependencies(P2ResolverImpl.java:116)
	at org.eclipse.tycho.p2.resolver.P2DependencyResolver.doResolveDependencies(P2DependencyResolver.java:367)
	at org.eclipse.tycho.p2.resolver.P2DependencyResolver.resolveDependencies(P2DependencyResolver.java:335)
	at org.eclipse.tycho.core.resolver.DefaultTychoResolver.resolveProject(DefaultTychoResolver.java:117)
	at org.eclipse.tycho.core.maven.TychoMavenLifecycleParticipant.afterProjectsRead(TychoMavenLifecycleParticipant.java:95)
	at org.apache.maven.DefaultMaven.doExecute(DefaultMaven.java:266)
	at org.apache.maven.DefaultMaven.doExecute(DefaultMaven.java:193)
	at org.apache.maven.DefaultMaven.execute(DefaultMaven.java:106)
	... 11 more
[ERROR] 
[ERROR] To see the full stack trace of the errors, re-run Maven with the -e switch.
[ERROR] Re-run Maven using the -X switch to enable full debug logging.
[ERROR] 
[ERROR] For more information about the errors and possible solutions, please read the following articles:
[ERROR] [Help 1] http://cwiki.apache.org/confluence/display/MAVEN/InternalErrorException
[DEBUG] Waiting for process to finish
[DEBUG] Result: 1
Archiving artifacts
Sending e-mails to: fbricon@gmail.com
Finished: FAILURE