FailedConsole Output

Skipping 2,687 KB.. Full Log
.EMBEDDED);
10:08:02 	^^^^^^^^^^^^
10:08:02 The type MavenRuntime is deprecated
10:08:02 [WARNING] /home/jenkins/agent/workspace/m2e-sonarqube/m2e-core-tests/org.eclipse.m2e.tests/src/org/eclipse/m2e/tests/internal/embedder/MavenEmbeddedRuntimeTest.java:[32] 
10:08:02 	MavenRuntime embeddedRuntime = runtimeManager.getRuntime(MavenRuntimeManager.EMBEDDED);
10:08:02 	                                              ^^^^^^^^^^^^^^^^^^^^^^^^^^^^^^^^^^^^^^^^
10:08:02 The method getRuntime(String) from the type MavenRuntimeManager is deprecated
10:08:02 [WARNING] /home/jenkins/agent/workspace/m2e-sonarqube/m2e-core-tests/org.eclipse.m2e.tests/src/org/eclipse/m2e/tests/internal/embedder/MavenEmbeddedRuntimeTest.java:[32] 
10:08:02 	MavenRuntime embeddedRuntime = runtimeManager.getRuntime(MavenRuntimeManager.EMBEDDED);
10:08:02 	                                                         ^^^^^^^^^^^^^^^^^^^
10:08:02 The type MavenRuntimeManager is deprecated
10:08:02 [WARNING] /home/jenkins/agent/workspace/m2e-sonarqube/m2e-core-tests/org.eclipse.m2e.tests/src/org/eclipse/m2e/tests/internal/embedder/MavenEmbeddedRuntimeTest.java:[32] 
10:08:02 	MavenRuntime embeddedRuntime = runtimeManager.getRuntime(MavenRuntimeManager.EMBEDDED);
10:08:02 	                                                                             ^^^^^^^^
10:08:02 The field MavenRuntimeManager.EMBEDDED is deprecated
10:08:02 [WARNING] /home/jenkins/agent/workspace/m2e-sonarqube/m2e-core-tests/org.eclipse.m2e.tests/src/org/eclipse/m2e/tests/internal/embedder/MavenEmbeddedRuntimeTest.java:[33] 
10:08:02 	String mavenVersion = embeddedRuntime.getVersion();
10:08:02 	                                      ^^^^^^^^^^^^
10:08:02 The method getVersion() from the type MavenRuntime is deprecated
10:08:02 [WARNING] /home/jenkins/agent/workspace/m2e-sonarqube/m2e-core-tests/org.eclipse.m2e.tests/src/org/eclipse/m2e/tests/TestFancyClassifierClasspathProvider.java:[42] 
10:08:02 	public void setRuntimeClasspath(Set<IRuntimeClasspathEntry> runtimeClasspath, IMavenProjectFacade mavenProjectFacade,
10:08:02       IProgressMonitor monitor) {
10:08:02 	            ^^^^^^^^^^^^^^^^^^^^^^^^^^^^^^^^^^^^^^^^^^^^^^^^^^^^^^^^^^^^^^^^^^^^^^^^^^^^^^^^^^^^^^^^^^^^^^^^^^^^^^^^^^^^^^^^^^^^^^^^^^^^^^^^^^^^^^^^^
10:08:02 The method TestFancyClassifierClasspathProvider.setRuntimeClasspath(Set<IRuntimeClasspathEntry>, IMavenProjectFacade, IProgressMonitor) overrides a deprecated method from AbstractClassifierClasspathProvider
10:08:02 [WARNING] /home/jenkins/agent/workspace/m2e-sonarqube/m2e-core-tests/org.eclipse.m2e.tests/src/org/eclipse/m2e/tests/TestFancyClassifierClasspathProvider.java:[47] 
10:08:02 	addFolders(runtimeClasspath, mavenProjectFacade.getProject(), folders);
10:08:02 	^^^^^^^^^^^^^^^^^^^^^^^^^^^^^^^^^^^^^^^^^^^^^^^^^^^^^^^^^^^^^^^^^^^^^^
10:08:02 The method addFolders(Set<IRuntimeClasspathEntry>, IProject, Set<IPath>) from the type AbstractClassifierClasspathProvider is deprecated
10:08:02 [WARNING] /home/jenkins/agent/workspace/m2e-sonarqube/m2e-core-tests/org.eclipse.m2e.tests/src/org/eclipse/m2e/tests/TestFancyClassifierClasspathProvider.java:[52] 
10:08:02 	public void setTestClasspath(Set<IRuntimeClasspathEntry> testClasspath, IMavenProjectFacade mavenProjectFacade,
10:08:02       IProgressMonitor monitor) {
10:08:02 	            ^^^^^^^^^^^^^^^^^^^^^^^^^^^^^^^^^^^^^^^^^^^^^^^^^^^^^^^^^^^^^^^^^^^^^^^^^^^^^^^^^^^^^^^^^^^^^^^^^^^^^^^^^^^^^^^^^^^^^^^^^^^^^^^^^^^
10:08:02 The method TestFancyClassifierClasspathProvider.setTestClasspath(Set<IRuntimeClasspathEntry>, IMavenProjectFacade, IProgressMonitor) overrides a deprecated method from AbstractClassifierClasspathProvider
10:08:02 [WARNING] /home/jenkins/agent/workspace/m2e-sonarqube/m2e-core-tests/org.eclipse.m2e.tests/src/org/eclipse/m2e/tests/TestFancyClassifierClasspathProvider.java:[57] 
10:08:02 	addFolders(testClasspath, mavenProjectFacade.getProject(), folders);
10:08:02 	^^^^^^^^^^^^^^^^^^^^^^^^^^^^^^^^^^^^^^^^^^^^^^^^^^^^^^^^^^^^^^^^^^^
10:08:02 The method addFolders(Set<IRuntimeClasspathEntry>, IProject, Set<IPath>) from the type AbstractClassifierClasspathProvider is deprecated
10:08:02 [WARNING] /home/jenkins/agent/workspace/m2e-sonarqube/m2e-core-tests/org.eclipse.m2e.tests/src/org/eclipse/m2e/tests/discovery/TestM2EBundleStrategy.java:[9] 
10:08:02 	import org.eclipse.core.runtime.SubProgressMonitor;
10:08:02 	       ^^^^^^^^^^^^^^^^^^^^^^^^^^^^^^^^^^^^^^^^^^^
10:08:02 The type SubProgressMonitor is deprecated
10:08:02 31. INFO in /home/jenkins/agent/workspace/m2e-sonarqube/m2e-core-tests/org.eclipse.m2e.tests/src/org/eclipse/m2e/tests/discovery/TestM2EBundleStrategy.java (at line 18)
10:08:02 	@SuppressWarnings("restriction")
10:08:02 	                  ^^^^^^^^^^^^^
10:08:02 At least one of the problems in category 'restriction' is not analysed due to a compiler option being ignored
10:08:02 [WARNING] /home/jenkins/agent/workspace/m2e-sonarqube/m2e-core-tests/org.eclipse.m2e.tests/src/org/eclipse/m2e/tests/discovery/TestM2EBundleStrategy.java:[32] 
10:08:02 	processExtensions(new SubProgressMonitor(monitor, extensions.length), extensions);
10:08:02 	                      ^^^^^^^^^^^^^^^^^^
10:08:02 The type SubProgressMonitor is deprecated
10:08:02 [WARNING] /home/jenkins/agent/workspace/m2e-sonarqube/m2e-core-tests/org.eclipse.m2e.tests/src/org/eclipse/m2e/tests/discovery/TestM2EBundleStrategy.java:[32] 
10:08:02 	processExtensions(new SubProgressMonitor(monitor, extensions.length), extensions);
10:08:02 	                      ^^^^^^^^^^^^^^^^^^^^^^^^^^^^^^^^^^^^^^^^^^^^^^
10:08:02 The constructor SubProgressMonitor(IProgressMonitor, int) is deprecated
10:08:02 34. INFO in /home/jenkins/agent/workspace/m2e-sonarqube/m2e-core-tests/org.eclipse.m2e.tests/src/org/eclipse/m2e/tests/ui/editing/AbstractOperationTest.java (at line 27)
10:08:02 	@SuppressWarnings("restriction")
10:08:02 	                  ^^^^^^^^^^^^^
10:08:02 At least one of the problems in category 'restriction' is not analysed due to a compiler option being ignored
10:08:02 [WARNING] /home/jenkins/agent/workspace/m2e-sonarqube/m2e-core-tests/org.eclipse.m2e.tests/src/org/eclipse/m2e/tests/jdt/internal/MavenClasspathContainerSaveHelperTest.java:[64] 
10:08:02 	ByteArrayOutputStream os = new ByteArrayOutputStream();
10:08:02 	                      ^^
10:08:02 Resource 'os' should be managed by try-with-resource
10:08:02 36. INFO in /home/jenkins/agent/workspace/m2e-sonarqube/m2e-core-tests/org.eclipse.m2e.tests/src/org/eclipse/m2e/tests/ui/editing/AddExclusionOperationTest.java (at line 34)
10:08:02 	@SuppressWarnings("restriction")
10:08:02 	                  ^^^^^^^^^^^^^
10:08:02 At least one of the problems in category 'restriction' is not analysed due to a compiler option being ignored
10:08:02 [WARNING] /home/jenkins/agent/workspace/m2e-sonarqube/m2e-core-tests/org.eclipse.m2e.tests/src/org/eclipse/m2e/tests/discovery/MavenDiscoveryTest.java:[239] 
10:08:02 	return new File(emptydir, resourceName).toURL();
10:08:02 	                                        ^^^^^^^
10:08:02 The method toURL() from the type File is deprecated
10:08:02 [WARNING] /home/jenkins/agent/workspace/m2e-sonarqube/m2e-core-tests/org.eclipse.m2e.tests/src/org/eclipse/m2e/tests/discovery/MavenDiscoveryTest.java:[264] 
10:08:02 	return pluginxml.toURL();
10:08:02 	                 ^^^^^^^
10:08:02 The method toURL() from the type File is deprecated
10:08:02 [WARNING] /home/jenkins/agent/workspace/m2e-sonarqube/m2e-core-tests/org.eclipse.m2e.tests/src/org/eclipse/m2e/tests/ProjectRegistryManagerTest.java:[417] 
10:08:02 	manager.refresh(request, monitor);
10:08:02 	        ^^^^^^^^^^^^^^^^^^^^^^^^^
10:08:02 The method refresh(MavenUpdateRequest, IProgressMonitor) from the type ProjectRegistryManager is deprecated
10:08:02 [WARNING] /home/jenkins/agent/workspace/m2e-sonarqube/m2e-core-tests/org.eclipse.m2e.tests/src/org/eclipse/m2e/tests/ProjectRegistryManagerTest.java:[423] 
10:08:02 	manager.refresh(request, monitor);
10:08:02 	        ^^^^^^^^^^^^^^^^^^^^^^^^^
10:08:02 The method refresh(MavenUpdateRequest, IProgressMonitor) from the type ProjectRegistryManager is deprecated
10:08:02 [WARNING] /home/jenkins/agent/workspace/m2e-sonarqube/m2e-core-tests/org.eclipse.m2e.tests/src/org/eclipse/m2e/tests/ProjectRegistryManagerTest.java:[544] 
10:08:02 	manager.refresh(new MavenUpdateRequest(p2, false, false), monitor);
10:08:02 	        ^^^^^^^^^^^^^^^^^^^^^^^^^^^^^^^^^^^^^^^^^^^^^^^^^^^^^^^^^^
10:08:02 The method refresh(MavenUpdateRequest, IProgressMonitor) from the type ProjectRegistryManager is deprecated
10:08:02 [WARNING] /home/jenkins/agent/workspace/m2e-sonarqube/m2e-core-tests/org.eclipse.m2e.tests/src/org/eclipse/m2e/tests/ProjectRegistryManagerTest.java:[758] 
10:08:02 	manager.refresh(updateRequest, monitor);
10:08:02 	        ^^^^^^^^^^^^^^^^^^^^^^^^^^^^^^^
10:08:02 The method refresh(MavenUpdateRequest, IProgressMonitor) from the type ProjectRegistryManager is deprecated
10:08:02 [WARNING] /home/jenkins/agent/workspace/m2e-sonarqube/m2e-core-tests/org.eclipse.m2e.tests/src/org/eclipse/m2e/tests/ProjectRegistryManagerTest.java:[769] 
10:08:02 	manager.refresh(updateRequest, monitor);
10:08:02 	        ^^^^^^^^^^^^^^^^^^^^^^^^^^^^^^^
10:08:02 The method refresh(MavenUpdateRequest, IProgressMonitor) from the type ProjectRegistryManager is deprecated
10:08:02 [WARNING] /home/jenkins/agent/workspace/m2e-sonarqube/m2e-core-tests/org.eclipse.m2e.tests/src/org/eclipse/m2e/tests/ProjectRegistryManagerTest.java:[1062] 
10:08:02 	manager.refresh(new MavenUpdateRequest(p1, false, false), monitor);
10:08:02 	        ^^^^^^^^^^^^^^^^^^^^^^^^^^^^^^^^^^^^^^^^^^^^^^^^^^^^^^^^^^
10:08:02 The method refresh(MavenUpdateRequest, IProgressMonitor) from the type ProjectRegistryManager is deprecated
10:08:02 [WARNING] /home/jenkins/agent/workspace/m2e-sonarqube/m2e-core-tests/org.eclipse.m2e.tests/src/org/eclipse/m2e/tests/ProjectRegistryManagerTest.java:[1072] 
10:08:02 	manager.refresh(new MavenUpdateRequest(p1, false, false), monitor);
10:08:02 	        ^^^^^^^^^^^^^^^^^^^^^^^^^^^^^^^^^^^^^^^^^^^^^^^^^^^^^^^^^^
10:08:02 The method refresh(MavenUpdateRequest, IProgressMonitor) from the type ProjectRegistryManager is deprecated
10:08:02 [WARNING] /home/jenkins/agent/workspace/m2e-sonarqube/m2e-core-tests/org.eclipse.m2e.tests/src/org/eclipse/m2e/tests/ProjectRegistryManagerTest.java:[1111] 
10:08:02 	manager.refresh(new MavenUpdateRequest(projects[0], false, true), monitor);
10:08:02 	        ^^^^^^^^^^^^^^^^^^^^^^^^^^^^^^^^^^^^^^^^^^^^^^^^^^^^^^^^^^^^^^^^^^
10:08:02 The method refresh(MavenUpdateRequest, IProgressMonitor) from the type ProjectRegistryManager is deprecated
10:08:02 [WARNING] /home/jenkins/agent/workspace/m2e-sonarqube/m2e-core-tests/org.eclipse.m2e.tests/src/org/eclipse/m2e/tests/ProjectRegistryManagerTest.java:[1140] 
10:08:02 	manager.refresh(new MavenUpdateRequest(p, false, true), monitor);
10:08:02 	        ^^^^^^^^^^^^^^^^^^^^^^^^^^^^^^^^^^^^^^^^^^^^^^^^^^^^^^^^
10:08:02 The method refresh(MavenUpdateRequest, IProgressMonitor) from the type ProjectRegistryManager is deprecated
10:08:02 [WARNING] /home/jenkins/agent/workspace/m2e-sonarqube/m2e-core-tests/org.eclipse.m2e.tests/src/org/eclipse/m2e/tests/ProjectRegistryManagerTest.java:[1190] 
10:08:02 	manager.refresh(request, monitor);
10:08:02 	        ^^^^^^^^^^^^^^^^^^^^^^^^^
10:08:02 The method refresh(MavenUpdateRequest, IProgressMonitor) from the type ProjectRegistryManager is deprecated
10:08:02 [WARNING] /home/jenkins/agent/workspace/m2e-sonarqube/m2e-core-tests/org.eclipse.m2e.tests/src/org/eclipse/m2e/tests/ProjectRegistryManagerTest.java:[1216] 
10:08:02 	manager.refresh(request, monitor);
10:08:02 	        ^^^^^^^^^^^^^^^^^^^^^^^^^
10:08:02 The method refresh(MavenUpdateRequest, IProgressMonitor) from the type ProjectRegistryManager is deprecated
10:08:02 [WARNING] /home/jenkins/agent/workspace/m2e-sonarqube/m2e-core-tests/org.eclipse.m2e.tests/src/org/eclipse/m2e/tests/ProjectRegistryManagerTest.java:[1242] 
10:08:02 	manager.refresh(request, monitor);
10:08:02 	        ^^^^^^^^^^^^^^^^^^^^^^^^^
10:08:02 The method refresh(MavenUpdateRequest, IProgressMonitor) from the type ProjectRegistryManager is deprecated
10:08:02 [WARNING] /home/jenkins/agent/workspace/m2e-sonarqube/m2e-core-tests/org.eclipse.m2e.tests/src/org/eclipse/m2e/tests/ProjectRegistryManagerTest.java:[1287] 
10:08:02 	manager.refresh(request, monitor);
10:08:02 	        ^^^^^^^^^^^^^^^^^^^^^^^^^
10:08:02 The method refresh(MavenUpdateRequest, IProgressMonitor) from the type ProjectRegistryManager is deprecated
10:08:02 [WARNING] /home/jenkins/agent/workspace/m2e-sonarqube/m2e-core-tests/org.eclipse.m2e.tests/src/org/eclipse/m2e/tests/ProjectRegistryManagerTest.java:[1411] 
10:08:02 	manager.refresh(request, monitor);
10:08:02 	        ^^^^^^^^^^^^^^^^^^^^^^^^^
10:08:02 The method refresh(MavenUpdateRequest, IProgressMonitor) from the type ProjectRegistryManager is deprecated
10:08:02 [WARNING] /home/jenkins/agent/workspace/m2e-sonarqube/m2e-core-tests/org.eclipse.m2e.tests/src/org/eclipse/m2e/tests/ProjectRegistryManagerTest.java:[1433] 
10:08:02 	manager.refresh(request, monitor);
10:08:02 	        ^^^^^^^^^^^^^^^^^^^^^^^^^
10:08:02 The method refresh(MavenUpdateRequest, IProgressMonitor) from the type ProjectRegistryManager is deprecated
10:08:02 [WARNING] /home/jenkins/agent/workspace/m2e-sonarqube/m2e-core-tests/org.eclipse.m2e.tests/src/org/eclipse/m2e/tests/ProjectRegistryManagerTest.java:[1461] 
10:08:02 	manager.refresh(request, monitor);
10:08:02 	        ^^^^^^^^^^^^^^^^^^^^^^^^^
10:08:02 The method refresh(MavenUpdateRequest, IProgressMonitor) from the type ProjectRegistryManager is deprecated
10:08:02 [WARNING] /home/jenkins/agent/workspace/m2e-sonarqube/m2e-core-tests/org.eclipse.m2e.tests/src/org/eclipse/m2e/tests/ProjectRegistryManagerTest.java:[1478] 
10:08:02 	manager.refresh(request, monitor); // shouldn't throw any exceptions
10:08:02 	        ^^^^^^^^^^^^^^^^^^^^^^^^^
10:08:02 The method refresh(MavenUpdateRequest, IProgressMonitor) from the type ProjectRegistryManager is deprecated
10:08:02 [WARNING] /home/jenkins/agent/workspace/m2e-sonarqube/m2e-core-tests/org.eclipse.m2e.tests/src/org/eclipse/m2e/tests/ProjectRegistryManagerTest.java:[1504] 
10:08:02 	manager.refresh(request, monitor); // shouldn't throw any exceptions
10:08:02 	        ^^^^^^^^^^^^^^^^^^^^^^^^^
10:08:02 The method refresh(MavenUpdateRequest, IProgressMonitor) from the type ProjectRegistryManager is deprecated
10:08:02 [WARNING] /home/jenkins/agent/workspace/m2e-sonarqube/m2e-core-tests/org.eclipse.m2e.tests/src/org/eclipse/m2e/tests/ProjectRegistryManagerTest.java:[1519] 
10:08:02 	manager.refresh(request, monitor);
10:08:02 	        ^^^^^^^^^^^^^^^^^^^^^^^^^
10:08:02 The method refresh(MavenUpdateRequest, IProgressMonitor) from the type ProjectRegistryManager is deprecated
10:08:02 58. INFO in /home/jenkins/agent/workspace/m2e-sonarqube/m2e-core-tests/org.eclipse.m2e.tests/src/org/eclipse/m2e/tests/internal/conversion/ProjectConversionParticipantSorterTest.java (at line 43)
10:08:02 	@SuppressWarnings("restriction")
10:08:02 	                  ^^^^^^^^^^^^^
10:08:02 At least one of the problems in category 'restriction' is not analysed due to a compiler option being ignored
10:08:02 59. INFO in /home/jenkins/agent/workspace/m2e-sonarqube/m2e-core-tests/org.eclipse.m2e.tests/src/org/eclipse/m2e/tests/ui/editing/PomHelperTest.java (at line 37)
10:08:02 	@SuppressWarnings("restriction")
10:08:02 	                  ^^^^^^^^^^^^^
10:08:02 At least one of the problems in category 'restriction' is not analysed due to a compiler option being ignored
10:08:02 60. INFO in /home/jenkins/agent/workspace/m2e-sonarqube/m2e-core-tests/org.eclipse.m2e.tests/src/org/eclipse/m2e/tests/ui/editing/PomEditsTest.java (at line 46)
10:08:02 	@SuppressWarnings("restriction")
10:08:02 	                  ^^^^^^^^^^^^^
10:08:02 At least one of the problems in category 'restriction' is not analysed due to a compiler option being ignored
10:08:02 61. INFO in /home/jenkins/agent/workspace/m2e-sonarqube/m2e-core-tests/org.eclipse.m2e.tests/src/org/eclipse/m2e/tests/MutableProjectRegistryTest.java (at line 54)
10:08:02 	@SuppressWarnings("restriction")
10:08:02 	                  ^^^^^^^^^^^^^
10:08:02 At least one of the problems in category 'restriction' is not analysed due to a compiler option being ignored
10:08:02 62. INFO in /home/jenkins/agent/workspace/m2e-sonarqube/m2e-core-tests/org.eclipse.m2e.tests/src/org/eclipse/m2e/tests/profiles/MavenProfileManagerTest.java (at line 40)
10:08:02 	@SuppressWarnings("restriction")
10:08:02 	                  ^^^^^^^^^^^^^
10:08:02 At least one of the problems in category 'restriction' is not analysed due to a compiler option being ignored
10:08:02 63. INFO in /home/jenkins/agent/workspace/m2e-sonarqube/m2e-core-tests/org.eclipse.m2e.tests/src/org/eclipse/m2e/tests/embedder/MavenImplTest.java (at line 64)
10:08:02 	@SuppressWarnings("restriction")
10:08:02 	                  ^^^^^^^^^^^^^
10:08:02 At least one of the problems in category 'restriction' is not analysed due to a compiler option being ignored
10:08:02 [WARNING] /home/jenkins/agent/workspace/m2e-sonarqube/m2e-core-tests/org.eclipse.m2e.tests/src/org/eclipse/m2e/tests/ProjectRegistryRefreshJobTest.java:[247] 
10:08:02 	event = new ResourceChangeEvent(project, IResourceChangeEvent.PRE_CLOSE, IncrementalProjectBuilder.FULL_BUILD,
10:08:02         delta) {
10:08:02 	            ^^^^^^^^^^^^^^^^^^^^^^^^^^^^^^^^^^^^^^^^^^^^^^^^^^^^^^^^^^^^^^^^^^^^^^^^^^^^^^^^^^^^^^^^^^^^^^^^^^^^^^^^^^^^^^^^^
10:08:02 The serializable class  does not declare a static final serialVersionUID field of type long
10:08:02 [WARNING] /home/jenkins/agent/workspace/m2e-sonarqube/m2e-core-tests/org.eclipse.m2e.tests/src/org/eclipse/m2e/tests/ProjectRegistryRefreshJobTest.java:[251] 
10:08:02 	return project;
10:08:02 	       ^^^^^^^
10:08:02 Read access to enclosing field ProjectRegistryRefreshJobTest.project is emulated by a synthetic accessor method
10:08:02 [WARNING] /home/jenkins/agent/workspace/m2e-sonarqube/m2e-core-tests/org.eclipse.m2e.tests/src/org/eclipse/m2e/tests/project/MavenProjectFacadeTest.java:[180] 
10:08:02 	MavenPluginActivator.getDefault().getMavenProjectManagerImpl().refresh(updateRequest, monitor);
10:08:02 	                                                               ^^^^^^^^^^^^^^^^^^^^^^^^^^^^^^^
10:08:02 The method refresh(MavenUpdateRequest, IProgressMonitor) from the type ProjectRegistryManager is deprecated
10:08:02 67. INFO in /home/jenkins/agent/workspace/m2e-sonarqube/m2e-core-tests/org.eclipse.m2e.tests/src/org/eclipse/m2e/tests/builder/EclipseBuildContextTest.java (at line 34)
10:08:02 	@SuppressWarnings("restriction")
10:08:02 	                  ^^^^^^^^^^^^^
10:08:02 At least one of the problems in category 'restriction' is not analysed due to a compiler option being ignored
10:08:02 [WARNING] /home/jenkins/agent/workspace/m2e-sonarqube/m2e-core-tests/org.eclipse.m2e.tests/src/org/eclipse/m2e/tests/mocks/MockLaunchConfiguration.java:[90] 
10:08:02 	List<String> attr = (List<String>) attributes.get(attributeName);
10:08:02 	                    ^^^^^^^^^^^^^^^^^^^^^^^^^^^^^^^^^^^^^^^^^^^^
10:08:02 Type safety: Unchecked cast from capture#6-of ? to List<String>
10:08:02 [WARNING] /home/jenkins/agent/workspace/m2e-sonarqube/m2e-core-tests/org.eclipse.m2e.tests/src/org/eclipse/m2e/tests/mocks/MockLaunchConfiguration.java:[96] 
10:08:02 	Set<String> attr = (Set<String>) attributes.get(attributeName);
10:08:02 	                   ^^^^^^^^^^^^^^^^^^^^^^^^^^^^^^^^^^^^^^^^^^^
10:08:02 Type safety: Unchecked cast from capture#7-of ? to Set<String>
10:08:02 [WARNING] /home/jenkins/agent/workspace/m2e-sonarqube/m2e-core-tests/org.eclipse.m2e.tests/src/org/eclipse/m2e/tests/mocks/MockLaunchConfiguration.java:[102] 
10:08:02 	Map<String, String> attr = (Map<String, String>) attributes.get(attributeName);
10:08:02 	                           ^^^^^^^^^^^^^^^^^^^^^^^^^^^^^^^^^^^^^^^^^^^^^^^^^^^
10:08:02 Type safety: Unchecked cast from capture#8-of ? to Map<String,String>
10:08:02 [WARNING] /home/jenkins/agent/workspace/m2e-sonarqube/m2e-core-tests/org.eclipse.m2e.tests/src/org/eclipse/m2e/tests/mocks/MockLaunchConfiguration.java:[114] 
10:08:02 	return (Map<String, Object>) attributes;
10:08:02 	       ^^^^^^^^^^^^^^^^^^^^^^^^^^^^^^^^
10:08:02 Type safety: Unchecked cast from Map<String,capture#10-of ?> to Map<String,Object>
10:08:02 [WARNING] /home/jenkins/agent/workspace/m2e-sonarqube/m2e-core-tests/org.eclipse.m2e.tests/src/org/eclipse/m2e/tests/mocks/MockLaunchConfiguration.java:[129] 
10:08:02 	public IPath getLocation() {
10:08:02 	             ^^^^^^^^^^^^^
10:08:02 The method MockLaunchConfiguration.getLocation() overrides a deprecated method from ILaunchConfiguration
10:08:02 [WARNING] /home/jenkins/agent/workspace/m2e-sonarqube/m2e-core-tests/org.eclipse.m2e.tests/src/org/eclipse/m2e/tests/internal/lifecyclemapping/ConfigElementMock.java:[42] 
10:08:02 	public String getAttributeAsIs(String name) {
10:08:02 	              ^^^^^^^^^^^^^^^^^^^^^^^^^^^^^
10:08:02 The method ConfigElementMock.getAttributeAsIs(String) overrides a deprecated method from IConfigurationElement
10:08:02 [WARNING] /home/jenkins/agent/workspace/m2e-sonarqube/m2e-core-tests/org.eclipse.m2e.tests/src/org/eclipse/m2e/tests/internal/lifecyclemapping/ConfigElementMock.java:[88] 
10:08:02 	public String getValueAsIs() {
10:08:02 	              ^^^^^^^^^^^^^^
10:08:02 The method ConfigElementMock.getValueAsIs() overrides a deprecated method from IConfigurationElement
10:08:02 [WARNING] /home/jenkins/agent/workspace/m2e-sonarqube/m2e-core-tests/org.eclipse.m2e.tests/src/org/eclipse/m2e/tests/internal/lifecyclemapping/ConfigElementMock.java:[94] 
10:08:02 	public String getNamespace() {
10:08:02 	              ^^^^^^^^^^^^^^
10:08:02 The method ConfigElementMock.getNamespace() overrides a deprecated method from IConfigurationElement
10:08:02 76. INFO in /home/jenkins/agent/workspace/m2e-sonarqube/m2e-core-tests/org.eclipse.m2e.tests/src/org/eclipse/m2e/tests/builder/EclipseIncrementalBuildContextTest.java (at line 34)
10:08:02 	@SuppressWarnings("restriction")
10:08:02 	                  ^^^^^^^^^^^^^
10:08:02 At least one of the problems in category 'restriction' is not analysed due to a compiler option being ignored
10:08:02 [WARNING] /home/jenkins/agent/workspace/m2e-sonarqube/m2e-core-tests/org.eclipse.m2e.tests/src/org/eclipse/m2e/tests/MavenProjectMutableStateTest.java:[103] 
10:08:02 	assertMutableState(project);
10:08:02 	^^^^^^^^^^^^^^^^^^^^^^^^^^^
10:08:02 Access to enclosing method assertMutableState(IProject) from the type MavenProjectMutableStateTest is emulated by a synthetic accessor method
10:08:02 78. INFO in /home/jenkins/agent/workspace/m2e-sonarqube/m2e-core-tests/org.eclipse.m2e.tests/src/org/eclipse/m2e/tests/ui/editing/RemoveDependencyOperationTest.java (at line 32)
10:08:02 	@SuppressWarnings("restriction")
10:08:02 	                  ^^^^^^^^^^^^^
10:08:02 At least one of the problems in category 'restriction' is not analysed due to a compiler option being ignored
10:08:02 78 problems (0 errors, 57 warnings, 57 info)
10:08:02 [INFO] 
10:08:02 [INFO] --- maven-resources-plugin:2.5:testResources (default-testResources) @ org.eclipse.m2e.tests ---
10:08:02 [debug] execute contextualize
10:08:02 [INFO] Using 'UTF-8' encoding to copy filtered resources.
10:08:02 [INFO] skip non existing resourceDirectory /home/jenkins/agent/workspace/m2e-sonarqube/m2e-core-tests/org.eclipse.m2e.tests/src/test/resources
10:08:02 [INFO] 
10:08:02 [INFO] --- tycho-source-plugin:1.6.0:plugin-source (plugin-source) @ org.eclipse.m2e.tests ---
10:08:02 [INFO] Building jar: /home/jenkins/agent/workspace/m2e-sonarqube/m2e-core-tests/org.eclipse.m2e.tests/target/org.eclipse.m2e.tests-1.16.0-SNAPSHOT-sources.jar
10:08:02 [INFO] 
10:08:02 [INFO] --- target-platform-configuration:1.6.0:target-platform (default-target-platform) @ org.eclipse.m2e.tests ---
10:08:02 [INFO] 
10:08:02 [INFO] --- tycho-packaging-plugin:1.6.0:package-plugin (default-package-plugin) @ org.eclipse.m2e.tests ---
10:08:02 [INFO] Building jar: /home/jenkins/agent/workspace/m2e-sonarqube/m2e-core-tests/org.eclipse.m2e.tests/target/org.eclipse.m2e.tests-1.16.0-SNAPSHOT.jar
10:08:02 [INFO] 
10:08:02 [INFO] --- tycho-p2-plugin:1.6.0:p2-metadata-default (default-p2-metadata-default) @ org.eclipse.m2e.tests ---
10:08:02 [INFO] No baseline version MavenProject: org.eclipse.m2e:org.eclipse.m2e.tests:1.16.0-SNAPSHOT @ /home/jenkins/agent/workspace/m2e-sonarqube/m2e-core-tests/org.eclipse.m2e.tests/pom.xml
10:08:02 [INFO] 
10:08:02 [INFO] --- tycho-surefire-plugin:1.6.0:test (default-test) @ org.eclipse.m2e.tests ---
10:08:03 [INFO] Expected eclipse log file: /home/jenkins/agent/workspace/m2e-sonarqube/m2e-core-tests/org.eclipse.m2e.tests/target/work/data/.metadata/.log
10:08:03 [INFO] Command line:
10:08:03 	[/opt/tools/java/oracle/jdk-8/1.8.0_202/jre/bin/java, -Dosgi.noShutdown=false, -Dosgi.os=linux, -Dosgi.ws=gtk, -Dosgi.arch=x86_64, -javaagent:/home/jenkins/agent/workspace/m2e-sonarqube/.repository/org/jacoco/org.jacoco.agent/0.8.5/org.jacoco.agent-0.8.5-runtime.jar=destfile=/home/jenkins/agent/workspace/m2e-sonarqube/jacoco.exec,append=true,includes=org.eclipse.m2e*:org.apache.maven*:org.eclipse.aether*, -Xmx800m, -Dosgi.clean=true, -jar, /home/jenkins/agent/workspace/m2e-sonarqube/.repository/p2/osgi/bundle/org.eclipse.equinox.launcher/1.5.700.v20200207-2156/org.eclipse.equinox.launcher-1.5.700.v20200207-2156.jar, -data, /home/jenkins/agent/workspace/m2e-sonarqube/m2e-core-tests/org.eclipse.m2e.tests/target/work/data, -install, /home/jenkins/agent/workspace/m2e-sonarqube/m2e-core-tests/org.eclipse.m2e.tests/target/work, -configuration, /home/jenkins/agent/workspace/m2e-sonarqube/m2e-core-tests/org.eclipse.m2e.tests/target/work/configuration, -application, org.eclipse.tycho.surefire.osgibooter.uitest, -testproperties, /home/jenkins/agent/workspace/m2e-sonarqube/m2e-core-tests/org.eclipse.m2e.tests/target/surefire.properties, -pluginCustomization, /home/jenkins/agent/workspace/m2e-sonarqube/m2e-core-tests/org.eclipse.m2e.tests/plugin_customization.ini, -timeout, 7200000]
10:08:03 Picked up JAVA_TOOL_OPTIONS: -XX:+IgnoreUnrecognizedVMOptions -XX:+UseContainerSupport -XX:+UnlockExperimentalVMOptions -XX:+UseCGroupMemoryLimitForHeap
10:08:03 Picked up _JAVA_OPTIONS: -XX:MaxRAMPercentage=64.0
10:08:18 SLF4J: Failed to load class "org.slf4j.impl.StaticLoggerBinder".
10:08:18 SLF4J: Defaulting to no-operation (NOP) logger implementation
10:08:18 SLF4J: See http://www.slf4j.org/codes.html#StaticLoggerBinder for further details.
10:08:22 Running org.eclipse.m2e.tests.discovery.ConfigurationUpdateStartupTest
10:09:36 Tests run: 6, Failures: 0, Errors: 0, Skipped: 0, Time elapsed: 74.387 s - in org.eclipse.m2e.tests.discovery.ConfigurationUpdateStartupTest
10:09:36 testNoMavenProjects(org.eclipse.m2e.tests.discovery.ConfigurationUpdateStartupTest)  Time elapsed: 16.656 s
10:09:36 testToggleEarlyStartup(org.eclipse.m2e.tests.discovery.ConfigurationUpdateStartupTest)  Time elapsed: 4.839 s
10:09:36 testMavenProjectsErrors(org.eclipse.m2e.tests.discovery.ConfigurationUpdateStartupTest)  Time elapsed: 46.635 s
10:09:36 testConfigureSpecifiedProjects(org.eclipse.m2e.tests.discovery.ConfigurationUpdateStartupTest)  Time elapsed: 2.103 s
10:09:36 testMavenProjectsNoErrors(org.eclipse.m2e.tests.discovery.ConfigurationUpdateStartupTest)  Time elapsed: 2.161 s
10:09:36 testEmptyWorkspace(org.eclipse.m2e.tests.discovery.ConfigurationUpdateStartupTest)  Time elapsed: 1.792 s
10:09:36 Running org.eclipse.m2e.tests.discovery.MavenDiscoveryInstallOperationTest
10:09:37 Tests run: 5, Failures: 0, Errors: 0, Skipped: 0, Time elapsed: 1.002 s - in org.eclipse.m2e.tests.discovery.MavenDiscoveryInstallOperationTest
10:09:37 testMissingRepository(org.eclipse.m2e.tests.discovery.MavenDiscoveryInstallOperationTest)  Time elapsed: 0.431 s
10:09:37 testMatchNoVersion(org.eclipse.m2e.tests.discovery.MavenDiscoveryInstallOperationTest)  Time elapsed: 0.229 s
10:09:37 testMatchHighestVersion(org.eclipse.m2e.tests.discovery.MavenDiscoveryInstallOperationTest)  Time elapsed: 0.074 s
10:09:37 testMissingIU(org.eclipse.m2e.tests.discovery.MavenDiscoveryInstallOperationTest)  Time elapsed: 0.074 s
10:09:37 testMatchLowestVersion(org.eclipse.m2e.tests.discovery.MavenDiscoveryInstallOperationTest)  Time elapsed: 0.075 s
10:09:37 Running org.eclipse.m2e.tests.discovery.MavenDiscoveryMarkerResolutionGeneratorTest
10:10:06 Tests run: 4, Failures: 0, Errors: 0, Skipped: 0, Time elapsed: 28.181 s - in org.eclipse.m2e.tests.discovery.MavenDiscoveryMarkerResolutionGeneratorTest
10:10:06 testCanResolveMojoExecutionMarker(org.eclipse.m2e.tests.discovery.MavenDiscoveryMarkerResolutionGeneratorTest)  Time elapsed: 3.824 s
10:10:06 testCanResolveConfiguratorMarker(org.eclipse.m2e.tests.discovery.MavenDiscoveryMarkerResolutionGeneratorTest)  Time elapsed: 1.89 s
10:10:06 testResolveMultipleMarkers(org.eclipse.m2e.tests.discovery.MavenDiscoveryMarkerResolutionGeneratorTest)  Time elapsed: 5.29 s
10:10:06 testCanResolveLifecycleIdMarker(org.eclipse.m2e.tests.discovery.MavenDiscoveryMarkerResolutionGeneratorTest)  Time elapsed: 17.176 s
10:10:06 Running org.eclipse.m2e.tests.discovery.LifecycleMappingDiscoveryTest
10:11:31 Tests run: 11, Failures: 0, Errors: 0, Skipped: 0, Time elapsed: 85.716 s - in org.eclipse.m2e.tests.discovery.LifecycleMappingDiscoveryTest
10:11:31 testAutomaticSelectionOfSingleProposal(org.eclipse.m2e.tests.discovery.LifecycleMappingDiscoveryTest)  Time elapsed: 5.716 s
10:11:31 testPreselectedProposals(org.eclipse.m2e.tests.discovery.LifecycleMappingDiscoveryTest)  Time elapsed: 17.342 s
10:11:31 testIsMappingComplete(org.eclipse.m2e.tests.discovery.LifecycleMappingDiscoveryTest)  Time elapsed: 13.194 s
10:11:31 testProposalToReplaceDefaultMapping(org.eclipse.m2e.tests.discovery.LifecycleMappingDiscoveryTest)  Time elapsed: 4.78 s
10:11:31 testPackagingPom(org.eclipse.m2e.tests.discovery.LifecycleMappingDiscoveryTest)  Time elapsed: 13.529 s
10:11:31 testAutomaticSelectionWithAmbiguousProposals(org.eclipse.m2e.tests.discovery.LifecycleMappingDiscoveryTest)  Time elapsed: 14.726 s
10:11:31 testDiscoverProjectConfigurators(org.eclipse.m2e.tests.discovery.LifecycleMappingDiscoveryTest)  Time elapsed: 1.872 s
10:11:31 testNoProposals(org.eclipse.m2e.tests.discovery.LifecycleMappingDiscoveryTest)  Time elapsed: 2.085 s
10:11:31 testProposalMatching(org.eclipse.m2e.tests.discovery.LifecycleMappingDiscoveryTest)  Time elapsed: 2.178 s
10:11:31 testDiscoverLifecycleMappingStrategy(org.eclipse.m2e.tests.discovery.LifecycleMappingDiscoveryTest)  Time elapsed: 1.606 s
10:11:31 testDefaultNonConfiguratorMapping(org.eclipse.m2e.tests.discovery.LifecycleMappingDiscoveryTest)  Time elapsed: 8.686 s
10:11:31 Running org.eclipse.m2e.tests.discovery.MavenDiscoveryTest
10:11:32 Tests run: 9, Failures: 0, Errors: 0, Skipped: 0, Time elapsed: 0.706 s - in org.eclipse.m2e.tests.discovery.MavenDiscoveryTest
10:11:32 testCatalogSelectedByConfiguratorId(org.eclipse.m2e.tests.discovery.MavenDiscoveryTest)  Time elapsed: 0.16 s
10:11:32 testCatalogItemWithoutMappingMetadata(org.eclipse.m2e.tests.discovery.MavenDiscoveryTest)  Time elapsed: 0.005 s
10:11:32 testCatalogItemExtensionsMetadata(org.eclipse.m2e.tests.discovery.MavenDiscoveryTest)  Time elapsed: 0.002 s
10:11:32 testNotMatchPluginSelection(org.eclipse.m2e.tests.discovery.MavenDiscoveryTest)  Time elapsed: 0.077 s
10:11:32 testCatalogSelectedByLifecycleId(org.eclipse.m2e.tests.discovery.MavenDiscoveryTest)  Time elapsed: 0.09 s
10:11:32 testMultipleSelections(org.eclipse.m2e.tests.discovery.MavenDiscoveryTest)  Time elapsed: 0.115 s
10:11:32 testCatalogSelectedByPackaging(org.eclipse.m2e.tests.discovery.MavenDiscoveryTest)  Time elapsed: 0.092 s
10:11:32 testCatalogSelectedByMojoExecution(org.eclipse.m2e.tests.discovery.MavenDiscoveryTest)  Time elapsed: 0.091 s
10:11:32 testCatalogUnselected(org.eclipse.m2e.tests.discovery.MavenDiscoveryTest)  Time elapsed: 0.071 s
10:11:32 Running org.eclipse.m2e.tests.internal.project.MavenProjectChangedListenerExtensionTest
10:11:34 Tests run: 1, Failures: 0, Errors: 0, Skipped: 0, Time elapsed: 2.013 s - in org.eclipse.m2e.tests.internal.project.MavenProjectChangedListenerExtensionTest
10:11:34 testExtension(org.eclipse.m2e.tests.internal.project.MavenProjectChangedListenerExtensionTest)  Time elapsed: 2.012 s
10:11:34 Running org.eclipse.m2e.tests.internal.refactoring.ExcludeArtifactRefactoringTest
10:11:37 Warning: NLS missing message: MavenImpl_error_lookup in: org.eclipse.m2e.editor.internal.messages
10:12:12 Tests run: 12, Failures: 0, Errors: 0, Skipped: 0, Time elapsed: 38.342 s - in org.eclipse.m2e.tests.internal.refactoring.ExcludeArtifactRefactoringTest
10:12:12 testSingleArtifactKeyRemoteParent(org.eclipse.m2e.tests.internal.refactoring.ExcludeArtifactRefactoringTest)  Time elapsed: 4.376 s
10:12:12 testSingleArtifactMissing(org.eclipse.m2e.tests.internal.refactoring.ExcludeArtifactRefactoringTest)  Time elapsed: 1.829 s
10:12:12 testSingleArtifactKeyInWorkspaceParent(org.eclipse.m2e.tests.internal.refactoring.ExcludeArtifactRefactoringTest)  Time elapsed: 4.097 s
10:12:12 testStrangePomName(org.eclipse.m2e.tests.internal.refactoring.ExcludeArtifactRefactoringTest)  Time elapsed: 1.933 s
10:12:12 testArtifactsInMultiplePom(org.eclipse.m2e.tests.internal.refactoring.ExcludeArtifactRefactoringTest)  Time elapsed: 4.084 s
10:12:12 testCopyDown(org.eclipse.m2e.tests.internal.refactoring.ExcludeArtifactRefactoringTest)  Time elapsed: 5.475 s
10:12:12 testSingleArtifactKeyWorkspaceParent(org.eclipse.m2e.tests.internal.refactoring.ExcludeArtifactRefactoringTest)  Time elapsed: 2.35 s
10:12:12 testMultipleArtifactWithMissing(org.eclipse.m2e.tests.internal.refactoring.ExcludeArtifactRefactoringTest)  Time elapsed: 2.051 s
10:12:12 testSingleArtifactNoParentBadFormat(org.eclipse.m2e.tests.internal.refactoring.ExcludeArtifactRefactoringTest)  Time elapsed: 5.87 s
10:12:12 testMultipleArtifactKeySinglePom(org.eclipse.m2e.tests.internal.refactoring.ExcludeArtifactRefactoringTest)  Time elapsed: 1.995 s
10:12:12 testSingleArtifactNoParent(org.eclipse.m2e.tests.internal.refactoring.ExcludeArtifactRefactoringTest)  Time elapsed: 1.933 s
10:12:12 testPullUp(org.eclipse.m2e.tests.internal.refactoring.ExcludeArtifactRefactoringTest)  Time elapsed: 2.348 s
10:12:12 Running org.eclipse.m2e.tests.internal.wizard.MavenImportWizardTest
10:12:28 Tests run: 3, Failures: 0, Errors: 0, Skipped: 0, Time elapsed: 15.708 s - in org.eclipse.m2e.tests.internal.wizard.MavenImportWizardTest
10:12:28 testNoRenameOnMavenImport(org.eclipse.m2e.tests.internal.wizard.MavenImportWizardTest)  Time elapsed: 2.844 s
10:12:28 testRenameOnMavenImport(org.eclipse.m2e.tests.internal.wizard.MavenImportWizardTest)  Time elapsed: 3.471 s
10:12:28 testNoRenameOnMavenImportInWorkspaceRoot(org.eclipse.m2e.tests.internal.wizard.MavenImportWizardTest)  Time elapsed: 9.392 s
10:12:28 Running org.eclipse.m2e.tests.internal.wizard.MavenImportWizardPageTest
10:13:21 Tests run: 6, Failures: 0, Errors: 0, Skipped: 0, Time elapsed: 52.766 s - in org.eclipse.m2e.tests.internal.wizard.MavenImportWizardPageTest
10:13:21 test408042_multimoduleProject(org.eclipse.m2e.tests.internal.wizard.MavenImportWizardPageTest)  Time elapsed: 2.395 s
10:13:21 test408042_nestedproject(org.eclipse.m2e.tests.internal.wizard.MavenImportWizardPageTest)  Time elapsed: 7.37 s
10:13:21 test408042_noRootProject(org.eclipse.m2e.tests.internal.wizard.MavenImportWizardPageTest)  Time elapsed: 5.275 s
10:13:21 test533463_noArtifactId(org.eclipse.m2e.tests.internal.wizard.MavenImportWizardPageTest)  Time elapsed: 6.788 s
10:13:21 test408042_simpleProject(org.eclipse.m2e.tests.internal.wizard.MavenImportWizardPageTest)  Time elapsed: 19.35 s
10:13:21 test422008_preselectedWorkingSet(org.eclipse.m2e.tests.internal.wizard.MavenImportWizardPageTest)  Time elapsed: 11.587 s
10:13:21 Running org.eclipse.m2e.tests.internal.wizard.MappingDiscoveryJobTest
10:13:44 Tests run: 2, Failures: 0, Errors: 0, Skipped: 0, Time elapsed: 23.009 s - in org.eclipse.m2e.tests.internal.wizard.MappingDiscoveryJobTest
10:13:44 testDontOpenMappingDiscoveryWizard(org.eclipse.m2e.tests.internal.wizard.MappingDiscoveryJobTest)  Time elapsed: 17.038 s
10:13:44 testOpensMappingDiscoveryWizard(org.eclipse.m2e.tests.internal.wizard.MappingDiscoveryJobTest)  Time elapsed: 5.97 s
10:13:44 Running org.eclipse.m2e.tests.internal.lifecyclemapping.ProjectConfigurationElementSorterTest
10:13:44 Tests run: 6, Failures: 0, Errors: 0, Skipped: 0, Time elapsed: 0.006 s - in org.eclipse.m2e.tests.internal.lifecyclemapping.ProjectConfigurationElementSorterTest
10:13:44 testSortConfigurators_MissingPreviousConfigurator(org.eclipse.m2e.tests.internal.lifecyclemapping.ProjectConfigurationElementSorterTest)  Time elapsed: 0.005 s
10:13:44 testSortConfigurators_isRoot(org.eclipse.m2e.tests.internal.lifecyclemapping.ProjectConfigurationElementSorterTest)  Time elapsed: 0 s
10:13:44 testSortConfigurators_HappyPath(org.eclipse.m2e.tests.internal.lifecyclemapping.ProjectConfigurationElementSorterTest)  Time elapsed: 0 s
10:13:44 testSortConfigurators_MissingFollowingConfigurator(org.eclipse.m2e.tests.internal.lifecyclemapping.ProjectConfigurationElementSorterTest)  Time elapsed: 0 s
10:13:44 testSortConfigurators_CycleDetected(org.eclipse.m2e.tests.internal.lifecyclemapping.ProjectConfigurationElementSorterTest)  Time elapsed: 0.001 s
10:13:44 testSortConfigurators_471840(org.eclipse.m2e.tests.internal.lifecyclemapping.ProjectConfigurationElementSorterTest)  Time elapsed: 0 s
10:13:44 Running org.eclipse.m2e.tests.internal.index.NexusIndexManagerSearchTest
10:18:07 Tests run: 9, Failures: 0, Errors: 0, Skipped: 0, Time elapsed: 262.678 s - in org.eclipse.m2e.tests.internal.index.NexusIndexManagerSearchTest
10:18:07 testPluginSearch(org.eclipse.m2e.tests.internal.index.NexusIndexManagerSearchTest)  Time elapsed: 12.406 s
10:18:07 testSearchGroups2(org.eclipse.m2e.tests.internal.index.NexusIndexManagerSearchTest)  Time elapsed: 35.82 s
10:18:07 testSearchGroups3(org.eclipse.m2e.tests.internal.index.NexusIndexManagerSearchTest)  Time elapsed: 7.528 s
10:18:07 testSha1Search(org.eclipse.m2e.tests.internal.index.NexusIndexManagerSearchTest)  Time elapsed: 3.224 s
10:18:07 testBogusSearchType(org.eclipse.m2e.tests.internal.index.NexusIndexManagerSearchTest)  Time elapsed: 77.431 s
10:18:07 testGroupSearch(org.eclipse.m2e.tests.internal.index.NexusIndexManagerSearchTest)  Time elapsed: 107.805 s
10:18:07 testSearchGroups(org.eclipse.m2e.tests.internal.index.NexusIndexManagerSearchTest)  Time elapsed: 9.015 s
10:18:07 testArtifactSearch(org.eclipse.m2e.tests.internal.index.NexusIndexManagerSearchTest)  Time elapsed: 4.445 s
10:18:07 testSorting(org.eclipse.m2e.tests.internal.index.NexusIndexManagerSearchTest)  Time elapsed: 5.002 s
10:18:07 Running org.eclipse.m2e.tests.internal.index.IndexedArtifactTest
10:18:07 Tests run: 3, Failures: 0, Errors: 0, Skipped: 0, Time elapsed: 0.002 s - in org.eclipse.m2e.tests.internal.index.IndexedArtifactTest
10:18:07 testHash(org.eclipse.m2e.tests.internal.index.IndexedArtifactTest)  Time elapsed: 0 s
10:18:07 testPackageName(org.eclipse.m2e.tests.internal.index.IndexedArtifactTest)  Time elapsed: 0.001 s
10:18:07 testEquals(org.eclipse.m2e.tests.internal.index.IndexedArtifactTest)  Time elapsed: 0 s
10:18:07 Running org.eclipse.m2e.tests.internal.index.NexusIndexManagerTest
10:23:10 Tests run: 14, Failures: 0, Errors: 0, Skipped: 0, Time elapsed: 303.147 s - in org.eclipse.m2e.tests.internal.index.NexusIndexManagerTest
10:23:10 testIndexedPublicArtifactGroups(org.eclipse.m2e.tests.internal.index.NexusIndexManagerTest)  Time elapsed: 63.586 s
10:23:10 test512006_nonProxyHost(org.eclipse.m2e.tests.internal.index.NexusIndexManagerTest)  Time elapsed: 29.569 s
10:23:10 testFetchIndexFromRepositoryWithAuthentication(org.eclipse.m2e.tests.internal.index.NexusIndexManagerTest)  Time elapsed: 3.435 s
10:23:10 testIndexedArtifactGroups(org.eclipse.m2e.tests.internal.index.NexusIndexManagerTest)  Time elapsed: 29.588 s
10:23:10 testWorkspaceIndex(org.eclipse.m2e.tests.internal.index.NexusIndexManagerTest)  Time elapsed: 5.698 s
10:23:10 testDisableIndex(org.eclipse.m2e.tests.internal.index.NexusIndexManagerTest)  Time elapsed: 40.594 s
10:23:10 testPublicNonMirrored(org.eclipse.m2e.tests.internal.index.NexusIndexManagerTest)  Time elapsed: 4.927 s
10:23:10 testMngEclipse1621(org.eclipse.m2e.tests.internal.index.NexusIndexManagerTest)  Time elapsed: 4.139 s
10:23:10 testMngEclipse1710(org.eclipse.m2e.tests.internal.index.NexusIndexManagerTest)  Time elapsed: 6.764 s
10:23:10 testMngEclipse1907(org.eclipse.m2e.tests.internal.index.NexusIndexManagerTest)  Time elapsed: 36.83 s
10:23:10 testProjectSpecificThenInSettings(org.eclipse.m2e.tests.internal.index.NexusIndexManagerTest)  Time elapsed: 22.698 s
10:23:10 testNoMirror(org.eclipse.m2e.tests.internal.index.NexusIndexManagerTest)  Time elapsed: 6.313 s
10:23:10 testPublicMirror(org.eclipse.m2e.tests.internal.index.NexusIndexManagerTest)  Time elapsed: 5.508 s
10:23:10 testProjectIndexes(org.eclipse.m2e.tests.internal.index.NexusIndexManagerTest)  Time elapsed: 43.495 s
10:23:10 Running org.eclipse.m2e.tests.internal.index.filter.IndexFilterTest
10:23:10 Tests run: 3, Failures: 0, Errors: 0, Skipped: 0, Time elapsed: 0.007 s - in org.eclipse.m2e.tests.internal.index.filter.IndexFilterTest
10:23:10 testIndexedArtifactFileNodeAdapter(org.eclipse.m2e.tests.internal.index.filter.IndexFilterTest)  Time elapsed: 0.003 s
10:23:10 testFilteredIndex_nonEmptyResult(org.eclipse.m2e.tests.internal.index.filter.IndexFilterTest)  Time elapsed: 0.003 s
10:23:10 testFilteredIndex_emptyResult(org.eclipse.m2e.tests.internal.index.filter.IndexFilterTest)  Time elapsed: 0 s
10:23:10 Running org.eclipse.m2e.tests.internal.embedder.MavenEmbeddedRuntimeTest
10:23:10 Tests run: 1, Failures: 0, Errors: 0, Skipped: 0, Time elapsed: 0.206 s - in org.eclipse.m2e.tests.internal.embedder.MavenEmbeddedRuntimeTest
10:23:10 testGetVersion(org.eclipse.m2e.tests.internal.embedder.MavenEmbeddedRuntimeTest)  Time elapsed: 0.205 s
10:23:10 Running org.eclipse.m2e.tests.internal.repository.RepositoryRegistryTest
10:23:11 Tests run: 1, Failures: 0, Errors: 0, Skipped: 0, Time elapsed: 1.408 s - in org.eclipse.m2e.tests.internal.repository.RepositoryRegistryTest
10:23:11 testSettingsDecryption(org.eclipse.m2e.tests.internal.repository.RepositoryRegistryTest)  Time elapsed: 1.407 s
10:23:11 Running org.eclipse.m2e.tests.internal.conversion.ProjectConversionParticipantSorterTest
10:23:11 Tests run: 6, Failures: 0, Errors: 0, Skipped: 0, Time elapsed: 0.004 s - in org.eclipse.m2e.tests.internal.conversion.ProjectConversionParticipantSorterTest
10:23:11 testSortConverters_AfterBefore(org.eclipse.m2e.tests.internal.conversion.ProjectConversionParticipantSorterTest)  Time elapsed: 0.002 s
10:23:11 testSortConverters_After2(org.eclipse.m2e.tests.internal.conversion.ProjectConversionParticipantSorterTest)  Time elapsed: 0 s
10:23:11 testSortConverters_After(org.eclipse.m2e.tests.internal.conversion.ProjectConversionParticipantSorterTest)  Time elapsed: 0 s
10:23:11 testSortConverters_Cycle_After(org.eclipse.m2e.tests.internal.conversion.ProjectConversionParticipantSorterTest)  Time elapsed: 0 s
10:23:11 testSortConverters_DuplicateConverters(org.eclipse.m2e.tests.internal.conversion.ProjectConversionParticipantSorterTest)  Time elapsed: 0 s
10:23:11 testSortConverters_Cycle_Before(org.eclipse.m2e.tests.internal.conversion.ProjectConversionParticipantSorterTest)  Time elapsed: 0 s
10:23:11 Running org.eclipse.m2e.tests.conversion.ProjectConversionEnablerTest
10:23:16 Tests run: 3, Failures: 0, Errors: 0, Skipped: 0, Time elapsed: 4.252 s - in org.eclipse.m2e.tests.conversion.ProjectConversionEnablerTest
10:23:16 testProjectCanBeConverted(org.eclipse.m2e.tests.conversion.ProjectConversionEnablerTest)  Time elapsed: 1.426 s
10:23:16 testProjectCannotBeConverted(org.eclipse.m2e.tests.conversion.ProjectConversionEnablerTest)  Time elapsed: 1.23 s
10:23:16 testEnablerNotFound(org.eclipse.m2e.tests.conversion.ProjectConversionEnablerTest)  Time elapsed: 1.596 s
10:23:16 Running org.eclipse.m2e.tests.conversion.ProjectConversionManagerTest
10:23:22 Tests run: 3, Failures: 0, Errors: 0, Skipped: 0, Time elapsed: 6.624 s - in org.eclipse.m2e.tests.conversion.ProjectConversionManagerTest
10:23:22 test393613_SortConversionParticipants(org.eclipse.m2e.tests.conversion.ProjectConversionManagerTest)  Time elapsed: 2.22 s
10:23:22 testConversionParticipantsPerProject(org.eclipse.m2e.tests.conversion.ProjectConversionManagerTest)  Time elapsed: 2.115 s
10:23:22 testRestrictedPackagings(org.eclipse.m2e.tests.conversion.ProjectConversionManagerTest)  Time elapsed: 2.287 s
10:23:22 Running org.eclipse.m2e.tests.conversion.ProjectConversionTest
10:25:40 Tests run: 7, Failures: 0, Errors: 0, Skipped: 0, Time elapsed: 137.872 s - in org.eclipse.m2e.tests.conversion.ProjectConversionTest
10:25:40 testMultipleSourcesProjectConversion(org.eclipse.m2e.tests.conversion.ProjectConversionTest)  Time elapsed: 83.408 s
10:25:40 testProjectConversionWithSvn(org.eclipse.m2e.tests.conversion.ProjectConversionTest)  Time elapsed: 3.629 s
10:25:40 testJavaMixedWithResourcesProjectConversion(org.eclipse.m2e.tests.conversion.ProjectConversionTest)  Time elapsed: 21.574 s
10:25:40 testInheritJavaSettingsDuringConversion(org.eclipse.m2e.tests.conversion.ProjectConversionTest)  Time elapsed: 3.856 s
10:25:40 testOptionalSourceProjectConversion(org.eclipse.m2e.tests.conversion.ProjectConversionTest)  Time elapsed: 4.016 s
10:25:40 testNoCustomizationNeededProjectConversion(org.eclipse.m2e.tests.conversion.ProjectConversionTest)  Time elapsed: 14.552 s
10:25:40 testMavenLayoutProjectConversion(org.eclipse.m2e.tests.conversion.ProjectConversionTest)  Time elapsed: 6.837 s
10:25:40 Running org.eclipse.m2e.tests.embedder.MavenRuntimeManagerTest
10:25:40 Tests run: 4, Failures: 0, Errors: 0, Skipped: 0, Time elapsed: 0.019 s - in org.eclipse.m2e.tests.embedder.MavenRuntimeManagerTest
10:25:40 testDefaultRuntime(org.eclipse.m2e.tests.embedder.MavenRuntimeManagerTest)  Time elapsed: 0.009 s
10:25:40 testSetDefaultRuntime(org.eclipse.m2e.tests.embedder.MavenRuntimeManagerTest)  Time elapsed: 0.001 s
10:25:40 testExternalRuntime(org.eclipse.m2e.tests.embedder.MavenRuntimeManagerTest)  Time elapsed: 0.008 s
10:25:40 testGetRuntime(org.eclipse.m2e.tests.embedder.MavenRuntimeManagerTest)  Time elapsed: 0 s
10:25:40 Running org.eclipse.m2e.tests.embedder.MavenModelEditTest
10:25:41 Tests run: 16, Failures: 0, Errors: 0, Skipped: 0, Time elapsed: 0.659 s - in org.eclipse.m2e.tests.embedder.MavenModelEditTest
10:25:41 testOneRemove(org.eclipse.m2e.tests.embedder.MavenModelEditTest)  Time elapsed: 0.226 s
10:25:41 testEncoding(org.eclipse.m2e.tests.embedder.MavenModelEditTest)  Time elapsed: 0.009 s
10:25:41 testAttributeChange(org.eclipse.m2e.tests.embedder.MavenModelEditTest)  Time elapsed: 0.005 s
10:25:41 testAttributeRoundtrip(org.eclipse.m2e.tests.embedder.MavenModelEditTest)  Time elapsed: 0.005 s
10:25:41 testAttributeRemove(org.eclipse.m2e.tests.embedder.MavenModelEditTest)  Time elapsed: 0.005 s
10:25:41 testManyRoundtrip(org.eclipse.m2e.tests.embedder.MavenModelEditTest)  Time elapsed: 0.007 s
10:25:41 testManybuildinRoundtrip(org.eclipse.m2e.tests.embedder.MavenModelEditTest)  Time elapsed: 0.007 s
10:25:41 testAttributeAdd(org.eclipse.m2e.tests.embedder.MavenModelEditTest)  Time elapsed: 0.006 s
10:25:41 testOneReplace(org.eclipse.m2e.tests.embedder.MavenModelEditTest)  Time elapsed: 0.005 s
10:25:41 testManyAdd(org.eclipse.m2e.tests.embedder.MavenModelEditTest)  Time elapsed: 0.164 s
10:25:41 testManybuildincommentRemove(org.eclipse.m2e.tests.embedder.MavenModelEditTest)  Time elapsed: 0.008 s
10:25:41 testManyChange(org.eclipse.m2e.tests.embedder.MavenModelEditTest)  Time elapsed: 0.047 s
10:25:41 testXpp3domRoundtrip(org.eclipse.m2e.tests.embedder.MavenModelEditTest)  Time elapsed: 0.014 s
10:25:41 testManyRemove(org.eclipse.m2e.tests.embedder.MavenModelEditTest)  Time elapsed: 0.026 s
10:25:41 testOneRoundtrip(org.eclipse.m2e.tests.embedder.MavenModelEditTest)  Time elapsed: 0.119 s
10:25:41 testManybuildinRemove(org.eclipse.m2e.tests.embedder.MavenModelEditTest)  Time elapsed: 0.006 s
10:25:41 Running org.eclipse.m2e.tests.embedder.MavenModelManagerTest
10:25:48 Tests run: 2, Failures: 0, Errors: 0, Skipped: 0, Time elapsed: 7.091 s - in org.eclipse.m2e.tests.embedder.MavenModelManagerTest
10:25:48 test416882_dependencyTree(org.eclipse.m2e.tests.embedder.MavenModelManagerTest)  Time elapsed: 3.616 s
10:25:48 testCreateMavenModel(org.eclipse.m2e.tests.embedder.MavenModelManagerTest)  Time elapsed: 3.473 s
10:25:48 Running org.eclipse.m2e.tests.embedder.MavenImplTest
10:27:22 Tests run: 21, Failures: 0, Errors: 0, Skipped: 1, Time elapsed: 93.909 s - in org.eclipse.m2e.tests.embedder.MavenImplTest
10:27:22 test438454_guiceScopedComponentInjection(org.eclipse.m2e.tests.embedder.MavenImplTest)  Time elapsed: 12.93 s
10:27:22 testUnreadableSettings(org.eclipse.m2e.tests.embedder.MavenImplTest)  Time elapsed: 3.968 s
10:27:22 testGetProxy(org.eclipse.m2e.tests.embedder.MavenImplTest)  Time elapsed: 3.855 s
10:27:22 testMNGECLIPSE2556_settingsSystemPropertiesSubstiution(org.eclipse.m2e.tests.embedder.MavenImplTest)  Time elapsed: 4.659 s
10:27:22 testGetDefaultRepositories(org.eclipse.m2e.tests.embedder.MavenImplTest)  Time elapsed: 4.51 s
10:27:22 testGetRepositories(org.eclipse.m2e.tests.embedder.MavenImplTest)  Time elapsed: 1.937 s
10:27:22 testMissingArtifact(org.eclipse.m2e.tests.embedder.MavenImplTest)  Time elapsed: 5.942 s
10:27:22 testIsUnavailable(org.eclipse.m2e.tests.embedder.MavenImplTest)  Time elapsed: 1.367 s
10:27:22 testLocalRepositoryListener(org.eclipse.m2e.tests.embedder.MavenImplTest)  Time elapsed: 1.187 s
10:27:22 testGlobalSettings(org.eclipse.m2e.tests.embedder.MavenImplTest)  Time elapsed: 6.02 s
10:27:22 testReadNoParent(org.eclipse.m2e.tests.embedder.MavenImplTest)  Time elapsed: 1.154 s
10:27:22 test358620_reparse_changed_user_settings(org.eclipse.m2e.tests.embedder.MavenImplTest)  Time elapsed: 1.679 s
10:27:22 test366839_userAgent(org.eclipse.m2e.tests.embedder.MavenImplTest)  Time elapsed: 1.769 s
10:27:22 testReadLocalParent(org.eclipse.m2e.tests.embedder.MavenImplTest)  Time elapsed: 1.191 s
10:27:22 testReadProjectWithDependenciesFromMirror(org.eclipse.m2e.tests.embedder.MavenImplTest)  Time elapsed: 25.626 s
10:27:22 testGetMojoParameterValue(org.eclipse.m2e.tests.embedder.MavenImplTest)  Time elapsed: 2.127 s
10:27:22 testGetRepositoriesWithSettingsInjection(org.eclipse.m2e.tests.embedder.MavenImplTest)  Time elapsed: 2.162 s
10:27:22 test386196_ParallelDownloads(org.eclipse.m2e.tests.embedder.MavenImplTest)  Time elapsed: 3.709 s
10:27:22 testProxySupport(org.eclipse.m2e.tests.embedder.MavenImplTest)  Time elapsed: 3.924 s
10:27:22 DISABLED_testSslWithMutualHandshake(org.eclipse.m2e.tests.embedder.MavenImplTest) skipped
10:27:22 testReadRemoteParent(org.eclipse.m2e.tests.embedder.MavenImplTest)  Time elapsed: 4.188 s
10:27:22 Running org.eclipse.m2e.tests.embedder.ArtifactKeyTest
10:27:22 Tests run: 1, Failures: 0, Errors: 0, Skipped: 0, Time elapsed: 0.001 s - in org.eclipse.m2e.tests.embedder.ArtifactKeyTest
10:27:22 testPortableString(org.eclipse.m2e.tests.embedder.ArtifactKeyTest)  Time elapsed: 0.001 s
10:27:22 Running org.eclipse.m2e.tests.embedder.MavenExecutionContextTest
10:28:07 Tests run: 6, Failures: 0, Errors: 0, Skipped: 0, Time elapsed: 45.658 s - in org.eclipse.m2e.tests.embedder.MavenExecutionContextTest
10:28:07 testBasic(org.eclipse.m2e.tests.embedder.MavenExecutionContextTest)  Time elapsed: 19.805 s
10:28:07 test496492_threadContextClassloaderLeak(org.eclipse.m2e.tests.embedder.MavenExecutionContextTest)  Time elapsed: 1.832 s
10:28:07 testExecutionRequestContainsSystemProperties(org.eclipse.m2e.tests.embedder.MavenExecutionContextTest)  Time elapsed: 19.677 s
10:28:07 testReenterShortcut(org.eclipse.m2e.tests.embedder.MavenExecutionContextTest)  Time elapsed: 1.368 s
10:28:07 testIllegalState(org.eclipse.m2e.tests.embedder.MavenExecutionContextTest)  Time elapsed: 1.219 s
10:28:07 testNested(org.eclipse.m2e.tests.embedder.MavenExecutionContextTest)  Time elapsed: 1.756 s
10:28:07 Running org.eclipse.m2e.tests.scm.ScmHandlerFactoryTest
10:28:07 Tests run: 1, Failures: 0, Errors: 0, Skipped: 0, Time elapsed: 0.005 s - in org.eclipse.m2e.tests.scm.ScmHandlerFactoryTest
10:28:07 testScmHandlerFactory(org.eclipse.m2e.tests.scm.ScmHandlerFactoryTest)  Time elapsed: 0.004 s
10:28:07 Running org.eclipse.m2e.tests.profiles.MavenProfileManagerTest
10:29:44 Tests run: 5, Failures: 0, Errors: 0, Skipped: 0, Time elapsed: 96.376 s - in org.eclipse.m2e.tests.profiles.MavenProfileManagerTest
10:29:44 testGetAvailableSettingsProfiles(org.eclipse.m2e.tests.profiles.MavenProfileManagerTest)  Time elapsed: 2.575 s
10:29:44 test441112_InheritParentActiveProfiles(org.eclipse.m2e.tests.profiles.MavenProfileManagerTest)  Time elapsed: 56.691 s
10:29:44 testUserSelectedProfiles(org.eclipse.m2e.tests.profiles.MavenProfileManagerTest)  Time elapsed: 8.285 s
10:29:44 testParentFromRemote(org.eclipse.m2e.tests.profiles.MavenProfileManagerTest)  Time elapsed: 11.374 s
10:29:44 testDisabledProfiles(org.eclipse.m2e.tests.profiles.MavenProfileManagerTest)  Time elapsed: 17.446 s
10:29:44 Running org.eclipse.m2e.tests.configurators.ResourcesEncodingConfiguratorTest
10:30:01 Tests run: 3, Failures: 0, Errors: 0, Skipped: 0, Time elapsed: 17.205 s - in org.eclipse.m2e.tests.configurators.ResourcesEncodingConfiguratorTest
10:30:01 test002_shouldConfigureEncodingForProjectWithSeveralResourceFolders(org.eclipse.m2e.tests.configurators.ResourcesEncodingConfiguratorTest)  Time elapsed: 2.566 s
10:30:01 test001_shouldConfigureEncodingForBasicProject(org.eclipse.m2e.tests.configurators.ResourcesEncodingConfiguratorTest)  Time elapsed: 4.305 s
10:30:01 test003_shouldResetToContainerDefinedEncoding(org.eclipse.m2e.tests.configurators.ResourcesEncodingConfiguratorTest)  Time elapsed: 10.334 s
10:30:01 Running org.eclipse.m2e.tests.configurators.CompilerSettingsWithEncodingConfiguratorTest
10:30:16 Tests run: 2, Failures: 0, Errors: 0, Skipped: 0, Time elapsed: 14.583 s - in org.eclipse.m2e.tests.configurators.CompilerSettingsWithEncodingConfiguratorTest
10:30:16 test002_shouldResetToContainerDefinedEncoding(org.eclipse.m2e.tests.configurators.CompilerSettingsWithEncodingConfiguratorTest)  Time elapsed: 11.397 s
10:30:16 test001_shouldSetEncodingForBasicProject(org.eclipse.m2e.tests.configurators.CompilerSettingsWithEncodingConfiguratorTest)  Time elapsed: 3.184 s
10:30:16 Running org.eclipse.m2e.tests.SourceLocationHelperTest
10:30:20 Exception in thread "Java indexing" java.lang.ArrayIndexOutOfBoundsException: 2048
10:30:20 	at org.eclipse.jdt.internal.core.index.DiskIndex.readChunk(DiskIndex.java:756)
10:30:20 	at org.eclipse.jdt.internal.core.index.DiskIndex.readAllDocumentNames(DiskIndex.java:634)
10:30:20 	at org.eclipse.jdt.internal.core.index.DiskIndex.mergeWith(DiskIndex.java:533)
10:30:20 	at org.eclipse.jdt.internal.core.index.Index.save(Index.java:203)
10:30:20 	at org.eclipse.jdt.internal.core.search.indexing.IndexManager.saveIndex(IndexManager.java:990)
10:30:20 	at org.eclipse.jdt.internal.core.search.indexing.AddJarFileToIndex.execute(AddJarFileToIndex.java:267)
10:30:20 	at org.eclipse.jdt.internal.core.search.processing.JobManager.run(JobManager.java:401)
10:30:20 	at java.lang.Thread.run(Thread.java:748)
10:30:26 Tests run: 5, Failures: 0, Errors: 0, Skipped: 0, Time elapsed: 10.544 s - in org.eclipse.m2e.tests.SourceLocationHelperTest
10:30:26 testDependencyLocation(org.eclipse.m2e.tests.SourceLocationHelperTest)  Time elapsed: 2.708 s
10:30:26 testMojoExecutionLocationWithExecutions(org.eclipse.m2e.tests.SourceLocationHelperTest)  Time elapsed: 2.473 s
10:30:26 testPackagingLocation(org.eclipse.m2e.tests.SourceLocationHelperTest)  Time elapsed: 1.487 s
10:30:26 testMojoExecutionLocation(org.eclipse.m2e.tests.SourceLocationHelperTest)  Time elapsed: 2.269 s
10:30:26 testPluginAttributeLocation(org.eclipse.m2e.tests.SourceLocationHelperTest)  Time elapsed: 1.606 s
10:30:26 Running org.eclipse.m2e.tests.util.search.IndexSearchEngineTest
10:30:29 Tests run: 1, Failures: 0, Errors: 0, Skipped: 0, Time elapsed: 3.273 s - in org.eclipse.m2e.tests.util.search.IndexSearchEngineTest
10:30:29 testGroupIDProposal(org.eclipse.m2e.tests.util.search.IndexSearchEngineTest)  Time elapsed: 3.271 s
10:30:29 Running org.eclipse.m2e.tests.jdt.ProjectLayoutTest
10:30:36 Tests run: 1, Failures: 0, Errors: 0, Skipped: 0, Time elapsed: 6.351 s - in org.eclipse.m2e.tests.jdt.ProjectLayoutTest
10:30:36 test472726_basedirResources(org.eclipse.m2e.tests.jdt.ProjectLayoutTest)  Time elapsed: 6.351 s
10:30:36 Running org.eclipse.m2e.tests.jdt.JavaClasspathTest
10:32:06 Tests run: 22, Failures: 0, Errors: 0, Skipped: 0, Time elapsed: 90.432 s - in org.eclipse.m2e.tests.jdt.JavaClasspathTest
10:32:06 testStaleDerivedEntries(org.eclipse.m2e.tests.jdt.JavaClasspathTest)  Time elapsed: 4.057 s
10:32:06 test398121_PreserveOrderOfClasspathContainersOnUpdate(org.eclipse.m2e.tests.jdt.JavaClasspathTest)  Time elapsed: 4.059 s
10:32:06 test370685_PreserveResourcesOnUpdate(org.eclipse.m2e.tests.jdt.JavaClasspathTest)  Time elapsed: 2.895 s
10:32:06 test480137_addingResourceFoldersAreNotRemovedDuringConfigurationUpdate(org.eclipse.m2e.tests.jdt.JavaClasspathTest)  Time elapsed: 8.685 s
10:32:06 test537851_DisableTestClasspathFlag(org.eclipse.m2e.tests.jdt.JavaClasspathTest)  Time elapsed: 2.71 s
10:32:06 test526858_ProjectExportingTests(org.eclipse.m2e.tests.jdt.JavaClasspathTest)  Time elapsed: 5.798 s
10:32:06 test466518_classpathJREOrder(org.eclipse.m2e.tests.jdt.JavaClasspathTest)  Time elapsed: 2.518 s
10:32:06 test518218_configureMethodParametersGenerationWithCompilerArgs(org.eclipse.m2e.tests.jdt.JavaClasspathTest)  Time elapsed: 4.089 s
10:32:06 test518218_configureMethodParametersGenerationWithParameters(org.eclipse.m2e.tests.jdt.JavaClasspathTest)  Time elapsed: 3.717 s
10:32:06 test388541_KeepClasspathAttributes(org.eclipse.m2e.tests.jdt.JavaClasspathTest)  Time elapsed: 2.452 s
10:32:06 test526858_TestClasspathAttributeOnProject(org.eclipse.m2e.tests.jdt.JavaClasspathTest)  Time elapsed: 3.92 s
10:32:06 test526858_TestClasspathAttributeOnJar(org.eclipse.m2e.tests.jdt.JavaClasspathTest)  Time elapsed: 3.506 s
10:32:06 test518218_configureMethodParametersGenerationWithCompilerArgument(org.eclipse.m2e.tests.jdt.JavaClasspathTest)  Time elapsed: 5.436 s
10:32:06 testClasspathContainers(org.eclipse.m2e.tests.jdt.JavaClasspathTest)  Time elapsed: 4.735 s
10:32:06 test414645_TestClasspathAttributeOnRuntimeProjectDependencies(org.eclipse.m2e.tests.jdt.JavaClasspathTest)  Time elapsed: 3.455 s
10:32:06 test394042_ClasspathEntry4(org.eclipse.m2e.tests.jdt.JavaClasspathTest)  Time elapsed: 4.557 s
10:32:06 test414645_TestClasspathAttributeOnRuntimeJarDependencies(org.eclipse.m2e.tests.jdt.JavaClasspathTest)  Time elapsed: 7.688 s
10:32:06 test525880_JavaAccessRulesArePreservedOnUpdate(org.eclipse.m2e.tests.jdt.JavaClasspathTest)  Time elapsed: 4.367 s
10:32:06 test534049_SetReleaseFlag(org.eclipse.m2e.tests.jdt.JavaClasspathTest)  Time elapsed: 2.99 s
10:32:06 test549312_fallbackToLatestEE(org.eclipse.m2e.tests.jdt.JavaClasspathTest)  Time elapsed: 1.841 s
10:32:06 testImport(org.eclipse.m2e.tests.jdt.JavaClasspathTest)  Time elapsed: 4.554 s
10:32:06 test486739_PreserveExportedOnUpdate(org.eclipse.m2e.tests.jdt.JavaClasspathTest)  Time elapsed: 2.401 s
10:32:06 Running org.eclipse.m2e.tests.jdt.internal.MavenClasspathContainerSaveHelperTest
10:32:06 Tests run: 1, Failures: 0, Errors: 0, Skipped: 0, Time elapsed: 0.004 s - in org.eclipse.m2e.tests.jdt.internal.MavenClasspathContainerSaveHelperTest
10:32:06 testClasspathContainerSace(org.eclipse.m2e.tests.jdt.internal.MavenClasspathContainerSaveHelperTest)  Time elapsed: 0.003 s
10:32:06 Running org.eclipse.m2e.tests.jdt.internal.ClasspathEntryDescriptorTest
10:32:06 Tests run: 1, Failures: 0, Errors: 0, Skipped: 0, Time elapsed: 0.001 s - in org.eclipse.m2e.tests.jdt.internal.ClasspathEntryDescriptorTest
10:32:06 testArtifactKeyDeserialization(org.eclipse.m2e.tests.jdt.internal.ClasspathEntryDescriptorTest)  Time elapsed: 0.001 s
10:32:06 Running org.eclipse.m2e.tests.jdt.JavaCodeGenerationProjectConfiguratorTest
10:32:09 Tests run: 1, Failures: 0, Errors: 0, Skipped: 0, Time elapsed: 2.32 s - in org.eclipse.m2e.tests.jdt.JavaCodeGenerationProjectConfiguratorTest
10:32:09 test368333_generatedSourcesFoldersAreNotRemovedDuringConfigurationUpdate(org.eclipse.m2e.tests.jdt.JavaCodeGenerationProjectConfiguratorTest)  Time elapsed: 2.318 s
10:32:09 Running org.eclipse.m2e.tests.project.MavenProjectInfoTest
10:32:09 Tests run: 1, Failures: 0, Errors: 0, Skipped: 0, Time elapsed: 0.001 s - in org.eclipse.m2e.tests.project.MavenProjectInfoTest
10:32:09 testTwoChildProjectInfosWithSameLabel(org.eclipse.m2e.tests.project.MavenProjectInfoTest)  Time elapsed: 0 s
10:32:09 Running org.eclipse.m2e.tests.project.CompilerSettings18Test
10:32:11 Tests run: 1, Failures: 0, Errors: 0, Skipped: 0, Time elapsed: 2.258 s - in org.eclipse.m2e.tests.project.CompilerSettings18Test
10:32:11 testCompilerSettings18(org.eclipse.m2e.tests.project.CompilerSettings18Test)  Time elapsed: 2.258 s
10:32:11 Running org.eclipse.m2e.tests.project.CompilerSynonymTest
10:32:15 Tests run: 1, Failures: 0, Errors: 0, Skipped: 0, Time elapsed: 4.267 s - in org.eclipse.m2e.tests.project.CompilerSynonymTest
10:32:15 testSynonym(org.eclipse.m2e.tests.project.CompilerSynonymTest)  Time elapsed: 4.267 s
10:32:15 Running org.eclipse.m2e.tests.project.MavenProjectFacadeTest
10:32:46 Tests run: 9, Failures: 0, Errors: 0, Skipped: 0, Time elapsed: 30.72 s - in org.eclipse.m2e.tests.project.MavenProjectFacadeTest
10:32:46 testGetProjectConfiguratorsAfterWorkspaceRestart(org.eclipse.m2e.tests.project.MavenProjectFacadeTest)  Time elapsed: 2.049 s
10:32:46 testGetMojoExecutionAfterWorkspaceRestart(org.eclipse.m2e.tests.project.MavenProjectFacadeTest)  Time elapsed: 2.212 s
10:32:46 testGetMojoExecutionsWithoutMavenExecutionContext(org.eclipse.m2e.tests.project.MavenProjectFacadeTest)  Time elapsed: 4.965 s
10:32:46 testGetProjectConfigurators(org.eclipse.m2e.tests.project.MavenProjectFacadeTest)  Time elapsed: 2.992 s
10:32:46 test436668_EclipseProjectMetadataNotStale(org.eclipse.m2e.tests.project.MavenProjectFacadeTest)  Time elapsed: 7.348 s
10:32:46 testGetMojoExecution(org.eclipse.m2e.tests.project.MavenProjectFacadeTest)  Time elapsed: 2.386 s
10:32:46 testGetMojoExecutions(org.eclipse.m2e.tests.project.MavenProjectFacadeTest)  Time elapsed: 2.145 s
10:32:46 testIsStale(org.eclipse.m2e.tests.project.MavenProjectFacadeTest)  Time elapsed: 2.231 s
10:32:46 testGetMojoExecutionsAfterWorkspaceRestart(org.eclipse.m2e.tests.project.MavenProjectFacadeTest)  Time elapsed: 4.391 s
10:32:46 Running org.eclipse.m2e.tests.BuildPathManagerTest
10:33:25 [INFO] ----------------------------------------------------------------------------
10:33:25 [INFO] Using following parameters for creating project from Old (1.x) Archetype: maven-archetype-quickstart:1.1
10:33:25 [INFO] ----------------------------------------------------------------------------
10:33:25 [INFO] Parameter: basedir, Value: /home/jenkins/agent/workspace/m2e-sonarqube/m2e-core-tests/org.eclipse.m2e.tests/target/work/data
10:33:25 [INFO] Parameter: package, Value: jar
10:33:25 [INFO] Parameter: groupId, Value: archetype-project
10:33:25 [INFO] Parameter: artifactId, Value: archetype-project
10:33:25 [INFO] Parameter: packageName, Value: jar
10:33:25 [INFO] Parameter: version, Value: 0.0.1-SNAPSHOT
10:33:25 [INFO] project created from Old (1.x) Archetype in dir: /home/jenkins/agent/workspace/m2e-sonarqube/m2e-core-tests/org.eclipse.m2e.tests/target/work/data/archetype-project
10:36:09 [INFO] ----------------------------------------------------------------------------
10:36:09 [INFO] Using following parameters for creating project from Old (1.x) Archetype: maven-archetype-quickstart:1.1
10:36:09 [INFO] ----------------------------------------------------------------------------
10:36:09 [INFO] Parameter: basedir, Value: /tmp/m2eclipse1144833230834835473test/external-archetype-project-1
10:36:09 [INFO] Parameter: package, Value: jar
10:36:09 [INFO] Parameter: groupId, Value: external-archetype-project-1
10:36:09 [INFO] Parameter: artifactId, Value: external-archetype-project-1
10:36:09 [INFO] Parameter: packageName, Value: jar
10:36:09 [INFO] Parameter: version, Value: 0.0.1-SNAPSHOT
10:36:09 [INFO] project created from Old (1.x) Archetype in dir: /tmp/m2eclipse1144833230834835473test/external-archetype-project-1/external-archetype-project-1
10:36:11 [INFO] ----------------------------------------------------------------------------
10:36:11 [INFO] Using following parameters for creating project from Old (1.x) Archetype: maven-archetype-quickstart:1.1
10:36:11 [INFO] ----------------------------------------------------------------------------
10:36:11 [INFO] Parameter: basedir, Value: /tmp/m2eclipse1144833230834835473test/external-archetype-project-2
10:36:11 [INFO] Parameter: package, Value: jar
10:36:11 [INFO] Parameter: groupId, Value: external-archetype-project-2
10:36:11 [INFO] Parameter: artifactId, Value: external-archetype-project-2
10:36:11 [INFO] Parameter: packageName, Value: jar
10:36:11 [INFO] Parameter: version, Value: 0.0.1-SNAPSHOT
10:37:03 Tests run: 45, Failures: 0, Errors: 0, Skipped: 1, Time elapsed: 256.692 s - in org.eclipse.m2e.tests.BuildPathManagerTest
10:37:03 testDownloadSources_001_workspaceRestart(org.eclipse.m2e.tests.BuildPathManagerTest)  Time elapsed: 11.293 s
10:37:03 testEnableMavenNatureWithNoWorkspace(org.eclipse.m2e.tests.BuildPathManagerTest)  Time elapsed: 7.69 s
10:37:03 test385391_keepCustomSourceEncoding(org.eclipse.m2e.tests.BuildPathManagerTest)  Time elapsed: 3.91 s
10:37:03 testProjectImportWithProfile1(org.eclipse.m2e.tests.BuildPathManagerTest)  Time elapsed: 3.631 s
10:37:03 testProjectImportWithProfile2(org.eclipse.m2e.tests.BuildPathManagerTest)  Time elapsed: 2.685 s
10:37:03 testProjectNameWithNameTemplate(org.eclipse.m2e.tests.BuildPathManagerTest)  Time elapsed: 4.365 s
10:37:03 testProjectImport001_useMavenOutputFolders(org.eclipse.m2e.tests.BuildPathManagerTest)  Time elapsed: 3.553 s
10:37:03 testArchetypeProject(org.eclipse.m2e.tests.BuildPathManagerTest)  Time elapsed: 4.693 s
10:37:03 testClasspathOrderWorkspace001(org.eclipse.m2e.tests.BuildPathManagerTest)  Time elapsed: 7.547 s
10:37:03 testClasspathOrderWorkspace003(org.eclipse.m2e.tests.BuildPathManagerTest)  Time elapsed: 4.031 s
10:37:03 testDownloadSources_001_sourceAttachment(org.eclipse.m2e.tests.BuildPathManagerTest)  Time elapsed: 3.015 s
10:37:03 testMNGECLIPSE_2367_same_sources_resources(org.eclipse.m2e.tests.BuildPathManagerTest)  Time elapsed: 11.343 s
10:37:03 test360962_forbiddenReferencePreference(org.eclipse.m2e.tests.BuildPathManagerTest)  Time elapsed: 11.276 s
10:37:03 test388596_expandedSnapshotDependency(org.eclipse.m2e.tests.BuildPathManagerTest)  Time elapsed: 3.668 s
10:37:03 test359725_resourcesWorkspaceRoot(org.eclipse.m2e.tests.BuildPathManagerTest)  Time elapsed: 1.998 s
10:37:03 testClassifiers(org.eclipse.m2e.tests.BuildPathManagerTest)  Time elapsed: 2.993 s
10:37:03 test486721_overlappingResourceFolders(org.eclipse.m2e.tests.BuildPathManagerTest)  Time elapsed: 3.181 s
10:37:03 test005_dependencyAvailableFromLocalRepoAndWorkspace(org.eclipse.m2e.tests.BuildPathManagerTest)  Time elapsed: 28.162 s
10:37:03 testDisableMavenNature(org.eclipse.m2e.tests.BuildPathManagerTest)  Time elapsed: 4.112 s
10:37:03 testDownloadSources_001_basic(org.eclipse.m2e.tests.BuildPathManagerTest)  Time elapsed: 8.75 s
10:37:03 testDownloadSources_003_customRemoteRepository(org.eclipse.m2e.tests.BuildPathManagerTest)  Time elapsed: 11.18 s
10:37:03 _testProjectImport002_useMavenOutputFolders(org.eclipse.m2e.tests.BuildPathManagerTest) skipped
10:37:03 testMNGECLIPSE_2367_sources_encloses_resources(org.eclipse.m2e.tests.BuildPathManagerTest)  Time elapsed: 14.85 s
10:37:03 testDownloadSources_006_nonMavenProject(org.eclipse.m2e.tests.BuildPathManagerTest)  Time elapsed: 18.129 s
10:37:03 testCompilerSettings14(org.eclipse.m2e.tests.BuildPathManagerTest)  Time elapsed: 4.072 s
10:37:03 testSimpleProjectInExternalLocation(org.eclipse.m2e.tests.BuildPathManagerTest)  Time elapsed: 3.189 s
10:37:03 testDownloadSources_007_missingTestsSources(org.eclipse.m2e.tests.BuildPathManagerTest)  Time elapsed: 2.506 s
10:37:03 testMNGECLIPSE_696_compiler_includes_excludes(org.eclipse.m2e.tests.BuildPathManagerTest)  Time elapsed: 5.102 s
10:37:03 test431080_flatDirectoryLayout(org.eclipse.m2e.tests.BuildPathManagerTest)  Time elapsed: 1.897 s
10:37:03 testDownloadSources_005_classifier(org.eclipse.m2e.tests.BuildPathManagerTest)  Time elapsed: 3.342 s
10:37:03 testDownloadSources_008_fallbackToJavadocWhenMissingSources(org.eclipse.m2e.tests.BuildPathManagerTest)  Time elapsed: 3.005 s
10:37:03 testArchetypeProjectInExternalLocation(org.eclipse.m2e.tests.BuildPathManagerTest)  Time elapsed: 6.456 s
10:37:03 testMNGECLIPSE_2367_testSources_encloses_resources(org.eclipse.m2e.tests.BuildPathManagerTest)  Time elapsed: 2.05 s
10:37:03 testCompilerSettingsJsr14(org.eclipse.m2e.tests.BuildPathManagerTest)  Time elapsed: 1.911 s
10:37:03 testProjectNameTemplateWithProperties(org.eclipse.m2e.tests.BuildPathManagerTest)  Time elapsed: 2.142 s
10:37:03 testDownloadSources_002_javadoconly(org.eclipse.m2e.tests.BuildPathManagerTest)  Time elapsed: 2.424 s
10:37:03 testMavenBuilderOrder(org.eclipse.m2e.tests.BuildPathManagerTest)  Time elapsed: 3.417 s
10:37:03 testDownloadSources_004_testsClassifier(org.eclipse.m2e.tests.BuildPathManagerTest)  Time elapsed: 17.216 s
10:37:03 testEnableMavenNature(org.eclipse.m2e.tests.BuildPathManagerTest)  Time elapsed: 8.231 s
10:37:03 testProjectNameTemplate(org.eclipse.m2e.tests.BuildPathManagerTest)  Time elapsed: 2.875 s
10:37:03 testMNGECLIPSE_1047_localRepoPath(org.eclipse.m2e.tests.BuildPathManagerTest)  Time elapsed: 1.149 s
10:37:03 testCreateSimpleProject(org.eclipse.m2e.tests.BuildPathManagerTest)  Time elapsed: 1.742 s
10:37:03 testMNGECLIPSE_2433_resourcesOutsideBasdir(org.eclipse.m2e.tests.BuildPathManagerTest)  Time elapsed: 3.019 s
10:37:03 testUpdateProjectConfigurationWithWorkspace(org.eclipse.m2e.tests.BuildPathManagerTest)  Time elapsed: 3.048 s
10:37:03 test486721_sourceAndResourceUnderSameNonDefaultFolder(org.eclipse.m2e.tests.BuildPathManagerTest)  Time elapsed: 1.839 s
10:37:03 Running org.eclipse.m2e.tests.lifecycle.MavenPluginMetadataSourceTest
10:37:14 Tests run: 2, Failures: 0, Errors: 0, Skipped: 0, Time elapsed: 11.184 s - in org.eclipse.m2e.tests.lifecycle.MavenPluginMetadataSourceTest
10:37:14 testBasic(org.eclipse.m2e.tests.lifecycle.MavenPluginMetadataSourceTest)  Time elapsed: 1.902 s
10:37:14 test422135_mavenPluginSourceWorkspaceResolution(org.eclipse.m2e.tests.lifecycle.MavenPluginMetadataSourceTest)  Time elapsed: 9.28 s
10:37:14 Running org.eclipse.m2e.tests.lifecycle.PluginExecutionMetadataPrioritiesTest
10:38:04 Tests run: 8, Failures: 0, Errors: 0, Skipped: 0, Time elapsed: 50.604 s - in org.eclipse.m2e.tests.lifecycle.PluginExecutionMetadataPrioritiesTest
10:38:04 testWorkspaceOverridesEclipseExtensions(org.eclipse.m2e.tests.lifecycle.PluginExecutionMetadataPrioritiesTest)  Time elapsed: 3.525 s
10:38:04 testEclipseExtension(org.eclipse.m2e.tests.lifecycle.PluginExecutionMetadataPrioritiesTest)  Time elapsed: 15.813 s
10:38:04 testDefaultMetadataSource(org.eclipse.m2e.tests.lifecycle.PluginExecutionMetadataPrioritiesTest)  Time elapsed: 4.093 s
10:38:04 testPomOverridesWorkspace(org.eclipse.m2e.tests.lifecycle.PluginExecutionMetadataPrioritiesTest)  Time elapsed: 10.322 s
10:38:04 testEmbeddedInPom(org.eclipse.m2e.tests.lifecycle.PluginExecutionMetadataPrioritiesTest)  Time elapsed: 2.611 s
10:38:04 testReferencedFromPom(org.eclipse.m2e.tests.lifecycle.PluginExecutionMetadataPrioritiesTest)  Time elapsed: 2.844 s
10:38:04 testParent(org.eclipse.m2e.tests.lifecycle.PluginExecutionMetadataPrioritiesTest)  Time elapsed: 7.091 s
10:38:04 testWorkspace(org.eclipse.m2e.tests.lifecycle.PluginExecutionMetadataPrioritiesTest)  Time elapsed: 4.303 s
10:38:04 Running org.eclipse.m2e.tests.lifecycle.LifecycleComparisonTest
10:38:19 Tests run: 3, Failures: 0, Errors: 0, Skipped: 0, Time elapsed: 14.702 s - in org.eclipse.m2e.tests.lifecycle.LifecycleComparisonTest
10:38:19 testPluginConfigurationChange(org.eclipse.m2e.tests.lifecycle.LifecycleComparisonTest)  Time elapsed: 9.189 s
10:38:19 testSameProject(org.eclipse.m2e.tests.lifecycle.LifecycleComparisonTest)  Time elapsed: 2.859 s
10:38:19 testPluginVersionChange(org.eclipse.m2e.tests.lifecycle.LifecycleComparisonTest)  Time elapsed: 2.654 s
10:38:19 Running org.eclipse.m2e.tests.lifecycle.LifecycleMappingTest
10:38:44 running TEST_SECONDARY3
10:38:44 running TEST_SECONDARY4
10:38:44 running TEST_SECONDARY6
10:38:44 running TEST_SECONDARY5
10:41:06 Tests run: 35, Failures: 0, Errors: 0, Skipped: 0, Time elapsed: 166.627 s - in org.eclipse.m2e.tests.lifecycle.LifecycleMappingTest
10:41:06 testGetLifecycleMappingMetadata(org.eclipse.m2e.tests.lifecycle.LifecycleMappingTest)  Time elapsed: 3.017 s
10:41:06 test387736_missingAction(org.eclipse.m2e.tests.lifecycle.LifecycleMappingTest)  Time elapsed: 4.058 s
10:41:06 testProfilesAndProperties(org.eclipse.m2e.tests.lifecycle.LifecycleMappingTest)  Time elapsed: 1.948 s
10:41:06 testConfiguratorsFollowPhaseOrder(org.eclipse.m2e.tests.lifecycle.LifecycleMappingTest)  Time elapsed: 1.649 s
10:41:06 testSecondaryConfiguratorsCustom(org.eclipse.m2e.tests.lifecycle.LifecycleMappingTest)  Time elapsed: 1.622 s
10:41:06 testDuplicatePluginExecution1(org.eclipse.m2e.tests.lifecycle.LifecycleMappingTest)  Time elapsed: 1.652 s
10:41:06 testDuplicatePluginExecution2(org.eclipse.m2e.tests.lifecycle.LifecycleMappingTest)  Time elapsed: 2.552 s
10:41:06 testNondeafaultLifecycles(org.eclipse.m2e.tests.lifecycle.LifecycleMappingTest)  Time elapsed: 3.106 s
10:41:06 testOrder(org.eclipse.m2e.tests.lifecycle.LifecycleMappingTest)  Time elapsed: 6.448 s
10:41:06 testSetNoopMappingDuringImport(org.eclipse.m2e.tests.lifecycle.LifecycleMappingTest)  Time elapsed: 3.276 s
10:41:06 testUseDefaultLifecycleMappingMetadataSource(org.eclipse.m2e.tests.lifecycle.LifecycleMappingTest)  Time elapsed: 2.316 s
10:41:06 testNotCoveredMojoExecutionIgnored(org.eclipse.m2e.tests.lifecycle.LifecycleMappingTest)  Time elapsed: 4.294 s
10:41:06 testNonresolvableExecutionPlan(org.eclipse.m2e.tests.lifecycle.LifecycleMappingTest)  Time elapsed: 6.223 s
10:41:06 testFailToGetPluginParameterValue(org.eclipse.m2e.tests.lifecycle.LifecycleMappingTest)  Time elapsed: 15.335 s
10:41:06 testSetCustomizableMappingDuringImport(org.eclipse.m2e.tests.lifecycle.LifecycleMappingTest)  Time elapsed: 6.066 s
10:41:06 testSameConfiguratorUsedTwice(org.eclipse.m2e.tests.lifecycle.LifecycleMappingTest)  Time elapsed: 3.474 s
10:41:06 testUnknownPackagingType(org.eclipse.m2e.tests.lifecycle.LifecycleMappingTest)  Time elapsed: 2.175 s
10:41:06 testGetLifecycleMappingMetadataMerge(org.eclipse.m2e.tests.lifecycle.LifecycleMappingTest)  Time elapsed: 2.047 s
10:41:06 testSecondaryConfiguratorsCustomizable(org.eclipse.m2e.tests.lifecycle.LifecycleMappingTest)  Time elapsed: 1.624 s
10:41:06 testIncompatibleVersion(org.eclipse.m2e.tests.lifecycle.LifecycleMappingTest)  Time elapsed: 4.211 s
10:41:06 testCompatibleVersion(org.eclipse.m2e.tests.lifecycle.LifecycleMappingTest)  Time elapsed: 2.042 s
10:41:06 testLifecycleMappingSpecifiedInMetadata(org.eclipse.m2e.tests.lifecycle.LifecycleMappingTest)  Time elapsed: 8.288 s
10:41:06 testPomPackagingType(org.eclipse.m2e.tests.lifecycle.LifecycleMappingTest)  Time elapsed: 2.544 s
10:41:06 testNotCoveredMojoExecutions(org.eclipse.m2e.tests.lifecycle.LifecycleMappingTest)  Time elapsed: 3.097 s
10:41:06 test494858ProcessingInstructions(org.eclipse.m2e.tests.lifecycle.LifecycleMappingTest)  Time elapsed: 5.736 s
10:41:06 testPackagingTypeMismatch(org.eclipse.m2e.tests.lifecycle.LifecycleMappingTest)  Time elapsed: 7.023 s
10:41:06 testGetLifecycleMappingMetadataOverride(org.eclipse.m2e.tests.lifecycle.LifecycleMappingTest)  Time elapsed: 3.964 s
10:41:06 testMissingLifecycleMappingMetadata(org.eclipse.m2e.tests.lifecycle.LifecycleMappingTest)  Time elapsed: 11.769 s
10:41:06 testMissingMapping(org.eclipse.m2e.tests.lifecycle.LifecycleMappingTest)  Time elapsed: 3.777 s
10:41:06 testDefaultJarLifecycleMapping(org.eclipse.m2e.tests.lifecycle.LifecycleMappingTest)  Time elapsed: 4.48 s
10:41:06 testMissingVersionRangeInPluginExecutionFilter(org.eclipse.m2e.tests.lifecycle.LifecycleMappingTest)  Time elapsed: 3.197 s
10:41:06 testDuplicatePackagingTypeMetadata(org.eclipse.m2e.tests.lifecycle.LifecycleMappingTest)  Time elapsed: 3.32 s
10:41:06 test371618_NullLifecycleMappingPluginVersion(org.eclipse.m2e.tests.lifecycle.LifecycleMappingTest)  Time elapsed: 8.346 s
10:41:06 testNotCoveredMojoExecutionWarnings(org.eclipse.m2e.tests.lifecycle.LifecycleMappingTest)  Time elapsed: 16.82 s
10:41:06 testNotInterestingPhaseConfigurator(org.eclipse.m2e.tests.lifecycle.LifecycleMappingTest)  Time elapsed: 5.129 s
10:41:06 Running org.eclipse.m2e.tests.lifecycle.LifecycleMappingMetadataPrioritiesTest
10:41:40 Tests run: 5, Failures: 0, Errors: 0, Skipped: 0, Time elapsed: 34.079 s - in org.eclipse.m2e.tests.lifecycle.LifecycleMappingMetadataPrioritiesTest
10:41:40 testEclipseExtension(org.eclipse.m2e.tests.lifecycle.LifecycleMappingMetadataPrioritiesTest)  Time elapsed: 8.81 s
10:41:40 testDefaultMetadataSource(org.eclipse.m2e.tests.lifecycle.LifecycleMappingMetadataPrioritiesTest)  Time elapsed: 6.327 s
10:41:40 testEmbeddedInPom(org.eclipse.m2e.tests.lifecycle.LifecycleMappingMetadataPrioritiesTest)  Time elapsed: 4.536 s
10:41:40 testReferencedFromPom(org.eclipse.m2e.tests.lifecycle.LifecycleMappingMetadataPrioritiesTest)  Time elapsed: 8.648 s
10:41:40 testParent(org.eclipse.m2e.tests.lifecycle.LifecycleMappingMetadataPrioritiesTest)  Time elapsed: 5.757 s
10:41:40 Running org.eclipse.m2e.tests.lifecycle.PluginExecutionActionsTest
10:42:15 Tests run: 7, Failures: 0, Errors: 0, Skipped: 0, Time elapsed: 35.108 s - in org.eclipse.m2e.tests.lifecycle.PluginExecutionActionsTest
10:42:15 testMojoExecutionIgnore(org.eclipse.m2e.tests.lifecycle.PluginExecutionActionsTest)  Time elapsed: 5.28 s
10:42:15 testMojoExecutionErrorWithMessage(org.eclipse.m2e.tests.lifecycle.PluginExecutionActionsTest)  Time elapsed: 7.007 s
10:42:15 testMojoExecutionError(org.eclipse.m2e.tests.lifecycle.PluginExecutionActionsTest)  Time elapsed: 4.271 s
10:42:15 testMojoExecutionConfigurator(org.eclipse.m2e.tests.lifecycle.PluginExecutionActionsTest)  Time elapsed: 5.391 s
10:42:15 testMojoExecutionExecute(org.eclipse.m2e.tests.lifecycle.PluginExecutionActionsTest)  Time elapsed: 4.872 s
10:42:15 testMojoExecutionIgnoreWithMessage(org.eclipse.m2e.tests.lifecycle.PluginExecutionActionsTest)  Time elapsed: 4.154 s
10:42:15 testMojoExecutionExecuteWithMessage(org.eclipse.m2e.tests.lifecycle.PluginExecutionActionsTest)  Time elapsed: 4.132 s
10:42:15 Running org.eclipse.m2e.tests.launch.MavenLauncherConfigurationHandlerTest
10:42:24 Tests run: 1, Failures: 0, Errors: 0, Skipped: 0, Time elapsed: 8.826 s - in org.eclipse.m2e.tests.launch.MavenLauncherConfigurationHandlerTest
10:42:24 test421015_workspaceProjectLibraryClasspathEntries(org.eclipse.m2e.tests.launch.MavenLauncherConfigurationHandlerTest)  Time elapsed: 8.826 s
10:42:24 Running org.eclipse.m2e.tests.launch.MavenRuntimeClasspathProviderTest
10:44:03 Tests run: 7, Failures: 0, Errors: 0, Skipped: 0, Time elapsed: 99.605 s - in org.eclipse.m2e.tests.launch.MavenRuntimeClasspathProviderTest
10:44:03 testAddJUnit5DependenciesWithEngine(org.eclipse.m2e.tests.launch.MavenRuntimeClasspathProviderTest)  Time elapsed: 15.285 s
10:44:03 testClasspathScopeRuntime(org.eclipse.m2e.tests.launch.MavenRuntimeClasspathProviderTest)  Time elapsed: 22.096 s
10:44:03 testAddJUnit5DependenciesAPIOnlyDisabled(org.eclipse.m2e.tests.launch.MavenRuntimeClasspathProviderTest)  Time elapsed: 6.548 s
10:44:03 testAddJUnit5DependenciesWithLauncher(org.eclipse.m2e.tests.launch.MavenRuntimeClasspathProviderTest)  Time elapsed: 6.687 s
10:44:03 testClasspathScopeTest(org.eclipse.m2e.tests.launch.MavenRuntimeClasspathProviderTest)  Time elapsed: 18.245 s
10:44:03 testAddJUnit5DependenciesAggregator(org.eclipse.m2e.tests.launch.MavenRuntimeClasspathProviderTest)  Time elapsed: 11.731 s
10:44:03 testAddJUnit5DependenciesAPIOnly(org.eclipse.m2e.tests.launch.MavenRuntimeClasspathProviderTest)  Time elapsed: 19.012 s
10:44:03 Running org.eclipse.m2e.tests.launch.MavenLaunchDelegateTest
10:44:03 Tests run: 6, Failures: 0, Errors: 0, Skipped: 0, Time elapsed: 0.04 s - in org.eclipse.m2e.tests.launch.MavenLaunchDelegateTest
10:44:03 testGetVMArguments332WithParent(org.eclipse.m2e.tests.launch.MavenLaunchDelegateTest)  Time elapsed: 0.011 s
10:44:03 testGetVMArgumentsSubstituteMultiModuleDir(org.eclipse.m2e.tests.launch.MavenLaunchDelegateTest)  Time elapsed: 0.005 s
10:44:03 testUserSettingsProgramArguments(org.eclipse.m2e.tests.launch.MavenLaunchDelegateTest)  Time elapsed: 0.014 s
10:44:03 testGlobalSettingsProgramArguments(org.eclipse.m2e.tests.launch.MavenLaunchDelegateTest)  Time elapsed: 0.007 s
10:44:03 testGetVMArguments325(org.eclipse.m2e.tests.launch.MavenLaunchDelegateTest)  Time elapsed: 0 s
10:44:03 testGetVMArguments331(org.eclipse.m2e.tests.launch.MavenLaunchDelegateTest)  Time elapsed: 0 s
10:44:03 Running org.eclipse.m2e.tests.launch.LaunchingUtilsTest
10:44:07 Tests run: 1, Failures: 0, Errors: 0, Skipped: 0, Time elapsed: 3.289 s - in org.eclipse.m2e.tests.launch.LaunchingUtilsTest
10:44:07 testGenerateProjectLocationVariableExpression(org.eclipse.m2e.tests.launch.LaunchingUtilsTest)  Time elapsed: 3.289 s
10:44:07 Running org.eclipse.m2e.tests.ui.editing.AddDependencyOperationTest
10:44:07 Tests run: 5, Failures: 0, Errors: 0, Skipped: 0, Time elapsed: 0.026 s - in org.eclipse.m2e.tests.ui.editing.AddDependencyOperationTest
10:44:07 testNoDependenciesElement(org.eclipse.m2e.tests.ui.editing.AddDependencyOperationTest)  Time elapsed: 0.008 s
10:44:07 testEmptyDependenciesElement(org.eclipse.m2e.tests.ui.editing.AddDependencyOperationTest)  Time elapsed: 0.004 s
10:44:07 testDuplicatedDependency(org.eclipse.m2e.tests.ui.editing.AddDependencyOperationTest)  Time elapsed: 0.001 s
10:44:07 testWithDependencies(org.eclipse.m2e.tests.ui.editing.AddDependencyOperationTest)  Time elapsed: 0.004 s
10:44:07 testExclusionsAdded(org.eclipse.m2e.tests.ui.editing.AddDependencyOperationTest)  Time elapsed: 0.008 s
10:44:07 Running org.eclipse.m2e.tests.ui.editing.AddExclusionOperationTest
10:44:07 Tests run: 6, Failures: 0, Errors: 0, Skipped: 0, Time elapsed: 0.009 s - in org.eclipse.m2e.tests.ui.editing.AddExclusionOperationTest
10:44:07 testAddExclusion(org.eclipse.m2e.tests.ui.editing.AddExclusionOperationTest)  Time elapsed: 0.004 s
10:44:07 testAddExclusion_existingExclusion(org.eclipse.m2e.tests.ui.editing.AddExclusionOperationTest)  Time elapsed: 0.003 s
10:44:07 testAddExclusion_duplicateExclusion(org.eclipse.m2e.tests.ui.editing.AddExclusionOperationTest)  Time elapsed: 0.001 s
10:44:07 testMissingDependency_withDependencies(org.eclipse.m2e.tests.ui.editing.AddExclusionOperationTest)  Time elapsed: 0 s
10:44:07 testMissingDependency_emptyDependenciesElement(org.eclipse.m2e.tests.ui.editing.AddExclusionOperationTest)  Time elapsed: 0 s
10:44:07 testMissingDependency_noDependenciesElement(org.eclipse.m2e.tests.ui.editing.AddExclusionOperationTest)  Time elapsed: 0 s
10:44:07 Running org.eclipse.m2e.tests.ui.editing.PomHelperTest
10:44:07 Tests run: 7, Failures: 0, Errors: 0, Skipped: 0, Time elapsed: 0.015 s - in org.eclipse.m2e.tests.ui.editing.PomHelperTest
10:44:07 testCreateDependencyInEmptyList(org.eclipse.m2e.tests.ui.editing.PomHelperTest)  Time elapsed: 0.003 s
10:44:07 testCreatePlugin(org.eclipse.m2e.tests.ui.editing.PomHelperTest)  Time elapsed: 0.004 s
10:44:07 testFindDependencies(org.eclipse.m2e.tests.ui.editing.PomHelperTest)  Time elapsed: 0 s
10:44:07 testFindDependenciesMissing(org.eclipse.m2e.tests.ui.editing.PomHelperTest)  Time elapsed: 0 s
10:44:07 testCreatePluginInEmptyList(org.eclipse.m2e.tests.ui.editing.PomHelperTest)  Time elapsed: 0.003 s
10:44:07 testCreateDependency(org.eclipse.m2e.tests.ui.editing.PomHelperTest)  Time elapsed: 0.003 s
10:44:07 testFindDependency(org.eclipse.m2e.tests.ui.editing.PomHelperTest)  Time elapsed: 0.001 s
10:44:07 Running org.eclipse.m2e.tests.ui.editing.PomEditsTest
10:44:07 Tests run: 5, Failures: 0, Errors: 0, Skipped: 0, Time elapsed: 0.005 s - in org.eclipse.m2e.tests.ui.editing.PomEditsTest
10:44:07 testFindChildren(org.eclipse.m2e.tests.ui.editing.PomEditsTest)  Time elapsed: 0 s
10:44:07 testRemoveChild(org.eclipse.m2e.tests.ui.editing.PomEditsTest)  Time elapsed: 0.002 s
10:44:07 testMatchers(org.eclipse.m2e.tests.ui.editing.PomEditsTest)  Time elapsed: 0.001 s
10:44:07 testFindChild(org.eclipse.m2e.tests.ui.editing.PomEditsTest)  Time elapsed: 0 s
10:44:07 testRemoveIfNoChildElement(org.eclipse.m2e.tests.ui.editing.PomEditsTest)  Time elapsed: 0.001 s
10:44:07 Running org.eclipse.m2e.tests.ui.editing.RemoveDependencyOperationTest
10:44:07 Tests run: 4, Failures: 0, Errors: 0, Skipped: 0, Time elapsed: 0.003 s - in org.eclipse.m2e.tests.ui.editing.RemoveDependencyOperationTest
10:44:07 testMissingDependency_withDependencies(org.eclipse.m2e.tests.ui.editing.RemoveDependencyOperationTest)  Time elapsed: 0.001 s
10:44:07 testRemoveDependency(org.eclipse.m2e.tests.ui.editing.RemoveDependencyOperationTest)  Time elapsed: 0 s
10:44:07 testMissingDependency_emptyDependenciesElement(org.eclipse.m2e.tests.ui.editing.RemoveDependencyOperationTest)  Time elapsed: 0 s
10:44:07 testMissingDependency_noDependenciesElement(org.eclipse.m2e.tests.ui.editing.RemoveDependencyOperationTest)  Time elapsed: 0.001 s
10:44:07 Running org.eclipse.m2e.tests.ui.OpenPomActionTest
10:44:12 Tests run: 1, Failures: 0, Errors: 0, Skipped: 0, Time elapsed: 5.434 s - in org.eclipse.m2e.tests.ui.OpenPomActionTest
10:44:12 test454759_openEditor(org.eclipse.m2e.tests.ui.OpenPomActionTest)  Time elapsed: 5.423 s
10:44:12 Running org.eclipse.m2e.tests.ui.MavenPropertyTesterTest
10:44:15 Tests run: 1, Failures: 0, Errors: 0, Skipped: 0, Time elapsed: 2.543 s - in org.eclipse.m2e.tests.ui.MavenPropertyTesterTest
10:44:15 testIsBuildDirectory(org.eclipse.m2e.tests.ui.MavenPropertyTesterTest)  Time elapsed: 2.542 s
10:44:15 Running org.eclipse.m2e.tests.archetype.ArchetypeUtilTest
10:44:15 Tests run: 2, Failures: 0, Errors: 0, Skipped: 0, Time elapsed: 0.002 s - in org.eclipse.m2e.tests.archetype.ArchetypeUtilTest
10:44:15 testAreEqual(org.eclipse.m2e.tests.archetype.ArchetypeUtilTest)  Time elapsed: 0.001 s
10:44:15 testGetHashCode(org.eclipse.m2e.tests.archetype.ArchetypeUtilTest)  Time elapsed: 0 s
10:44:15 Running org.eclipse.m2e.tests.archetype.ArchetypeManagerTest
10:44:16 Tests run: 12, Failures: 0, Errors: 0, Skipped: 0, Time elapsed: 1.677 s - in org.eclipse.m2e.tests.archetype.ArchetypeManagerTest
10:44:16 test371775_archetypeRepoAuthentication(org.eclipse.m2e.tests.archetype.ArchetypeManagerTest)  Time elapsed: 0.006 s
10:44:16 testEmbeddedLocalArchetypeCatalogFactory(org.eclipse.m2e.tests.archetype.ArchetypeManagerTest)  Time elapsed: 0.001 s
10:44:16 testArchetypeManagerSaveRestore(org.eclipse.m2e.tests.archetype.ArchetypeManagerTest)  Time elapsed: 0.571 s
10:44:16 testRepositoryUrlFromRemoteArchetypeCatalogs(org.eclipse.m2e.tests.archetype.ArchetypeManagerTest)  Time elapsed: 0.008 s
10:44:16 testArchetypeManager(org.eclipse.m2e.tests.archetype.ArchetypeManagerTest)  Time elapsed: 0.588 s
10:44:16 testAddRemoteCatalog(org.eclipse.m2e.tests.archetype.ArchetypeManagerTest)  Time elapsed: 0.006 s
10:44:16 testActiveArchetypeCatalogs(org.eclipse.m2e.tests.archetype.ArchetypeManagerTest)  Time elapsed: 0.054 s
10:44:16 testBadLocalArchetypeCatalogFactory(org.eclipse.m2e.tests.archetype.ArchetypeManagerTest)  Time elapsed: 0.001 s
10:44:16 testRemoteArchetypeCatalogFactory(org.eclipse.m2e.tests.archetype.ArchetypeManagerTest)  Time elapsed: 0 s
10:44:16 test359855_localArchetypeWithProperties(org.eclipse.m2e.tests.archetype.ArchetypeManagerTest)  Time elapsed: 0.081 s
10:44:16 testLocalArchetypeCatalogFactory(org.eclipse.m2e.tests.archetype.ArchetypeManagerTest)  Time elapsed: 0.001 s
10:44:16 test387784_remoteArchetypeWithProperties(org.eclipse.m2e.tests.archetype.ArchetypeManagerTest)  Time elapsed: 0.36 s
10:44:16 Running org.eclipse.m2e.tests.ProjectConfigurationManagerTest
10:46:24 [INFO] ----------------------------------------------------------------------------
10:46:24 [INFO] Using following parameters for creating project from Archetype: mngeclipse-2110:1.0
10:46:24 [INFO] ----------------------------------------------------------------------------
10:46:24 [INFO] Parameter: groupId, Value: mngeclipse-2110
10:46:24 [INFO] Parameter: artifactId, Value: mngeclipse-2110
10:46:24 [INFO] Parameter: version, Value: 0.0.1-SNAPSHOT
10:46:24 [INFO] Parameter: package, Value: jar
10:46:24 [INFO] Parameter: packageInPathFormat, Value: jar
10:46:24 [INFO] project created from Archetype in dir: /home/jenkins/agent/workspace/m2e-sonarqube/m2e-core-tests/org.eclipse.m2e.tests/target/work/data/mngeclipse-2110
10:48:02 [INFO] ----------------------------------------------------------------------------
10:48:02 [INFO] Using following parameters for creating project from Old (1.x) Archetype: maven-archetype-quickstart:1.1
10:48:02 [INFO] ----------------------------------------------------------------------------
10:48:02 [INFO] Parameter: basedir, Value: /home/jenkins/agent/workspace/m2e-sonarqube/m2e-core-tests/org.eclipse.m2e.tests/target/work/data/parent002
10:48:02 [INFO] Parameter: package, Value: jar
10:48:02 [INFO] Parameter: groupId, Value: archetyped
10:48:02 [INFO] Parameter: artifactId, Value: archetyped
10:48:02 [INFO] Parameter: packageName, Value: jar
10:48:02 [INFO] Parameter: version, Value: 0.0.1-SNAPSHOT
10:48:02 [INFO] project created from Old (1.x) Archetype in dir: /home/jenkins/agent/workspace/m2e-sonarqube/m2e-core-tests/org.eclipse.m2e.tests/target/work/data/parent002/archetyped
10:50:36 Tests run: 23, Failures: 0, Errors: 0, Skipped: 0, Time elapsed: 379.251 s - in org.eclipse.m2e.tests.ProjectConfigurationManagerTest
10:50:36 testAddRemoveMavenBuilder(org.eclipse.m2e.tests.ProjectConfigurationManagerTest)  Time elapsed: 39.275 s
10:50:36 testImportJavaProjectWithUnknownPackaging(org.eclipse.m2e.tests.ProjectConfigurationManagerTest)  Time elapsed: 8.712 s
10:50:36 testHiddenFolderForSimpleModule(org.eclipse.m2e.tests.ProjectConfigurationManagerTest)  Time elapsed: 3.125 s
10:50:36 testConfigureProjectEncodingForBasicProject(org.eclipse.m2e.tests.ProjectConfigurationManagerTest)  Time elapsed: 3.542 s
10:50:36 testAddRemoveMavenBuilderDisabled(org.eclipse.m2e.tests.ProjectConfigurationManagerTest)  Time elapsed: 1.885 s
10:50:36 testExtractionOfCompilerSettingsDespiteErrorsInExecutionPlan(org.eclipse.m2e.tests.ProjectConfigurationManagerTest)  Time elapsed: 16.097 s
10:50:36 testRevertToContainerDefinedEncoding(org.eclipse.m2e.tests.ProjectConfigurationManagerTest)  Time elapsed: 5.876 s
10:50:36 testIgnoreStaleProjectConfiguration(org.eclipse.m2e.tests.ProjectConfigurationManagerTest)  Time elapsed: 5.511 s
10:50:36 test397251_forcePluginResolutionUpdate(org.eclipse.m2e.tests.ProjectConfigurationManagerTest)  Time elapsed: 33.939 s
10:50:36 testResolutionOfArchetypeFromRepository(org.eclipse.m2e.tests.ProjectConfigurationManagerTest)  Time elapsed: 72.029 s
10:50:36 testStaleProjectConfigurationMarkerAfterFixingMissingBuildExtension(org.eclipse.m2e.tests.ProjectConfigurationManagerTest)  Time elapsed: 16.992 s
10:50:36 test447460MultipleUpdateConfiguration(org.eclipse.m2e.tests.ProjectConfigurationManagerTest)  Time elapsed: 15.085 s
10:50:36 testHiddenFolderForArchetypeModule(org.eclipse.m2e.tests.ProjectConfigurationManagerTest)  Time elapsed: 5.074 s
10:50:36 testStaleProjectConfigurationMarkerAfterWorkspaceRestart(org.eclipse.m2e.tests.ProjectConfigurationManagerTest)  Time elapsed: 7.445 s
10:50:36 testStaleProjectConfigurationWarningMarker(org.eclipse.m2e.tests.ProjectConfigurationManagerTest)  Time elapsed: 20.052 s
10:50:36 testAutomaticUpdateProjectConfigurationMarker(org.eclipse.m2e.tests.ProjectConfigurationManagerTest)  Time elapsed: 10.192 s
10:50:36 test473953_ProjectCreationListener(org.eclipse.m2e.tests.ProjectConfigurationManagerTest)  Time elapsed: 8.828 s
10:50:36 testWorkspaceResolutionOfInterModuleDependenciesDuringImport(org.eclipse.m2e.tests.ProjectConfigurationManagerTest)  Time elapsed: 30.053 s
10:50:36 testBasedirRenameRequired(org.eclipse.m2e.tests.ProjectConfigurationManagerTest)  Time elapsed: 15.57 s
10:50:36 testStaleProjectConfigurationMarker(org.eclipse.m2e.tests.ProjectConfigurationManagerTest)  Time elapsed: 13.866 s
10:50:36 testKeepEncodingSetByUserForSubfoldersAndFiles(org.eclipse.m2e.tests.ProjectConfigurationManagerTest)  Time elapsed: 16.201 s
10:50:36 testBasedirRenameNo(org.eclipse.m2e.tests.ProjectConfigurationManagerTest)  Time elapsed: 6.744 s
10:50:36 testBasicUpdateConfiguration(org.eclipse.m2e.tests.ProjectConfigurationManagerTest)  Time elapsed: 23.152 s
10:50:36 Running org.eclipse.m2e.tests.ProfileSupportTest
10:50:41 Tests run: 1, Failures: 0, Errors: 0, Skipped: 0, Time elapsed: 4.887 s - in org.eclipse.m2e.tests.ProfileSupportTest
10:50:41 test337353_deactivateProfile(org.eclipse.m2e.tests.ProfileSupportTest)  Time elapsed: 4.886 s
10:50:41 Running org.eclipse.m2e.tests.JavaUtilTest
10:50:41 Tests run: 1, Failures: 0, Errors: 0, Skipped: 0, Time elapsed: 0.003 s - in org.eclipse.m2e.tests.JavaUtilTest
10:50:41 testGetDefaultJavaPackage(org.eclipse.m2e.tests.JavaUtilTest)  Time elapsed: 0.003 s
10:50:41 Running org.eclipse.m2e.tests.ProjectRegistryManagerTest
10:54:09 Tests run: 50, Failures: 0, Errors: 0, Skipped: 1, Time elapsed: 208.287 s - in org.eclipse.m2e.tests.ProjectRegistryManagerTest
10:54:10 test020_moduleWithPomErrors(org.eclipse.m2e.tests.ProjectRegistryManagerTest)  Time elapsed: 1.186 s
10:54:10 test356645_redundantSnapshotResolution(org.eclipse.m2e.tests.ProjectRegistryManagerTest)  Time elapsed: 1.391 s
10:54:10 test000_pom_simple(org.eclipse.m2e.tests.ProjectRegistryManagerTest)  Time elapsed: 6.327 s
10:54:10 test008_staleMissingParent(org.eclipse.m2e.tests.ProjectRegistryManagerTest)  Time elapsed: 3.114 s
10:54:10 _testExtensionPluginResolution(org.eclipse.m2e.tests.ProjectRegistryManagerTest) skipped
10:54:10 test435692_affected_changes(org.eclipse.m2e.tests.ProjectRegistryManagerTest)  Time elapsed: 11.557 s
10:54:10 test007_staleDependencies(org.eclipse.m2e.tests.ProjectRegistryManagerTest)  Time elapsed: 11.32 s
10:54:10 test001_missingParent(org.eclipse.m2e.tests.ProjectRegistryManagerTest)  Time elapsed: 3.155 s
10:54:10 testWorkspaceDependencyVersionRange(org.eclipse.m2e.tests.ProjectRegistryManagerTest)  Time elapsed: 1.993 s
10:54:10 test000_removeClosed(org.eclipse.m2e.tests.ProjectRegistryManagerTest)  Time elapsed: 2.401 s
10:54:10 test013_missingDependencyMarker(org.eclipse.m2e.tests.ProjectRegistryManagerTest)  Time elapsed: 30.863 s
10:54:10 test436929_import_refresh(org.eclipse.m2e.tests.ProjectRegistryManagerTest)  Time elapsed: 9.409 s
10:54:10 testGlobalUpdatePolicyNever(org.eclipse.m2e.tests.ProjectRegistryManagerTest)  Time elapsed: 1.324 s
10:54:10 testRepositoryMetadataCacheUsed(org.eclipse.m2e.tests.ProjectRegistryManagerTest)  Time elapsed: 3.41 s
10:54:10 test008_staleMissingParent2(org.eclipse.m2e.tests.ProjectRegistryManagerTest)  Time elapsed: 1.135 s
10:54:10 test015_refreshOffline(org.eclipse.m2e.tests.ProjectRegistryManagerTest)  Time elapsed: 1.061 s
10:54:10 test017_moduleRefresh(org.eclipse.m2e.tests.ProjectRegistryManagerTest)  Time elapsed: 1.815 s
10:54:10 test000_simple(org.eclipse.m2e.tests.ProjectRegistryManagerTest)  Time elapsed: 2.083 s
10:54:10 test005_dependencyAvailableFromLocalRepoAndWorkspace(org.eclipse.m2e.tests.ProjectRegistryManagerTest)  Time elapsed: 1.205 s
10:54:10 test463075_extensionAndPluginRealm(org.eclipse.m2e.tests.ProjectRegistryManagerTest)  Time elapsed: 1.2 s
10:54:10 testPropertiesSubstitution(org.eclipse.m2e.tests.ProjectRegistryManagerTest)  Time elapsed: 1.264 s
10:54:10 test000_deletePom(org.eclipse.m2e.tests.ProjectRegistryManagerTest)  Time elapsed: 1.776 s
10:54:10 test006_parentAvailableFromLocalRepoAndWorkspace(org.eclipse.m2e.tests.ProjectRegistryManagerTest)  Time elapsed: 3.68 s
10:54:10 test005_snapshotAvailableFromLocalRepoAndWorkspace(org.eclipse.m2e.tests.ProjectRegistryManagerTest)  Time elapsed: 8.092 s
10:54:10 test007_changedVersion(org.eclipse.m2e.tests.ProjectRegistryManagerTest)  Time elapsed: 1.302 s
10:54:10 test000_eventMerge(org.eclipse.m2e.tests.ProjectRegistryManagerTest)  Time elapsed: 1.44 s
10:54:10 testWorkspaceResolutionApi(org.eclipse.m2e.tests.ProjectRegistryManagerTest)  Time elapsed: 1.273 s
10:54:10 testOptionalDependencies(org.eclipse.m2e.tests.ProjectRegistryManagerTest)  Time elapsed: 1.361 s
10:54:10 test460983_parentVersionRange(org.eclipse.m2e.tests.ProjectRegistryManagerTest)  Time elapsed: 1.23 s
10:54:10 test009_noworkspaceResolution(org.eclipse.m2e.tests.ProjectRegistryManagerTest)  Time elapsed: 3.444 s
10:54:10 test001_dependencyOnModuleWithInheritedGroupAndVersion(org.eclipse.m2e.tests.ProjectRegistryManagerTest)  Time elapsed: 1.384 s
10:54:10 testDependencyScopeChanged(org.eclipse.m2e.tests.ProjectRegistryManagerTest)  Time elapsed: 25.071 s
10:54:10 test007_newTransitiveDependency(org.eclipse.m2e.tests.ProjectRegistryManagerTest)  Time elapsed: 1.248 s
10:54:10 testCorrelatedMissingDependency(org.eclipse.m2e.tests.ProjectRegistryManagerTest)  Time elapsed: 1.227 s
10:54:10 test013_cantParsePomMarker(org.eclipse.m2e.tests.ProjectRegistryManagerTest)  Time elapsed: 2.174 s
10:54:10 test006_parentAvailableFromLocalRepoAndWorkspace01(org.eclipse.m2e.tests.ProjectRegistryManagerTest)  Time elapsed: 1.316 s
10:54:10 testPluginMainArtifactNotResolvedFromWorkspace(org.eclipse.m2e.tests.ProjectRegistryManagerTest)  Time elapsed: 1.125 s
10:54:10 test000_removeDeleted(org.eclipse.m2e.tests.ProjectRegistryManagerTest)  Time elapsed: 1.297 s
10:54:10 testEnvironmentVariablesConsidered(org.eclipse.m2e.tests.ProjectRegistryManagerTest)  Time elapsed: 1.614 s
10:54:10 test441257_stalePluginRealms(org.eclipse.m2e.tests.ProjectRegistryManagerTest)  Time elapsed: 1.653 s
10:54:10 test418674_ChecksumPolicyFail(org.eclipse.m2e.tests.ProjectRegistryManagerTest)  Time elapsed: 4.812 s
10:54:10 test418674_ChecksumPolicyWarn(org.eclipse.m2e.tests.ProjectRegistryManagerTest)  Time elapsed: 5.629 s
10:54:10 test021_dependencyVersionRange(org.eclipse.m2e.tests.ProjectRegistryManagerTest)  Time elapsed: 9.049 s
10:54:10 test405090_staleBuildExtensionsResolutionError(org.eclipse.m2e.tests.ProjectRegistryManagerTest)  Time elapsed: 1.713 s
10:54:10 test007_dependentRefreshAfterWorkspaceRestart(org.eclipse.m2e.tests.ProjectRegistryManagerTest)  Time elapsed: 5.453 s
10:54:10 testJdkProfileActivation(org.eclipse.m2e.tests.ProjectRegistryManagerTest)  Time elapsed: 3.517 s
10:54:10 test022_noChangeReloadWithUnrelatedRemoveProject(org.eclipse.m2e.tests.ProjectRegistryManagerTest)  Time elapsed: 2.254 s
10:54:10 test012_downloadExternalDependency(org.eclipse.m2e.tests.ProjectRegistryManagerTest)  Time elapsed: 12.358 s
10:54:10 test441257_stalePluginRealms_withParent(org.eclipse.m2e.tests.ProjectRegistryManagerTest)  Time elapsed: 2.824 s
10:54:10 test453995_dependencyManagementVersionless(org.eclipse.m2e.tests.ProjectRegistryManagerTest)  Time elapsed: 1.753 s
10:54:10 Running org.eclipse.m2e.tests.builder.BuildContextLifecycleTest
10:54:13 Tests run: 1, Failures: 0, Errors: 0, Skipped: 0, Time elapsed: 4.208 s - in org.eclipse.m2e.tests.builder.BuildContextLifecycleTest
10:54:13 testBuildContextRefreshProject(org.eclipse.m2e.tests.builder.BuildContextLifecycleTest)  Time elapsed: 4.207 s
10:54:13 Running org.eclipse.m2e.tests.builder.EclipseBuildContextTest
10:54:18 Tests run: 2, Failures: 0, Errors: 0, Skipped: 0, Time elapsed: 5.156 s - in org.eclipse.m2e.tests.builder.EclipseBuildContextTest
10:54:18 testScanner(org.eclipse.m2e.tests.builder.EclipseBuildContextTest)  Time elapsed: 3.466 s
10:54:18 test361038_buildContext_scan_nonExistingFolder(org.eclipse.m2e.tests.builder.EclipseBuildContextTest)  Time elapsed: 1.689 s
10:54:18 Running org.eclipse.m2e.tests.builder.MavenBuilderTest
10:55:23 Tests run: 14, Failures: 0, Errors: 0, Skipped: 2, Time elapsed: 64.768 s - in org.eclipse.m2e.tests.builder.MavenBuilderTest
10:55:23 test005_pomChanged(org.eclipse.m2e.tests.builder.MavenBuilderTest)  Time elapsed: 1.927 s
10:55:23 test007_refreshChangedPom(org.eclipse.m2e.tests.builder.MavenBuilderTest)  Time elapsed: 1.93 s
10:55:23 _test006_testPluginProperties(org.eclipse.m2e.tests.builder.MavenBuilderTest) skipped
10:55:23 test397251_malformedPom(org.eclipse.m2e.tests.builder.MavenBuilderTest)  Time elapsed: 1.428 s
10:55:23 test422106_legacyPlexusUtils(org.eclipse.m2e.tests.builder.MavenBuilderTest)  Time elapsed: 5.931 s
10:55:23 test004_useMavenOutputFolders(org.eclipse.m2e.tests.builder.MavenBuilderTest)  Time elapsed: 7.074 s
10:55:23 test002_customResourceLocation(org.eclipse.m2e.tests.builder.MavenBuilderTest)  Time elapsed: 1.904 s
10:55:23 test001_standardLayout(org.eclipse.m2e.tests.builder.MavenBuilderTest)  Time elapsed: 1.709 s
10:55:23 test_crossproject(org.eclipse.m2e.tests.builder.MavenBuilderTest)  Time elapsed: 2.122 s
10:55:23 test380096_cleanProjectWithLifecycleMappingProblemsAfterWorkspaceRestart(org.eclipse.m2e.tests.builder.MavenBuilderTest)  Time elapsed: 2.184 s
10:55:23 test010_properties(org.eclipse.m2e.tests.builder.MavenBuilderTest)  Time elapsed: 2.591 s
10:55:23 _test008_classpathChange(org.eclipse.m2e.tests.builder.MavenBuilderTest) skipped
10:55:23 test368380_buildContextDeepRefreshFromLocal(org.eclipse.m2e.tests.builder.MavenBuilderTest)  Time elapsed: 29.473 s
10:55:23 test013_refreshFixedPom(org.eclipse.m2e.tests.builder.MavenBuilderTest)  Time elapsed: 6.492 s
10:55:23 Running org.eclipse.m2e.tests.builder.EclipseIncrementalBuildContextTest
10:55:27 Tests run: 1, Failures: 0, Errors: 0, Skipped: 0, Time elapsed: 3.832 s - in org.eclipse.m2e.tests.builder.EclipseIncrementalBuildContextTest
10:55:27 testScanner(org.eclipse.m2e.tests.builder.EclipseIncrementalBuildContextTest)  Time elapsed: 3.832 s
10:55:27 Running org.eclipse.m2e.tests.properties.MavenPropertiesTest
10:56:45 Tests run: 2, Failures: 0, Errors: 0, Skipped: 0, Time elapsed: 77.885 s - in org.eclipse.m2e.tests.properties.MavenPropertiesTest
10:56:45 testBuildingProjectWithProperties(org.eclipse.m2e.tests.properties.MavenPropertiesTest)  Time elapsed: 6.562 s
10:56:45 testReadResolverConfigurationProperties(org.eclipse.m2e.tests.properties.MavenPropertiesTest)  Time elapsed: 71.322 s
10:56:45 Running org.eclipse.m2e.tests.MutableProjectRegistryTest
10:57:16 Tests run: 8, Failures: 0, Errors: 0, Skipped: 0, Time elapsed: 31.277 s - in org.eclipse.m2e.tests.MutableProjectRegistryTest
10:57:16 testRemoveProject(org.eclipse.m2e.tests.MutableProjectRegistryTest)  Time elapsed: 2.122 s
10:57:16 testReplaceProject(org.eclipse.m2e.tests.MutableProjectRegistryTest)  Time elapsed: 4.765 s
10:57:16 testIllegalStateMerge(org.eclipse.m2e.tests.MutableProjectRegistryTest)  Time elapsed: 17.159 s
10:57:16 testForeignClassesInSerializedProjectRegistry(org.eclipse.m2e.tests.MutableProjectRegistryTest)  Time elapsed: 1.252 s
10:57:16 testDetectNoLongerExistingProjectsInWorkspaceState(org.eclipse.m2e.tests.MutableProjectRegistryTest)  Time elapsed: 1.692 s
10:57:16 testAddProject(org.eclipse.m2e.tests.MutableProjectRegistryTest)  Time elapsed: 1.215 s
10:57:16 testSaveParticipant(org.eclipse.m2e.tests.MutableProjectRegistryTest)  Time elapsed: 1.806 s
10:57:16 testRemoveUnknownProject(org.eclipse.m2e.tests.MutableProjectRegistryTest)  Time elapsed: 1.265 s
10:57:16 Running org.eclipse.m2e.tests.ResourceChangeListenerTest
10:57:54 Tests run: 7, Failures: 1, Errors: 0, Skipped: 0, Time elapsed: 37.832 s <<< FAILURE! - in org.eclipse.m2e.tests.ResourceChangeListenerTest
10:57:54 testPomChanges(org.eclipse.m2e.tests.ResourceChangeListenerTest)  Time elapsed: 6.339 s
10:57:54 testMarkerOnlyChange(org.eclipse.m2e.tests.ResourceChangeListenerTest)  Time elapsed: 13.066 s
10:57:54 testPomMove001(org.eclipse.m2e.tests.ResourceChangeListenerTest)  Time elapsed: 5.197 s
10:57:54 testPomMove002(org.eclipse.m2e.tests.ResourceChangeListenerTest)  Time elapsed: 5.072 s
10:57:54 testProjectDelete(org.eclipse.m2e.tests.ResourceChangeListenerTest)  Time elapsed: 2.933 s  <<< FAILURE!
10:57:54 java.lang.AssertionError: expected:<1> but was:<4>
10:57:54 	at org.eclipse.m2e.tests.ResourceChangeListenerTest.testProjectDelete(ResourceChangeListenerTest.java:178)
10:57:54 
10:57:54 testPomDelete(org.eclipse.m2e.tests.ResourceChangeListenerTest)  Time elapsed: 2.488 s
10:57:54 testPomRename(org.eclipse.m2e.tests.ResourceChangeListenerTest)  Time elapsed: 2.736 s
10:57:54 Running org.eclipse.m2e.tests.ProjectRegistryRefreshJobTest
11:01:06 Tests run: 10, Failures: 0, Errors: 0, Skipped: 0, Time elapsed: 192.31 s - in org.eclipse.m2e.tests.ProjectRegistryRefreshJobTest
11:01:06 test436679_NoRefreshWhenImport(org.eclipse.m2e.tests.ProjectRegistryRefreshJobTest)  Time elapsed: 56.916 s
11:01:06 test445675_autobuild(org.eclipse.m2e.tests.ProjectRegistryRefreshJobTest)  Time elapsed: 7.618 s
11:01:06 testMultiProject(org.eclipse.m2e.tests.ProjectRegistryRefreshJobTest)  Time elapsed: 49.343 s
11:01:06 testRefreshAfterOpen(org.eclipse.m2e.tests.ProjectRegistryRefreshJobTest)  Time elapsed: 19.996 s
11:01:06 testUpdateForced(org.eclipse.m2e.tests.ProjectRegistryRefreshJobTest)  Time elapsed: 6.713 s
11:01:06 test416050_ignoreNonMavenProjectChanges(org.eclipse.m2e.tests.ProjectRegistryRefreshJobTest)  Time elapsed: 12.659 s
11:01:06 testDependencyAdded_NoUpdate(org.eclipse.m2e.tests.ProjectRegistryRefreshJobTest)  Time elapsed: 19.49 s
11:01:06 testXXXX_projectRenameRefresh(org.eclipse.m2e.tests.ProjectRegistryRefreshJobTest)  Time elapsed: 4.767 s
11:01:06 test437493_NoRefreshWhenInitClasspathContainer(org.eclipse.m2e.tests.ProjectRegistryRefreshJobTest)  Time elapsed: 6.44 s
11:01:06 testUpdateNotForced(org.eclipse.m2e.tests.ProjectRegistryRefreshJobTest)  Time elapsed: 8.366 s
11:01:06 Running org.eclipse.m2e.tests.MarkerTest
11:01:46 Tests run: 10, Failures: 0, Errors: 0, Skipped: 0, Time elapsed: 39.869 s - in org.eclipse.m2e.tests.MarkerTest
11:01:46 testBuildContextWithTwoProjectConfigurators(org.eclipse.m2e.tests.MarkerTest)  Time elapsed: 2.482 s
11:01:46 test512825_missingArtifactVersion(org.eclipse.m2e.tests.MarkerTest)  Time elapsed: 8.512 s
11:01:46 testManagedTransitive(org.eclipse.m2e.tests.MarkerTest)  Time elapsed: 3.795 s
11:01:46 testBuildContextWithSameProjectConfiguratorTwice(org.eclipse.m2e.tests.MarkerTest)  Time elapsed: 2.994 s
11:01:46 testNoDuplicateMarker(org.eclipse.m2e.tests.MarkerTest)  Time elapsed: 1.755 s
11:01:46 test(org.eclipse.m2e.tests.MarkerTest)  Time elapsed: 5.306 s
11:01:46 testMarkerResolutions(org.eclipse.m2e.tests.MarkerTest)  Time elapsed: 5.207 s
11:01:46 test361445_missingArtifactMarkerAttributes(org.eclipse.m2e.tests.MarkerTest)  Time elapsed: 1.979 s
11:01:46 testBuildContextWithOneProjectConfigurator(org.eclipse.m2e.tests.MarkerTest)  Time elapsed: 1.855 s
11:01:46 testBuildCantReadPom(org.eclipse.m2e.tests.MarkerTest)  Time elapsed: 5.983 s
11:01:46 Running org.eclipse.m2e.tests.ClasspathProviderTest
11:02:56 Tests run: 20, Failures: 0, Errors: 0, Skipped: 0, Time elapsed: 70.28 s - in org.eclipse.m2e.tests.ClasspathProviderTest
11:02:56 testTestClassesTestScopeAndTestType(org.eclipse.m2e.tests.ClasspathProviderTest)  Time elapsed: 1.662 s
11:02:56 testSourcePath(org.eclipse.m2e.tests.ClasspathProviderTest)  Time elapsed: 3.707 s
11:02:56 testCustomClasspath(org.eclipse.m2e.tests.ClasspathProviderTest)  Time elapsed: 5.908 s
11:02:56 test368230_unknownClassifier(org.eclipse.m2e.tests.ClasspathProviderTest)  Time elapsed: 1.214 s
11:02:56 testTestClassesDefaultClassifier(org.eclipse.m2e.tests.ClasspathProviderTest)  Time elapsed: 1.165 s
11:02:56 testJunitClasspathOrder(org.eclipse.m2e.tests.ClasspathProviderTest)  Time elapsed: 1.398 s
11:02:56 testProvidedScopeTestApp(org.eclipse.m2e.tests.ClasspathProviderTest)  Time elapsed: 1.941 s
11:02:56 testNoFilterResources(org.eclipse.m2e.tests.ClasspathProviderTest)  Time elapsed: 20.6 s
11:02:56 testProvidedScopeApp(org.eclipse.m2e.tests.ClasspathProviderTest)  Time elapsed: 1.463 s
11:02:56 testLaunchConfigListener(org.eclipse.m2e.tests.ClasspathProviderTest)  Time elapsed: 4.486 s
11:02:56 testProvidedScopeAppTest(org.eclipse.m2e.tests.ClasspathProviderTest)  Time elapsed: 2.013 s
11:02:56 testTestClassesTestsClassifier(org.eclipse.m2e.tests.ClasspathProviderTest)  Time elapsed: 1.396 s
11:02:56 test(org.eclipse.m2e.tests.ClasspathProviderTest)  Time elapsed: 1.43 s
11:02:56 testNonDefaultTestSource(org.eclipse.m2e.tests.ClasspathProviderTest)  Time elapsed: 5.23 s
11:02:56 testCustomProjectEntry(org.eclipse.m2e.tests.ClasspathProviderTest)  Time elapsed: 1.374 s
11:02:56 testCustomBuildpath(org.eclipse.m2e.tests.ClasspathProviderTest)  Time elapsed: 1.489 s
11:02:56 testNotMavenProject(org.eclipse.m2e.tests.ClasspathProviderTest)  Time elapsed: 2.152 s
11:02:56 testTestClassesDefaultAndTestsClassifier(org.eclipse.m2e.tests.ClasspathProviderTest)  Time elapsed: 1.368 s
11:02:56 testSystemScope(org.eclipse.m2e.tests.ClasspathProviderTest)  Time elapsed: 7.345 s
11:02:56 test368230_FancyClassifier(org.eclipse.m2e.tests.ClasspathProviderTest)  Time elapsed: 2.937 s
11:02:56 Running org.eclipse.m2e.tests.MavenProjectMutableStateTest
11:03:01 Tests run: 3, Failures: 0, Errors: 0, Skipped: 0, Time elapsed: 5.168 s - in org.eclipse.m2e.tests.MavenProjectMutableStateTest
11:03:01 testExecuteMojo(org.eclipse.m2e.tests.MavenProjectMutableStateTest)  Time elapsed: 1.546 s
11:03:01 testMavenBuilder(org.eclipse.m2e.tests.MavenProjectMutableStateTest)  Time elapsed: 1.748 s
11:03:01 testImport(org.eclipse.m2e.tests.MavenProjectMutableStateTest)  Time elapsed: 1.873 s
11:03:01 Running org.eclipse.m2e.tests.LocalProjectScannerTest
11:03:01 Tests run: 11, Failures: 0, Errors: 0, Skipped: 0, Time elapsed: 0.008 s - in org.eclipse.m2e.tests.LocalProjectScannerTest
11:03:01 testDeepNesting002(org.eclipse.m2e.tests.LocalProjectScannerTest)  Time elapsed: 0.001 s
11:03:01 testOutsideWorkspace(org.eclipse.m2e.tests.LocalProjectScannerTest)  Time elapsed: 0 s
11:03:01 testModuleCorrelationInverse(org.eclipse.m2e.tests.LocalProjectScannerTest)  Time elapsed: 0.001 s
11:03:01 testCircleRefs(org.eclipse.m2e.tests.LocalProjectScannerTest)  Time elapsed: 0 s
11:03:01 testSkipNested(org.eclipse.m2e.tests.LocalProjectScannerTest)  Time elapsed: 0.001 s
11:03:01 testNoMetadata(org.eclipse.m2e.tests.LocalProjectScannerTest)  Time elapsed: 0 s
11:03:01 testStackOverflow(org.eclipse.m2e.tests.LocalProjectScannerTest)  Time elapsed: 0.002 s
11:03:01 testMNGECLIPSE614_ImportModulesOutsideOfParent(org.eclipse.m2e.tests.LocalProjectScannerTest)  Time elapsed: 0.001 s
11:03:01 testDeepNesting(org.eclipse.m2e.tests.LocalProjectScannerTest)  Time elapsed: 0 s
11:03:01 testRenameInWorkspace(org.eclipse.m2e.tests.LocalProjectScannerTest)  Time elapsed: 0.001 s
11:03:01 testModuleReferencedByFile(org.eclipse.m2e.tests.LocalProjectScannerTest)  Time elapsed: 0 s
11:03:01 
11:03:01 Results:
11:03:01 
11:03:01 Failures: 
11:03:01   ResourceChangeListenerTest.testProjectDelete:178 expected:<1> but was:<4>
11:03:01 
11:03:01 Tests run: 547, Failures: 1, Errors: 0, Skipped: 5
11:03:01 
11:03:13 [ERROR] There are test failures.
11:03:13 
11:03:13 Please refer to /home/jenkins/agent/workspace/m2e-sonarqube/m2e-core-tests/org.eclipse.m2e.tests/target/surefire-reports for the individual test results.
11:03:13 [INFO] 
11:03:13 [INFO] --- tycho-p2-extras-plugin:1.6.0:compare-version-with-baselines (check-no-version-regression) @ org.eclipse.m2e.tests ---
11:03:13 [INFO] 
11:03:13 [INFO] --- maven-install-plugin:2.3.1:install (default-install) @ org.eclipse.m2e.tests ---
11:03:13 [INFO] Installing /home/jenkins/agent/workspace/m2e-sonarqube/m2e-core-tests/org.eclipse.m2e.tests/target/org.eclipse.m2e.tests-1.16.0-SNAPSHOT.jar to /home/jenkins/agent/workspace/m2e-sonarqube/.repository/org/eclipse/m2e/org.eclipse.m2e.tests/1.16.0-SNAPSHOT/org.eclipse.m2e.tests-1.16.0-SNAPSHOT.jar
11:03:13 [INFO] Installing /home/jenkins/agent/workspace/m2e-sonarqube/m2e-core-tests/org.eclipse.m2e.tests/pom.xml to /home/jenkins/agent/workspace/m2e-sonarqube/.repository/org/eclipse/m2e/org.eclipse.m2e.tests/1.16.0-SNAPSHOT/org.eclipse.m2e.tests-1.16.0-SNAPSHOT.pom
11:03:13 [INFO] Installing /home/jenkins/agent/workspace/m2e-sonarqube/m2e-core-tests/org.eclipse.m2e.tests/target/org.eclipse.m2e.tests-1.16.0-SNAPSHOT-sources.jar to /home/jenkins/agent/workspace/m2e-sonarqube/.repository/org/eclipse/m2e/org.eclipse.m2e.tests/1.16.0-SNAPSHOT/org.eclipse.m2e.tests-1.16.0-SNAPSHOT-sources.jar
11:03:13 [INFO] Installing /home/jenkins/agent/workspace/m2e-sonarqube/m2e-core-tests/org.eclipse.m2e.tests/target/p2content.xml to /home/jenkins/agent/workspace/m2e-sonarqube/.repository/org/eclipse/m2e/org.eclipse.m2e.tests/1.16.0-SNAPSHOT/org.eclipse.m2e.tests-1.16.0-SNAPSHOT-p2metadata.xml
11:03:13 [INFO] Installing /home/jenkins/agent/workspace/m2e-sonarqube/m2e-core-tests/org.eclipse.m2e.tests/target/p2artifacts.xml to /home/jenkins/agent/workspace/m2e-sonarqube/.repository/org/eclipse/m2e/org.eclipse.m2e.tests/1.16.0-SNAPSHOT/org.eclipse.m2e.tests-1.16.0-SNAPSHOT-p2artifacts.xml
11:03:13 [INFO] 
11:03:13 [INFO] --- tycho-p2-plugin:1.6.0:update-local-index (default-update-local-index) @ org.eclipse.m2e.tests ---
11:03:13 [INFO] 
11:03:13 [INFO] ------------< org.eclipse.m2e:org.eclipse.m2e.editor.tests >------------
11:03:13 [INFO] Building Maven Integration for Eclipse POM Editor tests 1.16.0-SNAPSHOT [38/40]
11:03:13 [INFO] ------------------------[ eclipse-test-plugin ]-------------------------
11:03:13 [INFO] 
11:03:13 [INFO] --- maven-clean-plugin:2.4.1:clean (default-clean) @ org.eclipse.m2e.editor.tests ---
11:03:13 [INFO] 
11:03:13 [INFO] --- tycho-packaging-plugin:1.6.0:build-qualifier (default-build-qualifier) @ org.eclipse.m2e.editor.tests ---
11:03:13 [INFO] The project's OSGi version is 1.16.0.20200429-1632
11:03:13 [INFO] 
11:03:13 [INFO] --- tycho-packaging-plugin:1.6.0:validate-id (default-validate-id) @ org.eclipse.m2e.editor.tests ---
11:03:13 [INFO] 
11:03:13 [INFO] --- tycho-packaging-plugin:1.6.0:validate-version (default-validate-version) @ org.eclipse.m2e.editor.tests ---
11:03:13 [INFO] 
11:03:13 [INFO] --- jacoco-maven-plugin:0.8.5:prepare-agent (default) @ org.eclipse.m2e.editor.tests ---
11:03:13 [INFO] tycho.testArgLine set to -javaagent:/home/jenkins/agent/workspace/m2e-sonarqube/.repository/org/jacoco/org.jacoco.agent/0.8.5/org.jacoco.agent-0.8.5-runtime.jar=destfile=/home/jenkins/agent/workspace/m2e-sonarqube/jacoco.exec,append=true,includes=org.eclipse.m2e*:org.apache.maven*:org.eclipse.aether* -Xmx800m
11:03:13 [INFO] 
11:03:13 [INFO] --- maven-resources-plugin:2.5:resources (default-resources) @ org.eclipse.m2e.editor.tests ---
11:03:13 [debug] execute contextualize
11:03:13 [INFO] Using 'UTF-8' encoding to copy filtered resources.
11:03:13 [INFO] skip non existing resourceDirectory /home/jenkins/agent/workspace/m2e-sonarqube/m2e-core-tests/org.eclipse.m2e.editor.tests/src/main/resources
11:03:13 [INFO] 
11:03:13 [INFO] --- tycho-compiler-plugin:1.6.0:compile (default-compile) @ org.eclipse.m2e.editor.tests ---
11:03:13 [INFO] Compiling 3 source files to /home/jenkins/agent/workspace/m2e-sonarqube/m2e-core-tests/org.eclipse.m2e.editor.tests/target/classes
11:03:13 [INFO] 
11:03:13 [INFO] --- maven-resources-plugin:2.5:testResources (default-testResources) @ org.eclipse.m2e.editor.tests ---
11:03:13 [debug] execute contextualize
11:03:13 [INFO] Using 'UTF-8' encoding to copy filtered resources.
11:03:13 [INFO] skip non existing resourceDirectory /home/jenkins/agent/workspace/m2e-sonarqube/m2e-core-tests/org.eclipse.m2e.editor.tests/src/test/resources
11:03:13 [INFO] 
11:03:13 [INFO] --- tycho-source-plugin:1.6.0:plugin-source (plugin-source) @ org.eclipse.m2e.editor.tests ---
11:03:13 [INFO] Building jar: /home/jenkins/agent/workspace/m2e-sonarqube/m2e-core-tests/org.eclipse.m2e.editor.tests/target/org.eclipse.m2e.editor.tests-1.16.0-SNAPSHOT-sources.jar
11:03:13 [INFO] 
11:03:13 [INFO] --- target-platform-configuration:1.6.0:target-platform (default-target-platform) @ org.eclipse.m2e.editor.tests ---
11:03:13 [INFO] 
11:03:13 [INFO] --- tycho-packaging-plugin:1.6.0:package-plugin (default-package-plugin) @ org.eclipse.m2e.editor.tests ---
11:03:13 [INFO] Building jar: /home/jenkins/agent/workspace/m2e-sonarqube/m2e-core-tests/org.eclipse.m2e.editor.tests/target/org.eclipse.m2e.editor.tests-1.16.0-SNAPSHOT.jar
11:03:13 [INFO] 
11:03:13 [INFO] --- tycho-p2-plugin:1.6.0:p2-metadata-default (default-p2-metadata-default) @ org.eclipse.m2e.editor.tests ---
11:03:13 [INFO] No baseline version MavenProject: org.eclipse.m2e:org.eclipse.m2e.editor.tests:1.16.0-SNAPSHOT @ /home/jenkins/agent/workspace/m2e-sonarqube/m2e-core-tests/org.eclipse.m2e.editor.tests/pom.xml
11:03:13 [INFO] 
11:03:13 [INFO] --- tycho-surefire-plugin:1.6.0:test (default-test) @ org.eclipse.m2e.editor.tests ---
11:03:13 [INFO] Expected eclipse log file: /home/jenkins/agent/workspace/m2e-sonarqube/m2e-core-tests/org.eclipse.m2e.editor.tests/target/work/data/.metadata/.log
11:03:13 [INFO] Command line:
11:03:13 	[/opt/tools/java/oracle/jdk-8/1.8.0_202/jre/bin/java, -Dosgi.noShutdown=false, -Dosgi.os=linux, -Dosgi.ws=gtk, -Dosgi.arch=x86_64, -javaagent:/home/jenkins/agent/workspace/m2e-sonarqube/.repository/org/jacoco/org.jacoco.agent/0.8.5/org.jacoco.agent-0.8.5-runtime.jar=destfile=/home/jenkins/agent/workspace/m2e-sonarqube/jacoco.exec,append=true,includes=org.eclipse.m2e*:org.apache.maven*:org.eclipse.aether*, -Xmx800m, -Dosgi.clean=true, -jar, /home/jenkins/agent/workspace/m2e-sonarqube/.repository/p2/osgi/bundle/org.eclipse.equinox.launcher/1.5.700.v20200207-2156/org.eclipse.equinox.launcher-1.5.700.v20200207-2156.jar, -data, /home/jenkins/agent/workspace/m2e-sonarqube/m2e-core-tests/org.eclipse.m2e.editor.tests/target/work/data, -install, /home/jenkins/agent/workspace/m2e-sonarqube/m2e-core-tests/org.eclipse.m2e.editor.tests/target/work, -configuration, /home/jenkins/agent/workspace/m2e-sonarqube/m2e-core-tests/org.eclipse.m2e.editor.tests/target/work/configuration, -application, org.eclipse.tycho.surefire.osgibooter.uitest, -testproperties, /home/jenkins/agent/workspace/m2e-sonarqube/m2e-core-tests/org.eclipse.m2e.editor.tests/target/surefire.properties, -pluginCustomization, /home/jenkins/agent/workspace/m2e-sonarqube/m2e-core-tests/org.eclipse.m2e.editor.tests/plugin_customization.ini, -timeout, 7200000]
11:03:13 Picked up JAVA_TOOL_OPTIONS: -XX:+IgnoreUnrecognizedVMOptions -XX:+UseContainerSupport -XX:+UnlockExperimentalVMOptions -XX:+UseCGroupMemoryLimitForHeap
11:03:13 Picked up _JAVA_OPTIONS: -XX:MaxRAMPercentage=64.0
11:03:18 Running org.eclipse.m2e.editor.MavenPomEditorDirtyTest
11:03:18 SLF4J: Failed to load class "org.slf4j.impl.StaticLoggerBinder".
11:03:18 SLF4J: Defaulting to no-operation (NOP) logger implementation
11:03:18 SLF4J: See http://www.slf4j.org/codes.html#StaticLoggerBinder for further details.
11:03:25 Warning: NLS missing message: MavenImpl_error_lookup in: org.eclipse.m2e.editor.internal.messages
11:03:27 Tests run: 1, Failures: 0, Errors: 0, Skipped: 0, Time elapsed: 9.079 s - in org.eclipse.m2e.editor.MavenPomEditorDirtyTest
11:03:27 test358656_dirtyStateAfterFSModification(org.eclipse.m2e.editor.MavenPomEditorDirtyTest)  Time elapsed: 7.052 s
11:03:27 Running org.eclipse.m2e.editor.dialogs.ManageDependenciesDialogTest
11:04:16 Tests run: 9, Failures: 0, Errors: 0, Skipped: 0, Time elapsed: 48.285 s - in org.eclipse.m2e.editor.dialogs.ManageDependenciesDialogTest
11:04:16 testDepLabelProvider(org.eclipse.m2e.editor.dialogs.ManageDependenciesDialogTest)  Time elapsed: 19.152 s
11:04:16 testBrokenSource(org.eclipse.m2e.editor.dialogs.ManageDependenciesDialogTest)  Time elapsed: 2.777 s
11:04:16 testBrokenTarget(org.eclipse.m2e.editor.dialogs.ManageDependenciesDialogTest)  Time elapsed: 1.924 s
11:04:16 testDepExistsDiffVersionDiffPOMs(org.eclipse.m2e.editor.dialogs.ManageDependenciesDialogTest)  Time elapsed: 10.084 s
11:04:16 testDepExists(org.eclipse.m2e.editor.dialogs.ManageDependenciesDialogTest)  Time elapsed: 2.238 s
11:04:16 testMultipleDependencies(org.eclipse.m2e.editor.dialogs.ManageDependenciesDialogTest)  Time elapsed: 6.363 s
11:04:16 testDiffPOMs(org.eclipse.m2e.editor.dialogs.ManageDependenciesDialogTest)  Time elapsed: 1.53 s
11:04:16 testDepExistsDiffVersion(org.eclipse.m2e.editor.dialogs.ManageDependenciesDialogTest)  Time elapsed: 1.64 s
11:04:16 testSamePOM(org.eclipse.m2e.editor.dialogs.ManageDependenciesDialogTest)  Time elapsed: 2.575 s
11:04:16 Running org.eclipse.m2e.editor.dialogs.MavenModuleSelectionDialogTest
11:04:21 Tests run: 1, Failures: 0, Errors: 0, Skipped: 0, Time elapsed: 4.829 s - in org.eclipse.m2e.editor.dialogs.MavenModuleSelectionDialogTest
11:04:21 testModuleSelection(org.eclipse.m2e.editor.dialogs.MavenModuleSelectionDialogTest)  Time elapsed: 4.828 s
11:04:21 
11:04:21 Results:
11:04:21 
11:04:21 Tests run: 11, Failures: 0, Errors: 0, Skipped: 0
11:04:21 
11:04:24 [INFO] All tests passed!
11:04:24 [INFO] 
11:04:24 [INFO] --- tycho-p2-extras-plugin:1.6.0:compare-version-with-baselines (check-no-version-regression) @ org.eclipse.m2e.editor.tests ---
11:04:24 [INFO] 
11:04:24 [INFO] --- maven-install-plugin:2.3.1:install (default-install) @ org.eclipse.m2e.editor.tests ---
11:04:24 [INFO] Installing /home/jenkins/agent/workspace/m2e-sonarqube/m2e-core-tests/org.eclipse.m2e.editor.tests/target/org.eclipse.m2e.editor.tests-1.16.0-SNAPSHOT.jar to /home/jenkins/agent/workspace/m2e-sonarqube/.repository/org/eclipse/m2e/org.eclipse.m2e.editor.tests/1.16.0-SNAPSHOT/org.eclipse.m2e.editor.tests-1.16.0-SNAPSHOT.jar
11:04:24 [INFO] Installing /home/jenkins/agent/workspace/m2e-sonarqube/m2e-core-tests/org.eclipse.m2e.editor.tests/pom.xml to /home/jenkins/agent/workspace/m2e-sonarqube/.repository/org/eclipse/m2e/org.eclipse.m2e.editor.tests/1.16.0-SNAPSHOT/org.eclipse.m2e.editor.tests-1.16.0-SNAPSHOT.pom
11:04:24 [INFO] Installing /home/jenkins/agent/workspace/m2e-sonarqube/m2e-core-tests/org.eclipse.m2e.editor.tests/target/org.eclipse.m2e.editor.tests-1.16.0-SNAPSHOT-sources.jar to /home/jenkins/agent/workspace/m2e-sonarqube/.repository/org/eclipse/m2e/org.eclipse.m2e.editor.tests/1.16.0-SNAPSHOT/org.eclipse.m2e.editor.tests-1.16.0-SNAPSHOT-sources.jar
11:04:24 [INFO] Installing /home/jenkins/agent/workspace/m2e-sonarqube/m2e-core-tests/org.eclipse.m2e.editor.tests/target/p2content.xml to /home/jenkins/agent/workspace/m2e-sonarqube/.repository/org/eclipse/m2e/org.eclipse.m2e.editor.tests/1.16.0-SNAPSHOT/org.eclipse.m2e.editor.tests-1.16.0-SNAPSHOT-p2metadata.xml
11:04:24 [INFO] Installing /home/jenkins/agent/workspace/m2e-sonarqube/m2e-core-tests/org.eclipse.m2e.editor.tests/target/p2artifacts.xml to /home/jenkins/agent/workspace/m2e-sonarqube/.repository/org/eclipse/m2e/org.eclipse.m2e.editor.tests/1.16.0-SNAPSHOT/org.eclipse.m2e.editor.tests-1.16.0-SNAPSHOT-p2artifacts.xml
11:04:24 [INFO] 
11:04:24 [INFO] --- tycho-p2-plugin:1.6.0:update-local-index (default-update-local-index) @ org.eclipse.m2e.editor.tests ---
11:04:24 [INFO] 
11:04:24 [INFO] ----------< org.eclipse.m2e:org.eclipse.m2e.editor.xml.tests >----------
11:04:24 [INFO] Building Maven POM XML Editor Tests 1.16.0-SNAPSHOT              [39/40]
11:04:24 [INFO] ------------------------[ eclipse-test-plugin ]-------------------------
11:04:25 [INFO] 
11:04:25 [INFO] --- maven-clean-plugin:2.4.1:clean (default-clean) @ org.eclipse.m2e.editor.xml.tests ---
11:04:25 [INFO] 
11:04:25 [INFO] --- tycho-packaging-plugin:1.6.0:build-qualifier (default-build-qualifier) @ org.eclipse.m2e.editor.xml.tests ---
11:04:25 [INFO] The project's OSGi version is 1.16.0.20200429-1632
11:04:25 [INFO] 
11:04:25 [INFO] --- tycho-packaging-plugin:1.6.0:validate-id (default-validate-id) @ org.eclipse.m2e.editor.xml.tests ---
11:04:25 [INFO] 
11:04:25 [INFO] --- tycho-packaging-plugin:1.6.0:validate-version (default-validate-version) @ org.eclipse.m2e.editor.xml.tests ---
11:04:25 [INFO] 
11:04:25 [INFO] --- jacoco-maven-plugin:0.8.5:prepare-agent (default) @ org.eclipse.m2e.editor.xml.tests ---
11:04:25 [INFO] tycho.testArgLine set to -javaagent:/home/jenkins/agent/workspace/m2e-sonarqube/.repository/org/jacoco/org.jacoco.agent/0.8.5/org.jacoco.agent-0.8.5-runtime.jar=destfile=/home/jenkins/agent/workspace/m2e-sonarqube/jacoco.exec,append=true,includes=org.eclipse.m2e*:org.apache.maven*:org.eclipse.aether* -Xmx800m
11:04:25 [INFO] 
11:04:25 [INFO] --- maven-resources-plugin:2.5:resources (default-resources) @ org.eclipse.m2e.editor.xml.tests ---
11:04:25 [debug] execute contextualize
11:04:25 [INFO] Using 'UTF-8' encoding to copy filtered resources.
11:04:25 [INFO] skip non existing resourceDirectory /home/jenkins/agent/workspace/m2e-sonarqube/m2e-core-tests/org.eclipse.m2e.editor.xml.tests/src/main/resources
11:04:25 [INFO] 
11:04:25 [INFO] --- tycho-compiler-plugin:1.6.0:compile (default-compile) @ org.eclipse.m2e.editor.xml.tests ---
11:04:25 [WARNING] Parameter 'useProjectSettings' is set to true, but preferences file '/home/jenkins/agent/workspace/m2e-sonarqube/m2e-core-tests/org.eclipse.m2e.editor.xml.tests/.settings/org.eclipse.jdt.core.prefs' could not be found!
11:04:25 [INFO] Compiling 22 source files to /home/jenkins/agent/workspace/m2e-sonarqube/m2e-core-tests/org.eclipse.m2e.editor.xml.tests/target/classes
11:04:25 [INFO] 
11:04:25 [INFO] --- maven-resources-plugin:2.5:testResources (default-testResources) @ org.eclipse.m2e.editor.xml.tests ---
11:04:25 [debug] execute contextualize
11:04:25 [INFO] Using 'UTF-8' encoding to copy filtered resources.
11:04:25 [INFO] skip non existing resourceDirectory /home/jenkins/agent/workspace/m2e-sonarqube/m2e-core-tests/org.eclipse.m2e.editor.xml.tests/src/test/resources
11:04:25 [INFO] 
11:04:25 [INFO] --- tycho-source-plugin:1.6.0:plugin-source (plugin-source) @ org.eclipse.m2e.editor.xml.tests ---
11:04:25 [INFO] Building jar: /home/jenkins/agent/workspace/m2e-sonarqube/m2e-core-tests/org.eclipse.m2e.editor.xml.tests/target/org.eclipse.m2e.editor.xml.tests-1.16.0-SNAPSHOT-sources.jar
11:04:25 [INFO] 
11:04:25 [INFO] --- target-platform-configuration:1.6.0:target-platform (default-target-platform) @ org.eclipse.m2e.editor.xml.tests ---
11:04:25 [INFO] 
11:04:25 [INFO] --- tycho-packaging-plugin:1.6.0:package-plugin (default-package-plugin) @ org.eclipse.m2e.editor.xml.tests ---
11:04:25 [INFO] Building jar: /home/jenkins/agent/workspace/m2e-sonarqube/m2e-core-tests/org.eclipse.m2e.editor.xml.tests/target/org.eclipse.m2e.editor.xml.tests-1.16.0-SNAPSHOT.jar
11:04:25 [INFO] 
11:04:25 [INFO] --- tycho-p2-plugin:1.6.0:p2-metadata-default (default-p2-metadata-default) @ org.eclipse.m2e.editor.xml.tests ---
11:04:25 [INFO] No baseline version MavenProject: org.eclipse.m2e:org.eclipse.m2e.editor.xml.tests:1.16.0-SNAPSHOT @ /home/jenkins/agent/workspace/m2e-sonarqube/m2e-core-tests/org.eclipse.m2e.editor.xml.tests/pom.xml
11:04:25 [INFO] 
11:04:25 [INFO] --- tycho-surefire-plugin:1.6.0:test (default-test) @ org.eclipse.m2e.editor.xml.tests ---
11:04:25 [INFO] Expected eclipse log file: /home/jenkins/agent/workspace/m2e-sonarqube/m2e-core-tests/org.eclipse.m2e.editor.xml.tests/target/work/data/.metadata/.log
11:04:25 [INFO] Command line:
11:04:25 	[/opt/tools/java/oracle/jdk-8/1.8.0_202/jre/bin/java, -Dosgi.noShutdown=false, -Dosgi.os=linux, -Dosgi.ws=gtk, -Dosgi.arch=x86_64, -javaagent:/home/jenkins/agent/workspace/m2e-sonarqube/.repository/org/jacoco/org.jacoco.agent/0.8.5/org.jacoco.agent-0.8.5-runtime.jar=destfile=/home/jenkins/agent/workspace/m2e-sonarqube/jacoco.exec,append=true,includes=org.eclipse.m2e*:org.apache.maven*:org.eclipse.aether*, -Xmx800m, -Dosgi.clean=true, -jar, /home/jenkins/agent/workspace/m2e-sonarqube/.repository/p2/osgi/bundle/org.eclipse.equinox.launcher/1.5.700.v20200207-2156/org.eclipse.equinox.launcher-1.5.700.v20200207-2156.jar, -data, /home/jenkins/agent/workspace/m2e-sonarqube/m2e-core-tests/org.eclipse.m2e.editor.xml.tests/target/work/data, -install, /home/jenkins/agent/workspace/m2e-sonarqube/m2e-core-tests/org.eclipse.m2e.editor.xml.tests/target/work, -configuration, /home/jenkins/agent/workspace/m2e-sonarqube/m2e-core-tests/org.eclipse.m2e.editor.xml.tests/target/work/configuration, -application, org.eclipse.tycho.surefire.osgibooter.uitest, -testproperties, /home/jenkins/agent/workspace/m2e-sonarqube/m2e-core-tests/org.eclipse.m2e.editor.xml.tests/target/surefire.properties, -pluginCustomization, /home/jenkins/agent/workspace/m2e-sonarqube/m2e-core-tests/org.eclipse.m2e.editor.xml.tests/plugin_customization.ini, -timeout, 7200000]
11:04:25 Picked up JAVA_TOOL_OPTIONS: -XX:+IgnoreUnrecognizedVMOptions -XX:+UseContainerSupport -XX:+UnlockExperimentalVMOptions -XX:+UseCGroupMemoryLimitForHeap
11:04:25 Picked up _JAVA_OPTIONS: -XX:MaxRAMPercentage=64.0
11:04:31 SLF4J: Failed to load class "org.slf4j.impl.StaticLoggerBinder".
11:04:31 SLF4J: Defaulting to no-operation (NOP) logger implementation
11:04:31 SLF4J: See http://www.slf4j.org/codes.html#StaticLoggerBinder for further details.
11:04:32 Running org.eclipse.m2e.editor.xml.PluginConfigCompletionTest
11:05:46 Warning: NLS missing message: MavenImpl_error_lookup in: org.eclipse.m2e.editor.internal.messages
11:06:33 Tests run: 12, Failures: 0, Errors: 0, Skipped: 0, Time elapsed: 121.066 s - in org.eclipse.m2e.editor.xml.PluginConfigCompletionTest
11:06:33 testMetadataExtension(org.eclipse.m2e.editor.xml.PluginConfigCompletionTest)  Time elapsed: 75.111 s
11:06:33 testAllMojosCompletion(org.eclipse.m2e.editor.xml.PluginConfigCompletionTest)  Time elapsed: 15.137 s
11:06:33 testListItemNameCompletion(org.eclipse.m2e.editor.xml.PluginConfigCompletionTest)  Time elapsed: 1.784 s
11:06:33 testImplementationListItemNameCompletion(org.eclipse.m2e.editor.xml.PluginConfigCompletionTest)  Time elapsed: 1.602 s
11:06:33 testListItemParameterCompletion(org.eclipse.m2e.editor.xml.PluginConfigCompletionTest)  Time elapsed: 1.425 s
11:06:33 testM2ELifecycleMappingConfiguration(org.eclipse.m2e.editor.xml.PluginConfigCompletionTest)  Time elapsed: 1.208 s
11:06:33 testImplementationContentCompletion(org.eclipse.m2e.editor.xml.PluginConfigCompletionTest)  Time elapsed: 1.226 s
11:06:33 testSubclassListItems(org.eclipse.m2e.editor.xml.PluginConfigCompletionTest)  Time elapsed: 17.774 s
11:06:33 testNestedParameterCompletion(org.eclipse.m2e.editor.xml.PluginConfigCompletionTest)  Time elapsed: 1.849 s
11:06:33 testSingleMojoCompletion(org.eclipse.m2e.editor.xml.PluginConfigCompletionTest)  Time elapsed: 1.252 s
11:06:33 testAnyListItemNameParameterCompletion(org.eclipse.m2e.editor.xml.PluginConfigCompletionTest)  Time elapsed: 1.165 s
11:06:33 testUnknownContentCompletion(org.eclipse.m2e.editor.xml.PluginConfigCompletionTest)  Time elapsed: 1.241 s
11:06:33 Running org.eclipse.m2e.editor.xml.RelativePath3Test
11:06:35 Tests run: 1, Failures: 0, Errors: 0, Skipped: 0, Time elapsed: 1.461 s - in org.eclipse.m2e.editor.xml.RelativePath3Test
11:06:35 testRelativePath(org.eclipse.m2e.editor.xml.RelativePath3Test)  Time elapsed: 1.46 s
11:06:35 Running org.eclipse.m2e.editor.xml.HoverTest
11:06:36 Tests run: 1, Failures: 0, Errors: 0, Skipped: 0, Time elapsed: 1.29 s - in org.eclipse.m2e.editor.xml.HoverTest
11:06:36 testHasHover(org.eclipse.m2e.editor.xml.HoverTest)  Time elapsed: 1.289 s
11:06:36 Running org.eclipse.m2e.editor.xml.ExtractProject2Test
11:06:38 Tests run: 1, Failures: 0, Errors: 0, Skipped: 0, Time elapsed: 1.58 s - in org.eclipse.m2e.editor.xml.ExtractProject2Test
11:06:38 testExtractProject(org.eclipse.m2e.editor.xml.ExtractProject2Test)  Time elapsed: 1.578 s
11:06:38 Running org.eclipse.m2e.editor.xml.ExtractProjectTest
11:06:39 Tests run: 1, Failures: 0, Errors: 0, Skipped: 0, Time elapsed: 1.62 s - in org.eclipse.m2e.editor.xml.ExtractProjectTest
11:06:39 testExtractProject(org.eclipse.m2e.editor.xml.ExtractProjectTest)  Time elapsed: 1.619 s
11:06:39 Running org.eclipse.m2e.editor.xml.HoverDependencyManagedTest
11:06:41 Tests run: 1, Failures: 0, Errors: 0, Skipped: 0, Time elapsed: 1.487 s - in org.eclipse.m2e.editor.xml.HoverDependencyManagedTest
11:06:41 testHasHover(org.eclipse.m2e.editor.xml.HoverDependencyManagedTest)  Time elapsed: 1.487 s
11:06:41 Running org.eclipse.m2e.editor.xml.PomContentAssistProcessorTest
11:06:41 Tests run: 1, Failures: 0, Errors: 0, Skipped: 0, Time elapsed: 0.004 s - in org.eclipse.m2e.editor.xml.PomContentAssistProcessorTest
11:06:41 testExtractPrefix(org.eclipse.m2e.editor.xml.PomContentAssistProcessorTest)  Time elapsed: 0.004 s
11:06:41 Running org.eclipse.m2e.editor.xml.MissingSchemaMarkerTest
11:06:50 Tests run: 1, Failures: 0, Errors: 0, Skipped: 0, Time elapsed: 9.309 s - in org.eclipse.m2e.editor.xml.MissingSchemaMarkerTest
11:06:50 testMissingSchemaMarker(org.eclipse.m2e.editor.xml.MissingSchemaMarkerTest)  Time elapsed: 9.308 s
11:06:50 Running org.eclipse.m2e.editor.xml.WarnIfGroupSameThanParentTest
11:06:54 Tests run: 1, Failures: 0, Errors: 0, Skipped: 0, Time elapsed: 4.019 s - in org.eclipse.m2e.editor.xml.WarnIfGroupSameThanParentTest
11:06:54 testMNGEclipse2552(org.eclipse.m2e.editor.xml.WarnIfGroupSameThanParentTest)  Time elapsed: 4.019 s
11:06:54 Running org.eclipse.m2e.editor.xml.HyperlinkTest
11:06:55 true
11:06:57 Tests run: 1, Failures: 0, Errors: 0, Skipped: 0, Time elapsed: 2.392 s - in org.eclipse.m2e.editor.xml.HyperlinkTest
11:06:57 testHasLink(org.eclipse.m2e.editor.xml.HyperlinkTest)  Time elapsed: 2.391 s
11:06:57 Running org.eclipse.m2e.editor.xml.ManagedArtifactMarkerTest
11:07:33 Tests run: 7, Failures: 0, Errors: 0, Skipped: 0, Time elapsed: 36.597 s - in org.eclipse.m2e.editor.xml.ManagedArtifactMarkerTest
11:07:33 test439309_errorOnManagedVersionOverride(org.eclipse.m2e.editor.xml.ManagedArtifactMarkerTest)  Time elapsed: 3.792 s
11:07:33 test439309_ignoreManagedVersionOverride(org.eclipse.m2e.editor.xml.ManagedArtifactMarkerTest)  Time elapsed: 5.336 s
11:07:33 test355882_noMarkerOnDifferentClassifier(org.eclipse.m2e.editor.xml.ManagedArtifactMarkerTest)  Time elapsed: 11.532 s
11:07:33 test553839_noErrorCausedByPluginVersionFromSuperPom(org.eclipse.m2e.editor.xml.ManagedArtifactMarkerTest)  Time elapsed: 2.451 s
11:07:33 testMNGEclipse2559Second(org.eclipse.m2e.editor.xml.ManagedArtifactMarkerTest)  Time elapsed: 2.732 s
11:07:33 test355882_MarkerOnClassifierVersionOverride(org.eclipse.m2e.editor.xml.ManagedArtifactMarkerTest)  Time elapsed: 3.023 s
11:07:33 testMNGEclipse2559(org.eclipse.m2e.editor.xml.ManagedArtifactMarkerTest)  Time elapsed: 7.695 s
11:07:33 Running org.eclipse.m2e.editor.xml.PomTemplateContextTest
11:08:03 Tests run: 11, Failures: 0, Errors: 0, Skipped: 0, Time elapsed: 30.095 s - in org.eclipse.m2e.editor.xml.PomTemplateContextTest
11:08:03 testGetTemplatesArtifactId_WithGroupId(org.eclipse.m2e.editor.xml.PomTemplateContextTest)  Time elapsed: 2.05 s
11:08:03 testGetTemplatesDependencyScope(org.eclipse.m2e.editor.xml.PomTemplateContextTest)  Time elapsed: 2.879 s
11:08:03 test439251_GetTemplatesConfigurationFromMojoWithEmptyParameters(org.eclipse.m2e.editor.xml.PomTemplateContextTest)  Time elapsed: 1.762 s
11:08:03 testGetTemplatesPackaging(org.eclipse.m2e.editor.xml.PomTemplateContextTest)  Time elapsed: 5.582 s
11:08:03 testGetTemplatesVersion_WithoutGroupId(org.eclipse.m2e.editor.xml.PomTemplateContextTest)  Time elapsed: 5.165 s
11:08:03 testGetTemplatesArtifactId_WithoutGroupId(org.eclipse.m2e.editor.xml.PomTemplateContextTest)  Time elapsed: 2.932 s
11:08:03 testGetTemplatesConfiguration(org.eclipse.m2e.editor.xml.PomTemplateContextTest)  Time elapsed: 3.791 s
11:08:03 testGetTemplatesDependencyManagementScope(org.eclipse.m2e.editor.xml.PomTemplateContextTest)  Time elapsed: 2.473 s
11:08:03 testGetTemplatesVersion_WithGroupId(org.eclipse.m2e.editor.xml.PomTemplateContextTest)  Time elapsed: 1.105 s
11:08:03 testGetTemplatesPhase(org.eclipse.m2e.editor.xml.PomTemplateContextTest)  Time elapsed: 1.329 s
11:08:03 testGetTemplatesGoal(org.eclipse.m2e.editor.xml.PomTemplateContextTest)  Time elapsed: 1.025 s
11:08:03 Running org.eclipse.m2e.editor.xml.FileCompletionTest
11:08:55 Tests run: 2, Failures: 0, Errors: 0, Skipped: 0, Time elapsed: 51.383 s - in org.eclipse.m2e.editor.xml.FileCompletionTest
11:08:55 testFilesAndDirsCompletion(org.eclipse.m2e.editor.xml.FileCompletionTest)  Time elapsed: 3.047 s
11:08:55 testModuleCompletion(org.eclipse.m2e.editor.xml.FileCompletionTest)  Time elapsed: 48.335 s
11:08:55 Running org.eclipse.m2e.editor.xml.RelativePath1Test
11:09:04 Tests run: 1, Failures: 0, Errors: 0, Skipped: 0, Time elapsed: 9.208 s - in org.eclipse.m2e.editor.xml.RelativePath1Test
11:09:04 testRelativePath(org.eclipse.m2e.editor.xml.RelativePath1Test)  Time elapsed: 9.207 s
11:09:04 Running org.eclipse.m2e.editor.xml.PomEditsTest
11:09:12 Tests run: 2, Failures: 0, Errors: 0, Skipped: 0, Time elapsed: 7.615 s - in org.eclipse.m2e.editor.xml.PomEditsTest
11:09:12 test371438_insertAt_insideEmptyElement(org.eclipse.m2e.editor.xml.PomEditsTest)  Time elapsed: 2.091 s
11:09:12 test467590_emptyPom(org.eclipse.m2e.editor.xml.PomEditsTest)  Time elapsed: 5.523 s
11:09:12 Running org.eclipse.m2e.editor.xml.RelativePath2Test
11:09:26 Tests run: 1, Failures: 0, Errors: 0, Skipped: 0, Time elapsed: 14.38 s - in org.eclipse.m2e.editor.xml.RelativePath2Test
11:09:26 testRelativePath(org.eclipse.m2e.editor.xml.RelativePath2Test)  Time elapsed: 14.379 s
11:09:26 Running org.eclipse.m2e.editor.xml.PropertyCompletionTest
11:09:28 Tests run: 1, Failures: 0, Errors: 0, Skipped: 0, Time elapsed: 1.787 s - in org.eclipse.m2e.editor.xml.PropertyCompletionTest
11:09:28 testCompletion(org.eclipse.m2e.editor.xml.PropertyCompletionTest)  Time elapsed: 1.786 s
11:09:28 
11:09:28 Results:
11:09:28 
11:09:28 Tests run: 46, Failures: 0, Errors: 0, Skipped: 0
11:09:28 
11:09:34 [INFO] All tests passed!
11:09:34 [INFO] 
11:09:34 [INFO] --- tycho-p2-extras-plugin:1.6.0:compare-version-with-baselines (check-no-version-regression) @ org.eclipse.m2e.editor.xml.tests ---
11:09:34 [INFO] 
11:09:34 [INFO] --- maven-install-plugin:2.3.1:install (default-install) @ org.eclipse.m2e.editor.xml.tests ---
11:09:34 [INFO] Installing /home/jenkins/agent/workspace/m2e-sonarqube/m2e-core-tests/org.eclipse.m2e.editor.xml.tests/target/org.eclipse.m2e.editor.xml.tests-1.16.0-SNAPSHOT.jar to /home/jenkins/agent/workspace/m2e-sonarqube/.repository/org/eclipse/m2e/org.eclipse.m2e.editor.xml.tests/1.16.0-SNAPSHOT/org.eclipse.m2e.editor.xml.tests-1.16.0-SNAPSHOT.jar
11:09:34 [INFO] Installing /home/jenkins/agent/workspace/m2e-sonarqube/m2e-core-tests/org.eclipse.m2e.editor.xml.tests/pom.xml to /home/jenkins/agent/workspace/m2e-sonarqube/.repository/org/eclipse/m2e/org.eclipse.m2e.editor.xml.tests/1.16.0-SNAPSHOT/org.eclipse.m2e.editor.xml.tests-1.16.0-SNAPSHOT.pom
11:09:34 [INFO] Installing /home/jenkins/agent/workspace/m2e-sonarqube/m2e-core-tests/org.eclipse.m2e.editor.xml.tests/target/org.eclipse.m2e.editor.xml.tests-1.16.0-SNAPSHOT-sources.jar to /home/jenkins/agent/workspace/m2e-sonarqube/.repository/org/eclipse/m2e/org.eclipse.m2e.editor.xml.tests/1.16.0-SNAPSHOT/org.eclipse.m2e.editor.xml.tests-1.16.0-SNAPSHOT-sources.jar
11:09:34 [INFO] Installing /home/jenkins/agent/workspace/m2e-sonarqube/m2e-core-tests/org.eclipse.m2e.editor.xml.tests/target/p2content.xml to /home/jenkins/agent/workspace/m2e-sonarqube/.repository/org/eclipse/m2e/org.eclipse.m2e.editor.xml.tests/1.16.0-SNAPSHOT/org.eclipse.m2e.editor.xml.tests-1.16.0-SNAPSHOT-p2metadata.xml
11:09:34 [INFO] Installing /home/jenkins/agent/workspace/m2e-sonarqube/m2e-core-tests/org.eclipse.m2e.editor.xml.tests/target/p2artifacts.xml to /home/jenkins/agent/workspace/m2e-sonarqube/.repository/org/eclipse/m2e/org.eclipse.m2e.editor.xml.tests/1.16.0-SNAPSHOT/org.eclipse.m2e.editor.xml.tests-1.16.0-SNAPSHOT-p2artifacts.xml
11:09:34 [INFO] 
11:09:34 [INFO] --- tycho-p2-plugin:1.6.0:update-local-index (default-update-local-index) @ org.eclipse.m2e.editor.xml.tests ---
11:09:34 [INFO] ------------------------------------------------------------------------
11:09:34 [INFO] Reactor Summary for Maven Integration for Eclipse (parent) 1.16.0-SNAPSHOT:
11:09:34 [INFO] 
11:09:34 [INFO] Maven Integration for Eclipse (parent) ............. SUCCESS [ 45.734 s]
11:09:34 [INFO] Maven Project Model Edit Bundle .................... SUCCESS [01:29 min]
11:09:34 [INFO] Maven Integration for Eclipse Core Plug-in ......... SUCCESS [ 17.819 s]
11:09:34 [INFO] Maven Integration for Eclipse UI Plug-in ........... SUCCESS [  3.489 s]
11:09:34 [INFO] Maven Integration for Eclipse Launching ............ SUCCESS [  1.104 s]
11:09:34 [INFO] Maven Integration for Eclipse JDT .................. SUCCESS [  1.346 s]
11:09:34 [INFO] Maven Integration for Eclipse JDT UI ............... SUCCESS [  0.887 s]
11:09:34 [INFO] Maven POM Refactoring .............................. SUCCESS [ 10.711 s]
11:09:34 [INFO] m2e Marketplace .................................... SUCCESS [  5.296 s]
11:09:34 [INFO] Maven POM Editor ................................... SUCCESS [  3.878 s]
11:09:34 [INFO] Maven POM XML Editor ............................... SUCCESS [  1.530 s]
11:09:34 [INFO] org.eclipse.m2e.lifecyclemapping.defaults .......... SUCCESS [  7.141 s]
11:09:34 [INFO] org.eclipse.m2e.scm ................................ SUCCESS [  1.628 s]
11:09:34 [INFO] Maven Profile Manager Core ......................... SUCCESS [  0.941 s]
11:09:34 [INFO] Maven Profile Manager UI ........................... SUCCESS [  1.196 s]
11:09:34 [INFO] Maven Integration for Eclipse Importer framework ... SUCCESS [  0.819 s]
11:09:34 [INFO] org.eclipse.m2e.sourcelookup ....................... SUCCESS [  1.167 s]
11:09:34 [INFO] org.eclipse.m2e.binaryproject ...................... SUCCESS [  0.863 s]
11:09:34 [INFO] org.eclipse.m2e.binaryproject.ui ................... SUCCESS [  1.237 s]
11:09:34 [INFO] org.eclipse.m2e.sourcelookup.ui .................... SUCCESS [  1.091 s]
11:09:34 [INFO] org.eclipse.m2e.editor.lemminx ..................... SUCCESS [ 57.830 s]
11:09:34 [INFO] M2E Testing Helpers ................................ SUCCESS [  0.944 s]
11:09:34 [INFO] org.eclipse.m2e.logback.appender ................... SUCCESS [  1.642 s]
11:09:34 [INFO] org.eclipse.m2e.logback.configuration .............. SUCCESS [  1.318 s]
11:09:34 [INFO] org.eclipse.m2e.sse.ui.feature ..................... SUCCESS [  0.577 s]
11:09:34 [INFO] Maven Integration for Eclipse ...................... FAILURE [  3.555 s]
11:09:34 [INFO] org.eclipse.m2e.lemminx.feature .................... SUCCESS [  0.517 s]
11:09:34 [INFO] m2e extensions development support (Optional) ...... SUCCESS [  4.693 s]
11:09:34 [INFO] Maven Integration for Eclipse slf4j over logback logging (Optional) SUCCESS [  0.770 s]
11:09:34 [INFO] Maven Integration for Eclipse Update Site .......... SKIPPED
11:09:34 [INFO] org.eclipse.m2e.core.tests ......................... SUCCESS [01:54 min]
11:09:34 [INFO] Tests for Maven Integration for Eclipse Importer framework SUCCESS [01:24 min]
11:09:34 [INFO] org.eclipse.m2e.binaryproject.tests ................ SUCCESS [02:05 min]
11:09:34 [INFO] org.eclipse.m2e.editor.lemminx.tests ............... SUCCESS [ 43.765 s]
11:09:34 [INFO] org.eclipse.m2e.jdt.tests .......................... SUCCESS [01:10 min]
11:09:34 [INFO] org.eclipse.m2e.editor.xml.sse.tests ............... SUCCESS [ 21.215 s]
11:09:34 [INFO] m2e-core-tests ..................................... SUCCESS [  0.012 s]
11:09:34 [INFO] Maven Integration for Eclipse tests ................ SUCCESS [55:11 min]
11:09:34 [INFO] Maven Integration for Eclipse POM Editor tests ..... SUCCESS [01:11 min]
11:09:34 [INFO] Maven POM XML Editor Tests ......................... SUCCESS [05:09 min]
11:09:34 [INFO] ------------------------------------------------------------------------
11:09:34 [INFO] BUILD FAILURE
11:09:34 [INFO] ------------------------------------------------------------------------
11:09:34 [INFO] Total time:  01:16 h
11:09:34 [INFO] Finished at: 2020-06-11T15:09:34Z
11:09:34 [INFO] ------------------------------------------------------------------------
11:09:34 [ERROR] Failed to execute goal org.eclipse.tycho.extras:tycho-p2-extras-plugin:1.6.0:compare-version-with-baselines (check-no-version-regression) on project org.eclipse.m2e.feature: Only qualifier changed for (org.eclipse.m2e.feature.feature.jar/1.16.0.20200611-1350). Expected to have bigger x.y.z than what is available in baseline (1.16.0.20200610-1735) -> [Help 1]
11:09:34 [ERROR] 
11:09:34 [ERROR] To see the full stack trace of the errors, re-run Maven with the -e switch.
11:09:34 [ERROR] Re-run Maven using the -X switch to enable full debug logging.
11:09:34 [ERROR] 
11:09:34 [ERROR] For more information about the errors and possible solutions, please read the following articles:
11:09:34 [ERROR] [Help 1] http://cwiki.apache.org/confluence/display/MAVEN/MojoFailureException
11:09:34 [ERROR] 
11:09:34 [ERROR] After correcting the problems, you can resume the build with the command
11:09:34 [ERROR]   mvn <args> -rf :org.eclipse.m2e.feature
11:09:35 Build step 'Invoke top-level Maven targets' marked build as failure
11:09:35 Terminating xvnc.
11:11:37 Recording test results
11:11:37 Archiving artifacts
11:11:37 Finished: FAILURE