AbortedConsole Output

Skipping 2,610 KB.. Full Log
2e.editor.lemminx.tests ---
10:13:44 [INFO] Building jar: /home/jenkins/agent/workspace/m2e-sonarqube/org.eclipse.m2e.editor.lemminx.tests/target/org.eclipse.m2e.editor.lemminx.tests-1.16.0-SNAPSHOT.jar
10:13:44 [INFO] 
10:13:44 [INFO] --- tycho-p2-plugin:1.6.0:p2-metadata-default (default-p2-metadata-default) @ org.eclipse.m2e.editor.lemminx.tests ---
10:13:44 [INFO] No baseline version MavenProject: org.eclipse.m2e:org.eclipse.m2e.editor.lemminx.tests:1.16.0-SNAPSHOT @ /home/jenkins/agent/workspace/m2e-sonarqube/org.eclipse.m2e.editor.lemminx.tests/pom.xml
10:13:44 [INFO] 
10:13:44 [INFO] --- tycho-surefire-plugin:1.6.0:test (default-test) @ org.eclipse.m2e.editor.lemminx.tests ---
10:13:46 [INFO] Expected eclipse log file: /home/jenkins/agent/workspace/m2e-sonarqube/org.eclipse.m2e.editor.lemminx.tests/target/work/data/.metadata/.log
10:13:46 [INFO] Command line:
10:13:46 	[/opt/tools/java/oracle/jdk-8/1.8.0_202/jre/bin/java, -Dosgi.noShutdown=false, -Dosgi.os=linux, -Dosgi.ws=gtk, -Dosgi.arch=x86_64, -javaagent:/home/jenkins/agent/workspace/m2e-sonarqube/.repository/org/jacoco/org.jacoco.agent/0.8.5/org.jacoco.agent-0.8.5-runtime.jar=destfile=/home/jenkins/agent/workspace/m2e-sonarqube/jacoco.exec,append=true,includes=org.eclipse.m2e*:org.apache.maven*:org.eclipse.aether*, -Xmx800m, -Dosgi.clean=true, -jar, /home/jenkins/agent/workspace/m2e-sonarqube/.repository/p2/osgi/bundle/org.eclipse.equinox.launcher/1.5.700.v20200207-2156/org.eclipse.equinox.launcher-1.5.700.v20200207-2156.jar, -data, /home/jenkins/agent/workspace/m2e-sonarqube/org.eclipse.m2e.editor.lemminx.tests/target/work/data, -install, /home/jenkins/agent/workspace/m2e-sonarqube/org.eclipse.m2e.editor.lemminx.tests/target/work, -configuration, /home/jenkins/agent/workspace/m2e-sonarqube/org.eclipse.m2e.editor.lemminx.tests/target/work/configuration, -application, org.eclipse.tycho.surefire.osgibooter.uitest, -testproperties, /home/jenkins/agent/workspace/m2e-sonarqube/org.eclipse.m2e.editor.lemminx.tests/target/surefire.properties, -timeout, 7200000]
10:13:46 Picked up JAVA_TOOL_OPTIONS: -XX:+IgnoreUnrecognizedVMOptions -XX:+UseContainerSupport -XX:+UnlockExperimentalVMOptions -XX:+UseCGroupMemoryLimitForHeap
10:13:46 Picked up _JAVA_OPTIONS: -XX:MaxRAMPercentage=64.0
10:13:52 Running org.eclipse.m2e.editor.lemminx.tests.EditorTest
10:13:52 SLF4J: Failed to load class "org.slf4j.impl.StaticLoggerBinder".
10:13:52 SLF4J: Defaulting to no-operation (NOP) logger implementation
10:13:52 SLF4J: See http://www.slf4j.org/codes.html#StaticLoggerBinder for further details.
10:13:54 Warning: NLS missing message: MavenImpl_error_lookup in: org.eclipse.m2e.editor.internal.messages
10:13:56 Picked up JAVA_TOOL_OPTIONS: -XX:+IgnoreUnrecognizedVMOptions -XX:+UseContainerSupport -XX:+UnlockExperimentalVMOptions -XX:+UseCGroupMemoryLimitForHeap
10:13:56 Picked up _JAVA_OPTIONS: -XX:MaxRAMPercentage=64.0
10:13:57 Jun 10, 2020 2:13:57 PM org.eclipse.lemminx.XMLLanguageServer initialize
10:13:57 INFO: Initializing XML Language server 0.11.1-20200325-1306 with /opt/tools/java/oracle/jdk-8/1.8.0_202/jre
10:14:02 Picked up JAVA_TOOL_OPTIONS: -XX:+IgnoreUnrecognizedVMOptions -XX:+UseContainerSupport -XX:+UnlockExperimentalVMOptions -XX:+UseCGroupMemoryLimitForHeap
10:14:02 Picked up _JAVA_OPTIONS: -XX:MaxRAMPercentage=64.0
10:14:03 Jun 10, 2020 2:14:03 PM org.eclipse.lemminx.XMLLanguageServer initialize
10:14:03 INFO: Initializing XML Language server 0.11.1-20200325-1306 with /opt/tools/java/oracle/jdk-8/1.8.0_202/jre
10:14:04 SLF4J: Failed to load class "org.slf4j.impl.StaticLoggerBinder".
10:14:04 SLF4J: Defaulting to no-operation (NOP) logger implementation
10:14:04 SLF4J: See http://www.slf4j.org/codes.html#StaticLoggerBinder for further details.
10:14:12 Jun 10, 2020 2:14:12 PM org.eclipse.lemminx.uriresolver.CacheResourcesManager lambda$downloadResource$0
10:14:12 INFO: Downloading http://maven.apache.org/xsd/maven-4.0.0.xsd to /home/jenkins/.lemminx/cache/http/maven.apache.org/xsd/maven-4.0.0.xsd...
10:14:13 Jun 10, 2020 2:14:13 PM org.eclipse.lemminx.uriresolver.CacheResourcesManager lambda$downloadResource$0
10:14:13 INFO: Downloaded http://maven.apache.org/xsd/maven-4.0.0.xsd to /home/jenkins/.lemminx/cache/http/maven.apache.org/xsd/maven-4.0.0.xsd in 389ms
10:14:13 Tests run: 2, Failures: 0, Errors: 0, Skipped: 0, Time elapsed: 21.461 s - in org.eclipse.m2e.editor.lemminx.tests.EditorTest
10:14:13 testEditorOpenOnSourcePage(org.eclipse.m2e.editor.lemminx.tests.EditorTest)  Time elapsed: 4.694 s
10:14:13 testGenericEditorHasMavenExtensionEnabled(org.eclipse.m2e.editor.lemminx.tests.EditorTest)  Time elapsed: 16.713 s
10:14:13 
10:14:13 Results:
10:14:13 
10:14:13 Tests run: 2, Failures: 0, Errors: 0, Skipped: 0
10:14:13 
10:14:17 [INFO] All tests passed!
10:14:17 [INFO] 
10:14:17 [INFO] --- tycho-p2-extras-plugin:1.6.0:compare-version-with-baselines (check-no-version-regression) @ org.eclipse.m2e.editor.lemminx.tests ---
10:14:17 [INFO] 
10:14:17 [INFO] --- maven-install-plugin:2.3.1:install (default-install) @ org.eclipse.m2e.editor.lemminx.tests ---
10:14:17 [INFO] Installing /home/jenkins/agent/workspace/m2e-sonarqube/org.eclipse.m2e.editor.lemminx.tests/target/org.eclipse.m2e.editor.lemminx.tests-1.16.0-SNAPSHOT.jar to /home/jenkins/agent/workspace/m2e-sonarqube/.repository/org/eclipse/m2e/org.eclipse.m2e.editor.lemminx.tests/1.16.0-SNAPSHOT/org.eclipse.m2e.editor.lemminx.tests-1.16.0-SNAPSHOT.jar
10:14:17 [INFO] Installing /home/jenkins/agent/workspace/m2e-sonarqube/org.eclipse.m2e.editor.lemminx.tests/pom.xml to /home/jenkins/agent/workspace/m2e-sonarqube/.repository/org/eclipse/m2e/org.eclipse.m2e.editor.lemminx.tests/1.16.0-SNAPSHOT/org.eclipse.m2e.editor.lemminx.tests-1.16.0-SNAPSHOT.pom
10:14:17 [INFO] Installing /home/jenkins/agent/workspace/m2e-sonarqube/org.eclipse.m2e.editor.lemminx.tests/target/org.eclipse.m2e.editor.lemminx.tests-1.16.0-SNAPSHOT-sources.jar to /home/jenkins/agent/workspace/m2e-sonarqube/.repository/org/eclipse/m2e/org.eclipse.m2e.editor.lemminx.tests/1.16.0-SNAPSHOT/org.eclipse.m2e.editor.lemminx.tests-1.16.0-SNAPSHOT-sources.jar
10:14:17 [INFO] Installing /home/jenkins/agent/workspace/m2e-sonarqube/org.eclipse.m2e.editor.lemminx.tests/target/p2content.xml to /home/jenkins/agent/workspace/m2e-sonarqube/.repository/org/eclipse/m2e/org.eclipse.m2e.editor.lemminx.tests/1.16.0-SNAPSHOT/org.eclipse.m2e.editor.lemminx.tests-1.16.0-SNAPSHOT-p2metadata.xml
10:14:17 [INFO] Installing /home/jenkins/agent/workspace/m2e-sonarqube/org.eclipse.m2e.editor.lemminx.tests/target/p2artifacts.xml to /home/jenkins/agent/workspace/m2e-sonarqube/.repository/org/eclipse/m2e/org.eclipse.m2e.editor.lemminx.tests/1.16.0-SNAPSHOT/org.eclipse.m2e.editor.lemminx.tests-1.16.0-SNAPSHOT-p2artifacts.xml
10:14:17 [INFO] 
10:14:17 [INFO] --- tycho-p2-plugin:1.6.0:update-local-index (default-update-local-index) @ org.eclipse.m2e.editor.lemminx.tests ---
10:14:17 [INFO] 
10:14:17 [INFO] -------------< org.eclipse.m2e:org.eclipse.m2e.jdt.tests >--------------
10:14:17 [INFO] Building org.eclipse.m2e.jdt.tests 1.16.0-SNAPSHOT               [35/40]
10:14:17 [INFO] ------------------------[ eclipse-test-plugin ]-------------------------
10:14:17 [INFO] 
10:14:17 [INFO] --- maven-clean-plugin:2.4.1:clean (default-clean) @ org.eclipse.m2e.jdt.tests ---
10:14:17 [INFO] 
10:14:17 [INFO] --- tycho-packaging-plugin:1.6.0:build-qualifier (default-build-qualifier) @ org.eclipse.m2e.jdt.tests ---
10:14:17 [INFO] The project's OSGi version is 1.16.0.20200514-1409
10:14:17 [INFO] 
10:14:17 [INFO] --- tycho-packaging-plugin:1.6.0:validate-id (default-validate-id) @ org.eclipse.m2e.jdt.tests ---
10:14:17 [INFO] 
10:14:17 [INFO] --- tycho-packaging-plugin:1.6.0:validate-version (default-validate-version) @ org.eclipse.m2e.jdt.tests ---
10:14:17 [INFO] 
10:14:17 [INFO] --- jacoco-maven-plugin:0.8.5:prepare-agent (default) @ org.eclipse.m2e.jdt.tests ---
10:14:17 [INFO] tycho.testArgLine set to -javaagent:/home/jenkins/agent/workspace/m2e-sonarqube/.repository/org/jacoco/org.jacoco.agent/0.8.5/org.jacoco.agent-0.8.5-runtime.jar=destfile=/home/jenkins/agent/workspace/m2e-sonarqube/jacoco.exec,append=true,includes=org.eclipse.m2e*:org.apache.maven*:org.eclipse.aether* -Xmx800m
10:14:17 [INFO] 
10:14:17 [INFO] --- maven-resources-plugin:2.5:resources (default-resources) @ org.eclipse.m2e.jdt.tests ---
10:14:17 [debug] execute contextualize
10:14:17 [INFO] Using 'UTF-8' encoding to copy filtered resources.
10:14:17 [INFO] skip non existing resourceDirectory /home/jenkins/agent/workspace/m2e-sonarqube/org.eclipse.m2e.jdt.tests/src/main/resources
10:14:17 [INFO] 
10:14:17 [INFO] --- tycho-compiler-plugin:1.6.0:compile (default-compile) @ org.eclipse.m2e.jdt.tests ---
10:14:17 [WARNING] Parameter 'useProjectSettings' is set to true, but preferences file '/home/jenkins/agent/workspace/m2e-sonarqube/org.eclipse.m2e.jdt.tests/.settings/org.eclipse.jdt.core.prefs' could not be found!
10:14:17 [INFO] Compiling 1 source file to /home/jenkins/agent/workspace/m2e-sonarqube/org.eclipse.m2e.jdt.tests/target/classes
10:14:17 [INFO] 
10:14:17 [INFO] --- maven-resources-plugin:2.5:testResources (default-testResources) @ org.eclipse.m2e.jdt.tests ---
10:14:17 [debug] execute contextualize
10:14:17 [INFO] Using 'UTF-8' encoding to copy filtered resources.
10:14:17 [INFO] skip non existing resourceDirectory /home/jenkins/agent/workspace/m2e-sonarqube/org.eclipse.m2e.jdt.tests/src/test/resources
10:14:17 [INFO] 
10:14:17 [INFO] --- tycho-source-plugin:1.6.0:plugin-source (plugin-source) @ org.eclipse.m2e.jdt.tests ---
10:14:17 [WARNING] Bundle-Name header not found in /home/jenkins/agent/workspace/m2e-sonarqube/org.eclipse.m2e.jdt.tests/META-INF/MANIFEST.MF, fallback to Bundle-SymbolicName for source bundle
10:14:17 [WARNING] Bundle-Vendor header not found in /home/jenkins/agent/workspace/m2e-sonarqube/org.eclipse.m2e.jdt.tests/META-INF/MANIFEST.MF, fallback to 'unknown' for source bundle
10:14:17 [INFO] Building jar: /home/jenkins/agent/workspace/m2e-sonarqube/org.eclipse.m2e.jdt.tests/target/org.eclipse.m2e.jdt.tests-1.16.0-SNAPSHOT-sources.jar
10:14:17 [INFO] 
10:14:17 [INFO] --- target-platform-configuration:1.6.0:target-platform (default-target-platform) @ org.eclipse.m2e.jdt.tests ---
10:14:17 [INFO] 
10:14:17 [INFO] --- tycho-packaging-plugin:1.6.0:package-plugin (default-package-plugin) @ org.eclipse.m2e.jdt.tests ---
10:14:17 [INFO] Building jar: /home/jenkins/agent/workspace/m2e-sonarqube/org.eclipse.m2e.jdt.tests/target/org.eclipse.m2e.jdt.tests-1.16.0-SNAPSHOT.jar
10:14:17 [INFO] 
10:14:17 [INFO] --- tycho-p2-plugin:1.6.0:p2-metadata-default (default-p2-metadata-default) @ org.eclipse.m2e.jdt.tests ---
10:14:17 [INFO] No baseline version MavenProject: org.eclipse.m2e:org.eclipse.m2e.jdt.tests:1.16.0-SNAPSHOT @ /home/jenkins/agent/workspace/m2e-sonarqube/org.eclipse.m2e.jdt.tests/pom.xml
10:14:17 [INFO] 
10:14:17 [INFO] --- tycho-surefire-plugin:1.6.0:test (default-test) @ org.eclipse.m2e.jdt.tests ---
10:14:18 [INFO] Expected eclipse log file: /home/jenkins/agent/workspace/m2e-sonarqube/org.eclipse.m2e.jdt.tests/target/work/data/.metadata/.log
10:14:18 [INFO] Command line:
10:14:18 	[/opt/tools/java/oracle/jdk-8/1.8.0_202/jre/bin/java, -Dosgi.noShutdown=false, -Dosgi.os=linux, -Dosgi.ws=gtk, -Dosgi.arch=x86_64, -javaagent:/home/jenkins/agent/workspace/m2e-sonarqube/.repository/org/jacoco/org.jacoco.agent/0.8.5/org.jacoco.agent-0.8.5-runtime.jar=destfile=/home/jenkins/agent/workspace/m2e-sonarqube/jacoco.exec,append=true,includes=org.eclipse.m2e*:org.apache.maven*:org.eclipse.aether*, -Xmx800m, -Dosgi.clean=true, -jar, /home/jenkins/agent/workspace/m2e-sonarqube/.repository/p2/osgi/bundle/org.eclipse.equinox.launcher/1.5.700.v20200207-2156/org.eclipse.equinox.launcher-1.5.700.v20200207-2156.jar, -data, /home/jenkins/agent/workspace/m2e-sonarqube/org.eclipse.m2e.jdt.tests/target/work/data, -install, /home/jenkins/agent/workspace/m2e-sonarqube/org.eclipse.m2e.jdt.tests/target/work, -configuration, /home/jenkins/agent/workspace/m2e-sonarqube/org.eclipse.m2e.jdt.tests/target/work/configuration, -application, org.eclipse.tycho.surefire.osgibooter.uitest, -testproperties, /home/jenkins/agent/workspace/m2e-sonarqube/org.eclipse.m2e.jdt.tests/target/surefire.properties, -timeout, 7200000]
10:14:18 Picked up JAVA_TOOL_OPTIONS: -XX:+IgnoreUnrecognizedVMOptions -XX:+UseContainerSupport -XX:+UnlockExperimentalVMOptions -XX:+UseCGroupMemoryLimitForHeap
10:14:18 Picked up _JAVA_OPTIONS: -XX:MaxRAMPercentage=64.0
10:14:26 Running org.eclipse.m2e.jdt.tests.JavaConfigurationTest
10:14:26 SLF4J: Failed to load class "org.slf4j.impl.StaticLoggerBinder".
10:14:26 SLF4J: Defaulting to no-operation (NOP) logger implementation
10:14:26 SLF4J: See http://www.slf4j.org/codes.html#StaticLoggerBinder for further details.
10:15:17 Tests run: 1, Failures: 0, Errors: 0, Skipped: 0, Time elapsed: 50.294 s - in org.eclipse.m2e.jdt.tests.JavaConfigurationTest
10:15:17 testFileChangeUpdatesJDTSettings(org.eclipse.m2e.jdt.tests.JavaConfigurationTest)  Time elapsed: 46.253 s
10:15:17 
10:15:17 Results:
10:15:17 
10:15:17 Tests run: 1, Failures: 0, Errors: 0, Skipped: 0
10:15:17 
10:15:19 [INFO] All tests passed!
10:15:19 [INFO] 
10:15:19 [INFO] --- tycho-p2-extras-plugin:1.6.0:compare-version-with-baselines (check-no-version-regression) @ org.eclipse.m2e.jdt.tests ---
10:15:19 [INFO] 
10:15:19 [INFO] --- maven-install-plugin:2.3.1:install (default-install) @ org.eclipse.m2e.jdt.tests ---
10:15:19 [INFO] Installing /home/jenkins/agent/workspace/m2e-sonarqube/org.eclipse.m2e.jdt.tests/target/org.eclipse.m2e.jdt.tests-1.16.0-SNAPSHOT.jar to /home/jenkins/agent/workspace/m2e-sonarqube/.repository/org/eclipse/m2e/org.eclipse.m2e.jdt.tests/1.16.0-SNAPSHOT/org.eclipse.m2e.jdt.tests-1.16.0-SNAPSHOT.jar
10:15:19 [INFO] Installing /home/jenkins/agent/workspace/m2e-sonarqube/org.eclipse.m2e.jdt.tests/pom.xml to /home/jenkins/agent/workspace/m2e-sonarqube/.repository/org/eclipse/m2e/org.eclipse.m2e.jdt.tests/1.16.0-SNAPSHOT/org.eclipse.m2e.jdt.tests-1.16.0-SNAPSHOT.pom
10:15:19 [INFO] Installing /home/jenkins/agent/workspace/m2e-sonarqube/org.eclipse.m2e.jdt.tests/target/org.eclipse.m2e.jdt.tests-1.16.0-SNAPSHOT-sources.jar to /home/jenkins/agent/workspace/m2e-sonarqube/.repository/org/eclipse/m2e/org.eclipse.m2e.jdt.tests/1.16.0-SNAPSHOT/org.eclipse.m2e.jdt.tests-1.16.0-SNAPSHOT-sources.jar
10:15:19 [INFO] Installing /home/jenkins/agent/workspace/m2e-sonarqube/org.eclipse.m2e.jdt.tests/target/p2content.xml to /home/jenkins/agent/workspace/m2e-sonarqube/.repository/org/eclipse/m2e/org.eclipse.m2e.jdt.tests/1.16.0-SNAPSHOT/org.eclipse.m2e.jdt.tests-1.16.0-SNAPSHOT-p2metadata.xml
10:15:19 [INFO] Installing /home/jenkins/agent/workspace/m2e-sonarqube/org.eclipse.m2e.jdt.tests/target/p2artifacts.xml to /home/jenkins/agent/workspace/m2e-sonarqube/.repository/org/eclipse/m2e/org.eclipse.m2e.jdt.tests/1.16.0-SNAPSHOT/org.eclipse.m2e.jdt.tests-1.16.0-SNAPSHOT-p2artifacts.xml
10:15:19 [INFO] 
10:15:19 [INFO] --- tycho-p2-plugin:1.6.0:update-local-index (default-update-local-index) @ org.eclipse.m2e.jdt.tests ---
10:15:19 [INFO] 
10:15:19 [INFO] --------< org.eclipse.m2e:org.eclipse.m2e.editor.xml.sse.tests >--------
10:15:19 [INFO] Building org.eclipse.m2e.editor.xml.sse.tests 1.16.0-SNAPSHOT    [36/40]
10:15:19 [INFO] ------------------------[ eclipse-test-plugin ]-------------------------
10:15:19 [INFO] 
10:15:19 [INFO] --- maven-clean-plugin:2.4.1:clean (default-clean) @ org.eclipse.m2e.editor.xml.sse.tests ---
10:15:19 [INFO] 
10:15:19 [INFO] --- tycho-packaging-plugin:1.6.0:build-qualifier (default-build-qualifier) @ org.eclipse.m2e.editor.xml.sse.tests ---
10:15:19 [INFO] The project's OSGi version is 1.16.0.20200514-2159
10:15:19 [INFO] 
10:15:19 [INFO] --- tycho-packaging-plugin:1.6.0:validate-id (default-validate-id) @ org.eclipse.m2e.editor.xml.sse.tests ---
10:15:19 [INFO] 
10:15:19 [INFO] --- tycho-packaging-plugin:1.6.0:validate-version (default-validate-version) @ org.eclipse.m2e.editor.xml.sse.tests ---
10:15:19 [INFO] 
10:15:19 [INFO] --- jacoco-maven-plugin:0.8.5:prepare-agent (default) @ org.eclipse.m2e.editor.xml.sse.tests ---
10:15:19 [INFO] tycho.testArgLine set to -javaagent:/home/jenkins/agent/workspace/m2e-sonarqube/.repository/org/jacoco/org.jacoco.agent/0.8.5/org.jacoco.agent-0.8.5-runtime.jar=destfile=/home/jenkins/agent/workspace/m2e-sonarqube/jacoco.exec,append=true,includes=org.eclipse.m2e*:org.apache.maven*:org.eclipse.aether* -Xmx800m
10:15:19 [INFO] 
10:15:19 [INFO] --- maven-resources-plugin:2.5:resources (default-resources) @ org.eclipse.m2e.editor.xml.sse.tests ---
10:15:19 [debug] execute contextualize
10:15:19 [INFO] Using 'UTF-8' encoding to copy filtered resources.
10:15:19 [INFO] skip non existing resourceDirectory /home/jenkins/agent/workspace/m2e-sonarqube/org.eclipse.m2e.editor.xml.sse.tests/src/main/resources
10:15:19 [INFO] 
10:15:19 [INFO] --- tycho-compiler-plugin:1.6.0:compile (default-compile) @ org.eclipse.m2e.editor.xml.sse.tests ---
10:15:19 [WARNING] Parameter 'useProjectSettings' is set to true, but preferences file '/home/jenkins/agent/workspace/m2e-sonarqube/org.eclipse.m2e.editor.xml.sse.tests/.settings/org.eclipse.jdt.core.prefs' could not be found!
10:15:19 [INFO] Compiling 1 source file to /home/jenkins/agent/workspace/m2e-sonarqube/org.eclipse.m2e.editor.xml.sse.tests/target/classes
10:15:19 [INFO] 
10:15:19 [INFO] --- maven-resources-plugin:2.5:testResources (default-testResources) @ org.eclipse.m2e.editor.xml.sse.tests ---
10:15:19 [debug] execute contextualize
10:15:19 [INFO] Using 'UTF-8' encoding to copy filtered resources.
10:15:19 [INFO] skip non existing resourceDirectory /home/jenkins/agent/workspace/m2e-sonarqube/org.eclipse.m2e.editor.xml.sse.tests/src/test/resources
10:15:19 [INFO] 
10:15:19 [INFO] --- tycho-source-plugin:1.6.0:plugin-source (plugin-source) @ org.eclipse.m2e.editor.xml.sse.tests ---
10:15:19 [INFO] Building jar: /home/jenkins/agent/workspace/m2e-sonarqube/org.eclipse.m2e.editor.xml.sse.tests/target/org.eclipse.m2e.editor.xml.sse.tests-1.16.0-SNAPSHOT-sources.jar
10:15:19 [INFO] 
10:15:19 [INFO] --- target-platform-configuration:1.6.0:target-platform (default-target-platform) @ org.eclipse.m2e.editor.xml.sse.tests ---
10:15:19 [INFO] 
10:15:19 [INFO] --- tycho-packaging-plugin:1.6.0:package-plugin (default-package-plugin) @ org.eclipse.m2e.editor.xml.sse.tests ---
10:15:19 [INFO] Building jar: /home/jenkins/agent/workspace/m2e-sonarqube/org.eclipse.m2e.editor.xml.sse.tests/target/org.eclipse.m2e.editor.xml.sse.tests-1.16.0-SNAPSHOT.jar
10:15:19 [INFO] 
10:15:19 [INFO] --- tycho-p2-plugin:1.6.0:p2-metadata-default (default-p2-metadata-default) @ org.eclipse.m2e.editor.xml.sse.tests ---
10:15:19 [INFO] No baseline version MavenProject: org.eclipse.m2e:org.eclipse.m2e.editor.xml.sse.tests:1.16.0-SNAPSHOT @ /home/jenkins/agent/workspace/m2e-sonarqube/org.eclipse.m2e.editor.xml.sse.tests/pom.xml
10:15:19 [INFO] 
10:15:19 [INFO] --- tycho-surefire-plugin:1.6.0:test (default-test) @ org.eclipse.m2e.editor.xml.sse.tests ---
10:15:20 [INFO] Expected eclipse log file: /home/jenkins/agent/workspace/m2e-sonarqube/org.eclipse.m2e.editor.xml.sse.tests/target/work/data/.metadata/.log
10:15:20 [INFO] Command line:
10:15:20 	[/opt/tools/java/oracle/jdk-8/1.8.0_202/jre/bin/java, -Dosgi.noShutdown=false, -Dosgi.os=linux, -Dosgi.ws=gtk, -Dosgi.arch=x86_64, -javaagent:/home/jenkins/agent/workspace/m2e-sonarqube/.repository/org/jacoco/org.jacoco.agent/0.8.5/org.jacoco.agent-0.8.5-runtime.jar=destfile=/home/jenkins/agent/workspace/m2e-sonarqube/jacoco.exec,append=true,includes=org.eclipse.m2e*:org.apache.maven*:org.eclipse.aether*, -Xmx800m, -Dosgi.clean=true, -jar, /home/jenkins/agent/workspace/m2e-sonarqube/.repository/p2/osgi/bundle/org.eclipse.equinox.launcher/1.5.700.v20200207-2156/org.eclipse.equinox.launcher-1.5.700.v20200207-2156.jar, -data, /home/jenkins/agent/workspace/m2e-sonarqube/org.eclipse.m2e.editor.xml.sse.tests/target/work/data, -install, /home/jenkins/agent/workspace/m2e-sonarqube/org.eclipse.m2e.editor.xml.sse.tests/target/work, -configuration, /home/jenkins/agent/workspace/m2e-sonarqube/org.eclipse.m2e.editor.xml.sse.tests/target/work/configuration, -application, org.eclipse.tycho.surefire.osgibooter.uitest, -testproperties, /home/jenkins/agent/workspace/m2e-sonarqube/org.eclipse.m2e.editor.xml.sse.tests/target/surefire.properties, -timeout, 7200000]
10:15:20 Picked up JAVA_TOOL_OPTIONS: -XX:+IgnoreUnrecognizedVMOptions -XX:+UseContainerSupport -XX:+UnlockExperimentalVMOptions -XX:+UseCGroupMemoryLimitForHeap
10:15:20 Picked up _JAVA_OPTIONS: -XX:MaxRAMPercentage=64.0
10:15:25 Running org.eclipse.m2e.editor.xml.sse.tests.WTPEditorTest
10:15:25 SLF4J: Failed to load class "org.slf4j.impl.StaticLoggerBinder".
10:15:25 SLF4J: Defaulting to no-operation (NOP) logger implementation
10:15:25 SLF4J: See http://www.slf4j.org/codes.html#StaticLoggerBinder for further details.
10:15:27 Warning: NLS missing message: MavenImpl_error_lookup in: org.eclipse.m2e.editor.internal.messages
10:15:31 Warning: NLS unused message: MarkerHoverControl_openDiscoveryPrefs in: org.eclipse.m2e.editor.xml.internal.messages
10:15:31 Warning: NLS unused message: MarkerHoverControl_openLifecyclePrefs in: org.eclipse.m2e.editor.xml.internal.messages
10:15:31 Warning: NLS unused message: MarkerHoverControl_openParentDefinition in: org.eclipse.m2e.editor.xml.internal.messages
10:15:31 Warning: NLS unused message: MarkerHoverControl_openWarningsPrefs in: org.eclipse.m2e.editor.xml.internal.messages
10:15:31 Warning: NLS unused message: MavenMarkerResolution_error in: org.eclipse.m2e.editor.xml.internal.messages
10:15:31 Warning: NLS unused message: MavenMarkerResolution_error_title in: org.eclipse.m2e.editor.xml.internal.messages
10:15:31 Warning: NLS unused message: MavenMarkerResolution_schema_label in: org.eclipse.m2e.editor.xml.internal.messages
10:15:31 Tests run: 1, Failures: 0, Errors: 0, Skipped: 0, Time elapsed: 6.347 s - in org.eclipse.m2e.editor.xml.sse.tests.WTPEditorTest
10:15:31 testXSDCompletion(org.eclipse.m2e.editor.xml.sse.tests.WTPEditorTest)  Time elapsed: 6.3 s
10:15:31 
10:15:31 Results:
10:15:31 
10:15:31 Tests run: 1, Failures: 0, Errors: 0, Skipped: 0
10:15:31 
10:15:37 [INFO] All tests passed!
10:15:37 [INFO] 
10:15:37 [INFO] --- tycho-p2-extras-plugin:1.6.0:compare-version-with-baselines (check-no-version-regression) @ org.eclipse.m2e.editor.xml.sse.tests ---
10:15:37 [INFO] 
10:15:37 [INFO] --- maven-install-plugin:2.3.1:install (default-install) @ org.eclipse.m2e.editor.xml.sse.tests ---
10:15:37 [INFO] Installing /home/jenkins/agent/workspace/m2e-sonarqube/org.eclipse.m2e.editor.xml.sse.tests/target/org.eclipse.m2e.editor.xml.sse.tests-1.16.0-SNAPSHOT.jar to /home/jenkins/agent/workspace/m2e-sonarqube/.repository/org/eclipse/m2e/org.eclipse.m2e.editor.xml.sse.tests/1.16.0-SNAPSHOT/org.eclipse.m2e.editor.xml.sse.tests-1.16.0-SNAPSHOT.jar
10:15:37 [INFO] Installing /home/jenkins/agent/workspace/m2e-sonarqube/org.eclipse.m2e.editor.xml.sse.tests/pom.xml to /home/jenkins/agent/workspace/m2e-sonarqube/.repository/org/eclipse/m2e/org.eclipse.m2e.editor.xml.sse.tests/1.16.0-SNAPSHOT/org.eclipse.m2e.editor.xml.sse.tests-1.16.0-SNAPSHOT.pom
10:15:37 [INFO] Installing /home/jenkins/agent/workspace/m2e-sonarqube/org.eclipse.m2e.editor.xml.sse.tests/target/org.eclipse.m2e.editor.xml.sse.tests-1.16.0-SNAPSHOT-sources.jar to /home/jenkins/agent/workspace/m2e-sonarqube/.repository/org/eclipse/m2e/org.eclipse.m2e.editor.xml.sse.tests/1.16.0-SNAPSHOT/org.eclipse.m2e.editor.xml.sse.tests-1.16.0-SNAPSHOT-sources.jar
10:15:37 [INFO] Installing /home/jenkins/agent/workspace/m2e-sonarqube/org.eclipse.m2e.editor.xml.sse.tests/target/p2content.xml to /home/jenkins/agent/workspace/m2e-sonarqube/.repository/org/eclipse/m2e/org.eclipse.m2e.editor.xml.sse.tests/1.16.0-SNAPSHOT/org.eclipse.m2e.editor.xml.sse.tests-1.16.0-SNAPSHOT-p2metadata.xml
10:15:37 [INFO] Installing /home/jenkins/agent/workspace/m2e-sonarqube/org.eclipse.m2e.editor.xml.sse.tests/target/p2artifacts.xml to /home/jenkins/agent/workspace/m2e-sonarqube/.repository/org/eclipse/m2e/org.eclipse.m2e.editor.xml.sse.tests/1.16.0-SNAPSHOT/org.eclipse.m2e.editor.xml.sse.tests-1.16.0-SNAPSHOT-p2artifacts.xml
10:15:37 [INFO] 
10:15:37 [INFO] --- tycho-p2-plugin:1.6.0:update-local-index (default-update-local-index) @ org.eclipse.m2e.editor.xml.sse.tests ---
10:15:37 [INFO] 
10:15:37 [INFO] -------------------< org.eclipse.m2e:m2e-core-tests >-------------------
10:15:37 [INFO] Building m2e-core-tests 1.16.0-SNAPSHOT                          [37/40]
10:15:37 [INFO] --------------------------------[ pom ]---------------------------------
10:15:37 [INFO] 
10:15:37 [INFO] --- maven-clean-plugin:2.4.1:clean (default-clean) @ m2e-core-tests ---
10:15:37 [INFO] 
10:15:37 [INFO] --- jacoco-maven-plugin:0.8.5:prepare-agent (default) @ m2e-core-tests ---
10:15:37 [INFO] argLine set to -javaagent:/home/jenkins/agent/workspace/m2e-sonarqube/.repository/org/jacoco/org.jacoco.agent/0.8.5/org.jacoco.agent-0.8.5-runtime.jar=destfile=/home/jenkins/agent/workspace/m2e-sonarqube/jacoco.exec,append=true,includes=org.eclipse.m2e*:org.apache.maven*:org.eclipse.aether*
10:15:37 [INFO] 
10:15:37 [INFO] --- tycho-source-plugin:1.6.0:plugin-source (plugin-source) @ m2e-core-tests ---
10:15:37 [INFO] 
10:15:37 [INFO] --- tycho-p2-extras-plugin:1.6.0:compare-version-with-baselines (check-no-version-regression) @ m2e-core-tests ---
10:15:37 [INFO] 
10:15:37 [INFO] --- maven-install-plugin:2.3.1:install (default-install) @ m2e-core-tests ---
10:15:37 [INFO] Installing /home/jenkins/agent/workspace/m2e-sonarqube/m2e-core-tests/pom.xml to /home/jenkins/agent/workspace/m2e-sonarqube/.repository/org/eclipse/m2e/m2e-core-tests/1.16.0-SNAPSHOT/m2e-core-tests-1.16.0-SNAPSHOT.pom
10:15:37 [INFO] 
10:15:37 [INFO] ---------------< org.eclipse.m2e:org.eclipse.m2e.tests >----------------
10:15:37 [INFO] Building Maven Integration for Eclipse tests 1.16.0-SNAPSHOT     [38/40]
10:15:37 [INFO] ------------------------[ eclipse-test-plugin ]-------------------------
10:15:37 [INFO] 
10:15:37 [INFO] --- maven-clean-plugin:2.4.1:clean (default-clean) @ org.eclipse.m2e.tests ---
10:15:37 [INFO] 
10:15:37 [INFO] --- tycho-packaging-plugin:1.6.0:build-qualifier (default-build-qualifier) @ org.eclipse.m2e.tests ---
10:15:38 [INFO] The project's OSGi version is 1.16.0.20200429-0948
10:15:38 [INFO] 
10:15:38 [INFO] --- tycho-packaging-plugin:1.6.0:validate-id (default-validate-id) @ org.eclipse.m2e.tests ---
10:15:38 [INFO] 
10:15:38 [INFO] --- tycho-packaging-plugin:1.6.0:validate-version (default-validate-version) @ org.eclipse.m2e.tests ---
10:15:38 [INFO] 
10:15:38 [INFO] --- jacoco-maven-plugin:0.8.5:prepare-agent (default) @ org.eclipse.m2e.tests ---
10:15:38 [INFO] tycho.testArgLine set to -javaagent:/home/jenkins/agent/workspace/m2e-sonarqube/.repository/org/jacoco/org.jacoco.agent/0.8.5/org.jacoco.agent-0.8.5-runtime.jar=destfile=/home/jenkins/agent/workspace/m2e-sonarqube/jacoco.exec,append=true,includes=org.eclipse.m2e*:org.apache.maven*:org.eclipse.aether* -Xmx800m
10:15:38 [INFO] 
10:15:38 [INFO] --- maven-resources-plugin:2.5:resources (default-resources) @ org.eclipse.m2e.tests ---
10:15:38 [debug] execute contextualize
10:15:38 [INFO] Using 'UTF-8' encoding to copy filtered resources.
10:15:38 [INFO] skip non existing resourceDirectory /home/jenkins/agent/workspace/m2e-sonarqube/m2e-core-tests/org.eclipse.m2e.tests/src/main/resources
10:15:38 [INFO] 
10:15:38 [INFO] --- tycho-compiler-plugin:1.6.0:compile (default-compile) @ org.eclipse.m2e.tests ---
10:15:40 [INFO] Compiling 113 source files to /home/jenkins/agent/workspace/m2e-sonarqube/m2e-core-tests/org.eclipse.m2e.tests/target/classes
10:15:40 [WARNING] /home/jenkins/agent/workspace/m2e-sonarqube/m2e-core-tests/org.eclipse.m2e.tests/src/org/eclipse/m2e/tests/internal/project/ImportSortOrderTestCase.java:[82] 
10:15:40 	manager.refresh(updateRequest, monitor);
10:15:40 	        ^^^^^^^^^^^^^^^^^^^^^^^^^^^^^^^
10:15:40 The method refresh(MavenUpdateRequest, IProgressMonitor) from the type ProjectRegistryManager is deprecated
10:15:40 [WARNING] /home/jenkins/agent/workspace/m2e-sonarqube/m2e-core-tests/org.eclipse.m2e.tests/src/org/eclipse/m2e/tests/internal/refactoring/ExcludeArtifactRefactoringTest.java:[482] 
10:15:40 	waitForJobsToComplete();
10:15:40 	^^^^^^^^^^^^^^^^^^^^^^^
10:15:40 Access to enclosing method waitForJobsToComplete() from the type AbstractMavenProjectTestCase is emulated by a synthetic accessor method
10:15:40 [WARNING] /home/jenkins/agent/workspace/m2e-sonarqube/m2e-core-tests/org.eclipse.m2e.tests/src/org/eclipse/m2e/tests/internal/refactoring/ExcludeArtifactRefactoringTest.java:[483] 
10:15:40 	return editor;
10:15:40 	       ^^^^^^
10:15:40 Read access to enclosing field ExcludeArtifactRefactoringTest.editor is emulated by a synthetic accessor method
10:15:40 [WARNING] /home/jenkins/agent/workspace/m2e-sonarqube/m2e-core-tests/org.eclipse.m2e.tests/src/org/eclipse/m2e/tests/internal/refactoring/ExcludeArtifactRefactoringTest.java:[489] 
10:15:40 	editor = (MavenPomEditor) getActivePage()
10:15:40 	^^^^^^
10:15:40 Write access to enclosing field ExcludeArtifactRefactoringTest.editor is emulated by a synthetic accessor method
10:15:40 [WARNING] /home/jenkins/agent/workspace/m2e-sonarqube/m2e-core-tests/org.eclipse.m2e.tests/src/org/eclipse/m2e/tests/internal/refactoring/ExcludeArtifactRefactoringTest.java:[576] 
10:15:40 	resource.load(new HashMap());
10:15:40 	                  ^^^^^^^
10:15:40 HashMap is a raw type. References to generic type HashMap<K,V> should be parameterized
10:15:40 6. INFO in /home/jenkins/agent/workspace/m2e-sonarqube/m2e-core-tests/org.eclipse.m2e.tests/src/org/eclipse/m2e/tests/SourceLocationHelperTest.java (at line 36)
10:15:40 	@SuppressWarnings("restriction")
10:15:40 	                  ^^^^^^^^^^^^^
10:15:40 At least one of the problems in category 'restriction' is not analysed due to a compiler option being ignored
10:15:40 7. INFO in /home/jenkins/agent/workspace/m2e-sonarqube/m2e-core-tests/org.eclipse.m2e.tests/src/org/eclipse/m2e/tests/discovery/MavenDiscoveryInstallOperationTest.java (at line 26)
10:15:40 	@SuppressWarnings("restriction")
10:15:40 	                  ^^^^^^^^^^^^^
10:15:40 At least one of the problems in category 'restriction' is not analysed due to a compiler option being ignored
10:15:40 8. INFO in /home/jenkins/agent/workspace/m2e-sonarqube/m2e-core-tests/org.eclipse.m2e.tests/src/org/eclipse/m2e/tests/BuildPathManagerTest.java (at line 94)
10:15:40 	@SuppressWarnings("restriction")
10:15:40 	                  ^^^^^^^^^^^^^
10:15:40 At least one of the problems in category 'restriction' is not analysed due to a compiler option being ignored
10:15:40 [WARNING] /home/jenkins/agent/workspace/m2e-sonarqube/m2e-core-tests/org.eclipse.m2e.tests/src/org/eclipse/m2e/tests/BuildPathManagerTest.java:[1179] 
10:15:40 	MavenPlugin.getProjectConfigurationManager().createArchetypeProject(project, location, archetype, //
10:15:40           projectName, projectName, "0.0.1-SNAPSHOT", "jar", new Properties(), pic, monitor);
10:15:40 	                                             ^^^^^^^^^^^^^^^^^^^^^^^^^^^^^^^^^^^^^^^^^^^^^^^^^^^^^^^^^^^^^^^^^^^^^^^^^^^^^^^^^^^^^^^^^^^^^^^^^^^^^^^^^^^^^^^^^^^^^^^^^^^^^^^^^^^^^^^^^^^^^^^^^^^^
10:15:40 The method createArchetypeProject(IProject, IPath, Archetype, String, String, String, String, Properties, ProjectImportConfiguration, IProgressMonitor) from the type IProjectConfigurationManager is deprecated
10:15:40 10. INFO in /home/jenkins/agent/workspace/m2e-sonarqube/m2e-core-tests/org.eclipse.m2e.tests/src/org/eclipse/m2e/tests/lifecycle/PluginExecutionMetadataPrioritiesTest.java (at line 32)
10:15:40 	@SuppressWarnings("restriction")
10:15:40 	                  ^^^^^^^^^^^^^
10:15:40 At least one of the problems in category 'restriction' is not analysed due to a compiler option being ignored
10:15:40 11. INFO in /home/jenkins/agent/workspace/m2e-sonarqube/m2e-core-tests/org.eclipse.m2e.tests/src/org/eclipse/m2e/tests/internal/index/NexusIndexManagerSearchTest.java (at line 51)
10:15:40 	@SuppressWarnings("restriction")
10:15:40 	                  ^^^^^^^^^^^^^
10:15:40 At least one of the problems in category 'restriction' is not analysed due to a compiler option being ignored
10:15:40 [WARNING] /home/jenkins/agent/workspace/m2e-sonarqube/m2e-core-tests/org.eclipse.m2e.tests/src/org/eclipse/m2e/tests/internal/embedder/EclipseClassRealmManagerDelegateTest.java:[61] 
10:15:40 	public List<String> getImports() {
10:15:40 	                    ^^^^^^^^^^^^
10:15:40 The method new ClassRealmRequest(){}.getImports() overrides a deprecated method from ClassRealmRequest
10:15:40 13. INFO in /home/jenkins/agent/workspace/m2e-sonarqube/m2e-core-tests/org.eclipse.m2e.tests/src/org/eclipse/m2e/tests/lifecycle/LifecycleComparisonTest.java (at line 19)
10:15:40 	@SuppressWarnings("restriction")
10:15:40 	                  ^^^^^^^^^^^^^
10:15:40 At least one of the problems in category 'restriction' is not analysed due to a compiler option being ignored
10:15:40 14. INFO in /home/jenkins/agent/workspace/m2e-sonarqube/m2e-core-tests/org.eclipse.m2e.tests/src/org/eclipse/m2e/tests/ui/editing/AddDependencyOperationTest.java (at line 37)
10:15:40 	@SuppressWarnings("restriction")
10:15:40 	                  ^^^^^^^^^^^^^
10:15:40 At least one of the problems in category 'restriction' is not analysed due to a compiler option being ignored
10:15:40 15. INFO in /home/jenkins/agent/workspace/m2e-sonarqube/m2e-core-tests/org.eclipse.m2e.tests/src/org/eclipse/m2e/tests/lifecycle/LifecycleMappingTest.java (at line 87)
10:15:40 	@SuppressWarnings("restriction")
10:15:40 	                  ^^^^^^^^^^^^^
10:15:40 At least one of the problems in category 'restriction' is not analysed due to a compiler option being ignored
10:15:40 [WARNING] /home/jenkins/agent/workspace/m2e-sonarqube/m2e-core-tests/org.eclipse.m2e.tests/src/org/eclipse/m2e/tests/internal/embedder/MavenEmbeddedRuntimeTest.java:[22] 
10:15:40 	import org.eclipse.m2e.core.embedder.MavenRuntime;
10:15:40 	       ^^^^^^^^^^^^^^^^^^^^^^^^^^^^^^^^^^^^^^^^^^
10:15:40 The type MavenRuntime is deprecated
10:15:40 [WARNING] /home/jenkins/agent/workspace/m2e-sonarqube/m2e-core-tests/org.eclipse.m2e.tests/src/org/eclipse/m2e/tests/internal/embedder/MavenEmbeddedRuntimeTest.java:[23] 
10:15:40 	import org.eclipse.m2e.core.embedder.MavenRuntimeManager;
10:15:40 	       ^^^^^^^^^^^^^^^^^^^^^^^^^^^^^^^^^^^^^^^^^^^^^^^^^
10:15:40 The type MavenRuntimeManager is deprecated
10:15:40 18. INFO in /home/jenkins/agent/workspace/m2e-sonarqube/m2e-core-tests/org.eclipse.m2e.tests/src/org/eclipse/m2e/tests/internal/embedder/MavenEmbeddedRuntimeTest.java (at line 27)
10:15:40 	@SuppressWarnings("restriction")
10:15:40 	                  ^^^^^^^^^^^^^
10:15:40 At least one of the problems in category 'restriction' is not analysed due to a compiler option being ignored
10:15:40 [WARNING] /home/jenkins/agent/workspace/m2e-sonarqube/m2e-core-tests/org.eclipse.m2e.tests/src/org/eclipse/m2e/tests/internal/embedder/MavenEmbeddedRuntimeTest.java:[31] 
10:15:40 	MavenRuntimeManager runtimeManager = MavenPlugin.getMavenRuntimeManager();
10:15:40 	^^^^^^^^^^^^^^^^^^^
10:15:40 The type MavenRuntimeManager is deprecated
10:15:40 [WARNING] /home/jenkins/agent/workspace/m2e-sonarqube/m2e-core-tests/org.eclipse.m2e.tests/src/org/eclipse/m2e/tests/internal/embedder/MavenEmbeddedRuntimeTest.java:[31] 
10:15:40 	MavenRuntimeManager runtimeManager = MavenPlugin.getMavenRuntimeManager();
10:15:40 	                                                 ^^^^^^^^^^^^^^^^^^^^^^^^
10:15:40 The method getMavenRuntimeManager() from the type MavenPlugin is deprecated
10:15:40 [WARNING] /home/jenkins/agent/workspace/m2e-sonarqube/m2e-core-tests/org.eclipse.m2e.tests/src/org/eclipse/m2e/tests/internal/embedder/MavenEmbeddedRuntimeTest.java:[32] 
10:15:40 	MavenRuntime embeddedRuntime = runtimeManager.getRuntime(MavenRuntimeManager.EMBEDDED);
10:15:40 	^^^^^^^^^^^^
10:15:40 The type MavenRuntime is deprecated
10:15:40 [WARNING] /home/jenkins/agent/workspace/m2e-sonarqube/m2e-core-tests/org.eclipse.m2e.tests/src/org/eclipse/m2e/tests/internal/embedder/MavenEmbeddedRuntimeTest.java:[32] 
10:15:40 	MavenRuntime embeddedRuntime = runtimeManager.getRuntime(MavenRuntimeManager.EMBEDDED);
10:15:40 	                                              ^^^^^^^^^^^^^^^^^^^^^^^^^^^^^^^^^^^^^^^^
10:15:40 The method getRuntime(String) from the type MavenRuntimeManager is deprecated
10:15:40 [WARNING] /home/jenkins/agent/workspace/m2e-sonarqube/m2e-core-tests/org.eclipse.m2e.tests/src/org/eclipse/m2e/tests/internal/embedder/MavenEmbeddedRuntimeTest.java:[32] 
10:15:40 	MavenRuntime embeddedRuntime = runtimeManager.getRuntime(MavenRuntimeManager.EMBEDDED);
10:15:40 	                                                         ^^^^^^^^^^^^^^^^^^^
10:15:40 The type MavenRuntimeManager is deprecated
10:15:40 [WARNING] /home/jenkins/agent/workspace/m2e-sonarqube/m2e-core-tests/org.eclipse.m2e.tests/src/org/eclipse/m2e/tests/internal/embedder/MavenEmbeddedRuntimeTest.java:[32] 
10:15:40 	MavenRuntime embeddedRuntime = runtimeManager.getRuntime(MavenRuntimeManager.EMBEDDED);
10:15:40 	                                                                             ^^^^^^^^
10:15:40 The field MavenRuntimeManager.EMBEDDED is deprecated
10:15:40 [WARNING] /home/jenkins/agent/workspace/m2e-sonarqube/m2e-core-tests/org.eclipse.m2e.tests/src/org/eclipse/m2e/tests/internal/embedder/MavenEmbeddedRuntimeTest.java:[33] 
10:15:40 	String mavenVersion = embeddedRuntime.getVersion();
10:15:40 	                                      ^^^^^^^^^^^^
10:15:40 The method getVersion() from the type MavenRuntime is deprecated
10:15:40 [WARNING] /home/jenkins/agent/workspace/m2e-sonarqube/m2e-core-tests/org.eclipse.m2e.tests/src/org/eclipse/m2e/tests/TestFancyClassifierClasspathProvider.java:[42] 
10:15:40 	public void setRuntimeClasspath(Set<IRuntimeClasspathEntry> runtimeClasspath, IMavenProjectFacade mavenProjectFacade,
10:15:40       IProgressMonitor monitor) {
10:15:40 	            ^^^^^^^^^^^^^^^^^^^^^^^^^^^^^^^^^^^^^^^^^^^^^^^^^^^^^^^^^^^^^^^^^^^^^^^^^^^^^^^^^^^^^^^^^^^^^^^^^^^^^^^^^^^^^^^^^^^^^^^^^^^^^^^^^^^^^^^^^
10:15:40 The method TestFancyClassifierClasspathProvider.setRuntimeClasspath(Set<IRuntimeClasspathEntry>, IMavenProjectFacade, IProgressMonitor) overrides a deprecated method from AbstractClassifierClasspathProvider
10:15:40 [WARNING] /home/jenkins/agent/workspace/m2e-sonarqube/m2e-core-tests/org.eclipse.m2e.tests/src/org/eclipse/m2e/tests/TestFancyClassifierClasspathProvider.java:[47] 
10:15:40 	addFolders(runtimeClasspath, mavenProjectFacade.getProject(), folders);
10:15:40 	^^^^^^^^^^^^^^^^^^^^^^^^^^^^^^^^^^^^^^^^^^^^^^^^^^^^^^^^^^^^^^^^^^^^^^
10:15:40 The method addFolders(Set<IRuntimeClasspathEntry>, IProject, Set<IPath>) from the type AbstractClassifierClasspathProvider is deprecated
10:15:40 [WARNING] /home/jenkins/agent/workspace/m2e-sonarqube/m2e-core-tests/org.eclipse.m2e.tests/src/org/eclipse/m2e/tests/TestFancyClassifierClasspathProvider.java:[52] 
10:15:40 	public void setTestClasspath(Set<IRuntimeClasspathEntry> testClasspath, IMavenProjectFacade mavenProjectFacade,
10:15:40       IProgressMonitor monitor) {
10:15:40 	            ^^^^^^^^^^^^^^^^^^^^^^^^^^^^^^^^^^^^^^^^^^^^^^^^^^^^^^^^^^^^^^^^^^^^^^^^^^^^^^^^^^^^^^^^^^^^^^^^^^^^^^^^^^^^^^^^^^^^^^^^^^^^^^^^^^^
10:15:40 The method TestFancyClassifierClasspathProvider.setTestClasspath(Set<IRuntimeClasspathEntry>, IMavenProjectFacade, IProgressMonitor) overrides a deprecated method from AbstractClassifierClasspathProvider
10:15:40 [WARNING] /home/jenkins/agent/workspace/m2e-sonarqube/m2e-core-tests/org.eclipse.m2e.tests/src/org/eclipse/m2e/tests/TestFancyClassifierClasspathProvider.java:[57] 
10:15:40 	addFolders(testClasspath, mavenProjectFacade.getProject(), folders);
10:15:40 	^^^^^^^^^^^^^^^^^^^^^^^^^^^^^^^^^^^^^^^^^^^^^^^^^^^^^^^^^^^^^^^^^^^
10:15:40 The method addFolders(Set<IRuntimeClasspathEntry>, IProject, Set<IPath>) from the type AbstractClassifierClasspathProvider is deprecated
10:15:40 [WARNING] /home/jenkins/agent/workspace/m2e-sonarqube/m2e-core-tests/org.eclipse.m2e.tests/src/org/eclipse/m2e/tests/discovery/TestM2EBundleStrategy.java:[9] 
10:15:40 	import org.eclipse.core.runtime.SubProgressMonitor;
10:15:40 	       ^^^^^^^^^^^^^^^^^^^^^^^^^^^^^^^^^^^^^^^^^^^
10:15:40 The type SubProgressMonitor is deprecated
10:15:40 31. INFO in /home/jenkins/agent/workspace/m2e-sonarqube/m2e-core-tests/org.eclipse.m2e.tests/src/org/eclipse/m2e/tests/discovery/TestM2EBundleStrategy.java (at line 18)
10:15:40 	@SuppressWarnings("restriction")
10:15:40 	                  ^^^^^^^^^^^^^
10:15:40 At least one of the problems in category 'restriction' is not analysed due to a compiler option being ignored
10:15:40 [WARNING] /home/jenkins/agent/workspace/m2e-sonarqube/m2e-core-tests/org.eclipse.m2e.tests/src/org/eclipse/m2e/tests/discovery/TestM2EBundleStrategy.java:[32] 
10:15:40 	processExtensions(new SubProgressMonitor(monitor, extensions.length), extensions);
10:15:40 	                      ^^^^^^^^^^^^^^^^^^
10:15:40 The type SubProgressMonitor is deprecated
10:15:40 [WARNING] /home/jenkins/agent/workspace/m2e-sonarqube/m2e-core-tests/org.eclipse.m2e.tests/src/org/eclipse/m2e/tests/discovery/TestM2EBundleStrategy.java:[32] 
10:15:40 	processExtensions(new SubProgressMonitor(monitor, extensions.length), extensions);
10:15:40 	                      ^^^^^^^^^^^^^^^^^^^^^^^^^^^^^^^^^^^^^^^^^^^^^^
10:15:40 The constructor SubProgressMonitor(IProgressMonitor, int) is deprecated
10:15:40 34. INFO in /home/jenkins/agent/workspace/m2e-sonarqube/m2e-core-tests/org.eclipse.m2e.tests/src/org/eclipse/m2e/tests/ui/editing/AbstractOperationTest.java (at line 27)
10:15:40 	@SuppressWarnings("restriction")
10:15:40 	                  ^^^^^^^^^^^^^
10:15:40 At least one of the problems in category 'restriction' is not analysed due to a compiler option being ignored
10:15:40 [WARNING] /home/jenkins/agent/workspace/m2e-sonarqube/m2e-core-tests/org.eclipse.m2e.tests/src/org/eclipse/m2e/tests/jdt/internal/MavenClasspathContainerSaveHelperTest.java:[64] 
10:15:40 	ByteArrayOutputStream os = new ByteArrayOutputStream();
10:15:40 	                      ^^
10:15:40 Resource 'os' should be managed by try-with-resource
10:15:40 36. INFO in /home/jenkins/agent/workspace/m2e-sonarqube/m2e-core-tests/org.eclipse.m2e.tests/src/org/eclipse/m2e/tests/ui/editing/AddExclusionOperationTest.java (at line 34)
10:15:40 	@SuppressWarnings("restriction")
10:15:40 	                  ^^^^^^^^^^^^^
10:15:40 At least one of the problems in category 'restriction' is not analysed due to a compiler option being ignored
10:15:40 [WARNING] /home/jenkins/agent/workspace/m2e-sonarqube/m2e-core-tests/org.eclipse.m2e.tests/src/org/eclipse/m2e/tests/discovery/MavenDiscoveryTest.java:[239] 
10:15:40 	return new File(emptydir, resourceName).toURL();
10:15:40 	                                        ^^^^^^^
10:15:40 The method toURL() from the type File is deprecated
10:15:40 [WARNING] /home/jenkins/agent/workspace/m2e-sonarqube/m2e-core-tests/org.eclipse.m2e.tests/src/org/eclipse/m2e/tests/discovery/MavenDiscoveryTest.java:[264] 
10:15:40 	return pluginxml.toURL();
10:15:40 	                 ^^^^^^^
10:15:40 The method toURL() from the type File is deprecated
10:15:40 [WARNING] /home/jenkins/agent/workspace/m2e-sonarqube/m2e-core-tests/org.eclipse.m2e.tests/src/org/eclipse/m2e/tests/ProjectRegistryManagerTest.java:[417] 
10:15:40 	manager.refresh(request, monitor);
10:15:40 	        ^^^^^^^^^^^^^^^^^^^^^^^^^
10:15:40 The method refresh(MavenUpdateRequest, IProgressMonitor) from the type ProjectRegistryManager is deprecated
10:15:40 [WARNING] /home/jenkins/agent/workspace/m2e-sonarqube/m2e-core-tests/org.eclipse.m2e.tests/src/org/eclipse/m2e/tests/ProjectRegistryManagerTest.java:[423] 
10:15:40 	manager.refresh(request, monitor);
10:15:40 	        ^^^^^^^^^^^^^^^^^^^^^^^^^
10:15:40 The method refresh(MavenUpdateRequest, IProgressMonitor) from the type ProjectRegistryManager is deprecated
10:15:40 [WARNING] /home/jenkins/agent/workspace/m2e-sonarqube/m2e-core-tests/org.eclipse.m2e.tests/src/org/eclipse/m2e/tests/ProjectRegistryManagerTest.java:[544] 
10:15:40 	manager.refresh(new MavenUpdateRequest(p2, false, false), monitor);
10:15:40 	        ^^^^^^^^^^^^^^^^^^^^^^^^^^^^^^^^^^^^^^^^^^^^^^^^^^^^^^^^^^
10:15:40 The method refresh(MavenUpdateRequest, IProgressMonitor) from the type ProjectRegistryManager is deprecated
10:15:40 [WARNING] /home/jenkins/agent/workspace/m2e-sonarqube/m2e-core-tests/org.eclipse.m2e.tests/src/org/eclipse/m2e/tests/ProjectRegistryManagerTest.java:[758] 
10:15:40 	manager.refresh(updateRequest, monitor);
10:15:40 	        ^^^^^^^^^^^^^^^^^^^^^^^^^^^^^^^
10:15:40 The method refresh(MavenUpdateRequest, IProgressMonitor) from the type ProjectRegistryManager is deprecated
10:15:40 [WARNING] /home/jenkins/agent/workspace/m2e-sonarqube/m2e-core-tests/org.eclipse.m2e.tests/src/org/eclipse/m2e/tests/ProjectRegistryManagerTest.java:[769] 
10:15:40 	manager.refresh(updateRequest, monitor);
10:15:40 	        ^^^^^^^^^^^^^^^^^^^^^^^^^^^^^^^
10:15:40 The method refresh(MavenUpdateRequest, IProgressMonitor) from the type ProjectRegistryManager is deprecated
10:15:40 [WARNING] /home/jenkins/agent/workspace/m2e-sonarqube/m2e-core-tests/org.eclipse.m2e.tests/src/org/eclipse/m2e/tests/ProjectRegistryManagerTest.java:[1062] 
10:15:40 	manager.refresh(new MavenUpdateRequest(p1, false, false), monitor);
10:15:40 	        ^^^^^^^^^^^^^^^^^^^^^^^^^^^^^^^^^^^^^^^^^^^^^^^^^^^^^^^^^^
10:15:40 The method refresh(MavenUpdateRequest, IProgressMonitor) from the type ProjectRegistryManager is deprecated
10:15:40 [WARNING] /home/jenkins/agent/workspace/m2e-sonarqube/m2e-core-tests/org.eclipse.m2e.tests/src/org/eclipse/m2e/tests/ProjectRegistryManagerTest.java:[1072] 
10:15:40 	manager.refresh(new MavenUpdateRequest(p1, false, false), monitor);
10:15:40 	        ^^^^^^^^^^^^^^^^^^^^^^^^^^^^^^^^^^^^^^^^^^^^^^^^^^^^^^^^^^
10:15:40 The method refresh(MavenUpdateRequest, IProgressMonitor) from the type ProjectRegistryManager is deprecated
10:15:40 [WARNING] /home/jenkins/agent/workspace/m2e-sonarqube/m2e-core-tests/org.eclipse.m2e.tests/src/org/eclipse/m2e/tests/ProjectRegistryManagerTest.java:[1111] 
10:15:40 	manager.refresh(new MavenUpdateRequest(projects[0], false, true), monitor);
10:15:40 	        ^^^^^^^^^^^^^^^^^^^^^^^^^^^^^^^^^^^^^^^^^^^^^^^^^^^^^^^^^^^^^^^^^^
10:15:40 The method refresh(MavenUpdateRequest, IProgressMonitor) from the type ProjectRegistryManager is deprecated
10:15:40 [WARNING] /home/jenkins/agent/workspace/m2e-sonarqube/m2e-core-tests/org.eclipse.m2e.tests/src/org/eclipse/m2e/tests/ProjectRegistryManagerTest.java:[1140] 
10:15:40 	manager.refresh(new MavenUpdateRequest(p, false, true), monitor);
10:15:40 	        ^^^^^^^^^^^^^^^^^^^^^^^^^^^^^^^^^^^^^^^^^^^^^^^^^^^^^^^^
10:15:40 The method refresh(MavenUpdateRequest, IProgressMonitor) from the type ProjectRegistryManager is deprecated
10:15:40 [WARNING] /home/jenkins/agent/workspace/m2e-sonarqube/m2e-core-tests/org.eclipse.m2e.tests/src/org/eclipse/m2e/tests/ProjectRegistryManagerTest.java:[1190] 
10:15:40 	manager.refresh(request, monitor);
10:15:40 	        ^^^^^^^^^^^^^^^^^^^^^^^^^
10:15:40 The method refresh(MavenUpdateRequest, IProgressMonitor) from the type ProjectRegistryManager is deprecated
10:15:40 [WARNING] /home/jenkins/agent/workspace/m2e-sonarqube/m2e-core-tests/org.eclipse.m2e.tests/src/org/eclipse/m2e/tests/ProjectRegistryManagerTest.java:[1216] 
10:15:40 	manager.refresh(request, monitor);
10:15:40 	        ^^^^^^^^^^^^^^^^^^^^^^^^^
10:15:40 The method refresh(MavenUpdateRequest, IProgressMonitor) from the type ProjectRegistryManager is deprecated
10:15:40 [WARNING] /home/jenkins/agent/workspace/m2e-sonarqube/m2e-core-tests/org.eclipse.m2e.tests/src/org/eclipse/m2e/tests/ProjectRegistryManagerTest.java:[1242] 
10:15:40 	manager.refresh(request, monitor);
10:15:40 	        ^^^^^^^^^^^^^^^^^^^^^^^^^
10:15:40 The method refresh(MavenUpdateRequest, IProgressMonitor) from the type ProjectRegistryManager is deprecated
10:15:40 [WARNING] /home/jenkins/agent/workspace/m2e-sonarqube/m2e-core-tests/org.eclipse.m2e.tests/src/org/eclipse/m2e/tests/ProjectRegistryManagerTest.java:[1287] 
10:15:40 	manager.refresh(request, monitor);
10:15:40 	        ^^^^^^^^^^^^^^^^^^^^^^^^^
10:15:40 The method refresh(MavenUpdateRequest, IProgressMonitor) from the type ProjectRegistryManager is deprecated
10:15:40 [WARNING] /home/jenkins/agent/workspace/m2e-sonarqube/m2e-core-tests/org.eclipse.m2e.tests/src/org/eclipse/m2e/tests/ProjectRegistryManagerTest.java:[1411] 
10:15:40 	manager.refresh(request, monitor);
10:15:40 	        ^^^^^^^^^^^^^^^^^^^^^^^^^
10:15:40 The method refresh(MavenUpdateRequest, IProgressMonitor) from the type ProjectRegistryManager is deprecated
10:15:40 [WARNING] /home/jenkins/agent/workspace/m2e-sonarqube/m2e-core-tests/org.eclipse.m2e.tests/src/org/eclipse/m2e/tests/ProjectRegistryManagerTest.java:[1433] 
10:15:40 	manager.refresh(request, monitor);
10:15:40 	        ^^^^^^^^^^^^^^^^^^^^^^^^^
10:15:40 The method refresh(MavenUpdateRequest, IProgressMonitor) from the type ProjectRegistryManager is deprecated
10:15:40 [WARNING] /home/jenkins/agent/workspace/m2e-sonarqube/m2e-core-tests/org.eclipse.m2e.tests/src/org/eclipse/m2e/tests/ProjectRegistryManagerTest.java:[1461] 
10:15:40 	manager.refresh(request, monitor);
10:15:40 	        ^^^^^^^^^^^^^^^^^^^^^^^^^
10:15:40 The method refresh(MavenUpdateRequest, IProgressMonitor) from the type ProjectRegistryManager is deprecated
10:15:40 [WARNING] /home/jenkins/agent/workspace/m2e-sonarqube/m2e-core-tests/org.eclipse.m2e.tests/src/org/eclipse/m2e/tests/ProjectRegistryManagerTest.java:[1478] 
10:15:40 	manager.refresh(request, monitor); // shouldn't throw any exceptions
10:15:40 	        ^^^^^^^^^^^^^^^^^^^^^^^^^
10:15:40 The method refresh(MavenUpdateRequest, IProgressMonitor) from the type ProjectRegistryManager is deprecated
10:15:40 [WARNING] /home/jenkins/agent/workspace/m2e-sonarqube/m2e-core-tests/org.eclipse.m2e.tests/src/org/eclipse/m2e/tests/ProjectRegistryManagerTest.java:[1504] 
10:15:40 	manager.refresh(request, monitor); // shouldn't throw any exceptions
10:15:40 	        ^^^^^^^^^^^^^^^^^^^^^^^^^
10:15:40 The method refresh(MavenUpdateRequest, IProgressMonitor) from the type ProjectRegistryManager is deprecated
10:15:40 [WARNING] /home/jenkins/agent/workspace/m2e-sonarqube/m2e-core-tests/org.eclipse.m2e.tests/src/org/eclipse/m2e/tests/ProjectRegistryManagerTest.java:[1519] 
10:15:40 	manager.refresh(request, monitor);
10:15:40 	        ^^^^^^^^^^^^^^^^^^^^^^^^^
10:15:40 The method refresh(MavenUpdateRequest, IProgressMonitor) from the type ProjectRegistryManager is deprecated
10:15:40 58. INFO in /home/jenkins/agent/workspace/m2e-sonarqube/m2e-core-tests/org.eclipse.m2e.tests/src/org/eclipse/m2e/tests/internal/conversion/ProjectConversionParticipantSorterTest.java (at line 43)
10:15:40 	@SuppressWarnings("restriction")
10:15:40 	                  ^^^^^^^^^^^^^
10:15:40 At least one of the problems in category 'restriction' is not analysed due to a compiler option being ignored
10:15:40 59. INFO in /home/jenkins/agent/workspace/m2e-sonarqube/m2e-core-tests/org.eclipse.m2e.tests/src/org/eclipse/m2e/tests/ui/editing/PomHelperTest.java (at line 37)
10:15:40 	@SuppressWarnings("restriction")
10:15:40 	                  ^^^^^^^^^^^^^
10:15:40 At least one of the problems in category 'restriction' is not analysed due to a compiler option being ignored
10:15:40 60. INFO in /home/jenkins/agent/workspace/m2e-sonarqube/m2e-core-tests/org.eclipse.m2e.tests/src/org/eclipse/m2e/tests/ui/editing/PomEditsTest.java (at line 46)
10:15:40 	@SuppressWarnings("restriction")
10:15:40 	                  ^^^^^^^^^^^^^
10:15:40 At least one of the problems in category 'restriction' is not analysed due to a compiler option being ignored
10:15:40 61. INFO in /home/jenkins/agent/workspace/m2e-sonarqube/m2e-core-tests/org.eclipse.m2e.tests/src/org/eclipse/m2e/tests/MutableProjectRegistryTest.java (at line 54)
10:15:40 	@SuppressWarnings("restriction")
10:15:40 	                  ^^^^^^^^^^^^^
10:15:40 At least one of the problems in category 'restriction' is not analysed due to a compiler option being ignored
10:15:40 62. INFO in /home/jenkins/agent/workspace/m2e-sonarqube/m2e-core-tests/org.eclipse.m2e.tests/src/org/eclipse/m2e/tests/profiles/MavenProfileManagerTest.java (at line 40)
10:15:40 	@SuppressWarnings("restriction")
10:15:40 	                  ^^^^^^^^^^^^^
10:15:40 At least one of the problems in category 'restriction' is not analysed due to a compiler option being ignored
10:15:40 63. INFO in /home/jenkins/agent/workspace/m2e-sonarqube/m2e-core-tests/org.eclipse.m2e.tests/src/org/eclipse/m2e/tests/embedder/MavenImplTest.java (at line 64)
10:15:40 	@SuppressWarnings("restriction")
10:15:40 	                  ^^^^^^^^^^^^^
10:15:40 At least one of the problems in category 'restriction' is not analysed due to a compiler option being ignored
10:15:40 [WARNING] /home/jenkins/agent/workspace/m2e-sonarqube/m2e-core-tests/org.eclipse.m2e.tests/src/org/eclipse/m2e/tests/ProjectRegistryRefreshJobTest.java:[247] 
10:15:40 	event = new ResourceChangeEvent(project, IResourceChangeEvent.PRE_CLOSE, IncrementalProjectBuilder.FULL_BUILD,
10:15:40         delta) {
10:15:40 	            ^^^^^^^^^^^^^^^^^^^^^^^^^^^^^^^^^^^^^^^^^^^^^^^^^^^^^^^^^^^^^^^^^^^^^^^^^^^^^^^^^^^^^^^^^^^^^^^^^^^^^^^^^^^^^^^^^
10:15:40 The serializable class  does not declare a static final serialVersionUID field of type long
10:15:40 [WARNING] /home/jenkins/agent/workspace/m2e-sonarqube/m2e-core-tests/org.eclipse.m2e.tests/src/org/eclipse/m2e/tests/ProjectRegistryRefreshJobTest.java:[251] 
10:15:40 	return project;
10:15:40 	       ^^^^^^^
10:15:40 Read access to enclosing field ProjectRegistryRefreshJobTest.project is emulated by a synthetic accessor method
10:15:40 [WARNING] /home/jenkins/agent/workspace/m2e-sonarqube/m2e-core-tests/org.eclipse.m2e.tests/src/org/eclipse/m2e/tests/project/MavenProjectFacadeTest.java:[180] 
10:15:40 	MavenPluginActivator.getDefault().getMavenProjectManagerImpl().refresh(updateRequest, monitor);
10:15:40 	                                                               ^^^^^^^^^^^^^^^^^^^^^^^^^^^^^^^
10:15:40 The method refresh(MavenUpdateRequest, IProgressMonitor) from the type ProjectRegistryManager is deprecated
10:15:40 67. INFO in /home/jenkins/agent/workspace/m2e-sonarqube/m2e-core-tests/org.eclipse.m2e.tests/src/org/eclipse/m2e/tests/builder/EclipseBuildContextTest.java (at line 34)
10:15:40 	@SuppressWarnings("restriction")
10:15:40 	                  ^^^^^^^^^^^^^
10:15:40 At least one of the problems in category 'restriction' is not analysed due to a compiler option being ignored
10:15:40 [WARNING] /home/jenkins/agent/workspace/m2e-sonarqube/m2e-core-tests/org.eclipse.m2e.tests/src/org/eclipse/m2e/tests/mocks/MockLaunchConfiguration.java:[90] 
10:15:40 	List<String> attr = (List<String>) attributes.get(attributeName);
10:15:40 	                    ^^^^^^^^^^^^^^^^^^^^^^^^^^^^^^^^^^^^^^^^^^^^
10:15:40 Type safety: Unchecked cast from capture#6-of ? to List<String>
10:15:40 [WARNING] /home/jenkins/agent/workspace/m2e-sonarqube/m2e-core-tests/org.eclipse.m2e.tests/src/org/eclipse/m2e/tests/mocks/MockLaunchConfiguration.java:[96] 
10:15:40 	Set<String> attr = (Set<String>) attributes.get(attributeName);
10:15:40 	                   ^^^^^^^^^^^^^^^^^^^^^^^^^^^^^^^^^^^^^^^^^^^
10:15:40 Type safety: Unchecked cast from capture#7-of ? to Set<String>
10:15:40 [WARNING] /home/jenkins/agent/workspace/m2e-sonarqube/m2e-core-tests/org.eclipse.m2e.tests/src/org/eclipse/m2e/tests/mocks/MockLaunchConfiguration.java:[102] 
10:15:40 	Map<String, String> attr = (Map<String, String>) attributes.get(attributeName);
10:15:40 	                           ^^^^^^^^^^^^^^^^^^^^^^^^^^^^^^^^^^^^^^^^^^^^^^^^^^^
10:15:40 Type safety: Unchecked cast from capture#8-of ? to Map<String,String>
10:15:40 [WARNING] /home/jenkins/agent/workspace/m2e-sonarqube/m2e-core-tests/org.eclipse.m2e.tests/src/org/eclipse/m2e/tests/mocks/MockLaunchConfiguration.java:[114] 
10:15:40 	return (Map<String, Object>) attributes;
10:15:40 	       ^^^^^^^^^^^^^^^^^^^^^^^^^^^^^^^^
10:15:40 Type safety: Unchecked cast from Map<String,capture#10-of ?> to Map<String,Object>
10:15:40 [WARNING] /home/jenkins/agent/workspace/m2e-sonarqube/m2e-core-tests/org.eclipse.m2e.tests/src/org/eclipse/m2e/tests/mocks/MockLaunchConfiguration.java:[129] 
10:15:40 	public IPath getLocation() {
10:15:40 	             ^^^^^^^^^^^^^
10:15:40 The method MockLaunchConfiguration.getLocation() overrides a deprecated method from ILaunchConfiguration
10:15:40 [WARNING] /home/jenkins/agent/workspace/m2e-sonarqube/m2e-core-tests/org.eclipse.m2e.tests/src/org/eclipse/m2e/tests/internal/lifecyclemapping/ConfigElementMock.java:[42] 
10:15:40 	public String getAttributeAsIs(String name) {
10:15:40 	              ^^^^^^^^^^^^^^^^^^^^^^^^^^^^^
10:15:40 The method ConfigElementMock.getAttributeAsIs(String) overrides a deprecated method from IConfigurationElement
10:15:40 [WARNING] /home/jenkins/agent/workspace/m2e-sonarqube/m2e-core-tests/org.eclipse.m2e.tests/src/org/eclipse/m2e/tests/internal/lifecyclemapping/ConfigElementMock.java:[88] 
10:15:40 	public String getValueAsIs() {
10:15:40 	              ^^^^^^^^^^^^^^
10:15:40 The method ConfigElementMock.getValueAsIs() overrides a deprecated method from IConfigurationElement
10:15:40 [WARNING] /home/jenkins/agent/workspace/m2e-sonarqube/m2e-core-tests/org.eclipse.m2e.tests/src/org/eclipse/m2e/tests/internal/lifecyclemapping/ConfigElementMock.java:[94] 
10:15:40 	public String getNamespace() {
10:15:40 	              ^^^^^^^^^^^^^^
10:15:40 The method ConfigElementMock.getNamespace() overrides a deprecated method from IConfigurationElement
10:15:40 76. INFO in /home/jenkins/agent/workspace/m2e-sonarqube/m2e-core-tests/org.eclipse.m2e.tests/src/org/eclipse/m2e/tests/builder/EclipseIncrementalBuildContextTest.java (at line 34)
10:15:40 	@SuppressWarnings("restriction")
10:15:40 	                  ^^^^^^^^^^^^^
10:15:40 At least one of the problems in category 'restriction' is not analysed due to a compiler option being ignored
10:15:40 [WARNING] /home/jenkins/agent/workspace/m2e-sonarqube/m2e-core-tests/org.eclipse.m2e.tests/src/org/eclipse/m2e/tests/MavenProjectMutableStateTest.java:[103] 
10:15:40 	assertMutableState(project);
10:15:40 	^^^^^^^^^^^^^^^^^^^^^^^^^^^
10:15:40 Access to enclosing method assertMutableState(IProject) from the type MavenProjectMutableStateTest is emulated by a synthetic accessor method
10:15:40 78. INFO in /home/jenkins/agent/workspace/m2e-sonarqube/m2e-core-tests/org.eclipse.m2e.tests/src/org/eclipse/m2e/tests/ui/editing/RemoveDependencyOperationTest.java (at line 32)
10:15:40 	@SuppressWarnings("restriction")
10:15:40 	                  ^^^^^^^^^^^^^
10:15:40 At least one of the problems in category 'restriction' is not analysed due to a compiler option being ignored
10:15:40 78 problems (0 errors, 57 warnings, 57 info)
10:15:40 [INFO] 
10:15:40 [INFO] --- maven-resources-plugin:2.5:testResources (default-testResources) @ org.eclipse.m2e.tests ---
10:15:40 [debug] execute contextualize
10:15:40 [INFO] Using 'UTF-8' encoding to copy filtered resources.
10:15:40 [INFO] skip non existing resourceDirectory /home/jenkins/agent/workspace/m2e-sonarqube/m2e-core-tests/org.eclipse.m2e.tests/src/test/resources
10:15:40 [INFO] 
10:15:40 [INFO] --- tycho-source-plugin:1.6.0:plugin-source (plugin-source) @ org.eclipse.m2e.tests ---
10:15:40 [INFO] Building jar: /home/jenkins/agent/workspace/m2e-sonarqube/m2e-core-tests/org.eclipse.m2e.tests/target/org.eclipse.m2e.tests-1.16.0-SNAPSHOT-sources.jar
10:15:41 [INFO] 
10:15:41 [INFO] --- target-platform-configuration:1.6.0:target-platform (default-target-platform) @ org.eclipse.m2e.tests ---
10:15:41 [INFO] 
10:15:41 [INFO] --- tycho-packaging-plugin:1.6.0:package-plugin (default-package-plugin) @ org.eclipse.m2e.tests ---
10:15:41 [INFO] Building jar: /home/jenkins/agent/workspace/m2e-sonarqube/m2e-core-tests/org.eclipse.m2e.tests/target/org.eclipse.m2e.tests-1.16.0-SNAPSHOT.jar
10:15:41 [INFO] 
10:15:41 [INFO] --- tycho-p2-plugin:1.6.0:p2-metadata-default (default-p2-metadata-default) @ org.eclipse.m2e.tests ---
10:15:41 [INFO] No baseline version MavenProject: org.eclipse.m2e:org.eclipse.m2e.tests:1.16.0-SNAPSHOT @ /home/jenkins/agent/workspace/m2e-sonarqube/m2e-core-tests/org.eclipse.m2e.tests/pom.xml
10:15:41 [INFO] 
10:15:41 [INFO] --- tycho-surefire-plugin:1.6.0:test (default-test) @ org.eclipse.m2e.tests ---
10:15:41 [INFO] Expected eclipse log file: /home/jenkins/agent/workspace/m2e-sonarqube/m2e-core-tests/org.eclipse.m2e.tests/target/work/data/.metadata/.log
10:15:41 [INFO] Command line:
10:15:41 	[/opt/tools/java/oracle/jdk-8/1.8.0_202/jre/bin/java, -Dosgi.noShutdown=false, -Dosgi.os=linux, -Dosgi.ws=gtk, -Dosgi.arch=x86_64, -javaagent:/home/jenkins/agent/workspace/m2e-sonarqube/.repository/org/jacoco/org.jacoco.agent/0.8.5/org.jacoco.agent-0.8.5-runtime.jar=destfile=/home/jenkins/agent/workspace/m2e-sonarqube/jacoco.exec,append=true,includes=org.eclipse.m2e*:org.apache.maven*:org.eclipse.aether*, -Xmx800m, -Dosgi.clean=true, -jar, /home/jenkins/agent/workspace/m2e-sonarqube/.repository/p2/osgi/bundle/org.eclipse.equinox.launcher/1.5.700.v20200207-2156/org.eclipse.equinox.launcher-1.5.700.v20200207-2156.jar, -data, /home/jenkins/agent/workspace/m2e-sonarqube/m2e-core-tests/org.eclipse.m2e.tests/target/work/data, -install, /home/jenkins/agent/workspace/m2e-sonarqube/m2e-core-tests/org.eclipse.m2e.tests/target/work, -configuration, /home/jenkins/agent/workspace/m2e-sonarqube/m2e-core-tests/org.eclipse.m2e.tests/target/work/configuration, -application, org.eclipse.tycho.surefire.osgibooter.uitest, -testproperties, /home/jenkins/agent/workspace/m2e-sonarqube/m2e-core-tests/org.eclipse.m2e.tests/target/surefire.properties, -pluginCustomization, /home/jenkins/agent/workspace/m2e-sonarqube/m2e-core-tests/org.eclipse.m2e.tests/plugin_customization.ini, -timeout, 7200000]
10:15:41 Picked up JAVA_TOOL_OPTIONS: -XX:+IgnoreUnrecognizedVMOptions -XX:+UseContainerSupport -XX:+UnlockExperimentalVMOptions -XX:+UseCGroupMemoryLimitForHeap
10:15:41 Picked up _JAVA_OPTIONS: -XX:MaxRAMPercentage=64.0
10:15:48 SLF4J: Failed to load class "org.slf4j.impl.StaticLoggerBinder".
10:15:48 SLF4J: Defaulting to no-operation (NOP) logger implementation
10:15:48 SLF4J: See http://www.slf4j.org/codes.html#StaticLoggerBinder for further details.
10:15:50 Running org.eclipse.m2e.tests.discovery.ConfigurationUpdateStartupTest
10:18:09 Tests run: 6, Failures: 0, Errors: 0, Skipped: 0, Time elapsed: 138.533 s - in org.eclipse.m2e.tests.discovery.ConfigurationUpdateStartupTest
10:18:09 testNoMavenProjects(org.eclipse.m2e.tests.discovery.ConfigurationUpdateStartupTest)  Time elapsed: 12.214 s
10:18:09 testToggleEarlyStartup(org.eclipse.m2e.tests.discovery.ConfigurationUpdateStartupTest)  Time elapsed: 2.092 s
10:18:09 testMavenProjectsErrors(org.eclipse.m2e.tests.discovery.ConfigurationUpdateStartupTest)  Time elapsed: 92.485 s
10:18:09 testConfigureSpecifiedProjects(org.eclipse.m2e.tests.discovery.ConfigurationUpdateStartupTest)  Time elapsed: 8.449 s
10:18:09 testMavenProjectsNoErrors(org.eclipse.m2e.tests.discovery.ConfigurationUpdateStartupTest)  Time elapsed: 8.046 s
10:18:09 testEmptyWorkspace(org.eclipse.m2e.tests.discovery.ConfigurationUpdateStartupTest)  Time elapsed: 15.214 s
10:18:09 Running org.eclipse.m2e.tests.discovery.MavenDiscoveryInstallOperationTest
10:18:10 Tests run: 5, Failures: 0, Errors: 0, Skipped: 0, Time elapsed: 1.342 s - in org.eclipse.m2e.tests.discovery.MavenDiscoveryInstallOperationTest
10:18:10 testMissingRepository(org.eclipse.m2e.tests.discovery.MavenDiscoveryInstallOperationTest)  Time elapsed: 0.578 s
10:18:10 testMatchNoVersion(org.eclipse.m2e.tests.discovery.MavenDiscoveryInstallOperationTest)  Time elapsed: 0.423 s
10:18:10 testMatchHighestVersion(org.eclipse.m2e.tests.discovery.MavenDiscoveryInstallOperationTest)  Time elapsed: 0.074 s
10:18:10 testMissingIU(org.eclipse.m2e.tests.discovery.MavenDiscoveryInstallOperationTest)  Time elapsed: 0.076 s
10:18:10 testMatchLowestVersion(org.eclipse.m2e.tests.discovery.MavenDiscoveryInstallOperationTest)  Time elapsed: 0.074 s
10:18:10 Running org.eclipse.m2e.tests.discovery.MavenDiscoveryMarkerResolutionGeneratorTest
10:19:30 Tests run: 4, Failures: 0, Errors: 0, Skipped: 0, Time elapsed: 80.049 s - in org.eclipse.m2e.tests.discovery.MavenDiscoveryMarkerResolutionGeneratorTest
10:19:30 testCanResolveMojoExecutionMarker(org.eclipse.m2e.tests.discovery.MavenDiscoveryMarkerResolutionGeneratorTest)  Time elapsed: 31.286 s
10:19:30 testCanResolveConfiguratorMarker(org.eclipse.m2e.tests.discovery.MavenDiscoveryMarkerResolutionGeneratorTest)  Time elapsed: 11.1 s
10:19:30 testResolveMultipleMarkers(org.eclipse.m2e.tests.discovery.MavenDiscoveryMarkerResolutionGeneratorTest)  Time elapsed: 31.424 s
10:19:30 testCanResolveLifecycleIdMarker(org.eclipse.m2e.tests.discovery.MavenDiscoveryMarkerResolutionGeneratorTest)  Time elapsed: 6.237 s
10:19:30 Running org.eclipse.m2e.tests.discovery.LifecycleMappingDiscoveryTest
10:22:50 Tests run: 11, Failures: 0, Errors: 0, Skipped: 0, Time elapsed: 200.29 s - in org.eclipse.m2e.tests.discovery.LifecycleMappingDiscoveryTest
10:22:50 testAutomaticSelectionOfSingleProposal(org.eclipse.m2e.tests.discovery.LifecycleMappingDiscoveryTest)  Time elapsed: 41.047 s
10:22:50 testPreselectedProposals(org.eclipse.m2e.tests.discovery.LifecycleMappingDiscoveryTest)  Time elapsed: 16.21 s
10:22:50 testIsMappingComplete(org.eclipse.m2e.tests.discovery.LifecycleMappingDiscoveryTest)  Time elapsed: 3.5 s
10:22:50 testProposalToReplaceDefaultMapping(org.eclipse.m2e.tests.discovery.LifecycleMappingDiscoveryTest)  Time elapsed: 9.221 s
10:22:50 testPackagingPom(org.eclipse.m2e.tests.discovery.LifecycleMappingDiscoveryTest)  Time elapsed: 7.593 s
10:22:50 testAutomaticSelectionWithAmbiguousProposals(org.eclipse.m2e.tests.discovery.LifecycleMappingDiscoveryTest)  Time elapsed: 11.395 s
10:22:50 testDiscoverProjectConfigurators(org.eclipse.m2e.tests.discovery.LifecycleMappingDiscoveryTest)  Time elapsed: 38.581 s
10:22:50 testNoProposals(org.eclipse.m2e.tests.discovery.LifecycleMappingDiscoveryTest)  Time elapsed: 22.132 s
10:22:50 testProposalMatching(org.eclipse.m2e.tests.discovery.LifecycleMappingDiscoveryTest)  Time elapsed: 15.073 s
10:22:50 testDiscoverLifecycleMappingStrategy(org.eclipse.m2e.tests.discovery.LifecycleMappingDiscoveryTest)  Time elapsed: 21.305 s
10:22:50 testDefaultNonConfiguratorMapping(org.eclipse.m2e.tests.discovery.LifecycleMappingDiscoveryTest)  Time elapsed: 14.232 s
10:22:50 Running org.eclipse.m2e.tests.discovery.MavenDiscoveryTest
10:22:52 Tests run: 9, Failures: 0, Errors: 0, Skipped: 0, Time elapsed: 1.714 s - in org.eclipse.m2e.tests.discovery.MavenDiscoveryTest
10:22:52 testCatalogSelectedByConfiguratorId(org.eclipse.m2e.tests.discovery.MavenDiscoveryTest)  Time elapsed: 0.736 s
10:22:52 testCatalogItemWithoutMappingMetadata(org.eclipse.m2e.tests.discovery.MavenDiscoveryTest)  Time elapsed: 0.425 s
10:22:52 testCatalogItemExtensionsMetadata(org.eclipse.m2e.tests.discovery.MavenDiscoveryTest)  Time elapsed: 0.003 s
10:22:52 testNotMatchPluginSelection(org.eclipse.m2e.tests.discovery.MavenDiscoveryTest)  Time elapsed: 0.087 s
10:22:52 testCatalogSelectedByLifecycleId(org.eclipse.m2e.tests.discovery.MavenDiscoveryTest)  Time elapsed: 0.093 s
10:22:52 testMultipleSelections(org.eclipse.m2e.tests.discovery.MavenDiscoveryTest)  Time elapsed: 0.114 s
10:22:52 testCatalogSelectedByPackaging(org.eclipse.m2e.tests.discovery.MavenDiscoveryTest)  Time elapsed: 0.091 s
10:22:52 testCatalogSelectedByMojoExecution(org.eclipse.m2e.tests.discovery.MavenDiscoveryTest)  Time elapsed: 0.09 s
10:22:52 testCatalogUnselected(org.eclipse.m2e.tests.discovery.MavenDiscoveryTest)  Time elapsed: 0.073 s
10:22:52 Running org.eclipse.m2e.tests.internal.project.MavenProjectChangedListenerExtensionTest
10:23:18 Tests run: 1, Failures: 0, Errors: 0, Skipped: 0, Time elapsed: 26.402 s - in org.eclipse.m2e.tests.internal.project.MavenProjectChangedListenerExtensionTest
10:23:18 testExtension(org.eclipse.m2e.tests.internal.project.MavenProjectChangedListenerExtensionTest)  Time elapsed: 26.401 s
10:23:18 Running org.eclipse.m2e.tests.internal.refactoring.ExcludeArtifactRefactoringTest
10:23:51 Warning: NLS missing message: MavenImpl_error_lookup in: org.eclipse.m2e.editor.internal.messages
10:25:13 Tests run: 12, Failures: 0, Errors: 0, Skipped: 0, Time elapsed: 114.984 s - in org.eclipse.m2e.tests.internal.refactoring.ExcludeArtifactRefactoringTest
10:25:13 testSingleArtifactKeyRemoteParent(org.eclipse.m2e.tests.internal.refactoring.ExcludeArtifactRefactoringTest)  Time elapsed: 39.908 s
10:25:13 testSingleArtifactMissing(org.eclipse.m2e.tests.internal.refactoring.ExcludeArtifactRefactoringTest)  Time elapsed: 9.434 s
10:25:13 testSingleArtifactKeyInWorkspaceParent(org.eclipse.m2e.tests.internal.refactoring.ExcludeArtifactRefactoringTest)  Time elapsed: 2.949 s
10:25:13 testStrangePomName(org.eclipse.m2e.tests.internal.refactoring.ExcludeArtifactRefactoringTest)  Time elapsed: 4.413 s
10:25:13 testArtifactsInMultiplePom(org.eclipse.m2e.tests.internal.refactoring.ExcludeArtifactRefactoringTest)  Time elapsed: 26.043 s
10:25:13 testCopyDown(org.eclipse.m2e.tests.internal.refactoring.ExcludeArtifactRefactoringTest)  Time elapsed: 2.728 s
10:25:13 testSingleArtifactKeyWorkspaceParent(org.eclipse.m2e.tests.internal.refactoring.ExcludeArtifactRefactoringTest)  Time elapsed: 4.53 s
10:25:13 testMultipleArtifactWithMissing(org.eclipse.m2e.tests.internal.refactoring.ExcludeArtifactRefactoringTest)  Time elapsed: 2.496 s
10:25:13 testSingleArtifactNoParentBadFormat(org.eclipse.m2e.tests.internal.refactoring.ExcludeArtifactRefactoringTest)  Time elapsed: 11.62 s
10:25:13 testMultipleArtifactKeySinglePom(org.eclipse.m2e.tests.internal.refactoring.ExcludeArtifactRefactoringTest)  Time elapsed: 6.423 s
10:25:13 testSingleArtifactNoParent(org.eclipse.m2e.tests.internal.refactoring.ExcludeArtifactRefactoringTest)  Time elapsed: 1.807 s
10:25:13 testPullUp(org.eclipse.m2e.tests.internal.refactoring.ExcludeArtifactRefactoringTest)  Time elapsed: 2.63 s
10:25:13 Running org.eclipse.m2e.tests.internal.wizard.MavenImportWizardTest
10:25:30 Tests run: 3, Failures: 0, Errors: 0, Skipped: 0, Time elapsed: 16.701 s - in org.eclipse.m2e.tests.internal.wizard.MavenImportWizardTest
10:25:30 testNoRenameOnMavenImport(org.eclipse.m2e.tests.internal.wizard.MavenImportWizardTest)  Time elapsed: 2.764 s
10:25:30 testRenameOnMavenImport(org.eclipse.m2e.tests.internal.wizard.MavenImportWizardTest)  Time elapsed: 1.942 s
10:25:30 testNoRenameOnMavenImportInWorkspaceRoot(org.eclipse.m2e.tests.internal.wizard.MavenImportWizardTest)  Time elapsed: 11.993 s
10:25:30 Running org.eclipse.m2e.tests.internal.wizard.MavenImportWizardPageTest
10:25:52 Tests run: 6, Failures: 0, Errors: 0, Skipped: 0, Time elapsed: 21.384 s - in org.eclipse.m2e.tests.internal.wizard.MavenImportWizardPageTest
10:25:52 test408042_multimoduleProject(org.eclipse.m2e.tests.internal.wizard.MavenImportWizardPageTest)  Time elapsed: 1.738 s
10:25:52 test408042_nestedproject(org.eclipse.m2e.tests.internal.wizard.MavenImportWizardPageTest)  Time elapsed: 5.535 s
10:25:52 test408042_noRootProject(org.eclipse.m2e.tests.internal.wizard.MavenImportWizardPageTest)  Time elapsed: 7.914 s
10:25:52 test533463_noArtifactId(org.eclipse.m2e.tests.internal.wizard.MavenImportWizardPageTest)  Time elapsed: 2.622 s
10:25:52 test408042_simpleProject(org.eclipse.m2e.tests.internal.wizard.MavenImportWizardPageTest)  Time elapsed: 1.129 s
10:25:52 test422008_preselectedWorkingSet(org.eclipse.m2e.tests.internal.wizard.MavenImportWizardPageTest)  Time elapsed: 2.445 s
10:25:52 Running org.eclipse.m2e.tests.internal.wizard.MappingDiscoveryJobTest
10:26:07 Tests run: 2, Failures: 0, Errors: 0, Skipped: 0, Time elapsed: 15.197 s - in org.eclipse.m2e.tests.internal.wizard.MappingDiscoveryJobTest
10:26:07 testDontOpenMappingDiscoveryWizard(org.eclipse.m2e.tests.internal.wizard.MappingDiscoveryJobTest)  Time elapsed: 2.304 s
10:26:07 testOpensMappingDiscoveryWizard(org.eclipse.m2e.tests.internal.wizard.MappingDiscoveryJobTest)  Time elapsed: 12.891 s
10:26:07 Running org.eclipse.m2e.tests.internal.lifecyclemapping.ProjectConfigurationElementSorterTest
10:26:07 Tests run: 6, Failures: 0, Errors: 0, Skipped: 0, Time elapsed: 0.007 s - in org.eclipse.m2e.tests.internal.lifecyclemapping.ProjectConfigurationElementSorterTest
10:26:07 testSortConfigurators_MissingPreviousConfigurator(org.eclipse.m2e.tests.internal.lifecyclemapping.ProjectConfigurationElementSorterTest)  Time elapsed: 0.005 s
10:26:07 testSortConfigurators_isRoot(org.eclipse.m2e.tests.internal.lifecyclemapping.ProjectConfigurationElementSorterTest)  Time elapsed: 0 s
10:26:07 testSortConfigurators_HappyPath(org.eclipse.m2e.tests.internal.lifecyclemapping.ProjectConfigurationElementSorterTest)  Time elapsed: 0 s
10:26:07 testSortConfigurators_MissingFollowingConfigurator(org.eclipse.m2e.tests.internal.lifecyclemapping.ProjectConfigurationElementSorterTest)  Time elapsed: 0 s
10:26:07 testSortConfigurators_CycleDetected(org.eclipse.m2e.tests.internal.lifecyclemapping.ProjectConfigurationElementSorterTest)  Time elapsed: 0 s
10:26:07 testSortConfigurators_471840(org.eclipse.m2e.tests.internal.lifecyclemapping.ProjectConfigurationElementSorterTest)  Time elapsed: 0 s
10:26:07 Running org.eclipse.m2e.tests.internal.index.NexusIndexManagerSearchTest
10:27:52 Tests run: 9, Failures: 0, Errors: 0, Skipped: 0, Time elapsed: 104.897 s - in org.eclipse.m2e.tests.internal.index.NexusIndexManagerSearchTest
10:27:52 testPluginSearch(org.eclipse.m2e.tests.internal.index.NexusIndexManagerSearchTest)  Time elapsed: 9.738 s
10:27:52 testSearchGroups2(org.eclipse.m2e.tests.internal.index.NexusIndexManagerSearchTest)  Time elapsed: 7.356 s
10:27:52 testSearchGroups3(org.eclipse.m2e.tests.internal.index.NexusIndexManagerSearchTest)  Time elapsed: 9.735 s
10:27:52 testSha1Search(org.eclipse.m2e.tests.internal.index.NexusIndexManagerSearchTest)  Time elapsed: 5.177 s
10:27:52 testBogusSearchType(org.eclipse.m2e.tests.internal.index.NexusIndexManagerSearchTest)  Time elapsed: 33.678 s
10:27:52 testGroupSearch(org.eclipse.m2e.tests.internal.index.NexusIndexManagerSearchTest)  Time elapsed: 6.678 s
10:27:52 testSearchGroups(org.eclipse.m2e.tests.internal.index.NexusIndexManagerSearchTest)  Time elapsed: 17.472 s
10:27:52 testArtifactSearch(org.eclipse.m2e.tests.internal.index.NexusIndexManagerSearchTest)  Time elapsed: 6.288 s
10:27:52 testSorting(org.eclipse.m2e.tests.internal.index.NexusIndexManagerSearchTest)  Time elapsed: 8.773 s
10:27:52 Running org.eclipse.m2e.tests.internal.index.IndexedArtifactTest
10:27:52 Tests run: 3, Failures: 0, Errors: 0, Skipped: 0, Time elapsed: 0.002 s - in org.eclipse.m2e.tests.internal.index.IndexedArtifactTest
10:27:52 testHash(org.eclipse.m2e.tests.internal.index.IndexedArtifactTest)  Time elapsed: 0.001 s
10:27:52 testPackageName(org.eclipse.m2e.tests.internal.index.IndexedArtifactTest)  Time elapsed: 0 s
10:27:52 testEquals(org.eclipse.m2e.tests.internal.index.IndexedArtifactTest)  Time elapsed: 0 s
10:27:52 Running org.eclipse.m2e.tests.internal.index.NexusIndexManagerTest
10:32:38 Tests run: 14, Failures: 0, Errors: 0, Skipped: 0, Time elapsed: 286.656 s - in org.eclipse.m2e.tests.internal.index.NexusIndexManagerTest
10:32:38 testIndexedPublicArtifactGroups(org.eclipse.m2e.tests.internal.index.NexusIndexManagerTest)  Time elapsed: 43.522 s
10:32:38 test512006_nonProxyHost(org.eclipse.m2e.tests.internal.index.NexusIndexManagerTest)  Time elapsed: 15.362 s
10:32:38 testFetchIndexFromRepositoryWithAuthentication(org.eclipse.m2e.tests.internal.index.NexusIndexManagerTest)  Time elapsed: 25.84 s
10:32:38 testIndexedArtifactGroups(org.eclipse.m2e.tests.internal.index.NexusIndexManagerTest)  Time elapsed: 60.999 s
10:32:38 testWorkspaceIndex(org.eclipse.m2e.tests.internal.index.NexusIndexManagerTest)  Time elapsed: 34.258 s
10:32:38 testDisableIndex(org.eclipse.m2e.tests.internal.index.NexusIndexManagerTest)  Time elapsed: 14.699 s
10:32:38 testPublicNonMirrored(org.eclipse.m2e.tests.internal.index.NexusIndexManagerTest)  Time elapsed: 21.64 s
10:32:38 testMngEclipse1621(org.eclipse.m2e.tests.internal.index.NexusIndexManagerTest)  Time elapsed: 18.683 s
10:32:38 testMngEclipse1710(org.eclipse.m2e.tests.internal.index.NexusIndexManagerTest)  Time elapsed: 22.227 s
10:32:38 testMngEclipse1907(org.eclipse.m2e.tests.internal.index.NexusIndexManagerTest)  Time elapsed: 8.133 s
10:32:38 testProjectSpecificThenInSettings(org.eclipse.m2e.tests.internal.index.NexusIndexManagerTest)  Time elapsed: 8.958 s
10:32:38 testNoMirror(org.eclipse.m2e.tests.internal.index.NexusIndexManagerTest)  Time elapsed: 2.678 s
10:32:38 testPublicMirror(org.eclipse.m2e.tests.internal.index.NexusIndexManagerTest)  Time elapsed: 6.738 s
10:32:38 testProjectIndexes(org.eclipse.m2e.tests.internal.index.NexusIndexManagerTest)  Time elapsed: 2.917 s
10:32:38 Running org.eclipse.m2e.tests.internal.index.filter.IndexFilterTest
10:32:38 Tests run: 3, Failures: 0, Errors: 0, Skipped: 0, Time elapsed: 0.01 s - in org.eclipse.m2e.tests.internal.index.filter.IndexFilterTest
10:32:38 testIndexedArtifactFileNodeAdapter(org.eclipse.m2e.tests.internal.index.filter.IndexFilterTest)  Time elapsed: 0.004 s
10:32:38 testFilteredIndex_nonEmptyResult(org.eclipse.m2e.tests.internal.index.filter.IndexFilterTest)  Time elapsed: 0.004 s
10:32:38 testFilteredIndex_emptyResult(org.eclipse.m2e.tests.internal.index.filter.IndexFilterTest)  Time elapsed: 0 s
10:32:38 Running org.eclipse.m2e.tests.internal.embedder.MavenEmbeddedRuntimeTest
10:32:38 Tests run: 1, Failures: 0, Errors: 0, Skipped: 0, Time elapsed: 0.076 s - in org.eclipse.m2e.tests.internal.embedder.MavenEmbeddedRuntimeTest
10:32:38 testGetVersion(org.eclipse.m2e.tests.internal.embedder.MavenEmbeddedRuntimeTest)  Time elapsed: 0.076 s
10:32:38 Running org.eclipse.m2e.tests.internal.repository.RepositoryRegistryTest
10:32:40 Tests run: 1, Failures: 0, Errors: 0, Skipped: 0, Time elapsed: 1.158 s - in org.eclipse.m2e.tests.internal.repository.RepositoryRegistryTest
10:32:40 testSettingsDecryption(org.eclipse.m2e.tests.internal.repository.RepositoryRegistryTest)  Time elapsed: 1.157 s
10:32:40 Running org.eclipse.m2e.tests.internal.conversion.ProjectConversionParticipantSorterTest
10:32:40 Tests run: 6, Failures: 0, Errors: 0, Skipped: 0, Time elapsed: 0.004 s - in org.eclipse.m2e.tests.internal.conversion.ProjectConversionParticipantSorterTest
10:32:40 testSortConverters_AfterBefore(org.eclipse.m2e.tests.internal.conversion.ProjectConversionParticipantSorterTest)  Time elapsed: 0.002 s
10:32:40 testSortConverters_After2(org.eclipse.m2e.tests.internal.conversion.ProjectConversionParticipantSorterTest)  Time elapsed: 0 s
10:32:40 testSortConverters_After(org.eclipse.m2e.tests.internal.conversion.ProjectConversionParticipantSorterTest)  Time elapsed: 0 s
10:32:40 testSortConverters_Cycle_After(org.eclipse.m2e.tests.internal.conversion.ProjectConversionParticipantSorterTest)  Time elapsed: 0 s
10:32:40 testSortConverters_DuplicateConverters(org.eclipse.m2e.tests.internal.conversion.ProjectConversionParticipantSorterTest)  Time elapsed: 0 s
10:32:40 testSortConverters_Cycle_Before(org.eclipse.m2e.tests.internal.conversion.ProjectConversionParticipantSorterTest)  Time elapsed: 0 s
10:32:40 Running org.eclipse.m2e.tests.conversion.ProjectConversionEnablerTest
10:32:43 Tests run: 3, Failures: 0, Errors: 0, Skipped: 0, Time elapsed: 3.182 s - in org.eclipse.m2e.tests.conversion.ProjectConversionEnablerTest
10:32:43 testProjectCanBeConverted(org.eclipse.m2e.tests.conversion.ProjectConversionEnablerTest)  Time elapsed: 0.998 s
10:32:43 testProjectCannotBeConverted(org.eclipse.m2e.tests.conversion.ProjectConversionEnablerTest)  Time elapsed: 1.22 s
10:32:43 testEnablerNotFound(org.eclipse.m2e.tests.conversion.ProjectConversionEnablerTest)  Time elapsed: 0.963 s
10:32:43 Running org.eclipse.m2e.tests.conversion.ProjectConversionManagerTest
10:32:46 Tests run: 3, Failures: 0, Errors: 0, Skipped: 0, Time elapsed: 3.728 s - in org.eclipse.m2e.tests.conversion.ProjectConversionManagerTest
10:32:46 test393613_SortConversionParticipants(org.eclipse.m2e.tests.conversion.ProjectConversionManagerTest)  Time elapsed: 1.086 s
10:32:46 testConversionParticipantsPerProject(org.eclipse.m2e.tests.conversion.ProjectConversionManagerTest)  Time elapsed: 1.1 s
10:32:46 testRestrictedPackagings(org.eclipse.m2e.tests.conversion.ProjectConversionManagerTest)  Time elapsed: 1.541 s
10:32:46 Running org.eclipse.m2e.tests.conversion.ProjectConversionTest
10:34:42 Tests run: 7, Failures: 0, Errors: 0, Skipped: 0, Time elapsed: 115.181 s - in org.eclipse.m2e.tests.conversion.ProjectConversionTest
10:34:42 testMultipleSourcesProjectConversion(org.eclipse.m2e.tests.conversion.ProjectConversionTest)  Time elapsed: 58.368 s
10:34:42 testProjectConversionWithSvn(org.eclipse.m2e.tests.conversion.ProjectConversionTest)  Time elapsed: 4.593 s
10:34:42 testJavaMixedWithResourcesProjectConversion(org.eclipse.m2e.tests.conversion.ProjectConversionTest)  Time elapsed: 8.024 s
10:34:42 testInheritJavaSettingsDuringConversion(org.eclipse.m2e.tests.conversion.ProjectConversionTest)  Time elapsed: 10.181 s
10:34:42 testOptionalSourceProjectConversion(org.eclipse.m2e.tests.conversion.ProjectConversionTest)  Time elapsed: 4.885 s
10:34:42 testNoCustomizationNeededProjectConversion(org.eclipse.m2e.tests.conversion.ProjectConversionTest)  Time elapsed: 26.14 s
10:34:42 testMavenLayoutProjectConversion(org.eclipse.m2e.tests.conversion.ProjectConversionTest)  Time elapsed: 2.989 s
10:34:42 Running org.eclipse.m2e.tests.embedder.MavenRuntimeManagerTest
10:34:42 Tests run: 4, Failures: 0, Errors: 0, Skipped: 0, Time elapsed: 0.013 s - in org.eclipse.m2e.tests.embedder.MavenRuntimeManagerTest
10:34:42 testDefaultRuntime(org.eclipse.m2e.tests.embedder.MavenRuntimeManagerTest)  Time elapsed: 0.006 s
10:34:42 testSetDefaultRuntime(org.eclipse.m2e.tests.embedder.MavenRuntimeManagerTest)  Time elapsed: 0 s
10:34:42 testExternalRuntime(org.eclipse.m2e.tests.embedder.MavenRuntimeManagerTest)  Time elapsed: 0.006 s
10:34:42 testGetRuntime(org.eclipse.m2e.tests.embedder.MavenRuntimeManagerTest)  Time elapsed: 0 s
10:34:42 Running org.eclipse.m2e.tests.embedder.MavenModelEditTest
10:34:42 Tests run: 16, Failures: 0, Errors: 0, Skipped: 0, Time elapsed: 0.436 s - in org.eclipse.m2e.tests.embedder.MavenModelEditTest
10:34:42 testOneRemove(org.eclipse.m2e.tests.embedder.MavenModelEditTest)  Time elapsed: 0.028 s
10:34:42 testEncoding(org.eclipse.m2e.tests.embedder.MavenModelEditTest)  Time elapsed: 0.006 s
10:34:42 testAttributeChange(org.eclipse.m2e.tests.embedder.MavenModelEditTest)  Time elapsed: 0.004 s
10:34:42 testAttributeRoundtrip(org.eclipse.m2e.tests.embedder.MavenModelEditTest)  Time elapsed: 0.005 s
10:34:42 testAttributeRemove(org.eclipse.m2e.tests.embedder.MavenModelEditTest)  Time elapsed: 0.005 s
10:34:42 testManyRoundtrip(org.eclipse.m2e.tests.embedder.MavenModelEditTest)  Time elapsed: 0.006 s
10:34:42 testManybuildinRoundtrip(org.eclipse.m2e.tests.embedder.MavenModelEditTest)  Time elapsed: 0.043 s
10:34:42 testAttributeAdd(org.eclipse.m2e.tests.embedder.MavenModelEditTest)  Time elapsed: 0.055 s
10:34:42 testOneReplace(org.eclipse.m2e.tests.embedder.MavenModelEditTest)  Time elapsed: 0.035 s
10:34:42 testManyAdd(org.eclipse.m2e.tests.embedder.MavenModelEditTest)  Time elapsed: 0.057 s
10:34:42 testManybuildincommentRemove(org.eclipse.m2e.tests.embedder.MavenModelEditTest)  Time elapsed: 0.006 s
10:34:42 testManyChange(org.eclipse.m2e.tests.embedder.MavenModelEditTest)  Time elapsed: 0.043 s
10:34:42 testXpp3domRoundtrip(org.eclipse.m2e.tests.embedder.MavenModelEditTest)  Time elapsed: 0.014 s
10:34:42 testManyRemove(org.eclipse.m2e.tests.embedder.MavenModelEditTest)  Time elapsed: 0.027 s
10:34:42 testOneRoundtrip(org.eclipse.m2e.tests.embedder.MavenModelEditTest)  Time elapsed: 0.038 s
10:34:42 testManybuildinRemove(org.eclipse.m2e.tests.embedder.MavenModelEditTest)  Time elapsed: 0.06 s
10:34:42 Running org.eclipse.m2e.tests.embedder.MavenModelManagerTest
10:34:46 Tests run: 2, Failures: 0, Errors: 0, Skipped: 0, Time elapsed: 3.777 s - in org.eclipse.m2e.tests.embedder.MavenModelManagerTest
10:34:46 test416882_dependencyTree(org.eclipse.m2e.tests.embedder.MavenModelManagerTest)  Time elapsed: 2 s
10:34:46 testCreateMavenModel(org.eclipse.m2e.tests.embedder.MavenModelManagerTest)  Time elapsed: 1.775 s
10:34:46 Running org.eclipse.m2e.tests.embedder.MavenImplTest
10:37:40 Tests run: 21, Failures: 0, Errors: 0, Skipped: 1, Time elapsed: 173.703 s - in org.eclipse.m2e.tests.embedder.MavenImplTest
10:37:40 test438454_guiceScopedComponentInjection(org.eclipse.m2e.tests.embedder.MavenImplTest)  Time elapsed: 4.807 s
10:37:40 testUnreadableSettings(org.eclipse.m2e.tests.embedder.MavenImplTest)  Time elapsed: 2.352 s
10:37:40 testGetProxy(org.eclipse.m2e.tests.embedder.MavenImplTest)  Time elapsed: 5.862 s
10:37:40 testMNGECLIPSE2556_settingsSystemPropertiesSubstiution(org.eclipse.m2e.tests.embedder.MavenImplTest)  Time elapsed: 15.033 s
10:37:40 testGetDefaultRepositories(org.eclipse.m2e.tests.embedder.MavenImplTest)  Time elapsed: 2.425 s
10:37:40 testGetRepositories(org.eclipse.m2e.tests.embedder.MavenImplTest)  Time elapsed: 6.669 s
10:37:40 testMissingArtifact(org.eclipse.m2e.tests.embedder.MavenImplTest)  Time elapsed: 1.41 s
10:37:40 testIsUnavailable(org.eclipse.m2e.tests.embedder.MavenImplTest)  Time elapsed: 1.566 s
10:37:40 testLocalRepositoryListener(org.eclipse.m2e.tests.embedder.MavenImplTest)  Time elapsed: 1.77 s
10:37:40 testGlobalSettings(org.eclipse.m2e.tests.embedder.MavenImplTest)  Time elapsed: 10.28 s
10:37:40 testReadNoParent(org.eclipse.m2e.tests.embedder.MavenImplTest)  Time elapsed: 3.05 s
10:37:40 test358620_reparse_changed_user_settings(org.eclipse.m2e.tests.embedder.MavenImplTest)  Time elapsed: 2.045 s
10:37:40 test366839_userAgent(org.eclipse.m2e.tests.embedder.MavenImplTest)  Time elapsed: 5.993 s
10:37:40 testReadLocalParent(org.eclipse.m2e.tests.embedder.MavenImplTest)  Time elapsed: 19.854 s
10:37:40 testReadProjectWithDependenciesFromMirror(org.eclipse.m2e.tests.embedder.MavenImplTest)  Time elapsed: 27.012 s
10:37:40 testGetMojoParameterValue(org.eclipse.m2e.tests.embedder.MavenImplTest)  Time elapsed: 7.069 s
10:37:40 testGetRepositoriesWithSettingsInjection(org.eclipse.m2e.tests.embedder.MavenImplTest)  Time elapsed: 8.334 s
10:37:40 test386196_ParallelDownloads(org.eclipse.m2e.tests.embedder.MavenImplTest)  Time elapsed: 21.674 s
10:37:40 testProxySupport(org.eclipse.m2e.tests.embedder.MavenImplTest)  Time elapsed: 15.601 s
10:37:40 DISABLED_testSslWithMutualHandshake(org.eclipse.m2e.tests.embedder.MavenImplTest) skipped
10:37:40 testReadRemoteParent(org.eclipse.m2e.tests.embedder.MavenImplTest)  Time elapsed: 10.892 s
10:37:40 Running org.eclipse.m2e.tests.embedder.ArtifactKeyTest
10:37:40 Tests run: 1, Failures: 0, Errors: 0, Skipped: 0, Time elapsed: 0.001 s - in org.eclipse.m2e.tests.embedder.ArtifactKeyTest
10:37:40 testPortableString(org.eclipse.m2e.tests.embedder.ArtifactKeyTest)  Time elapsed: 0.001 s
10:37:40 Running org.eclipse.m2e.tests.embedder.MavenExecutionContextTest
10:38:14 Tests run: 6, Failures: 0, Errors: 0, Skipped: 0, Time elapsed: 34.432 s - in org.eclipse.m2e.tests.embedder.MavenExecutionContextTest
10:38:14 testBasic(org.eclipse.m2e.tests.embedder.MavenExecutionContextTest)  Time elapsed: 6.849 s
10:38:14 test496492_threadContextClassloaderLeak(org.eclipse.m2e.tests.embedder.MavenExecutionContextTest)  Time elapsed: 3.551 s
10:38:14 testExecutionRequestContainsSystemProperties(org.eclipse.m2e.tests.embedder.MavenExecutionContextTest)  Time elapsed: 8.45 s
10:38:14 testReenterShortcut(org.eclipse.m2e.tests.embedder.MavenExecutionContextTest)  Time elapsed: 5.431 s
10:38:14 testIllegalState(org.eclipse.m2e.tests.embedder.MavenExecutionContextTest)  Time elapsed: 6.875 s
10:38:14 testNested(org.eclipse.m2e.tests.embedder.MavenExecutionContextTest)  Time elapsed: 3.275 s
10:38:14 Running org.eclipse.m2e.tests.scm.ScmHandlerFactoryTest
10:38:14 Tests run: 1, Failures: 0, Errors: 0, Skipped: 0, Time elapsed: 0.006 s - in org.eclipse.m2e.tests.scm.ScmHandlerFactoryTest
10:38:14 testScmHandlerFactory(org.eclipse.m2e.tests.scm.ScmHandlerFactoryTest)  Time elapsed: 0.006 s
10:38:14 Running org.eclipse.m2e.tests.profiles.MavenProfileManagerTest
10:40:00 Tests run: 5, Failures: 0, Errors: 0, Skipped: 0, Time elapsed: 105.559 s - in org.eclipse.m2e.tests.profiles.MavenProfileManagerTest
10:40:00 testGetAvailableSettingsProfiles(org.eclipse.m2e.tests.profiles.MavenProfileManagerTest)  Time elapsed: 11.349 s
10:40:00 test441112_InheritParentActiveProfiles(org.eclipse.m2e.tests.profiles.MavenProfileManagerTest)  Time elapsed: 27.875 s
10:40:00 testUserSelectedProfiles(org.eclipse.m2e.tests.profiles.MavenProfileManagerTest)  Time elapsed: 26.684 s
10:40:00 testParentFromRemote(org.eclipse.m2e.tests.profiles.MavenProfileManagerTest)  Time elapsed: 19.728 s
10:40:00 testDisabledProfiles(org.eclipse.m2e.tests.profiles.MavenProfileManagerTest)  Time elapsed: 19.918 s
10:40:00 Running org.eclipse.m2e.tests.configurators.ResourcesEncodingConfiguratorTest
10:40:25 Tests run: 3, Failures: 0, Errors: 0, Skipped: 0, Time elapsed: 24.968 s - in org.eclipse.m2e.tests.configurators.ResourcesEncodingConfiguratorTest
10:40:25 test002_shouldConfigureEncodingForProjectWithSeveralResourceFolders(org.eclipse.m2e.tests.configurators.ResourcesEncodingConfiguratorTest)  Time elapsed: 17.005 s
10:40:25 test001_shouldConfigureEncodingForBasicProject(org.eclipse.m2e.tests.configurators.ResourcesEncodingConfiguratorTest)  Time elapsed: 3.491 s
10:40:25 test003_shouldResetToContainerDefinedEncoding(org.eclipse.m2e.tests.configurators.ResourcesEncodingConfiguratorTest)  Time elapsed: 4.471 s
10:40:25 Running org.eclipse.m2e.tests.configurators.CompilerSettingsWithEncodingConfiguratorTest
10:40:43 Tests run: 2, Failures: 0, Errors: 0, Skipped: 0, Time elapsed: 18.726 s - in org.eclipse.m2e.tests.configurators.CompilerSettingsWithEncodingConfiguratorTest
10:40:43 test002_shouldResetToContainerDefinedEncoding(org.eclipse.m2e.tests.configurators.CompilerSettingsWithEncodingConfiguratorTest)  Time elapsed: 10.995 s
10:40:43 test001_shouldSetEncodingForBasicProject(org.eclipse.m2e.tests.configurators.CompilerSettingsWithEncodingConfiguratorTest)  Time elapsed: 7.73 s
10:40:43 Running org.eclipse.m2e.tests.SourceLocationHelperTest
10:41:06 Tests run: 5, Failures: 0, Errors: 0, Skipped: 0, Time elapsed: 23.048 s - in org.eclipse.m2e.tests.SourceLocationHelperTest
10:41:06 testDependencyLocation(org.eclipse.m2e.tests.SourceLocationHelperTest)  Time elapsed: 4.317 s
10:41:06 testMojoExecutionLocationWithExecutions(org.eclipse.m2e.tests.SourceLocationHelperTest)  Time elapsed: 5.279 s
10:41:06 testPackagingLocation(org.eclipse.m2e.tests.SourceLocationHelperTest)  Time elapsed: 2.292 s
10:41:06 testMojoExecutionLocation(org.eclipse.m2e.tests.SourceLocationHelperTest)  Time elapsed: 4.41 s
10:41:06 testPluginAttributeLocation(org.eclipse.m2e.tests.SourceLocationHelperTest)  Time elapsed: 6.75 s
10:41:06 Running org.eclipse.m2e.tests.util.search.IndexSearchEngineTest
10:41:16 Tests run: 1, Failures: 0, Errors: 0, Skipped: 0, Time elapsed: 9.688 s - in org.eclipse.m2e.tests.util.search.IndexSearchEngineTest
10:41:16 testGroupIDProposal(org.eclipse.m2e.tests.util.search.IndexSearchEngineTest)  Time elapsed: 9.687 s
10:41:16 Running org.eclipse.m2e.tests.jdt.ProjectLayoutTest
10:41:21 Tests run: 1, Failures: 0, Errors: 0, Skipped: 0, Time elapsed: 4.849 s - in org.eclipse.m2e.tests.jdt.ProjectLayoutTest
10:41:21 test472726_basedirResources(org.eclipse.m2e.tests.jdt.ProjectLayoutTest)  Time elapsed: 4.848 s
10:41:21 Running org.eclipse.m2e.tests.jdt.JavaClasspathTest
10:43:59 Tests run: 22, Failures: 0, Errors: 0, Skipped: 0, Time elapsed: 157.877 s - in org.eclipse.m2e.tests.jdt.JavaClasspathTest
10:43:59 testStaleDerivedEntries(org.eclipse.m2e.tests.jdt.JavaClasspathTest)  Time elapsed: 5.036 s
10:43:59 test398121_PreserveOrderOfClasspathContainersOnUpdate(org.eclipse.m2e.tests.jdt.JavaClasspathTest)  Time elapsed: 19.735 s
10:43:59 test370685_PreserveResourcesOnUpdate(org.eclipse.m2e.tests.jdt.JavaClasspathTest)  Time elapsed: 4.787 s
10:43:59 test480137_addingResourceFoldersAreNotRemovedDuringConfigurationUpdate(org.eclipse.m2e.tests.jdt.JavaClasspathTest)  Time elapsed: 31.735 s
10:43:59 test537851_DisableTestClasspathFlag(org.eclipse.m2e.tests.jdt.JavaClasspathTest)  Time elapsed: 6.363 s
10:43:59 test526858_ProjectExportingTests(org.eclipse.m2e.tests.jdt.JavaClasspathTest)  Time elapsed: 9.59 s
10:43:59 test466518_classpathJREOrder(org.eclipse.m2e.tests.jdt.JavaClasspathTest)  Time elapsed: 8.629 s
10:43:59 test518218_configureMethodParametersGenerationWithCompilerArgs(org.eclipse.m2e.tests.jdt.JavaClasspathTest)  Time elapsed: 8.858 s
10:43:59 test518218_configureMethodParametersGenerationWithParameters(org.eclipse.m2e.tests.jdt.JavaClasspathTest)  Time elapsed: 4.401 s
10:43:59 test388541_KeepClasspathAttributes(org.eclipse.m2e.tests.jdt.JavaClasspathTest)  Time elapsed: 4.786 s
10:43:59 test526858_TestClasspathAttributeOnProject(org.eclipse.m2e.tests.jdt.JavaClasspathTest)  Time elapsed: 3.568 s
10:43:59 test526858_TestClasspathAttributeOnJar(org.eclipse.m2e.tests.jdt.JavaClasspathTest)  Time elapsed: 11.199 s
10:43:59 test518218_configureMethodParametersGenerationWithCompilerArgument(org.eclipse.m2e.tests.jdt.JavaClasspathTest)  Time elapsed: 3.305 s
10:43:59 testClasspathContainers(org.eclipse.m2e.tests.jdt.JavaClasspathTest)  Time elapsed: 2.585 s
10:43:59 test414645_TestClasspathAttributeOnRuntimeProjectDependencies(org.eclipse.m2e.tests.jdt.JavaClasspathTest)  Time elapsed: 3.796 s
10:43:59 test394042_ClasspathEntry4(org.eclipse.m2e.tests.jdt.JavaClasspathTest)  Time elapsed: 7.148 s
10:43:59 test414645_TestClasspathAttributeOnRuntimeJarDependencies(org.eclipse.m2e.tests.jdt.JavaClasspathTest)  Time elapsed: 3.506 s
10:43:59 test525880_JavaAccessRulesArePreservedOnUpdate(org.eclipse.m2e.tests.jdt.JavaClasspathTest)  Time elapsed: 6.514 s
10:43:59 test534049_SetReleaseFlag(org.eclipse.m2e.tests.jdt.JavaClasspathTest)  Time elapsed: 2.815 s
10:43:59 test549312_fallbackToLatestEE(org.eclipse.m2e.tests.jdt.JavaClasspathTest)  Time elapsed: 2.439 s
10:43:59 testImport(org.eclipse.m2e.tests.jdt.JavaClasspathTest)  Time elapsed: 4.243 s
10:43:59 test486739_PreserveExportedOnUpdate(org.eclipse.m2e.tests.jdt.JavaClasspathTest)  Time elapsed: 2.835 s
10:43:59 Running org.eclipse.m2e.tests.jdt.internal.MavenClasspathContainerSaveHelperTest
10:43:59 Tests run: 1, Failures: 0, Errors: 0, Skipped: 0, Time elapsed: 0.003 s - in org.eclipse.m2e.tests.jdt.internal.MavenClasspathContainerSaveHelperTest
10:43:59 testClasspathContainerSace(org.eclipse.m2e.tests.jdt.internal.MavenClasspathContainerSaveHelperTest)  Time elapsed: 0.003 s
10:43:59 Running org.eclipse.m2e.tests.jdt.internal.ClasspathEntryDescriptorTest
10:43:59 Tests run: 1, Failures: 0, Errors: 0, Skipped: 0, Time elapsed: 0 s - in org.eclipse.m2e.tests.jdt.internal.ClasspathEntryDescriptorTest
10:43:59 testArtifactKeyDeserialization(org.eclipse.m2e.tests.jdt.internal.ClasspathEntryDescriptorTest)  Time elapsed: 0 s
10:43:59 Running org.eclipse.m2e.tests.jdt.JavaCodeGenerationProjectConfiguratorTest
10:44:02 Tests run: 1, Failures: 0, Errors: 0, Skipped: 0, Time elapsed: 3.246 s - in org.eclipse.m2e.tests.jdt.JavaCodeGenerationProjectConfiguratorTest
10:44:02 test368333_generatedSourcesFoldersAreNotRemovedDuringConfigurationUpdate(org.eclipse.m2e.tests.jdt.JavaCodeGenerationProjectConfiguratorTest)  Time elapsed: 3.245 s
10:44:02 Running org.eclipse.m2e.tests.project.MavenProjectInfoTest
10:44:02 Tests run: 1, Failures: 0, Errors: 0, Skipped: 0, Time elapsed: 0.001 s - in org.eclipse.m2e.tests.project.MavenProjectInfoTest
10:44:02 testTwoChildProjectInfosWithSameLabel(org.eclipse.m2e.tests.project.MavenProjectInfoTest)  Time elapsed: 0 s
10:44:02 Running org.eclipse.m2e.tests.project.CompilerSettings18Test
10:44:04 Tests run: 1, Failures: 0, Errors: 0, Skipped: 0, Time elapsed: 1.815 s - in org.eclipse.m2e.tests.project.CompilerSettings18Test
10:44:04 testCompilerSettings18(org.eclipse.m2e.tests.project.CompilerSettings18Test)  Time elapsed: 1.815 s
10:44:04 Running org.eclipse.m2e.tests.project.CompilerSynonymTest
10:44:05 Tests run: 1, Failures: 0, Errors: 0, Skipped: 0, Time elapsed: 1.561 s - in org.eclipse.m2e.tests.project.CompilerSynonymTest
10:44:05 testSynonym(org.eclipse.m2e.tests.project.CompilerSynonymTest)  Time elapsed: 1.561 s
10:44:05 Running org.eclipse.m2e.tests.project.MavenProjectFacadeTest
10:44:35 Tests run: 9, Failures: 0, Errors: 0, Skipped: 0, Time elapsed: 29.878 s - in org.eclipse.m2e.tests.project.MavenProjectFacadeTest
10:44:35 testGetProjectConfiguratorsAfterWorkspaceRestart(org.eclipse.m2e.tests.project.MavenProjectFacadeTest)  Time elapsed: 1.651 s
10:44:35 testGetMojoExecutionAfterWorkspaceRestart(org.eclipse.m2e.tests.project.MavenProjectFacadeTest)  Time elapsed: 1.681 s
10:44:35 testGetMojoExecutionsWithoutMavenExecutionContext(org.eclipse.m2e.tests.project.MavenProjectFacadeTest)  Time elapsed: 7.985 s
10:44:35 testGetProjectConfigurators(org.eclipse.m2e.tests.project.MavenProjectFacadeTest)  Time elapsed: 3.053 s
10:44:35 test436668_EclipseProjectMetadataNotStale(org.eclipse.m2e.tests.project.MavenProjectFacadeTest)  Time elapsed: 2.758 s
10:44:35 testGetMojoExecution(org.eclipse.m2e.tests.project.MavenProjectFacadeTest)  Time elapsed: 3.087 s
10:44:35 testGetMojoExecutions(org.eclipse.m2e.tests.project.MavenProjectFacadeTest)  Time elapsed: 2.51 s
10:44:35 testIsStale(org.eclipse.m2e.tests.project.MavenProjectFacadeTest)  Time elapsed: 1.99 s
10:44:35 testGetMojoExecutionsAfterWorkspaceRestart(org.eclipse.m2e.tests.project.MavenProjectFacadeTest)  Time elapsed: 5.161 s
10:44:35 Running org.eclipse.m2e.tests.BuildPathManagerTest
10:45:02 [INFO] ----------------------------------------------------------------------------
10:45:02 [INFO] Using following parameters for creating project from Old (1.x) Archetype: maven-archetype-quickstart:1.1
10:45:02 [INFO] ----------------------------------------------------------------------------
10:45:02 [INFO] Parameter: basedir, Value: /home/jenkins/agent/workspace/m2e-sonarqube/m2e-core-tests/org.eclipse.m2e.tests/target/work/data
10:45:02 [INFO] Parameter: package, Value: jar
10:45:02 [INFO] Parameter: groupId, Value: archetype-project
10:45:02 [INFO] Parameter: artifactId, Value: archetype-project
10:45:02 [INFO] Parameter: packageName, Value: jar
10:45:02 [INFO] Parameter: version, Value: 0.0.1-SNAPSHOT
10:45:02 [INFO] project created from Old (1.x) Archetype in dir: /home/jenkins/agent/workspace/m2e-sonarqube/m2e-core-tests/org.eclipse.m2e.tests/target/work/data/archetype-project
10:46:25 [INFO] ----------------------------------------------------------------------------
10:46:25 [INFO] Using following parameters for creating project from Old (1.x) Archetype: maven-archetype-quickstart:1.1
10:46:25 [INFO] ----------------------------------------------------------------------------
10:46:25 [INFO] Parameter: basedir, Value: /tmp/m2eclipse4520974403267063461test/external-archetype-project-1
10:46:25 [INFO] Parameter: package, Value: jar
10:46:25 [INFO] Parameter: groupId, Value: external-archetype-project-1
10:46:25 [INFO] Parameter: artifactId, Value: external-archetype-project-1
10:46:25 [INFO] Parameter: packageName, Value: jar
10:46:25 [INFO] Parameter: version, Value: 0.0.1-SNAPSHOT
10:46:25 [INFO] project created from Old (1.x) Archetype in dir: /tmp/m2eclipse4520974403267063461test/external-archetype-project-1/external-archetype-project-1
10:46:28 [INFO] ----------------------------------------------------------------------------
10:46:28 [INFO] Using following parameters for creating project from Old (1.x) Archetype: maven-archetype-quickstart:1.1
10:46:28 [INFO] ----------------------------------------------------------------------------
10:46:28 [INFO] Parameter: basedir, Value: /tmp/m2eclipse4520974403267063461test/external-archetype-project-2
10:46:28 [INFO] Parameter: package, Value: jar
10:46:28 [INFO] Parameter: groupId, Value: external-archetype-project-2
10:46:28 [INFO] Parameter: artifactId, Value: external-archetype-project-2
10:46:28 [INFO] Parameter: packageName, Value: jar
10:46:28 [INFO] Parameter: version, Value: 0.0.1-SNAPSHOT
10:48:23 Tests run: 45, Failures: 0, Errors: 0, Skipped: 1, Time elapsed: 227.4 s - in org.eclipse.m2e.tests.BuildPathManagerTest
10:48:23 testDownloadSources_001_workspaceRestart(org.eclipse.m2e.tests.BuildPathManagerTest)  Time elapsed: 4.759 s
10:48:23 testEnableMavenNatureWithNoWorkspace(org.eclipse.m2e.tests.BuildPathManagerTest)  Time elapsed: 6.547 s
10:48:23 test385391_keepCustomSourceEncoding(org.eclipse.m2e.tests.BuildPathManagerTest)  Time elapsed: 3.536 s
10:48:23 testProjectImportWithProfile1(org.eclipse.m2e.tests.BuildPathManagerTest)  Time elapsed: 2.275 s
10:48:23 testProjectImportWithProfile2(org.eclipse.m2e.tests.BuildPathManagerTest)  Time elapsed: 2.345 s
10:48:23 testProjectNameWithNameTemplate(org.eclipse.m2e.tests.BuildPathManagerTest)  Time elapsed: 4.068 s
10:48:23 testProjectImport001_useMavenOutputFolders(org.eclipse.m2e.tests.BuildPathManagerTest)  Time elapsed: 1.938 s
10:48:23 testArchetypeProject(org.eclipse.m2e.tests.BuildPathManagerTest)  Time elapsed: 2.345 s
10:48:23 testClasspathOrderWorkspace001(org.eclipse.m2e.tests.BuildPathManagerTest)  Time elapsed: 3.583 s
10:48:23 testClasspathOrderWorkspace003(org.eclipse.m2e.tests.BuildPathManagerTest)  Time elapsed: 2.246 s
10:48:23 testDownloadSources_001_sourceAttachment(org.eclipse.m2e.tests.BuildPathManagerTest)  Time elapsed: 6.017 s
10:48:23 testMNGECLIPSE_2367_same_sources_resources(org.eclipse.m2e.tests.BuildPathManagerTest)  Time elapsed: 4.625 s
10:48:23 test360962_forbiddenReferencePreference(org.eclipse.m2e.tests.BuildPathManagerTest)  Time elapsed: 2.429 s
10:48:23 test388596_expandedSnapshotDependency(org.eclipse.m2e.tests.BuildPathManagerTest)  Time elapsed: 5.493 s
10:48:23 test359725_resourcesWorkspaceRoot(org.eclipse.m2e.tests.BuildPathManagerTest)  Time elapsed: 2.676 s
10:48:23 testClassifiers(org.eclipse.m2e.tests.BuildPathManagerTest)  Time elapsed: 4.527 s
10:48:23 test486721_overlappingResourceFolders(org.eclipse.m2e.tests.BuildPathManagerTest)  Time elapsed: 2.429 s
10:48:23 test005_dependencyAvailableFromLocalRepoAndWorkspace(org.eclipse.m2e.tests.BuildPathManagerTest)  Time elapsed: 3.243 s
10:48:23 testDisableMavenNature(org.eclipse.m2e.tests.BuildPathManagerTest)  Time elapsed: 3.74 s
10:48:23 testDownloadSources_001_basic(org.eclipse.m2e.tests.BuildPathManagerTest)  Time elapsed: 3.835 s
10:48:23 testDownloadSources_003_customRemoteRepository(org.eclipse.m2e.tests.BuildPathManagerTest)  Time elapsed: 2.528 s
10:48:23 _testProjectImport002_useMavenOutputFolders(org.eclipse.m2e.tests.BuildPathManagerTest) skipped
10:48:23 testMNGECLIPSE_2367_sources_encloses_resources(org.eclipse.m2e.tests.BuildPathManagerTest)  Time elapsed: 2.937 s
10:48:23 testDownloadSources_006_nonMavenProject(org.eclipse.m2e.tests.BuildPathManagerTest)  Time elapsed: 6.175 s
10:48:23 testCompilerSettings14(org.eclipse.m2e.tests.BuildPathManagerTest)  Time elapsed: 2.971 s
10:48:23 testSimpleProjectInExternalLocation(org.eclipse.m2e.tests.BuildPathManagerTest)  Time elapsed: 2.016 s
10:48:23 testDownloadSources_007_missingTestsSources(org.eclipse.m2e.tests.BuildPathManagerTest)  Time elapsed: 2.607 s
10:48:23 testMNGECLIPSE_696_compiler_includes_excludes(org.eclipse.m2e.tests.BuildPathManagerTest)  Time elapsed: 2.2 s
10:48:23 test431080_flatDirectoryLayout(org.eclipse.m2e.tests.BuildPathManagerTest)  Time elapsed: 4.24 s
10:48:23 testDownloadSources_005_classifier(org.eclipse.m2e.tests.BuildPathManagerTest)  Time elapsed: 3.918 s
10:48:23 testDownloadSources_008_fallbackToJavadocWhenMissingSources(org.eclipse.m2e.tests.BuildPathManagerTest)  Time elapsed: 6.418 s
10:48:23 testArchetypeProjectInExternalLocation(org.eclipse.m2e.tests.BuildPathManagerTest)  Time elapsed: 5.685 s
10:48:23 testMNGECLIPSE_2367_testSources_encloses_resources(org.eclipse.m2e.tests.BuildPathManagerTest)  Time elapsed: 4.379 s
10:48:23 testCompilerSettingsJsr14(org.eclipse.m2e.tests.BuildPathManagerTest)  Time elapsed: 2.434 s
10:48:23 testProjectNameTemplateWithProperties(org.eclipse.m2e.tests.BuildPathManagerTest)  Time elapsed: 4.983 s
10:48:23 testDownloadSources_002_javadoconly(org.eclipse.m2e.tests.BuildPathManagerTest)  Time elapsed: 12.056 s
10:48:23 testMavenBuilderOrder(org.eclipse.m2e.tests.BuildPathManagerTest)  Time elapsed: 10.005 s
10:48:23 testDownloadSources_004_testsClassifier(org.eclipse.m2e.tests.BuildPathManagerTest)  Time elapsed: 4.041 s
10:48:23 testEnableMavenNature(org.eclipse.m2e.tests.BuildPathManagerTest)  Time elapsed: 24.925 s
10:48:23 testProjectNameTemplate(org.eclipse.m2e.tests.BuildPathManagerTest)  Time elapsed: 20.319 s
10:48:23 testMNGECLIPSE_1047_localRepoPath(org.eclipse.m2e.tests.BuildPathManagerTest)  Time elapsed: 2.905 s
10:48:23 testCreateSimpleProject(org.eclipse.m2e.tests.BuildPathManagerTest)  Time elapsed: 7.358 s
10:48:23 testMNGECLIPSE_2433_resourcesOutsideBasdir(org.eclipse.m2e.tests.BuildPathManagerTest)  Time elapsed: 5.474 s
10:48:23 testUpdateProjectConfigurationWithWorkspace(org.eclipse.m2e.tests.BuildPathManagerTest)  Time elapsed: 10.914 s
10:48:23 test486721_sourceAndResourceUnderSameNonDefaultFolder(org.eclipse.m2e.tests.BuildPathManagerTest)  Time elapsed: 3.251 s
10:48:23 Running org.eclipse.m2e.tests.lifecycle.MavenPluginMetadataSourceTest
10:48:32 Tests run: 2, Failures: 0, Errors: 0, Skipped: 0, Time elapsed: 9.004 s - in org.eclipse.m2e.tests.lifecycle.MavenPluginMetadataSourceTest
10:48:32 testBasic(org.eclipse.m2e.tests.lifecycle.MavenPluginMetadataSourceTest)  Time elapsed: 3.961 s
10:48:32 test422135_mavenPluginSourceWorkspaceResolution(org.eclipse.m2e.tests.lifecycle.MavenPluginMetadataSourceTest)  Time elapsed: 5.042 s
10:48:32 Running org.eclipse.m2e.tests.lifecycle.PluginExecutionMetadataPrioritiesTest
10:49:08 Tests run: 8, Failures: 0, Errors: 0, Skipped: 0, Time elapsed: 36.094 s - in org.eclipse.m2e.tests.lifecycle.PluginExecutionMetadataPrioritiesTest
10:49:08 testWorkspaceOverridesEclipseExtensions(org.eclipse.m2e.tests.lifecycle.PluginExecutionMetadataPrioritiesTest)  Time elapsed: 3.244 s
10:49:08 testEclipseExtension(org.eclipse.m2e.tests.lifecycle.PluginExecutionMetadataPrioritiesTest)  Time elapsed: 6.06 s
10:49:08 testDefaultMetadataSource(org.eclipse.m2e.tests.lifecycle.PluginExecutionMetadataPrioritiesTest)  Time elapsed: 5.891 s
10:49:08 testPomOverridesWorkspace(org.eclipse.m2e.tests.lifecycle.PluginExecutionMetadataPrioritiesTest)  Time elapsed: 5.112 s
10:49:08 testEmbeddedInPom(org.eclipse.m2e.tests.lifecycle.PluginExecutionMetadataPrioritiesTest)  Time elapsed: 4.348 s
10:49:08 testReferencedFromPom(org.eclipse.m2e.tests.lifecycle.PluginExecutionMetadataPrioritiesTest)  Time elapsed: 2.853 s
10:49:08 testParent(org.eclipse.m2e.tests.lifecycle.PluginExecutionMetadataPrioritiesTest)  Time elapsed: 6.113 s
10:49:08 testWorkspace(org.eclipse.m2e.tests.lifecycle.PluginExecutionMetadataPrioritiesTest)  Time elapsed: 2.471 s
10:49:08 Running org.eclipse.m2e.tests.lifecycle.LifecycleComparisonTest
10:49:19 Tests run: 3, Failures: 0, Errors: 0, Skipped: 0, Time elapsed: 11.243 s - in org.eclipse.m2e.tests.lifecycle.LifecycleComparisonTest
10:49:19 testPluginConfigurationChange(org.eclipse.m2e.tests.lifecycle.LifecycleComparisonTest)  Time elapsed: 2.004 s
10:49:19 testSameProject(org.eclipse.m2e.tests.lifecycle.LifecycleComparisonTest)  Time elapsed: 1.76 s
10:49:19 testPluginVersionChange(org.eclipse.m2e.tests.lifecycle.LifecycleComparisonTest)  Time elapsed: 7.478 s
10:49:19 Running org.eclipse.m2e.tests.lifecycle.LifecycleMappingTest
10:51:04 running TEST_SECONDARY3
10:51:04 running TEST_SECONDARY4
10:51:04 running TEST_SECONDARY6
10:51:04 running TEST_SECONDARY5
10:57:39 Tests run: 35, Failures: 0, Errors: 0, Skipped: 0, Time elapsed: 499.641 s - in org.eclipse.m2e.tests.lifecycle.LifecycleMappingTest
10:57:39 testGetLifecycleMappingMetadata(org.eclipse.m2e.tests.lifecycle.LifecycleMappingTest)  Time elapsed: 2.788 s
10:57:39 test387736_missingAction(org.eclipse.m2e.tests.lifecycle.LifecycleMappingTest)  Time elapsed: 3.795 s
10:57:39 testProfilesAndProperties(org.eclipse.m2e.tests.lifecycle.LifecycleMappingTest)  Time elapsed: 5.33 s
10:57:39 testConfiguratorsFollowPhaseOrder(org.eclipse.m2e.tests.lifecycle.LifecycleMappingTest)  Time elapsed: 3.843 s
10:57:39 testSecondaryConfiguratorsCustom(org.eclipse.m2e.tests.lifecycle.LifecycleMappingTest)  Time elapsed: 4.301 s
10:57:39 testDuplicatePluginExecution1(org.eclipse.m2e.tests.lifecycle.LifecycleMappingTest)  Time elapsed: 2.403 s
10:57:39 testDuplicatePluginExecution2(org.eclipse.m2e.tests.lifecycle.LifecycleMappingTest)  Time elapsed: 64.284 s
10:57:39 testNondeafaultLifecycles(org.eclipse.m2e.tests.lifecycle.LifecycleMappingTest)  Time elapsed: 7.901 s
10:57:39 testOrder(org.eclipse.m2e.tests.lifecycle.LifecycleMappingTest)  Time elapsed: 12.053 s
10:57:39 testSetNoopMappingDuringImport(org.eclipse.m2e.tests.lifecycle.LifecycleMappingTest)  Time elapsed: 6.894 s
10:57:39 testUseDefaultLifecycleMappingMetadataSource(org.eclipse.m2e.tests.lifecycle.LifecycleMappingTest)  Time elapsed: 5.496 s
10:57:39 testNotCoveredMojoExecutionIgnored(org.eclipse.m2e.tests.lifecycle.LifecycleMappingTest)  Time elapsed: 23.988 s
10:57:39 testNonresolvableExecutionPlan(org.eclipse.m2e.tests.lifecycle.LifecycleMappingTest)  Time elapsed: 13.874 s
10:57:39 testFailToGetPluginParameterValue(org.eclipse.m2e.tests.lifecycle.LifecycleMappingTest)  Time elapsed: 10.102 s
10:57:39 testSetCustomizableMappingDuringImport(org.eclipse.m2e.tests.lifecycle.LifecycleMappingTest)  Time elapsed: 18.318 s
10:57:39 testSameConfiguratorUsedTwice(org.eclipse.m2e.tests.lifecycle.LifecycleMappingTest)  Time elapsed: 20.242 s
10:57:39 testUnknownPackagingType(org.eclipse.m2e.tests.lifecycle.LifecycleMappingTest)  Time elapsed: 11.457 s
10:57:39 testGetLifecycleMappingMetadataMerge(org.eclipse.m2e.tests.lifecycle.LifecycleMappingTest)  Time elapsed: 22.18 s
10:57:39 testSecondaryConfiguratorsCustomizable(org.eclipse.m2e.tests.lifecycle.LifecycleMappingTest)  Time elapsed: 21.11 s
10:57:39 testIncompatibleVersion(org.eclipse.m2e.tests.lifecycle.LifecycleMappingTest)  Time elapsed: 8.16 s
10:57:39 testCompatibleVersion(org.eclipse.m2e.tests.lifecycle.LifecycleMappingTest)  Time elapsed: 9.467 s
10:57:39 testLifecycleMappingSpecifiedInMetadata(org.eclipse.m2e.tests.lifecycle.LifecycleMappingTest)  Time elapsed: 26.57 s
10:57:39 testPomPackagingType(org.eclipse.m2e.tests.lifecycle.LifecycleMappingTest)  Time elapsed: 13.412 s
10:57:39 testNotCoveredMojoExecutions(org.eclipse.m2e.tests.lifecycle.LifecycleMappingTest)  Time elapsed: 14.291 s
10:57:39 test494858ProcessingInstructions(org.eclipse.m2e.tests.lifecycle.LifecycleMappingTest)  Time elapsed: 16.08 s
10:57:39 testPackagingTypeMismatch(org.eclipse.m2e.tests.lifecycle.LifecycleMappingTest)  Time elapsed: 17.279 s
10:57:39 testGetLifecycleMappingMetadataOverride(org.eclipse.m2e.tests.lifecycle.LifecycleMappingTest)  Time elapsed: 12.607 s
10:57:39 testMissingLifecycleMappingMetadata(org.eclipse.m2e.tests.lifecycle.LifecycleMappingTest)  Time elapsed: 12.018 s
10:57:39 testMissingMapping(org.eclipse.m2e.tests.lifecycle.LifecycleMappingTest)  Time elapsed: 11.817 s
10:57:39 testDefaultJarLifecycleMapping(org.eclipse.m2e.tests.lifecycle.LifecycleMappingTest)  Time elapsed: 42.297 s
10:57:39 testMissingVersionRangeInPluginExecutionFilter(org.eclipse.m2e.tests.lifecycle.LifecycleMappingTest)  Time elapsed: 8.003 s
10:57:39 testDuplicatePackagingTypeMetadata(org.eclipse.m2e.tests.lifecycle.LifecycleMappingTest)  Time elapsed: 7.102 s
10:57:39 test371618_NullLifecycleMappingPluginVersion(org.eclipse.m2e.tests.lifecycle.LifecycleMappingTest)  Time elapsed: 18.509 s
10:57:39 testNotCoveredMojoExecutionWarnings(org.eclipse.m2e.tests.lifecycle.LifecycleMappingTest)  Time elapsed: 11.834 s
10:57:39 testNotInterestingPhaseConfigurator(org.eclipse.m2e.tests.lifecycle.LifecycleMappingTest)  Time elapsed: 9.832 s
10:57:39 Running org.eclipse.m2e.tests.lifecycle.LifecycleMappingMetadataPrioritiesTest
10:58:45 Tests run: 5, Failures: 0, Errors: 0, Skipped: 0, Time elapsed: 65.916 s - in org.eclipse.m2e.tests.lifecycle.LifecycleMappingMetadataPrioritiesTest
10:58:45 testEclipseExtension(org.eclipse.m2e.tests.lifecycle.LifecycleMappingMetadataPrioritiesTest)  Time elapsed: 16.952 s
10:58:45 testDefaultMetadataSource(org.eclipse.m2e.tests.lifecycle.LifecycleMappingMetadataPrioritiesTest)  Time elapsed: 8.502 s
10:58:45 testEmbeddedInPom(org.eclipse.m2e.tests.lifecycle.LifecycleMappingMetadataPrioritiesTest)  Time elapsed: 12.623 s
10:58:45 testReferencedFromPom(org.eclipse.m2e.tests.lifecycle.LifecycleMappingMetadataPrioritiesTest)  Time elapsed: 9.974 s
10:58:45 testParent(org.eclipse.m2e.tests.lifecycle.LifecycleMappingMetadataPrioritiesTest)  Time elapsed: 17.863 s
10:58:45 Running org.eclipse.m2e.tests.lifecycle.PluginExecutionActionsTest
10:59:56 Tests run: 7, Failures: 0, Errors: 0, Skipped: 0, Time elapsed: 70.974 s - in org.eclipse.m2e.tests.lifecycle.PluginExecutionActionsTest
10:59:56 testMojoExecutionIgnore(org.eclipse.m2e.tests.lifecycle.PluginExecutionActionsTest)  Time elapsed: 13.269 s
10:59:56 testMojoExecutionErrorWithMessage(org.eclipse.m2e.tests.lifecycle.PluginExecutionActionsTest)  Time elapsed: 7.486 s
10:59:56 testMojoExecutionError(org.eclipse.m2e.tests.lifecycle.PluginExecutionActionsTest)  Time elapsed: 12.498 s
10:59:56 testMojoExecutionConfigurator(org.eclipse.m2e.tests.lifecycle.PluginExecutionActionsTest)  Time elapsed: 10.263 s
10:59:56 testMojoExecutionExecute(org.eclipse.m2e.tests.lifecycle.PluginExecutionActionsTest)  Time elapsed: 6.98 s
10:59:56 testMojoExecutionIgnoreWithMessage(org.eclipse.m2e.tests.lifecycle.PluginExecutionActionsTest)  Time elapsed: 11.728 s
10:59:56 testMojoExecutionExecuteWithMessage(org.eclipse.m2e.tests.lifecycle.PluginExecutionActionsTest)  Time elapsed: 8.75 s
10:59:56 Running org.eclipse.m2e.tests.launch.MavenLauncherConfigurationHandlerTest
11:00:06 Tests run: 1, Failures: 0, Errors: 0, Skipped: 0, Time elapsed: 10.27 s - in org.eclipse.m2e.tests.launch.MavenLauncherConfigurationHandlerTest
11:00:06 test421015_workspaceProjectLibraryClasspathEntries(org.eclipse.m2e.tests.launch.MavenLauncherConfigurationHandlerTest)  Time elapsed: 10.269 s
11:00:06 Running org.eclipse.m2e.tests.launch.MavenRuntimeClasspathProviderTest
11:01:32 Tests run: 7, Failures: 0, Errors: 0, Skipped: 0, Time elapsed: 85.96 s - in org.eclipse.m2e.tests.launch.MavenRuntimeClasspathProviderTest
11:01:32 testAddJUnit5DependenciesWithEngine(org.eclipse.m2e.tests.launch.MavenRuntimeClasspathProviderTest)  Time elapsed: 15.889 s
11:01:32 testClasspathScopeRuntime(org.eclipse.m2e.tests.launch.MavenRuntimeClasspathProviderTest)  Time elapsed: 12.17 s
11:01:32 testAddJUnit5DependenciesAPIOnlyDisabled(org.eclipse.m2e.tests.launch.MavenRuntimeClasspathProviderTest)  Time elapsed: 15.294 s
11:01:32 testAddJUnit5DependenciesWithLauncher(org.eclipse.m2e.tests.launch.MavenRuntimeClasspathProviderTest)  Time elapsed: 7.322 s
11:01:32 testClasspathScopeTest(org.eclipse.m2e.tests.launch.MavenRuntimeClasspathProviderTest)  Time elapsed: 7.911 s
11:01:32 testAddJUnit5DependenciesAggregator(org.eclipse.m2e.tests.launch.MavenRuntimeClasspathProviderTest)  Time elapsed: 18.009 s
11:01:32 testAddJUnit5DependenciesAPIOnly(org.eclipse.m2e.tests.launch.MavenRuntimeClasspathProviderTest)  Time elapsed: 9.364 s
11:01:32 Running org.eclipse.m2e.tests.launch.MavenLaunchDelegateTest
11:01:32 Tests run: 6, Failures: 0, Errors: 0, Skipped: 0, Time elapsed: 0.21 s - in org.eclipse.m2e.tests.launch.MavenLaunchDelegateTest
11:01:32 testGetVMArguments332WithParent(org.eclipse.m2e.tests.launch.MavenLaunchDelegateTest)  Time elapsed: 0.005 s
11:01:32 testGetVMArgumentsSubstituteMultiModuleDir(org.eclipse.m2e.tests.launch.MavenLaunchDelegateTest)  Time elapsed: 0.004 s
11:01:32 testUserSettingsProgramArguments(org.eclipse.m2e.tests.launch.MavenLaunchDelegateTest)  Time elapsed: 0.192 s
11:01:32 testGlobalSettingsProgramArguments(org.eclipse.m2e.tests.launch.MavenLaunchDelegateTest)  Time elapsed: 0.007 s
11:01:32 testGetVMArguments325(org.eclipse.m2e.tests.launch.MavenLaunchDelegateTest)  Time elapsed: 0 s
11:01:32 testGetVMArguments331(org.eclipse.m2e.tests.launch.MavenLaunchDelegateTest)  Time elapsed: 0 s
11:01:32 Running org.eclipse.m2e.tests.launch.LaunchingUtilsTest
11:01:40 Tests run: 1, Failures: 0, Errors: 0, Skipped: 0, Time elapsed: 7.523 s - in org.eclipse.m2e.tests.launch.LaunchingUtilsTest
11:01:40 testGenerateProjectLocationVariableExpression(org.eclipse.m2e.tests.launch.LaunchingUtilsTest)  Time elapsed: 7.523 s
11:01:40 Running org.eclipse.m2e.tests.ui.editing.AddDependencyOperationTest
11:01:40 Tests run: 5, Failures: 0, Errors: 0, Skipped: 0, Time elapsed: 0.025 s - in org.eclipse.m2e.tests.ui.editing.AddDependencyOperationTest
11:01:40 testNoDependenciesElement(org.eclipse.m2e.tests.ui.editing.AddDependencyOperationTest)  Time elapsed: 0.008 s
11:01:40 testEmptyDependenciesElement(org.eclipse.m2e.tests.ui.editing.AddDependencyOperationTest)  Time elapsed: 0.004 s
11:01:40 testDuplicatedDependency(org.eclipse.m2e.tests.ui.editing.AddDependencyOperationTest)  Time elapsed: 0.001 s
11:01:40 testWithDependencies(org.eclipse.m2e.tests.ui.editing.AddDependencyOperationTest)  Time elapsed: 0.003 s
11:01:40 testExclusionsAdded(org.eclipse.m2e.tests.ui.editing.AddDependencyOperationTest)  Time elapsed: 0.007 s
11:01:40 Running org.eclipse.m2e.tests.ui.editing.AddExclusionOperationTest
11:01:40 Tests run: 6, Failures: 0, Errors: 0, Skipped: 0, Time elapsed: 0.009 s - in org.eclipse.m2e.tests.ui.editing.AddExclusionOperationTest
11:01:40 testAddExclusion(org.eclipse.m2e.tests.ui.editing.AddExclusionOperationTest)  Time elapsed: 0.004 s
11:01:40 testAddExclusion_existingExclusion(org.eclipse.m2e.tests.ui.editing.AddExclusionOperationTest)  Time elapsed: 0.003 s
11:01:40 testAddExclusion_duplicateExclusion(org.eclipse.m2e.tests.ui.editing.AddExclusionOperationTest)  Time elapsed: 0 s
11:01:40 testMissingDependency_withDependencies(org.eclipse.m2e.tests.ui.editing.AddExclusionOperationTest)  Time elapsed: 0 s
11:01:40 testMissingDependency_emptyDependenciesElement(org.eclipse.m2e.tests.ui.editing.AddExclusionOperationTest)  Time elapsed: 0.001 s
11:01:40 testMissingDependency_noDependenciesElement(org.eclipse.m2e.tests.ui.editing.AddExclusionOperationTest)  Time elapsed: 0 s
11:01:40 Running org.eclipse.m2e.tests.ui.editing.PomHelperTest
11:01:40 Tests run: 7, Failures: 0, Errors: 0, Skipped: 0, Time elapsed: 0.012 s - in org.eclipse.m2e.tests.ui.editing.PomHelperTest
11:01:40 testCreateDependencyInEmptyList(org.eclipse.m2e.tests.ui.editing.PomHelperTest)  Time elapsed: 0.003 s
11:01:40 testCreatePlugin(org.eclipse.m2e.tests.ui.editing.PomHelperTest)  Time elapsed: 0.003 s
11:01:40 testFindDependencies(org.eclipse.m2e.tests.ui.editing.PomHelperTest)  Time elapsed: 0 s
11:01:40 testFindDependenciesMissing(org.eclipse.m2e.tests.ui.editing.PomHelperTest)  Time elapsed: 0.001 s
11:01:40 testCreatePluginInEmptyList(org.eclipse.m2e.tests.ui.editing.PomHelperTest)  Time elapsed: 0.002 s
11:01:40 testCreateDependency(org.eclipse.m2e.tests.ui.editing.PomHelperTest)  Time elapsed: 0.003 s
11:01:40 testFindDependency(org.eclipse.m2e.tests.ui.editing.PomHelperTest)  Time elapsed: 0 s
11:01:40 Running org.eclipse.m2e.tests.ui.editing.PomEditsTest
11:01:40 Tests run: 5, Failures: 0, Errors: 0, Skipped: 0, Time elapsed: 0.005 s - in org.eclipse.m2e.tests.ui.editing.PomEditsTest
11:01:40 testFindChildren(org.eclipse.m2e.tests.ui.editing.PomEditsTest)  Time elapsed: 0.001 s
11:01:40 testRemoveChild(org.eclipse.m2e.tests.ui.editing.PomEditsTest)  Time elapsed: 0.002 s
11:01:40 testMatchers(org.eclipse.m2e.tests.ui.editing.PomEditsTest)  Time elapsed: 0.001 s
11:01:40 testFindChild(org.eclipse.m2e.tests.ui.editing.PomEditsTest)  Time elapsed: 0.001 s
11:01:40 testRemoveIfNoChildElement(org.eclipse.m2e.tests.ui.editing.PomEditsTest)  Time elapsed: 0 s
11:01:40 Running org.eclipse.m2e.tests.ui.editing.RemoveDependencyOperationTest
11:01:40 Tests run: 4, Failures: 0, Errors: 0, Skipped: 0, Time elapsed: 0.002 s - in org.eclipse.m2e.tests.ui.editing.RemoveDependencyOperationTest
11:01:40 testMissingDependency_withDependencies(org.eclipse.m2e.tests.ui.editing.RemoveDependencyOperationTest)  Time elapsed: 0 s
11:01:40 testRemoveDependency(org.eclipse.m2e.tests.ui.editing.RemoveDependencyOperationTest)  Time elapsed: 0.001 s
11:01:40 testMissingDependency_emptyDependenciesElement(org.eclipse.m2e.tests.ui.editing.RemoveDependencyOperationTest)  Time elapsed: 0 s
11:01:40 testMissingDependency_noDependenciesElement(org.eclipse.m2e.tests.ui.editing.RemoveDependencyOperationTest)  Time elapsed: 0 s
11:01:40 Running org.eclipse.m2e.tests.ui.OpenPomActionTest
11:02:13 Tests run: 1, Failures: 0, Errors: 0, Skipped: 0, Time elapsed: 33.546 s - in org.eclipse.m2e.tests.ui.OpenPomActionTest
11:02:13 test454759_openEditor(org.eclipse.m2e.tests.ui.OpenPomActionTest)  Time elapsed: 33.545 s
11:02:13 Running org.eclipse.m2e.tests.ui.MavenPropertyTesterTest
11:02:27 Tests run: 1, Failures: 0, Errors: 0, Skipped: 0, Time elapsed: 13.587 s - in org.eclipse.m2e.tests.ui.MavenPropertyTesterTest
11:02:27 testIsBuildDirectory(org.eclipse.m2e.tests.ui.MavenPropertyTesterTest)  Time elapsed: 13.586 s
11:02:27 Running org.eclipse.m2e.tests.archetype.ArchetypeUtilTest
11:02:27 Tests run: 2, Failures: 0, Errors: 0, Skipped: 0, Time elapsed: 0.001 s - in org.eclipse.m2e.tests.archetype.ArchetypeUtilTest
11:02:27 testAreEqual(org.eclipse.m2e.tests.archetype.ArchetypeUtilTest)  Time elapsed: 0.001 s
11:02:27 testGetHashCode(org.eclipse.m2e.tests.archetype.ArchetypeUtilTest)  Time elapsed: 0 s
11:02:27 Running org.eclipse.m2e.tests.archetype.ArchetypeManagerTest
11:02:36 Tests run: 12, Failures: 0, Errors: 0, Skipped: 0, Time elapsed: 8.876 s - in org.eclipse.m2e.tests.archetype.ArchetypeManagerTest
11:02:36 test371775_archetypeRepoAuthentication(org.eclipse.m2e.tests.archetype.ArchetypeManagerTest)  Time elapsed: 0.005 s
11:02:36 testEmbeddedLocalArchetypeCatalogFactory(org.eclipse.m2e.tests.archetype.ArchetypeManagerTest)  Time elapsed: 0.001 s
11:02:36 testArchetypeManagerSaveRestore(org.eclipse.m2e.tests.archetype.ArchetypeManagerTest)  Time elapsed: 0.566 s
11:02:36 testRepositoryUrlFromRemoteArchetypeCatalogs(org.eclipse.m2e.tests.archetype.ArchetypeManagerTest)  Time elapsed: 0.011 s
11:02:36 testArchetypeManager(org.eclipse.m2e.tests.archetype.ArchetypeManagerTest)  Time elapsed: 5.788 s
11:02:36 testAddRemoteCatalog(org.eclipse.m2e.tests.archetype.ArchetypeManagerTest)  Time elapsed: 0.013 s
11:02:36 testActiveArchetypeCatalogs(org.eclipse.m2e.tests.archetype.ArchetypeManagerTest)  Time elapsed: 2.227 s
11:02:36 testBadLocalArchetypeCatalogFactory(org.eclipse.m2e.tests.archetype.ArchetypeManagerTest)  Time elapsed: 0.001 s
11:02:36 testRemoteArchetypeCatalogFactory(org.eclipse.m2e.tests.archetype.ArchetypeManagerTest)  Time elapsed: 0 s
11:02:36 test359855_localArchetypeWithProperties(org.eclipse.m2e.tests.archetype.ArchetypeManagerTest)  Time elapsed: 0.044 s
11:02:36 testLocalArchetypeCatalogFactory(org.eclipse.m2e.tests.archetype.ArchetypeManagerTest)  Time elapsed: 0 s
11:02:36 test387784_remoteArchetypeWithProperties(org.eclipse.m2e.tests.archetype.ArchetypeManagerTest)  Time elapsed: 0.218 s
11:02:36 Running org.eclipse.m2e.tests.ProjectConfigurationManagerTest
11:05:32 [INFO] ----------------------------------------------------------------------------
11:05:32 [INFO] Using following parameters for creating project from Archetype: mngeclipse-2110:1.0
11:05:32 [INFO] ----------------------------------------------------------------------------
11:05:32 [INFO] Parameter: groupId, Value: mngeclipse-2110
11:05:32 [INFO] Parameter: artifactId, Value: mngeclipse-2110
11:05:32 [INFO] Parameter: version, Value: 0.0.1-SNAPSHOT
11:05:32 [INFO] Parameter: package, Value: jar
11:05:32 [INFO] Parameter: packageInPathFormat, Value: jar
11:05:32 [INFO] project created from Archetype in dir: /home/jenkins/agent/workspace/m2e-sonarqube/m2e-core-tests/org.eclipse.m2e.tests/target/work/data/mngeclipse-2110
11:08:40 [INFO] ----------------------------------------------------------------------------
11:08:40 [INFO] Using following parameters for creating project from Old (1.x) Archetype: maven-archetype-quickstart:1.1
11:08:40 [INFO] ----------------------------------------------------------------------------
11:08:40 [INFO] Parameter: basedir, Value: /home/jenkins/agent/workspace/m2e-sonarqube/m2e-core-tests/org.eclipse.m2e.tests/target/work/data/parent002
11:08:40 [INFO] Parameter: package, Value: jar
11:08:40 [INFO] Parameter: groupId, Value: archetyped
11:08:40 [INFO] Parameter: artifactId, Value: archetyped
11:08:40 [INFO] Parameter: packageName, Value: jar
11:08:40 [INFO] Parameter: version, Value: 0.0.1-SNAPSHOT
11:08:40 [INFO] project created from Old (1.x) Archetype in dir: /home/jenkins/agent/workspace/m2e-sonarqube/m2e-core-tests/org.eclipse.m2e.tests/target/work/data/parent002/archetyped
11:12:32 Tests run: 23, Failures: 0, Errors: 0, Skipped: 0, Time elapsed: 596.423 s - in org.eclipse.m2e.tests.ProjectConfigurationManagerTest
11:12:32 testAddRemoveMavenBuilder(org.eclipse.m2e.tests.ProjectConfigurationManagerTest)  Time elapsed: 11.751 s
11:12:32 testImportJavaProjectWithUnknownPackaging(org.eclipse.m2e.tests.ProjectConfigurationManagerTest)  Time elapsed: 17.071 s
11:12:32 testHiddenFolderForSimpleModule(org.eclipse.m2e.tests.ProjectConfigurationManagerTest)  Time elapsed: 27.212 s
11:12:32 testConfigureProjectEncodingForBasicProject(org.eclipse.m2e.tests.ProjectConfigurationManagerTest)  Time elapsed: 12.196 s
11:12:32 testAddRemoveMavenBuilderDisabled(org.eclipse.m2e.tests.ProjectConfigurationManagerTest)  Time elapsed: 4.038 s
11:12:32 testExtractionOfCompilerSettingsDespiteErrorsInExecutionPlan(org.eclipse.m2e.tests.ProjectConfigurationManagerTest)  Time elapsed: 15.003 s
11:12:32 testRevertToContainerDefinedEncoding(org.eclipse.m2e.tests.ProjectConfigurationManagerTest)  Time elapsed: 5.819 s
11:12:32 testIgnoreStaleProjectConfiguration(org.eclipse.m2e.tests.ProjectConfigurationManagerTest)  Time elapsed: 9.803 s
11:12:32 test397251_forcePluginResolutionUpdate(org.eclipse.m2e.tests.ProjectConfigurationManagerTest)  Time elapsed: 71.433 s
11:12:32 testResolutionOfArchetypeFromRepository(org.eclipse.m2e.tests.ProjectConfigurationManagerTest)  Time elapsed: 133.038 s
11:12:32 testStaleProjectConfigurationMarkerAfterFixingMissingBuildExtension(org.eclipse.m2e.tests.ProjectConfigurationManagerTest)  Time elapsed: 23.723 s
11:12:32 test447460MultipleUpdateConfiguration(org.eclipse.m2e.tests.ProjectConfigurationManagerTest)  Time elapsed: 23.595 s
11:12:32 testHiddenFolderForArchetypeModule(org.eclipse.m2e.tests.ProjectConfigurationManagerTest)  Time elapsed: 17.936 s
11:12:32 testStaleProjectConfigurationMarkerAfterWorkspaceRestart(org.eclipse.m2e.tests.ProjectConfigurationManagerTest)  Time elapsed: 23.248 s
11:12:32 testStaleProjectConfigurationWarningMarker(org.eclipse.m2e.tests.ProjectConfigurationManagerTest)  Time elapsed: 14.499 s
11:12:32 testAutomaticUpdateProjectConfigurationMarker(org.eclipse.m2e.tests.ProjectConfigurationManagerTest)  Time elapsed: 57.915 s
11:12:32 test473953_ProjectCreationListener(org.eclipse.m2e.tests.ProjectConfigurationManagerTest)  Time elapsed: 20.452 s
11:12:32 testWorkspaceResolutionOfInterModuleDependenciesDuringImport(org.eclipse.m2e.tests.ProjectConfigurationManagerTest)  Time elapsed: 40.664 s
11:12:32 testBasedirRenameRequired(org.eclipse.m2e.tests.ProjectConfigurationManagerTest)  Time elapsed: 27.057 s
11:12:32 testStaleProjectConfigurationMarker(org.eclipse.m2e.tests.ProjectConfigurationManagerTest)  Time elapsed: 11.347 s
11:12:32 testKeepEncodingSetByUserForSubfoldersAndFiles(org.eclipse.m2e.tests.ProjectConfigurationManagerTest)  Time elapsed: 8.166 s
11:12:32 testBasedirRenameNo(org.eclipse.m2e.tests.ProjectConfigurationManagerTest)  Time elapsed: 10.583 s
11:12:32 testBasicUpdateConfiguration(org.eclipse.m2e.tests.ProjectConfigurationManagerTest)  Time elapsed: 9.869 s
11:12:32 Running org.eclipse.m2e.tests.ProfileSupportTest
11:12:39 Tests run: 1, Failures: 0, Errors: 0, Skipped: 0, Time elapsed: 6.623 s - in org.eclipse.m2e.tests.ProfileSupportTest
11:12:39 test337353_deactivateProfile(org.eclipse.m2e.tests.ProfileSupportTest)  Time elapsed: 6.622 s
11:12:39 Running org.eclipse.m2e.tests.JavaUtilTest
11:12:39 Tests run: 1, Failures: 0, Errors: 0, Skipped: 0, Time elapsed: 0.004 s - in org.eclipse.m2e.tests.JavaUtilTest
11:12:39 testGetDefaultJavaPackage(org.eclipse.m2e.tests.JavaUtilTest)  Time elapsed: 0.004 s
11:12:39 Running org.eclipse.m2e.tests.ProjectRegistryManagerTest
11:17:33 Tests run: 50, Failures: 0, Errors: 0, Skipped: 1, Time elapsed: 294.486 s - in org.eclipse.m2e.tests.ProjectRegistryManagerTest
11:17:33 test020_moduleWithPomErrors(org.eclipse.m2e.tests.ProjectRegistryManagerTest)  Time elapsed: 10.02 s
11:17:33 test356645_redundantSnapshotResolution(org.eclipse.m2e.tests.ProjectRegistryManagerTest)  Time elapsed: 10.275 s
11:17:33 test000_pom_simple(org.eclipse.m2e.tests.ProjectRegistryManagerTest)  Time elapsed: 5.958 s
11:17:33 test008_staleMissingParent(org.eclipse.m2e.tests.ProjectRegistryManagerTest)  Time elapsed: 5.586 s
11:17:33 _testExtensionPluginResolution(org.eclipse.m2e.tests.ProjectRegistryManagerTest) skipped
11:17:33 test435692_affected_changes(org.eclipse.m2e.tests.ProjectRegistryManagerTest)  Time elapsed: 8.559 s
11:17:33 test007_staleDependencies(org.eclipse.m2e.tests.ProjectRegistryManagerTest)  Time elapsed: 4.105 s
11:17:33 test001_missingParent(org.eclipse.m2e.tests.ProjectRegistryManagerTest)  Time elapsed: 3.062 s
11:17:33 testWorkspaceDependencyVersionRange(org.eclipse.m2e.tests.ProjectRegistryManagerTest)  Time elapsed: 4.079 s
11:17:33 test000_removeClosed(org.eclipse.m2e.tests.ProjectRegistryManagerTest)  Time elapsed: 4.017 s
11:17:33 test013_missingDependencyMarker(org.eclipse.m2e.tests.ProjectRegistryManagerTest)  Time elapsed: 3.642 s
11:17:33 test436929_import_refresh(org.eclipse.m2e.tests.ProjectRegistryManagerTest)  Time elapsed: 4.706 s
11:17:33 testGlobalUpdatePolicyNever(org.eclipse.m2e.tests.ProjectRegistryManagerTest)  Time elapsed: 6.137 s
11:17:33 testRepositoryMetadataCacheUsed(org.eclipse.m2e.tests.ProjectRegistryManagerTest)  Time elapsed: 3.963 s
11:17:33 test008_staleMissingParent2(org.eclipse.m2e.tests.ProjectRegistryManagerTest)  Time elapsed: 6.09 s
11:17:33 test015_refreshOffline(org.eclipse.m2e.tests.ProjectRegistryManagerTest)  Time elapsed: 2.574 s
11:17:33 test017_moduleRefresh(org.eclipse.m2e.tests.ProjectRegistryManagerTest)  Time elapsed: 3.292 s
11:17:33 test000_simple(org.eclipse.m2e.tests.ProjectRegistryManagerTest)  Time elapsed: 3.175 s
11:17:33 test005_dependencyAvailableFromLocalRepoAndWorkspace(org.eclipse.m2e.tests.ProjectRegistryManagerTest)  Time elapsed: 4.9 s
11:17:33 test463075_extensionAndPluginRealm(org.eclipse.m2e.tests.ProjectRegistryManagerTest)  Time elapsed: 2.695 s
11:17:33 testPropertiesSubstitution(org.eclipse.m2e.tests.ProjectRegistryManagerTest)  Time elapsed: 5.284 s
11:17:33 test000_deletePom(org.eclipse.m2e.tests.ProjectRegistryManagerTest)  Time elapsed: 2.91 s
11:17:33 test006_parentAvailableFromLocalRepoAndWorkspace(org.eclipse.m2e.tests.ProjectRegistryManagerTest)  Time elapsed: 1.753 s
11:17:33 test005_snapshotAvailableFromLocalRepoAndWorkspace(org.eclipse.m2e.tests.ProjectRegistryManagerTest)  Time elapsed: 3.384 s
11:17:33 test007_changedVersion(org.eclipse.m2e.tests.ProjectRegistryManagerTest)  Time elapsed: 3.215 s
11:17:33 test000_eventMerge(org.eclipse.m2e.tests.ProjectRegistryManagerTest)  Time elapsed: 3.778 s
11:17:33 testWorkspaceResolutionApi(org.eclipse.m2e.tests.ProjectRegistryManagerTest)  Time elapsed: 4.598 s
11:17:33 testOptionalDependencies(org.eclipse.m2e.tests.ProjectRegistryManagerTest)  Time elapsed: 6.578 s
11:17:33 test460983_parentVersionRange(org.eclipse.m2e.tests.ProjectRegistryManagerTest)  Time elapsed: 5.488 s
11:17:33 test009_noworkspaceResolution(org.eclipse.m2e.tests.ProjectRegistryManagerTest)  Time elapsed: 5.07 s
11:17:33 test001_dependencyOnModuleWithInheritedGroupAndVersion(org.eclipse.m2e.tests.ProjectRegistryManagerTest)  Time elapsed: 13.118 s
11:17:33 testDependencyScopeChanged(org.eclipse.m2e.tests.ProjectRegistryManagerTest)  Time elapsed: 9.846 s
11:17:33 test007_newTransitiveDependency(org.eclipse.m2e.tests.ProjectRegistryManagerTest)  Time elapsed: 5.593 s
11:17:33 testCorrelatedMissingDependency(org.eclipse.m2e.tests.ProjectRegistryManagerTest)  Time elapsed: 3.419 s
11:17:33 test013_cantParsePomMarker(org.eclipse.m2e.tests.ProjectRegistryManagerTest)  Time elapsed: 3.566 s
11:17:33 test006_parentAvailableFromLocalRepoAndWorkspace01(org.eclipse.m2e.tests.ProjectRegistryManagerTest)  Time elapsed: 4.015 s
11:17:33 testPluginMainArtifactNotResolvedFromWorkspace(org.eclipse.m2e.tests.ProjectRegistryManagerTest)  Time elapsed: 4.522 s
11:17:33 test000_removeDeleted(org.eclipse.m2e.tests.ProjectRegistryManagerTest)  Time elapsed: 12.925 s
11:17:33 testEnvironmentVariablesConsidered(org.eclipse.m2e.tests.ProjectRegistryManagerTest)  Time elapsed: 6.309 s
11:17:33 test441257_stalePluginRealms(org.eclipse.m2e.tests.ProjectRegistryManagerTest)  Time elapsed: 5.349 s
11:17:33 test418674_ChecksumPolicyFail(org.eclipse.m2e.tests.ProjectRegistryManagerTest)  Time elapsed: 4.151 s
11:17:33 test418674_ChecksumPolicyWarn(org.eclipse.m2e.tests.ProjectRegistryManagerTest)  Time elapsed: 5.827 s
11:17:33 test021_dependencyVersionRange(org.eclipse.m2e.tests.ProjectRegistryManagerTest)  Time elapsed: 6.566 s
11:17:33 test405090_staleBuildExtensionsResolutionError(org.eclipse.m2e.tests.ProjectRegistryManagerTest)  Time elapsed: 15.161 s
11:17:33 test007_dependentRefreshAfterWorkspaceRestart(org.eclipse.m2e.tests.ProjectRegistryManagerTest)  Time elapsed: 5.472 s
11:17:33 testJdkProfileActivation(org.eclipse.m2e.tests.ProjectRegistryManagerTest)  Time elapsed: 4.609 s
11:17:33 test022_noChangeReloadWithUnrelatedRemoveProject(org.eclipse.m2e.tests.ProjectRegistryManagerTest)  Time elapsed: 13.077 s
11:17:33 test012_downloadExternalDependency(org.eclipse.m2e.tests.ProjectRegistryManagerTest)  Time elapsed: 3.866 s
11:17:33 test441257_stalePluginRealms_withParent(org.eclipse.m2e.tests.ProjectRegistryManagerTest)  Time elapsed: 5.106 s
11:17:33 test453995_dependencyManagementVersionless(org.eclipse.m2e.tests.ProjectRegistryManagerTest)  Time elapsed: 23.091 s
11:17:33 Running org.eclipse.m2e.tests.builder.BuildContextLifecycleTest
11:18:03 Tests run: 1, Failures: 0, Errors: 0, Skipped: 0, Time elapsed: 29.614 s - in org.eclipse.m2e.tests.builder.BuildContextLifecycleTest
11:18:03 testBuildContextRefreshProject(org.eclipse.m2e.tests.builder.BuildContextLifecycleTest)  Time elapsed: 29.613 s
11:18:03 Running org.eclipse.m2e.tests.builder.EclipseBuildContextTest
11:18:35 Tests run: 2, Failures: 0, Errors: 0, Skipped: 0, Time elapsed: 32.159 s - in org.eclipse.m2e.tests.builder.EclipseBuildContextTest
11:18:35 testScanner(org.eclipse.m2e.tests.builder.EclipseBuildContextTest)  Time elapsed: 15.531 s
11:18:35 test361038_buildContext_scan_nonExistingFolder(org.eclipse.m2e.tests.builder.EclipseBuildContextTest)  Time elapsed: 16.627 s
11:18:35 Running org.eclipse.m2e.tests.builder.MavenBuilderTest
11:20:23 Tests run: 14, Failures: 0, Errors: 0, Skipped: 2, Time elapsed: 107.916 s - in org.eclipse.m2e.tests.builder.MavenBuilderTest
11:20:23 test005_pomChanged(org.eclipse.m2e.tests.builder.MavenBuilderTest)  Time elapsed: 7.233 s
11:20:23 test007_refreshChangedPom(org.eclipse.m2e.tests.builder.MavenBuilderTest)  Time elapsed: 10.281 s
11:20:23 _test006_testPluginProperties(org.eclipse.m2e.tests.builder.MavenBuilderTest) skipped
11:20:23 test397251_malformedPom(org.eclipse.m2e.tests.builder.MavenBuilderTest)  Time elapsed: 6.296 s
11:20:23 test422106_legacyPlexusUtils(org.eclipse.m2e.tests.builder.MavenBuilderTest)  Time elapsed: 5.9 s
11:20:23 test004_useMavenOutputFolders(org.eclipse.m2e.tests.builder.MavenBuilderTest)  Time elapsed: 8.675 s
11:20:23 test002_customResourceLocation(org.eclipse.m2e.tests.builder.MavenBuilderTest)  Time elapsed: 8.351 s
11:20:23 test001_standardLayout(org.eclipse.m2e.tests.builder.MavenBuilderTest)  Time elapsed: 8.363 s
11:20:23 test_crossproject(org.eclipse.m2e.tests.builder.MavenBuilderTest)  Time elapsed: 10.191 s
11:20:23 test380096_cleanProjectWithLifecycleMappingProblemsAfterWorkspaceRestart(org.eclipse.m2e.tests.builder.MavenBuilderTest)  Time elapsed: 8.699 s
11:20:23 test010_properties(org.eclipse.m2e.tests.builder.MavenBuilderTest)  Time elapsed: 13.118 s
11:20:23 _test008_classpathChange(org.eclipse.m2e.tests.builder.MavenBuilderTest) skipped
11:20:23 test368380_buildContextDeepRefreshFromLocal(org.eclipse.m2e.tests.builder.MavenBuilderTest)  Time elapsed: 12.808 s
11:20:23 test013_refreshFixedPom(org.eclipse.m2e.tests.builder.MavenBuilderTest)  Time elapsed: 7.998 s
11:20:23 Running org.eclipse.m2e.tests.builder.EclipseIncrementalBuildContextTest
11:20:37 Tests run: 1, Failures: 0, Errors: 0, Skipped: 0, Time elapsed: 14.043 s - in org.eclipse.m2e.tests.builder.EclipseIncrementalBuildContextTest
11:20:37 testScanner(org.eclipse.m2e.tests.builder.EclipseIncrementalBuildContextTest)  Time elapsed: 14.043 s
11:20:37 Running org.eclipse.m2e.tests.properties.MavenPropertiesTest
11:20:54 Tests run: 2, Failures: 0, Errors: 0, Skipped: 0, Time elapsed: 17.122 s - in org.eclipse.m2e.tests.properties.MavenPropertiesTest
11:20:54 testBuildingProjectWithProperties(org.eclipse.m2e.tests.properties.MavenPropertiesTest)  Time elapsed: 10.614 s
11:20:54 testReadResolverConfigurationProperties(org.eclipse.m2e.tests.properties.MavenPropertiesTest)  Time elapsed: 6.507 s
11:20:54 Running org.eclipse.m2e.tests.MutableProjectRegistryTest
11:21:50 Tests run: 8, Failures: 0, Errors: 0, Skipped: 0, Time elapsed: 55.367 s - in org.eclipse.m2e.tests.MutableProjectRegistryTest
11:21:50 testRemoveProject(org.eclipse.m2e.tests.MutableProjectRegistryTest)  Time elapsed: 11.028 s
11:21:50 testReplaceProject(org.eclipse.m2e.tests.MutableProjectRegistryTest)  Time elapsed: 6.917 s
11:21:50 testIllegalStateMerge(org.eclipse.m2e.tests.MutableProjectRegistryTest)  Time elapsed: 6.768 s
11:21:50 testForeignClassesInSerializedProjectRegistry(org.eclipse.m2e.tests.MutableProjectRegistryTest)  Time elapsed: 13.058 s
11:21:50 testDetectNoLongerExistingProjectsInWorkspaceState(org.eclipse.m2e.tests.MutableProjectRegistryTest)  Time elapsed: 7.324 s
11:21:50 testAddProject(org.eclipse.m2e.tests.MutableProjectRegistryTest)  Time elapsed: 3.364 s
11:21:50 testSaveParticipant(org.eclipse.m2e.tests.MutableProjectRegistryTest)  Time elapsed: 3.295 s
11:21:50 testRemoveUnknownProject(org.eclipse.m2e.tests.MutableProjectRegistryTest)  Time elapsed: 3.612 s
11:21:50 Running org.eclipse.m2e.tests.ResourceChangeListenerTest
11:23:36 Tests run: 7, Failures: 1, Errors: 0, Skipped: 0, Time elapsed: 106.299 s <<< FAILURE! - in org.eclipse.m2e.tests.ResourceChangeListenerTest
11:23:36 testPomChanges(org.eclipse.m2e.tests.ResourceChangeListenerTest)  Time elapsed: 25.394 s
11:23:36 testMarkerOnlyChange(org.eclipse.m2e.tests.ResourceChangeListenerTest)  Time elapsed: 11.587 s
11:23:36 testPomMove001(org.eclipse.m2e.tests.ResourceChangeListenerTest)  Time elapsed: 13.816 s
11:23:36 testPomMove002(org.eclipse.m2e.tests.ResourceChangeListenerTest)  Time elapsed: 12.968 s
11:23:36 testProjectDelete(org.eclipse.m2e.tests.ResourceChangeListenerTest)  Time elapsed: 13.528 s  <<< FAILURE!
11:23:36 java.lang.AssertionError: expected:<1> but was:<5>
11:23:36 	at org.eclipse.m2e.tests.ResourceChangeListenerTest.testProjectDelete(ResourceChangeListenerTest.java:178)
11:23:36 
11:23:36 testPomDelete(org.eclipse.m2e.tests.ResourceChangeListenerTest)  Time elapsed: 15.518 s
11:23:36 testPomRename(org.eclipse.m2e.tests.ResourceChangeListenerTest)  Time elapsed: 13.486 s
11:23:36 Running org.eclipse.m2e.tests.ProjectRegistryRefreshJobTest
11:26:37 Terminating xvnc.
11:26:38 [INFO] 
11:26:38 [INFO] ------------< org.eclipse.m2e:org.eclipse.m2e.editor.tests >------------
11:26:38 [INFO] Building Maven Integration for Eclipse POM Editor tests 1.16.0-SNAPSHOT [39/40]
11:26:38 [INFO] ------------------------[ eclipse-test-plugin ]-------------------------
11:26:38 [INFO] 
11:26:38 [INFO] --- maven-clean-plugin:2.4.1:clean (default-clean) @ org.eclipse.m2e.editor.tests ---
11:26:38 [INFO] 
11:26:38 [INFO] --- tycho-packaging-plugin:1.6.0:build-qualifier (default-build-qualifier) @ org.eclipse.m2e.editor.tests ---
11:27:20 Build was aborted
11:27:20 Aborted by Mickael Istria
11:27:20 Recording test results
11:27:20 Archiving artifacts
11:27:25 Finished: ABORTED