FailedConsole Output

Skipping 2,591 KB.. Full Log
 /home/jenkins/agent/workspace/m2e-sonarqube/.repository/org/eclipse/m2e/org.eclipse.m2e.sdk.feature/1.16.0-SNAPSHOT/org.eclipse.m2e.sdk.feature-1.16.0-SNAPSHOT.pom
10:07:28 [INFO] Installing /home/jenkins/agent/workspace/m2e-sonarqube/org.eclipse.m2e.sdk.feature/target/p2content.xml to /home/jenkins/agent/workspace/m2e-sonarqube/.repository/org/eclipse/m2e/org.eclipse.m2e.sdk.feature/1.16.0-SNAPSHOT/org.eclipse.m2e.sdk.feature-1.16.0-SNAPSHOT-p2metadata.xml
10:07:29 [INFO] Installing /home/jenkins/agent/workspace/m2e-sonarqube/org.eclipse.m2e.sdk.feature/target/p2artifacts.xml to /home/jenkins/agent/workspace/m2e-sonarqube/.repository/org/eclipse/m2e/org.eclipse.m2e.sdk.feature/1.16.0-SNAPSHOT/org.eclipse.m2e.sdk.feature-1.16.0-SNAPSHOT-p2artifacts.xml
10:07:29 [INFO] 
10:07:29 [INFO] --- tycho-p2-plugin:1.6.0:update-local-index (default-update-local-index) @ org.eclipse.m2e.sdk.feature ---
10:07:29 [INFO] 
10:07:29 [INFO] ----------< org.eclipse.m2e:org.eclipse.m2e.logback.feature >-----------
10:07:29 [INFO] Building Maven Integration for Eclipse slf4j over logback logging (Optional) 1.16.0-SNAPSHOT [29/40]
10:07:29 [INFO] --------------------------[ eclipse-feature ]---------------------------
10:07:29 [INFO] 
10:07:29 [INFO] --- maven-clean-plugin:2.4.1:clean (default-clean) @ org.eclipse.m2e.logback.feature ---
10:07:29 [INFO] 
10:07:29 [INFO] --- tycho-packaging-plugin:1.6.0:build-qualifier-aggregator (default-build-qualifier-aggregator) @ org.eclipse.m2e.logback.feature ---
10:07:29 [INFO] The project's OSGi version is 1.16.0.20200318-1040
10:07:29 [INFO] 
10:07:29 [INFO] --- tycho-packaging-plugin:1.6.0:validate-id (default-validate-id) @ org.eclipse.m2e.logback.feature ---
10:07:29 [INFO] 
10:07:29 [INFO] --- tycho-packaging-plugin:1.6.0:validate-version (default-validate-version) @ org.eclipse.m2e.logback.feature ---
10:07:29 [INFO] 
10:07:29 [INFO] --- jacoco-maven-plugin:0.8.5:prepare-agent (default) @ org.eclipse.m2e.logback.feature ---
10:07:29 [INFO] argLine set to -javaagent:/home/jenkins/agent/workspace/m2e-sonarqube/.repository/org/jacoco/org.jacoco.agent/0.8.5/org.jacoco.agent-0.8.5-runtime.jar=destfile=/home/jenkins/agent/workspace/m2e-sonarqube/jacoco.exec,append=true,includes=org.eclipse.m2e*:org.apache.maven*:org.eclipse.aether*
10:07:29 [INFO] 
10:07:29 [INFO] --- tycho-source-plugin:1.6.0:plugin-source (plugin-source) @ org.eclipse.m2e.logback.feature ---
10:07:29 [INFO] 
10:07:29 [INFO] --- target-platform-configuration:1.6.0:target-platform (default-target-platform) @ org.eclipse.m2e.logback.feature ---
10:07:29 [INFO] 
10:07:29 [INFO] --- tycho-packaging-plugin:1.6.0:package-feature (default-package-feature) @ org.eclipse.m2e.logback.feature ---
10:07:29 [INFO] Building jar: /home/jenkins/agent/workspace/m2e-sonarqube/org.eclipse.m2e.logback.feature/target/org.eclipse.m2e.logback.feature-1.16.0-SNAPSHOT.jar
10:07:29 [INFO] 
10:07:29 [INFO] --- tycho-p2-plugin:1.6.0:p2-metadata-default (default-p2-metadata-default) @ org.eclipse.m2e.logback.feature ---
10:07:30 [WARNING] MavenProject: org.eclipse.m2e:org.eclipse.m2e.logback.feature:1.16.0-SNAPSHOT @ /home/jenkins/agent/workspace/m2e-sonarqube/org.eclipse.m2e.logback.feature/pom.xml: baseline and build artifacts have same version but different contents
10:07:30    no-classifier: different
10:07:30       META-INF/ECLIPSE_.RSA: present in baseline only
10:07:30       META-INF/ECLIPSE_.SF: present in baseline only
10:07:30 
10:07:30 [INFO] MavenProject: org.eclipse.m2e:org.eclipse.m2e.logback.feature:1.16.0-SNAPSHOT @ /home/jenkins/agent/workspace/m2e-sonarqube/org.eclipse.m2e.logback.feature/pom.xml
10:07:30     The main artifact has been replaced with the baseline version.
10:07:30 
10:07:30 [INFO] 
10:07:30 [INFO] --- tycho-p2-plugin:1.6.0:feature-p2-metadata (default-feature-p2-metadata) @ org.eclipse.m2e.logback.feature ---
10:07:30 [INFO] 
10:07:30 [INFO] --- tycho-p2-extras-plugin:1.6.0:compare-version-with-baselines (check-no-version-regression) @ org.eclipse.m2e.logback.feature ---
10:07:30 Jun 05, 2020 2:07:30 PM org.apache.http.impl.execchain.RetryExec execute
10:07:30 INFO: I/O exception (org.apache.http.NoHttpResponseException) caught when processing request to {s}->https://download.eclipse.org:443: The target server failed to respond
10:07:30 Jun 05, 2020 2:07:30 PM org.apache.http.impl.execchain.RetryExec execute
10:07:30 INFO: Retrying request to {s}->https://download.eclipse.org:443
10:07:30 [INFO] Fetching org.eclipse.m2e.logback.feature_1.15.0.20200108-1649.jar from https://download.eclipse.org/technology/m2e/releases/1.15/1.15.0.20200310-1746/features/ (19.01kB)
10:07:30 [INFO] 
10:07:30 [INFO] --- maven-install-plugin:2.3.1:install (default-install) @ org.eclipse.m2e.logback.feature ---
10:07:30 [INFO] Installing /home/jenkins/agent/workspace/m2e-sonarqube/org.eclipse.m2e.logback.feature/target/org.eclipse.m2e.logback.feature-1.16.0-SNAPSHOT.jar to /home/jenkins/agent/workspace/m2e-sonarqube/.repository/org/eclipse/m2e/org.eclipse.m2e.logback.feature/1.16.0-SNAPSHOT/org.eclipse.m2e.logback.feature-1.16.0-SNAPSHOT.jar
10:07:31 [INFO] Installing /home/jenkins/agent/workspace/m2e-sonarqube/org.eclipse.m2e.logback.feature/pom.xml to /home/jenkins/agent/workspace/m2e-sonarqube/.repository/org/eclipse/m2e/org.eclipse.m2e.logback.feature/1.16.0-SNAPSHOT/org.eclipse.m2e.logback.feature-1.16.0-SNAPSHOT.pom
10:07:31 [INFO] Installing /home/jenkins/agent/workspace/m2e-sonarqube/org.eclipse.m2e.logback.feature/target/p2content.xml to /home/jenkins/agent/workspace/m2e-sonarqube/.repository/org/eclipse/m2e/org.eclipse.m2e.logback.feature/1.16.0-SNAPSHOT/org.eclipse.m2e.logback.feature-1.16.0-SNAPSHOT-p2metadata.xml
10:07:31 [INFO] Installing /home/jenkins/agent/workspace/m2e-sonarqube/org.eclipse.m2e.logback.feature/target/p2artifacts.xml to /home/jenkins/agent/workspace/m2e-sonarqube/.repository/org/eclipse/m2e/org.eclipse.m2e.logback.feature/1.16.0-SNAPSHOT/org.eclipse.m2e.logback.feature-1.16.0-SNAPSHOT-p2artifacts.xml
10:07:31 [INFO] 
10:07:31 [INFO] --- tycho-p2-plugin:1.6.0:update-local-index (default-update-local-index) @ org.eclipse.m2e.logback.feature ---
10:07:31 [INFO] 
10:07:31 [INFO] ----------------< org.eclipse.m2e:org.eclipse.m2e.site >----------------
10:07:31 [INFO] Building Maven Integration for Eclipse Update Site 1.16.0-SNAPSHOT [30/40]
10:07:31 [INFO] -------------------------[ eclipse-repository ]-------------------------
10:07:31 [INFO] 
10:07:31 [INFO] --- maven-clean-plugin:2.4.1:clean (default-clean) @ org.eclipse.m2e.site ---
10:07:31 [INFO] 
10:07:31 [INFO] --- tycho-packaging-plugin:1.6.0:build-qualifier-aggregator (default-build-qualifier-aggregator) @ org.eclipse.m2e.site ---
10:07:31 [INFO] The project's OSGi version is 1.16.0.20200605-1350
10:07:31 [INFO] 
10:07:31 [INFO] --- maven-clean-plugin:2.4.1:clean (default-clean-1) @ org.eclipse.m2e.site ---
10:07:31 [INFO] 
10:07:31 [INFO] --- jacoco-maven-plugin:0.8.5:prepare-agent (default) @ org.eclipse.m2e.site ---
10:07:31 [INFO] argLine set to -javaagent:/home/jenkins/agent/workspace/m2e-sonarqube/.repository/org/jacoco/org.jacoco.agent/0.8.5/org.jacoco.agent-0.8.5-runtime.jar=destfile=/home/jenkins/agent/workspace/m2e-sonarqube/jacoco.exec,append=true,includes=org.eclipse.m2e*:org.apache.maven*:org.eclipse.aether*
10:07:31 [INFO] 
10:07:31 [INFO] --- maven-resources-plugin:2.5:resources (default-resources) @ org.eclipse.m2e.site ---
10:07:31 [debug] execute contextualize
10:07:31 [INFO] Using 'UTF-8' encoding to copy filtered resources.
10:07:31 [INFO] skip non existing resourceDirectory /home/jenkins/agent/workspace/m2e-sonarqube/org.eclipse.m2e.site/src/main/resources
10:07:31 [INFO] 
10:07:31 [INFO] --- tycho-source-plugin:1.6.0:plugin-source (plugin-source) @ org.eclipse.m2e.site ---
10:07:31 [INFO] 
10:07:31 [INFO] --- target-platform-configuration:1.6.0:target-platform (default-target-platform) @ org.eclipse.m2e.site ---
10:07:31 [INFO] 
10:07:31 [INFO] --- tycho-p2-publisher-plugin:1.6.0:publish-osgi-ee (default-publish-osgi-ee) @ org.eclipse.m2e.site ---
10:07:31 [INFO] Published profile IUs: [a.jre 9.0.0, config.a.jre 9.0.0]
10:07:31 [INFO] Published profile IUs: [a.jre.javase 11.0.0, config.a.jre.javase 11.0.0]
10:07:31 [INFO] Published profile IUs: [a.jre 9.0.0, config.a.jre 9.0.0]
10:07:31 [INFO] Published profile IUs: [a.jre.javase 13.0.0, config.a.jre.javase 13.0.0]
10:07:31 [INFO] Published profile IUs: [a.jre.javase 14.0.0, config.a.jre.javase 14.0.0]
10:07:31 [INFO] 
10:07:31 [INFO] --- tycho-p2-publisher-plugin:1.6.0:publish-products (default-publish-products) @ org.eclipse.m2e.site ---
10:07:31 [INFO] 
10:07:31 [INFO] --- tycho-p2-publisher-plugin:1.6.0:publish-categories (default-publish-categories) @ org.eclipse.m2e.site ---
10:07:31 [INFO] 
10:07:31 [INFO] --- tycho-p2-publisher-plugin:1.6.0:attach-artifacts (default-attach-artifacts) @ org.eclipse.m2e.site ---
10:07:31 [INFO] 
10:07:31 [INFO] --- tycho-p2-repository-plugin:1.6.0:assemble-repository (default-assemble-repository) @ org.eclipse.m2e.site ---
10:07:58 [INFO] 
10:07:58 [INFO] --- tycho-p2-repository-plugin:1.6.0:archive-repository (default-archive-repository) @ org.eclipse.m2e.site ---
10:07:58 [INFO] Building zip: /home/jenkins/agent/workspace/m2e-sonarqube/org.eclipse.m2e.site/target/org.eclipse.m2e.site-1.16.0-SNAPSHOT.zip
10:07:59 [INFO] 
10:07:59 [INFO] --- tycho-p2-extras-plugin:1.6.0:compare-version-with-baselines (check-no-version-regression) @ org.eclipse.m2e.site ---
10:07:59 [INFO] 
10:07:59 [INFO] --- maven-install-plugin:2.3.1:install (default-install) @ org.eclipse.m2e.site ---
10:07:59 [INFO] Installing /home/jenkins/agent/workspace/m2e-sonarqube/org.eclipse.m2e.site/target/org.eclipse.m2e.site-1.16.0-SNAPSHOT.zip to /home/jenkins/agent/workspace/m2e-sonarqube/.repository/org/eclipse/m2e/org.eclipse.m2e.site/1.16.0-SNAPSHOT/org.eclipse.m2e.site-1.16.0-SNAPSHOT.zip
10:07:59 [INFO] Installing /home/jenkins/agent/workspace/m2e-sonarqube/org.eclipse.m2e.site/pom.xml to /home/jenkins/agent/workspace/m2e-sonarqube/.repository/org/eclipse/m2e/org.eclipse.m2e.site/1.16.0-SNAPSHOT/org.eclipse.m2e.site-1.16.0-SNAPSHOT.pom
10:07:59 [INFO] Installing /home/jenkins/agent/workspace/m2e-sonarqube/org.eclipse.m2e.site/target/p2content.xml to /home/jenkins/agent/workspace/m2e-sonarqube/.repository/org/eclipse/m2e/org.eclipse.m2e.site/1.16.0-SNAPSHOT/org.eclipse.m2e.site-1.16.0-SNAPSHOT-p2metadata.xml
10:07:59 [INFO] Installing /home/jenkins/agent/workspace/m2e-sonarqube/org.eclipse.m2e.site/target/p2artifacts.xml to /home/jenkins/agent/workspace/m2e-sonarqube/.repository/org/eclipse/m2e/org.eclipse.m2e.site/1.16.0-SNAPSHOT/org.eclipse.m2e.site-1.16.0-SNAPSHOT-p2artifacts.xml
10:07:59 [INFO] 
10:07:59 [INFO] --- tycho-p2-plugin:1.6.0:update-local-index (default-update-local-index) @ org.eclipse.m2e.site ---
10:07:59 [INFO] 
10:07:59 [INFO] -------------< org.eclipse.m2e:org.eclipse.m2e.core.tests >-------------
10:07:59 [INFO] Building org.eclipse.m2e.core.tests 1.16.0-SNAPSHOT              [31/40]
10:07:59 [INFO] ------------------------[ eclipse-test-plugin ]-------------------------
10:07:59 [INFO] 
10:07:59 [INFO] --- maven-clean-plugin:2.4.1:clean (default-clean) @ org.eclipse.m2e.core.tests ---
10:07:59 [INFO] 
10:07:59 [INFO] --- tycho-packaging-plugin:1.6.0:build-qualifier (default-build-qualifier) @ org.eclipse.m2e.core.tests ---
10:07:59 [INFO] The project's OSGi version is 1.16.0.20200318-0852
10:07:59 [INFO] 
10:07:59 [INFO] --- tycho-packaging-plugin:1.6.0:validate-id (default-validate-id) @ org.eclipse.m2e.core.tests ---
10:07:59 [INFO] 
10:07:59 [INFO] --- tycho-packaging-plugin:1.6.0:validate-version (default-validate-version) @ org.eclipse.m2e.core.tests ---
10:07:59 [INFO] 
10:07:59 [INFO] --- jacoco-maven-plugin:0.8.5:prepare-agent (default) @ org.eclipse.m2e.core.tests ---
10:07:59 [INFO] tycho.testArgLine set to -javaagent:/home/jenkins/agent/workspace/m2e-sonarqube/.repository/org/jacoco/org.jacoco.agent/0.8.5/org.jacoco.agent-0.8.5-runtime.jar=destfile=/home/jenkins/agent/workspace/m2e-sonarqube/jacoco.exec,append=true,includes=org.eclipse.m2e*:org.apache.maven*:org.eclipse.aether* -Xmx800m
10:07:59 [INFO] 
10:07:59 [INFO] --- maven-resources-plugin:2.5:resources (default-resources) @ org.eclipse.m2e.core.tests ---
10:07:59 [debug] execute contextualize
10:07:59 [INFO] Using 'UTF-8' encoding to copy filtered resources.
10:07:59 [INFO] skip non existing resourceDirectory /home/jenkins/agent/workspace/m2e-sonarqube/org.eclipse.m2e.core.tests/src/main/resources
10:07:59 [INFO] 
10:07:59 [INFO] --- tycho-compiler-plugin:1.6.0:compile (default-compile) @ org.eclipse.m2e.core.tests ---
10:07:59 [WARNING] Parameter 'useProjectSettings' is set to true, but preferences file '/home/jenkins/agent/workspace/m2e-sonarqube/org.eclipse.m2e.core.tests/.settings/org.eclipse.jdt.core.prefs' could not be found!
10:07:59 [INFO] Compiling 4 source files to /home/jenkins/agent/workspace/m2e-sonarqube/org.eclipse.m2e.core.tests/target/classes
10:08:00 [INFO] 
10:08:00 [INFO] --- maven-resources-plugin:2.5:testResources (default-testResources) @ org.eclipse.m2e.core.tests ---
10:08:00 [debug] execute contextualize
10:08:00 [INFO] Using 'UTF-8' encoding to copy filtered resources.
10:08:00 [INFO] skip non existing resourceDirectory /home/jenkins/agent/workspace/m2e-sonarqube/org.eclipse.m2e.core.tests/src/test/resources
10:08:00 [INFO] 
10:08:00 [INFO] --- tycho-source-plugin:1.6.0:plugin-source (plugin-source) @ org.eclipse.m2e.core.tests ---
10:08:00 [INFO] Building jar: /home/jenkins/agent/workspace/m2e-sonarqube/org.eclipse.m2e.core.tests/target/org.eclipse.m2e.core.tests-1.16.0-SNAPSHOT-sources.jar
10:08:00 [INFO] 
10:08:00 [INFO] --- target-platform-configuration:1.6.0:target-platform (default-target-platform) @ org.eclipse.m2e.core.tests ---
10:08:00 [INFO] 
10:08:00 [INFO] --- tycho-packaging-plugin:1.6.0:package-plugin (default-package-plugin) @ org.eclipse.m2e.core.tests ---
10:08:00 [INFO] Building jar: /home/jenkins/agent/workspace/m2e-sonarqube/org.eclipse.m2e.core.tests/target/org.eclipse.m2e.core.tests-1.16.0-SNAPSHOT.jar
10:08:00 [INFO] 
10:08:00 [INFO] --- tycho-p2-plugin:1.6.0:p2-metadata-default (default-p2-metadata-default) @ org.eclipse.m2e.core.tests ---
10:08:00 [INFO] No baseline version MavenProject: org.eclipse.m2e:org.eclipse.m2e.core.tests:1.16.0-SNAPSHOT @ /home/jenkins/agent/workspace/m2e-sonarqube/org.eclipse.m2e.core.tests/pom.xml
10:08:00 [INFO] 
10:08:00 [INFO] --- tycho-surefire-plugin:1.6.0:test (default-test) @ org.eclipse.m2e.core.tests ---
10:08:00 [INFO] Expected eclipse log file: /home/jenkins/agent/workspace/m2e-sonarqube/org.eclipse.m2e.core.tests/target/work/data/.metadata/.log
10:08:00 [INFO] Command line:
10:08:00 	[/opt/tools/java/oracle/jdk-8/1.8.0_202/jre/bin/java, -Dosgi.noShutdown=false, -Dosgi.os=linux, -Dosgi.ws=gtk, -Dosgi.arch=x86_64, -javaagent:/home/jenkins/agent/workspace/m2e-sonarqube/.repository/org/jacoco/org.jacoco.agent/0.8.5/org.jacoco.agent-0.8.5-runtime.jar=destfile=/home/jenkins/agent/workspace/m2e-sonarqube/jacoco.exec,append=true,includes=org.eclipse.m2e*:org.apache.maven*:org.eclipse.aether*, -Xmx800m, -Dosgi.clean=true, -jar, /home/jenkins/agent/workspace/m2e-sonarqube/.repository/p2/osgi/bundle/org.eclipse.equinox.launcher/1.5.700.v20200207-2156/org.eclipse.equinox.launcher-1.5.700.v20200207-2156.jar, -data, /home/jenkins/agent/workspace/m2e-sonarqube/org.eclipse.m2e.core.tests/target/work/data, -install, /home/jenkins/agent/workspace/m2e-sonarqube/org.eclipse.m2e.core.tests/target/work, -configuration, /home/jenkins/agent/workspace/m2e-sonarqube/org.eclipse.m2e.core.tests/target/work/configuration, -application, org.eclipse.tycho.surefire.osgibooter.headlesstest, -testproperties, /home/jenkins/agent/workspace/m2e-sonarqube/org.eclipse.m2e.core.tests/target/surefire.properties, -timeout, 7200000]
10:08:00 Picked up JAVA_TOOL_OPTIONS: -XX:+IgnoreUnrecognizedVMOptions -XX:+UseContainerSupport -XX:+UnlockExperimentalVMOptions -XX:+UseCGroupMemoryLimitForHeap
10:08:00 Picked up _JAVA_OPTIONS: -XX:MaxRAMPercentage=64.0
10:08:03 SLF4J: Failed to load class "org.slf4j.impl.StaticLoggerBinder".
10:08:03 SLF4J: Defaulting to no-operation (NOP) logger implementation
10:08:03 SLF4J: See http://www.slf4j.org/codes.html#StaticLoggerBinder for further details.
10:08:04 Running org.eclipse.m2e.core.AllTests
10:22:24 Tests run: 7, Failures: 0, Errors: 0, Skipped: 1, Time elapsed: 858.154 s - in org.eclipse.m2e.core.AllTests
10:22:24 testMNG6530(org.eclipse.m2e.core.MavenBugsTest)  Time elapsed: 50.548 s
10:22:24 testMissingParentCapabilityStored(org.eclipse.m2e.core.internal.project.registry.RegistryTest)  Time elapsed: 2.911 s
10:22:24 testMultiRefreshKeepsCapabilities(org.eclipse.m2e.core.internal.project.registry.RegistryTest)  Time elapsed: 324.388 s
10:22:24 testDeletedFacadeIsRemoved(org.eclipse.m2e.core.internal.project.registry.RegistryTest)  Time elapsed: 23.824 s
10:22:24 testInvalidParent(org.eclipse.m2e.core.internal.project.registry.RegistryTest) skipped
10:22:24 testResolvedParentConfiguration(org.eclipse.m2e.core.internal.project.registry.RegistryTest)  Time elapsed: 19.884 s
10:22:24 testImportLongBuildChain(org.eclipse.m2e.core.internal.project.registry.MemoryConsumptionTest)  Time elapsed: 436.144 s
10:22:24 
10:22:24 Results:
10:22:24 
10:22:24 Tests run: 7, Failures: 0, Errors: 0, Skipped: 1
10:22:24 
10:22:54 [INFO] All tests passed!
10:22:54 [INFO] 
10:22:54 [INFO] --- tycho-p2-extras-plugin:1.6.0:compare-version-with-baselines (check-no-version-regression) @ org.eclipse.m2e.core.tests ---
10:22:56 [INFO] 
10:22:56 [INFO] --- maven-install-plugin:2.3.1:install (default-install) @ org.eclipse.m2e.core.tests ---
10:22:56 [INFO] Installing /home/jenkins/agent/workspace/m2e-sonarqube/org.eclipse.m2e.core.tests/target/org.eclipse.m2e.core.tests-1.16.0-SNAPSHOT.jar to /home/jenkins/agent/workspace/m2e-sonarqube/.repository/org/eclipse/m2e/org.eclipse.m2e.core.tests/1.16.0-SNAPSHOT/org.eclipse.m2e.core.tests-1.16.0-SNAPSHOT.jar
10:22:58 [INFO] Installing /home/jenkins/agent/workspace/m2e-sonarqube/org.eclipse.m2e.core.tests/pom.xml to /home/jenkins/agent/workspace/m2e-sonarqube/.repository/org/eclipse/m2e/org.eclipse.m2e.core.tests/1.16.0-SNAPSHOT/org.eclipse.m2e.core.tests-1.16.0-SNAPSHOT.pom
10:22:58 [INFO] Installing /home/jenkins/agent/workspace/m2e-sonarqube/org.eclipse.m2e.core.tests/target/org.eclipse.m2e.core.tests-1.16.0-SNAPSHOT-sources.jar to /home/jenkins/agent/workspace/m2e-sonarqube/.repository/org/eclipse/m2e/org.eclipse.m2e.core.tests/1.16.0-SNAPSHOT/org.eclipse.m2e.core.tests-1.16.0-SNAPSHOT-sources.jar
10:22:58 [INFO] Installing /home/jenkins/agent/workspace/m2e-sonarqube/org.eclipse.m2e.core.tests/target/p2content.xml to /home/jenkins/agent/workspace/m2e-sonarqube/.repository/org/eclipse/m2e/org.eclipse.m2e.core.tests/1.16.0-SNAPSHOT/org.eclipse.m2e.core.tests-1.16.0-SNAPSHOT-p2metadata.xml
10:22:58 [INFO] Installing /home/jenkins/agent/workspace/m2e-sonarqube/org.eclipse.m2e.core.tests/target/p2artifacts.xml to /home/jenkins/agent/workspace/m2e-sonarqube/.repository/org/eclipse/m2e/org.eclipse.m2e.core.tests/1.16.0-SNAPSHOT/org.eclipse.m2e.core.tests-1.16.0-SNAPSHOT-p2artifacts.xml
10:22:58 [INFO] 
10:22:58 [INFO] --- tycho-p2-plugin:1.6.0:update-local-index (default-update-local-index) @ org.eclipse.m2e.core.tests ---
10:22:58 [INFO] 
10:22:58 [INFO] -----------< org.eclipse.m2e:org.eclipse.m2e.importer.tests >-----------
10:22:58 [INFO] Building Tests for Maven Integration for Eclipse Importer framework 1.16.0-SNAPSHOT [32/40]
10:22:58 [INFO] ------------------------[ eclipse-test-plugin ]-------------------------
10:22:59 [INFO] 
10:22:59 [INFO] --- maven-clean-plugin:2.4.1:clean (default-clean) @ org.eclipse.m2e.importer.tests ---
10:22:59 [INFO] 
10:22:59 [INFO] --- tycho-packaging-plugin:1.6.0:build-qualifier (default-build-qualifier) @ org.eclipse.m2e.importer.tests ---
10:22:59 [INFO] The project's OSGi version is 1.16.0.20200318-0852
10:22:59 [INFO] 
10:22:59 [INFO] --- tycho-packaging-plugin:1.6.0:validate-id (default-validate-id) @ org.eclipse.m2e.importer.tests ---
10:22:59 [INFO] 
10:22:59 [INFO] --- tycho-packaging-plugin:1.6.0:validate-version (default-validate-version) @ org.eclipse.m2e.importer.tests ---
10:22:59 [INFO] 
10:22:59 [INFO] --- jacoco-maven-plugin:0.8.5:prepare-agent (default) @ org.eclipse.m2e.importer.tests ---
10:22:59 [INFO] tycho.testArgLine set to -javaagent:/home/jenkins/agent/workspace/m2e-sonarqube/.repository/org/jacoco/org.jacoco.agent/0.8.5/org.jacoco.agent-0.8.5-runtime.jar=destfile=/home/jenkins/agent/workspace/m2e-sonarqube/jacoco.exec,append=true,includes=org.eclipse.m2e*:org.apache.maven*:org.eclipse.aether* -Xmx800m
10:22:59 [INFO] 
10:22:59 [INFO] --- maven-resources-plugin:2.5:resources (default-resources) @ org.eclipse.m2e.importer.tests ---
10:22:59 [debug] execute contextualize
10:22:59 [INFO] Using 'UTF-8' encoding to copy filtered resources.
10:22:59 [INFO] skip non existing resourceDirectory /home/jenkins/agent/workspace/m2e-sonarqube/org.eclipse.m2e.importer.tests/src/main/resources
10:22:59 [INFO] 
10:22:59 [INFO] --- tycho-compiler-plugin:1.6.0:compile (default-compile) @ org.eclipse.m2e.importer.tests ---
10:22:59 [WARNING] Parameter 'useProjectSettings' is set to true, but preferences file '/home/jenkins/agent/workspace/m2e-sonarqube/org.eclipse.m2e.importer.tests/.settings/org.eclipse.jdt.core.prefs' could not be found!
10:22:59 [INFO] Compiling 1 source file to /home/jenkins/agent/workspace/m2e-sonarqube/org.eclipse.m2e.importer.tests/target/classes
10:22:59 [INFO] 
10:22:59 [INFO] --- maven-resources-plugin:2.5:testResources (default-testResources) @ org.eclipse.m2e.importer.tests ---
10:22:59 [debug] execute contextualize
10:22:59 [INFO] Using 'UTF-8' encoding to copy filtered resources.
10:22:59 [INFO] skip non existing resourceDirectory /home/jenkins/agent/workspace/m2e-sonarqube/org.eclipse.m2e.importer.tests/src/test/resources
10:22:59 [INFO] 
10:22:59 [INFO] --- tycho-source-plugin:1.6.0:plugin-source (plugin-source) @ org.eclipse.m2e.importer.tests ---
10:22:59 [INFO] Building jar: /home/jenkins/agent/workspace/m2e-sonarqube/org.eclipse.m2e.importer.tests/target/org.eclipse.m2e.importer.tests-1.16.0-SNAPSHOT-sources.jar
10:22:59 [INFO] 
10:22:59 [INFO] --- target-platform-configuration:1.6.0:target-platform (default-target-platform) @ org.eclipse.m2e.importer.tests ---
10:22:59 [INFO] 
10:22:59 [INFO] --- tycho-packaging-plugin:1.6.0:package-plugin (default-package-plugin) @ org.eclipse.m2e.importer.tests ---
10:22:59 [INFO] Building jar: /home/jenkins/agent/workspace/m2e-sonarqube/org.eclipse.m2e.importer.tests/target/org.eclipse.m2e.importer.tests-1.16.0-SNAPSHOT.jar
10:22:59 [INFO] 
10:22:59 [INFO] --- tycho-p2-plugin:1.6.0:p2-metadata-default (default-p2-metadata-default) @ org.eclipse.m2e.importer.tests ---
10:22:59 [INFO] No baseline version MavenProject: org.eclipse.m2e:org.eclipse.m2e.importer.tests:1.16.0-SNAPSHOT @ /home/jenkins/agent/workspace/m2e-sonarqube/org.eclipse.m2e.importer.tests/pom.xml
10:22:59 [INFO] 
10:22:59 [INFO] --- tycho-surefire-plugin:1.6.0:test (default-test) @ org.eclipse.m2e.importer.tests ---
10:23:00 [INFO] Expected eclipse log file: /home/jenkins/agent/workspace/m2e-sonarqube/org.eclipse.m2e.importer.tests/target/work/data/.metadata/.log
10:23:00 [INFO] Command line:
10:23:00 	[/opt/tools/java/oracle/jdk-8/1.8.0_202/jre/bin/java, -Dosgi.noShutdown=false, -Dosgi.os=linux, -Dosgi.ws=gtk, -Dosgi.arch=x86_64, -javaagent:/home/jenkins/agent/workspace/m2e-sonarqube/.repository/org/jacoco/org.jacoco.agent/0.8.5/org.jacoco.agent-0.8.5-runtime.jar=destfile=/home/jenkins/agent/workspace/m2e-sonarqube/jacoco.exec,append=true,includes=org.eclipse.m2e*:org.apache.maven*:org.eclipse.aether*, -Xmx800m, -Dosgi.clean=true, -jar, /home/jenkins/agent/workspace/m2e-sonarqube/.repository/p2/osgi/bundle/org.eclipse.equinox.launcher/1.5.700.v20200207-2156/org.eclipse.equinox.launcher-1.5.700.v20200207-2156.jar, -data, /home/jenkins/agent/workspace/m2e-sonarqube/org.eclipse.m2e.importer.tests/target/work/data, -install, /home/jenkins/agent/workspace/m2e-sonarqube/org.eclipse.m2e.importer.tests/target/work, -configuration, /home/jenkins/agent/workspace/m2e-sonarqube/org.eclipse.m2e.importer.tests/target/work/configuration, -application, org.eclipse.tycho.surefire.osgibooter.uitest, -testproperties, /home/jenkins/agent/workspace/m2e-sonarqube/org.eclipse.m2e.importer.tests/target/surefire.properties, -nouithread, -timeout, 7200000]
10:23:00 Picked up JAVA_TOOL_OPTIONS: -XX:+IgnoreUnrecognizedVMOptions -XX:+UseContainerSupport -XX:+UnlockExperimentalVMOptions -XX:+UseCGroupMemoryLimitForHeap
10:23:00 Picked up _JAVA_OPTIONS: -XX:MaxRAMPercentage=64.0
10:23:06 Running org.eclipse.m2e.importer.tests.MavenImporterTest
10:23:06 SLF4J: Failed to load class "org.slf4j.impl.StaticLoggerBinder".
10:23:06 SLF4J: Defaulting to no-operation (NOP) logger implementation
10:23:06 SLF4J: See http://www.slf4j.org/codes.html#StaticLoggerBinder for further details.
10:27:09 Tests run: 2, Failures: 2, Errors: 0, Skipped: 0, Time elapsed: 242.759 s <<< FAILURE! - in org.eclipse.m2e.importer.tests.MavenImporterTest
10:27:09 testRootWithoutPom(org.eclipse.m2e.importer.tests.MavenImporterTest)  Time elapsed: 60.517 s  <<< FAILURE!
10:27:09 java.lang.AssertionError: Timeout while waiting for completion of job: Building(4)
10:27:09 	at org.eclipse.m2e.importer.tests.MavenImporterTest.testRootWithoutPom(MavenImporterTest.java:129)
10:27:09 
10:27:09 test(org.eclipse.m2e.importer.tests.MavenImporterTest)  Time elapsed: 180.223 s  <<< FAILURE!
10:27:09 java.lang.AssertionError: Timeout while waiting for completion of job: Synchronizing projects(79)
10:27:09 	at org.eclipse.m2e.importer.tests.MavenImporterTest.test(MavenImporterTest.java:93)
10:27:09 
10:27:09 
10:27:09 Results:
10:27:09 
10:27:09 Failures: 
10:27:09   MavenImporterTest.test:93->AbstractMavenProjectTestCase.waitForJobsToComplete:472->AbstractMavenProjectTestCase.waitForJobsToComplete:476 Timeout while waiting for completion of job: Synchronizing projects(79)
10:27:09   MavenImporterTest.testRootWithoutPom:129->AbstractMavenProjectTestCase.waitForJobsToComplete:472->AbstractMavenProjectTestCase.waitForJobsToComplete:476 Timeout while waiting for completion of job: Building(4)
10:27:09 
10:27:09 Tests run: 2, Failures: 2, Errors: 0, Skipped: 0
10:27:09 
10:28:03 [ERROR] There are test failures.
10:28:15 
10:28:15 Please refer to /home/jenkins/agent/workspace/m2e-sonarqube/org.eclipse.m2e.importer.tests/target/surefire-reports for the individual test results.
10:28:15 [INFO] 
10:28:15 [INFO] --- tycho-p2-extras-plugin:1.6.0:compare-version-with-baselines (check-no-version-regression) @ org.eclipse.m2e.importer.tests ---
10:28:15 [INFO] 
10:28:15 [INFO] --- maven-install-plugin:2.3.1:install (default-install) @ org.eclipse.m2e.importer.tests ---
10:28:15 [INFO] Installing /home/jenkins/agent/workspace/m2e-sonarqube/org.eclipse.m2e.importer.tests/target/org.eclipse.m2e.importer.tests-1.16.0-SNAPSHOT.jar to /home/jenkins/agent/workspace/m2e-sonarqube/.repository/org/eclipse/m2e/org.eclipse.m2e.importer.tests/1.16.0-SNAPSHOT/org.eclipse.m2e.importer.tests-1.16.0-SNAPSHOT.jar
10:28:15 [INFO] Installing /home/jenkins/agent/workspace/m2e-sonarqube/org.eclipse.m2e.importer.tests/pom.xml to /home/jenkins/agent/workspace/m2e-sonarqube/.repository/org/eclipse/m2e/org.eclipse.m2e.importer.tests/1.16.0-SNAPSHOT/org.eclipse.m2e.importer.tests-1.16.0-SNAPSHOT.pom
10:28:15 [INFO] Installing /home/jenkins/agent/workspace/m2e-sonarqube/org.eclipse.m2e.importer.tests/target/org.eclipse.m2e.importer.tests-1.16.0-SNAPSHOT-sources.jar to /home/jenkins/agent/workspace/m2e-sonarqube/.repository/org/eclipse/m2e/org.eclipse.m2e.importer.tests/1.16.0-SNAPSHOT/org.eclipse.m2e.importer.tests-1.16.0-SNAPSHOT-sources.jar
10:28:15 [INFO] Installing /home/jenkins/agent/workspace/m2e-sonarqube/org.eclipse.m2e.importer.tests/target/p2content.xml to /home/jenkins/agent/workspace/m2e-sonarqube/.repository/org/eclipse/m2e/org.eclipse.m2e.importer.tests/1.16.0-SNAPSHOT/org.eclipse.m2e.importer.tests-1.16.0-SNAPSHOT-p2metadata.xml
10:28:15 [INFO] Installing /home/jenkins/agent/workspace/m2e-sonarqube/org.eclipse.m2e.importer.tests/target/p2artifacts.xml to /home/jenkins/agent/workspace/m2e-sonarqube/.repository/org/eclipse/m2e/org.eclipse.m2e.importer.tests/1.16.0-SNAPSHOT/org.eclipse.m2e.importer.tests-1.16.0-SNAPSHOT-p2artifacts.xml
10:28:15 [INFO] 
10:28:15 [INFO] --- tycho-p2-plugin:1.6.0:update-local-index (default-update-local-index) @ org.eclipse.m2e.importer.tests ---
10:28:15 [INFO] 
10:28:15 [INFO] --------< org.eclipse.m2e:org.eclipse.m2e.binaryproject.tests >---------
10:28:15 [INFO] Building org.eclipse.m2e.binaryproject.tests 1.16.0-SNAPSHOT     [33/40]
10:28:15 [INFO] ------------------------[ eclipse-test-plugin ]-------------------------
10:28:15 [INFO] 
10:28:15 [INFO] --- maven-clean-plugin:2.4.1:clean (default-clean) @ org.eclipse.m2e.binaryproject.tests ---
10:28:15 [INFO] 
10:28:15 [INFO] --- tycho-packaging-plugin:1.6.0:build-qualifier (default-build-qualifier) @ org.eclipse.m2e.binaryproject.tests ---
10:28:15 [INFO] The project's OSGi version is 1.16.0.20200318-0852
10:28:15 [INFO] 
10:28:15 [INFO] --- tycho-packaging-plugin:1.6.0:validate-id (default-validate-id) @ org.eclipse.m2e.binaryproject.tests ---
10:28:15 [INFO] 
10:28:15 [INFO] --- tycho-packaging-plugin:1.6.0:validate-version (default-validate-version) @ org.eclipse.m2e.binaryproject.tests ---
10:28:15 [INFO] 
10:28:15 [INFO] --- jacoco-maven-plugin:0.8.5:prepare-agent (default) @ org.eclipse.m2e.binaryproject.tests ---
10:28:15 [INFO] tycho.testArgLine set to -javaagent:/home/jenkins/agent/workspace/m2e-sonarqube/.repository/org/jacoco/org.jacoco.agent/0.8.5/org.jacoco.agent-0.8.5-runtime.jar=destfile=/home/jenkins/agent/workspace/m2e-sonarqube/jacoco.exec,append=true,includes=org.eclipse.m2e*:org.apache.maven*:org.eclipse.aether* -Xmx800m
10:28:15 [INFO] 
10:28:15 [INFO] --- maven-resources-plugin:2.5:resources (default-resources) @ org.eclipse.m2e.binaryproject.tests ---
10:28:15 [debug] execute contextualize
10:28:15 [INFO] Using 'UTF-8' encoding to copy filtered resources.
10:28:15 [INFO] skip non existing resourceDirectory /home/jenkins/agent/workspace/m2e-sonarqube/org.eclipse.m2e.binaryproject.tests/src/main/resources
10:28:15 [INFO] 
10:28:15 [INFO] --- tycho-compiler-plugin:1.6.0:compile (default-compile) @ org.eclipse.m2e.binaryproject.tests ---
10:28:15 [WARNING] Parameter 'useProjectSettings' is set to true, but preferences file '/home/jenkins/agent/workspace/m2e-sonarqube/org.eclipse.m2e.binaryproject.tests/.settings/org.eclipse.jdt.core.prefs' could not be found!
10:28:15 [INFO] Compiling 1 source file to /home/jenkins/agent/workspace/m2e-sonarqube/org.eclipse.m2e.binaryproject.tests/target/classes
10:28:15 [INFO] 
10:28:15 [INFO] --- maven-resources-plugin:2.5:testResources (default-testResources) @ org.eclipse.m2e.binaryproject.tests ---
10:28:15 [debug] execute contextualize
10:28:15 [INFO] Using 'UTF-8' encoding to copy filtered resources.
10:28:15 [INFO] skip non existing resourceDirectory /home/jenkins/agent/workspace/m2e-sonarqube/org.eclipse.m2e.binaryproject.tests/src/test/resources
10:28:15 [INFO] 
10:28:15 [INFO] --- tycho-source-plugin:1.6.0:plugin-source (plugin-source) @ org.eclipse.m2e.binaryproject.tests ---
10:28:15 [WARNING] Bundle-Name header not found in /home/jenkins/agent/workspace/m2e-sonarqube/org.eclipse.m2e.binaryproject.tests/META-INF/MANIFEST.MF, fallback to Bundle-SymbolicName for source bundle
10:28:15 [WARNING] Bundle-Vendor header not found in /home/jenkins/agent/workspace/m2e-sonarqube/org.eclipse.m2e.binaryproject.tests/META-INF/MANIFEST.MF, fallback to 'unknown' for source bundle
10:28:15 [INFO] Building jar: /home/jenkins/agent/workspace/m2e-sonarqube/org.eclipse.m2e.binaryproject.tests/target/org.eclipse.m2e.binaryproject.tests-1.16.0-SNAPSHOT-sources.jar
10:28:15 [INFO] 
10:28:15 [INFO] --- target-platform-configuration:1.6.0:target-platform (default-target-platform) @ org.eclipse.m2e.binaryproject.tests ---
10:28:15 [INFO] 
10:28:15 [INFO] --- tycho-packaging-plugin:1.6.0:package-plugin (default-package-plugin) @ org.eclipse.m2e.binaryproject.tests ---
10:28:15 [INFO] Building jar: /home/jenkins/agent/workspace/m2e-sonarqube/org.eclipse.m2e.binaryproject.tests/target/org.eclipse.m2e.binaryproject.tests-1.16.0-SNAPSHOT.jar
10:28:15 [INFO] 
10:28:15 [INFO] --- tycho-p2-plugin:1.6.0:p2-metadata-default (default-p2-metadata-default) @ org.eclipse.m2e.binaryproject.tests ---
10:28:15 [INFO] No baseline version MavenProject: org.eclipse.m2e:org.eclipse.m2e.binaryproject.tests:1.16.0-SNAPSHOT @ /home/jenkins/agent/workspace/m2e-sonarqube/org.eclipse.m2e.binaryproject.tests/pom.xml
10:28:15 [INFO] 
10:28:15 [INFO] --- tycho-surefire-plugin:1.6.0:test (default-test) @ org.eclipse.m2e.binaryproject.tests ---
10:28:15 [INFO] Expected eclipse log file: /home/jenkins/agent/workspace/m2e-sonarqube/org.eclipse.m2e.binaryproject.tests/target/work/data/.metadata/.log
10:28:15 [INFO] Command line:
10:28:15 	[/opt/tools/java/oracle/jdk-8/1.8.0_202/jre/bin/java, -Dosgi.noShutdown=false, -Dosgi.os=linux, -Dosgi.ws=gtk, -Dosgi.arch=x86_64, -javaagent:/home/jenkins/agent/workspace/m2e-sonarqube/.repository/org/jacoco/org.jacoco.agent/0.8.5/org.jacoco.agent-0.8.5-runtime.jar=destfile=/home/jenkins/agent/workspace/m2e-sonarqube/jacoco.exec,append=true,includes=org.eclipse.m2e*:org.apache.maven*:org.eclipse.aether*, -Xmx800m, -Dosgi.clean=true, -jar, /home/jenkins/agent/workspace/m2e-sonarqube/.repository/p2/osgi/bundle/org.eclipse.equinox.launcher/1.5.700.v20200207-2156/org.eclipse.equinox.launcher-1.5.700.v20200207-2156.jar, -data, /home/jenkins/agent/workspace/m2e-sonarqube/org.eclipse.m2e.binaryproject.tests/target/work/data, -install, /home/jenkins/agent/workspace/m2e-sonarqube/org.eclipse.m2e.binaryproject.tests/target/work, -configuration, /home/jenkins/agent/workspace/m2e-sonarqube/org.eclipse.m2e.binaryproject.tests/target/work/configuration, -application, org.eclipse.tycho.surefire.osgibooter.uitest, -testproperties, /home/jenkins/agent/workspace/m2e-sonarqube/org.eclipse.m2e.binaryproject.tests/target/surefire.properties, -timeout, 7200000]
10:28:15 Picked up JAVA_TOOL_OPTIONS: -XX:+IgnoreUnrecognizedVMOptions -XX:+UseContainerSupport -XX:+UnlockExperimentalVMOptions -XX:+UseCGroupMemoryLimitForHeap
10:28:15 Picked up _JAVA_OPTIONS: -XX:MaxRAMPercentage=64.0
10:28:17 Running org.eclipse.m2e.binaryproject.tests.BinaryProjectTest
10:28:17 SLF4J: Failed to load class "org.slf4j.impl.StaticLoggerBinder".
10:28:17 SLF4J: Defaulting to no-operation (NOP) logger implementation
10:28:17 SLF4J: See http://www.slf4j.org/codes.html#StaticLoggerBinder for further details.
10:32:17 Tests run: 1, Failures: 0, Errors: 0, Skipped: 0, Time elapsed: 239.415 s - in org.eclipse.m2e.binaryproject.tests.BinaryProjectTest
10:32:17 testBasic(org.eclipse.m2e.binaryproject.tests.BinaryProjectTest)  Time elapsed: 237.531 s
10:32:17 
10:32:17 Results:
10:32:17 
10:32:17 Tests run: 1, Failures: 0, Errors: 0, Skipped: 0
10:32:17 
10:32:34 [INFO] All tests passed!
10:32:34 [INFO] 
10:32:34 [INFO] --- tycho-p2-extras-plugin:1.6.0:compare-version-with-baselines (check-no-version-regression) @ org.eclipse.m2e.binaryproject.tests ---
10:32:34 [INFO] 
10:32:34 [INFO] --- maven-install-plugin:2.3.1:install (default-install) @ org.eclipse.m2e.binaryproject.tests ---
10:32:34 [INFO] Installing /home/jenkins/agent/workspace/m2e-sonarqube/org.eclipse.m2e.binaryproject.tests/target/org.eclipse.m2e.binaryproject.tests-1.16.0-SNAPSHOT.jar to /home/jenkins/agent/workspace/m2e-sonarqube/.repository/org/eclipse/m2e/org.eclipse.m2e.binaryproject.tests/1.16.0-SNAPSHOT/org.eclipse.m2e.binaryproject.tests-1.16.0-SNAPSHOT.jar
10:32:34 [INFO] Installing /home/jenkins/agent/workspace/m2e-sonarqube/org.eclipse.m2e.binaryproject.tests/pom.xml to /home/jenkins/agent/workspace/m2e-sonarqube/.repository/org/eclipse/m2e/org.eclipse.m2e.binaryproject.tests/1.16.0-SNAPSHOT/org.eclipse.m2e.binaryproject.tests-1.16.0-SNAPSHOT.pom
10:32:35 [INFO] Installing /home/jenkins/agent/workspace/m2e-sonarqube/org.eclipse.m2e.binaryproject.tests/target/org.eclipse.m2e.binaryproject.tests-1.16.0-SNAPSHOT-sources.jar to /home/jenkins/agent/workspace/m2e-sonarqube/.repository/org/eclipse/m2e/org.eclipse.m2e.binaryproject.tests/1.16.0-SNAPSHOT/org.eclipse.m2e.binaryproject.tests-1.16.0-SNAPSHOT-sources.jar
10:32:35 [INFO] Installing /home/jenkins/agent/workspace/m2e-sonarqube/org.eclipse.m2e.binaryproject.tests/target/p2content.xml to /home/jenkins/agent/workspace/m2e-sonarqube/.repository/org/eclipse/m2e/org.eclipse.m2e.binaryproject.tests/1.16.0-SNAPSHOT/org.eclipse.m2e.binaryproject.tests-1.16.0-SNAPSHOT-p2metadata.xml
10:32:35 [INFO] Installing /home/jenkins/agent/workspace/m2e-sonarqube/org.eclipse.m2e.binaryproject.tests/target/p2artifacts.xml to /home/jenkins/agent/workspace/m2e-sonarqube/.repository/org/eclipse/m2e/org.eclipse.m2e.binaryproject.tests/1.16.0-SNAPSHOT/org.eclipse.m2e.binaryproject.tests-1.16.0-SNAPSHOT-p2artifacts.xml
10:32:36 [INFO] 
10:32:36 [INFO] --- tycho-p2-plugin:1.6.0:update-local-index (default-update-local-index) @ org.eclipse.m2e.binaryproject.tests ---
10:32:36 [INFO] 
10:32:36 [INFO] --------< org.eclipse.m2e:org.eclipse.m2e.editor.lemminx.tests >--------
10:32:36 [INFO] Building org.eclipse.m2e.editor.lemminx.tests 1.16.0-SNAPSHOT    [34/40]
10:32:36 [INFO] ------------------------[ eclipse-test-plugin ]-------------------------
10:32:36 [INFO] 
10:32:36 [INFO] --- maven-clean-plugin:2.4.1:clean (default-clean) @ org.eclipse.m2e.editor.lemminx.tests ---
10:32:36 [INFO] 
10:32:36 [INFO] --- tycho-packaging-plugin:1.6.0:build-qualifier (default-build-qualifier) @ org.eclipse.m2e.editor.lemminx.tests ---
10:32:36 [INFO] The project's OSGi version is 1.16.0.20200511-1543
10:32:36 [INFO] 
10:32:36 [INFO] --- tycho-packaging-plugin:1.6.0:validate-id (default-validate-id) @ org.eclipse.m2e.editor.lemminx.tests ---
10:32:36 [INFO] 
10:32:36 [INFO] --- tycho-packaging-plugin:1.6.0:validate-version (default-validate-version) @ org.eclipse.m2e.editor.lemminx.tests ---
10:32:36 [INFO] 
10:32:36 [INFO] --- jacoco-maven-plugin:0.8.5:prepare-agent (default) @ org.eclipse.m2e.editor.lemminx.tests ---
10:32:36 [INFO] tycho.testArgLine set to -javaagent:/home/jenkins/agent/workspace/m2e-sonarqube/.repository/org/jacoco/org.jacoco.agent/0.8.5/org.jacoco.agent-0.8.5-runtime.jar=destfile=/home/jenkins/agent/workspace/m2e-sonarqube/jacoco.exec,append=true,includes=org.eclipse.m2e*:org.apache.maven*:org.eclipse.aether* -Xmx800m
10:32:36 [INFO] 
10:32:36 [INFO] --- maven-resources-plugin:2.5:resources (default-resources) @ org.eclipse.m2e.editor.lemminx.tests ---
10:32:36 [debug] execute contextualize
10:32:36 [INFO] Using 'UTF-8' encoding to copy filtered resources.
10:32:36 [INFO] skip non existing resourceDirectory /home/jenkins/agent/workspace/m2e-sonarqube/org.eclipse.m2e.editor.lemminx.tests/src/main/resources
10:32:36 [INFO] 
10:32:36 [INFO] --- tycho-compiler-plugin:1.6.0:compile (default-compile) @ org.eclipse.m2e.editor.lemminx.tests ---
10:32:36 [WARNING] Parameter 'useProjectSettings' is set to true, but preferences file '/home/jenkins/agent/workspace/m2e-sonarqube/org.eclipse.m2e.editor.lemminx.tests/.settings/org.eclipse.jdt.core.prefs' could not be found!
10:32:36 [INFO] Compiling 1 source file to /home/jenkins/agent/workspace/m2e-sonarqube/org.eclipse.m2e.editor.lemminx.tests/target/classes
10:32:36 [INFO] 
10:32:36 [INFO] --- maven-resources-plugin:2.5:testResources (default-testResources) @ org.eclipse.m2e.editor.lemminx.tests ---
10:32:36 [debug] execute contextualize
10:32:36 [INFO] Using 'UTF-8' encoding to copy filtered resources.
10:32:36 [INFO] skip non existing resourceDirectory /home/jenkins/agent/workspace/m2e-sonarqube/org.eclipse.m2e.editor.lemminx.tests/src/test/resources
10:32:36 [INFO] 
10:32:36 [INFO] --- tycho-source-plugin:1.6.0:plugin-source (plugin-source) @ org.eclipse.m2e.editor.lemminx.tests ---
10:32:36 [INFO] Building jar: /home/jenkins/agent/workspace/m2e-sonarqube/org.eclipse.m2e.editor.lemminx.tests/target/org.eclipse.m2e.editor.lemminx.tests-1.16.0-SNAPSHOT-sources.jar
10:32:36 [INFO] 
10:32:36 [INFO] --- target-platform-configuration:1.6.0:target-platform (default-target-platform) @ org.eclipse.m2e.editor.lemminx.tests ---
10:32:36 [INFO] 
10:32:36 [INFO] --- tycho-packaging-plugin:1.6.0:package-plugin (default-package-plugin) @ org.eclipse.m2e.editor.lemminx.tests ---
10:32:36 [INFO] Building jar: /home/jenkins/agent/workspace/m2e-sonarqube/org.eclipse.m2e.editor.lemminx.tests/target/org.eclipse.m2e.editor.lemminx.tests-1.16.0-SNAPSHOT.jar
10:32:36 [INFO] 
10:32:36 [INFO] --- tycho-p2-plugin:1.6.0:p2-metadata-default (default-p2-metadata-default) @ org.eclipse.m2e.editor.lemminx.tests ---
10:32:36 [INFO] No baseline version MavenProject: org.eclipse.m2e:org.eclipse.m2e.editor.lemminx.tests:1.16.0-SNAPSHOT @ /home/jenkins/agent/workspace/m2e-sonarqube/org.eclipse.m2e.editor.lemminx.tests/pom.xml
10:32:36 [INFO] 
10:32:36 [INFO] --- tycho-surefire-plugin:1.6.0:test (default-test) @ org.eclipse.m2e.editor.lemminx.tests ---
10:32:37 [INFO] Expected eclipse log file: /home/jenkins/agent/workspace/m2e-sonarqube/org.eclipse.m2e.editor.lemminx.tests/target/work/data/.metadata/.log
10:32:37 [INFO] Command line:
10:32:37 	[/opt/tools/java/oracle/jdk-8/1.8.0_202/jre/bin/java, -Dosgi.noShutdown=false, -Dosgi.os=linux, -Dosgi.ws=gtk, -Dosgi.arch=x86_64, -javaagent:/home/jenkins/agent/workspace/m2e-sonarqube/.repository/org/jacoco/org.jacoco.agent/0.8.5/org.jacoco.agent-0.8.5-runtime.jar=destfile=/home/jenkins/agent/workspace/m2e-sonarqube/jacoco.exec,append=true,includes=org.eclipse.m2e*:org.apache.maven*:org.eclipse.aether*, -Xmx800m, -Dosgi.clean=true, -jar, /home/jenkins/agent/workspace/m2e-sonarqube/.repository/p2/osgi/bundle/org.eclipse.equinox.launcher/1.5.700.v20200207-2156/org.eclipse.equinox.launcher-1.5.700.v20200207-2156.jar, -data, /home/jenkins/agent/workspace/m2e-sonarqube/org.eclipse.m2e.editor.lemminx.tests/target/work/data, -install, /home/jenkins/agent/workspace/m2e-sonarqube/org.eclipse.m2e.editor.lemminx.tests/target/work, -configuration, /home/jenkins/agent/workspace/m2e-sonarqube/org.eclipse.m2e.editor.lemminx.tests/target/work/configuration, -application, org.eclipse.tycho.surefire.osgibooter.uitest, -testproperties, /home/jenkins/agent/workspace/m2e-sonarqube/org.eclipse.m2e.editor.lemminx.tests/target/surefire.properties, -timeout, 7200000]
10:32:37 Picked up JAVA_TOOL_OPTIONS: -XX:+IgnoreUnrecognizedVMOptions -XX:+UseContainerSupport -XX:+UnlockExperimentalVMOptions -XX:+UseCGroupMemoryLimitForHeap
10:32:37 Picked up _JAVA_OPTIONS: -XX:MaxRAMPercentage=64.0
10:32:44 Running org.eclipse.m2e.editor.lemminx.tests.EditorTest
10:32:44 SLF4J: Failed to load class "org.slf4j.impl.StaticLoggerBinder".
10:32:44 SLF4J: Defaulting to no-operation (NOP) logger implementation
10:32:44 SLF4J: See http://www.slf4j.org/codes.html#StaticLoggerBinder for further details.
10:32:47 Warning: NLS missing message: MavenImpl_error_lookup in: org.eclipse.m2e.editor.internal.messages
10:32:50 Picked up JAVA_TOOL_OPTIONS: -XX:+IgnoreUnrecognizedVMOptions -XX:+UseContainerSupport -XX:+UnlockExperimentalVMOptions -XX:+UseCGroupMemoryLimitForHeap
10:32:50 Picked up _JAVA_OPTIONS: -XX:MaxRAMPercentage=64.0
10:32:51 Jun 05, 2020 2:32:51 PM org.eclipse.lemminx.XMLLanguageServer initialize
10:32:51 INFO: Initializing XML Language server 0.11.1-20200325-1306 with /opt/tools/java/oracle/jdk-8/1.8.0_202/jre
10:32:51 Picked up JAVA_TOOL_OPTIONS: -XX:+IgnoreUnrecognizedVMOptions -XX:+UseContainerSupport -XX:+UnlockExperimentalVMOptions -XX:+UseCGroupMemoryLimitForHeap
10:32:51 Picked up _JAVA_OPTIONS: -XX:MaxRAMPercentage=64.0
10:32:52 Jun 05, 2020 2:32:52 PM org.eclipse.lemminx.XMLLanguageServer initialize
10:32:52 INFO: Initializing XML Language server 0.11.1-20200325-1306 with /opt/tools/java/oracle/jdk-8/1.8.0_202/jre
10:32:52 Jun 05, 2020 2:32:52 PM org.eclipse.lsp4j.jsonrpc.RemoteEndpoint fallbackResponseError
10:32:52 SEVERE: Internal error: java.lang.reflect.InvocationTargetException
10:32:52 java.lang.RuntimeException: java.lang.reflect.InvocationTargetException
10:32:52 	at org.eclipse.lsp4j.jsonrpc.services.GenericEndpoint.lambda$null$0(GenericEndpoint.java:67)
10:32:52 	at org.eclipse.lsp4j.jsonrpc.services.GenericEndpoint.request(GenericEndpoint.java:120)
10:32:52 	at org.eclipse.lsp4j.jsonrpc.RemoteEndpoint.handleRequest(RemoteEndpoint.java:261)
10:32:52 	at org.eclipse.lsp4j.jsonrpc.RemoteEndpoint.consume(RemoteEndpoint.java:190)
10:32:52 	at org.eclipse.lemminx.commons.ParentProcessWatcher.lambda$apply$0(ParentProcessWatcher.java:143)
10:32:52 	at org.eclipse.lsp4j.jsonrpc.json.StreamMessageProducer.handleMessage(StreamMessageProducer.java:194)
10:32:52 	at org.eclipse.lsp4j.jsonrpc.json.StreamMessageProducer.listen(StreamMessageProducer.java:94)
10:32:52 	at org.eclipse.lsp4j.jsonrpc.json.ConcurrentMessageProcessor.run(ConcurrentMessageProcessor.java:113)
10:32:52 	at java.util.concurrent.Executors$RunnableAdapter.call(Executors.java:511)
10:32:52 	at java.util.concurrent.FutureTask.run(FutureTask.java:266)
10:32:52 	at java.util.concurrent.ThreadPoolExecutor.runWorker(ThreadPoolExecutor.java:1149)
10:32:52 	at java.util.concurrent.ThreadPoolExecutor$Worker.run(ThreadPoolExecutor.java:624)
10:32:52 	at java.lang.Thread.run(Thread.java:748)
10:32:52 Caused by: java.lang.reflect.InvocationTargetException
10:32:52 	at sun.reflect.NativeMethodAccessorImpl.invoke0(Native Method)
10:32:52 	at sun.reflect.NativeMethodAccessorImpl.invoke(NativeMethodAccessorImpl.java:62)
10:32:52 	at sun.reflect.DelegatingMethodAccessorImpl.invoke(DelegatingMethodAccessorImpl.java:43)
10:32:52 	at java.lang.reflect.Method.invoke(Method.java:498)
10:32:52 	at org.eclipse.lsp4j.jsonrpc.services.GenericEndpoint.lambda$null$0(GenericEndpoint.java:65)
10:32:52 	... 12 more
10:32:52 Caused by: java.lang.NullPointerException
10:32:52 	at org.eclipse.lemminx.XMLTextDocumentService.computeDOMAsync(XMLTextDocumentService.java:516)
10:32:52 	at org.eclipse.lemminx.XMLTextDocumentService.foldingRange(XMLTextDocumentService.java:288)
10:32:52 	... 17 more
10:32:52 
10:32:53 SLF4J: Failed to load class "org.slf4j.impl.StaticLoggerBinder".
10:32:53 SLF4J: Defaulting to no-operation (NOP) logger implementation
10:32:53 SLF4J: See http://www.slf4j.org/codes.html#StaticLoggerBinder for further details.
10:33:03 Jun 05, 2020 2:33:03 PM org.eclipse.lemminx.services.extensions.XMLExtensionsRegistry unregisterExtension
10:33:03 SEVERE: Error while stopping extension <org.eclipse.lemminx.maven.MavenPlugin>
10:33:03 java.lang.NullPointerException
10:33:03 	at org.eclipse.lemminx.maven.MavenPlugin.stop(MavenPlugin.java:228)
10:33:03 	at org.eclipse.lemminx.services.extensions.XMLExtensionsRegistry.unregisterExtension(XMLExtensionsRegistry.java:208)
10:33:03 	at java.util.ArrayList.forEach(ArrayList.java:1257)
10:33:03 	at org.eclipse.lemminx.services.extensions.XMLExtensionsRegistry.dispose(XMLExtensionsRegistry.java:221)
10:33:03 	at org.eclipse.lemminx.XMLLanguageServer.shutdown(XMLLanguageServer.java:181)
10:33:03 	at sun.reflect.NativeMethodAccessorImpl.invoke0(Native Method)
10:33:03 	at sun.reflect.NativeMethodAccessorImpl.invoke(NativeMethodAccessorImpl.java:62)
10:33:03 	at sun.reflect.DelegatingMethodAccessorImpl.invoke(DelegatingMethodAccessorImpl.java:43)
10:33:03 	at java.lang.reflect.Method.invoke(Method.java:498)
10:33:03 	at org.eclipse.lsp4j.jsonrpc.services.GenericEndpoint.lambda$null$0(GenericEndpoint.java:65)
10:33:03 	at org.eclipse.lsp4j.jsonrpc.services.GenericEndpoint.request(GenericEndpoint.java:120)
10:33:03 	at org.eclipse.lsp4j.jsonrpc.RemoteEndpoint.handleRequest(RemoteEndpoint.java:261)
10:33:03 	at org.eclipse.lsp4j.jsonrpc.RemoteEndpoint.consume(RemoteEndpoint.java:190)
10:33:03 	at org.eclipse.lemminx.commons.ParentProcessWatcher.lambda$apply$0(ParentProcessWatcher.java:143)
10:33:03 	at org.eclipse.lsp4j.jsonrpc.json.StreamMessageProducer.handleMessage(StreamMessageProducer.java:194)
10:33:03 	at org.eclipse.lsp4j.jsonrpc.json.StreamMessageProducer.listen(StreamMessageProducer.java:94)
10:33:03 	at org.eclipse.lsp4j.jsonrpc.json.ConcurrentMessageProcessor.run(ConcurrentMessageProcessor.java:113)
10:33:03 	at java.util.concurrent.Executors$RunnableAdapter.call(Executors.java:511)
10:33:03 	at java.util.concurrent.FutureTask.run(FutureTask.java:266)
10:33:03 	at java.util.concurrent.ThreadPoolExecutor.runWorker(ThreadPoolExecutor.java:1149)
10:33:03 	at java.util.concurrent.ThreadPoolExecutor$Worker.run(ThreadPoolExecutor.java:624)
10:33:03 	at java.lang.Thread.run(Thread.java:748)
10:33:03 
10:33:03 Tests run: 2, Failures: 1, Errors: 0, Skipped: 0, Time elapsed: 19.02 s <<< FAILURE! - in org.eclipse.m2e.editor.lemminx.tests.EditorTest
10:33:03 testEditorOpenOnSourcePage(org.eclipse.m2e.editor.lemminx.tests.EditorTest)  Time elapsed: 7.445 s
10:33:03 testGenericEditorHasMavenExtensionEnabled(org.eclipse.m2e.editor.lemminx.tests.EditorTest)  Time elapsed: 11.552 s  <<< FAILURE!
10:33:03 java.lang.AssertionError: Missing diagnostic report
10:33:03 	at org.eclipse.m2e.editor.lemminx.tests.EditorTest.testGenericEditorHasMavenExtensionEnabled(EditorTest.java:66)
10:33:03 
10:33:03 
10:33:03 Results:
10:33:03 
10:33:03 Failures: 
10:33:03   EditorTest.testGenericEditorHasMavenExtensionEnabled:66 Missing diagnostic report
10:33:03 
10:33:03 Tests run: 2, Failures: 1, Errors: 0, Skipped: 0
10:33:03 
10:33:13 [ERROR] There are test failures.
10:33:13 
10:33:13 Please refer to /home/jenkins/agent/workspace/m2e-sonarqube/org.eclipse.m2e.editor.lemminx.tests/target/surefire-reports for the individual test results.
10:33:13 [INFO] 
10:33:13 [INFO] --- tycho-p2-extras-plugin:1.6.0:compare-version-with-baselines (check-no-version-regression) @ org.eclipse.m2e.editor.lemminx.tests ---
10:33:13 [INFO] 
10:33:13 [INFO] --- maven-install-plugin:2.3.1:install (default-install) @ org.eclipse.m2e.editor.lemminx.tests ---
10:33:13 [INFO] Installing /home/jenkins/agent/workspace/m2e-sonarqube/org.eclipse.m2e.editor.lemminx.tests/target/org.eclipse.m2e.editor.lemminx.tests-1.16.0-SNAPSHOT.jar to /home/jenkins/agent/workspace/m2e-sonarqube/.repository/org/eclipse/m2e/org.eclipse.m2e.editor.lemminx.tests/1.16.0-SNAPSHOT/org.eclipse.m2e.editor.lemminx.tests-1.16.0-SNAPSHOT.jar
10:33:13 [INFO] Installing /home/jenkins/agent/workspace/m2e-sonarqube/org.eclipse.m2e.editor.lemminx.tests/pom.xml to /home/jenkins/agent/workspace/m2e-sonarqube/.repository/org/eclipse/m2e/org.eclipse.m2e.editor.lemminx.tests/1.16.0-SNAPSHOT/org.eclipse.m2e.editor.lemminx.tests-1.16.0-SNAPSHOT.pom
10:33:13 [INFO] Installing /home/jenkins/agent/workspace/m2e-sonarqube/org.eclipse.m2e.editor.lemminx.tests/target/org.eclipse.m2e.editor.lemminx.tests-1.16.0-SNAPSHOT-sources.jar to /home/jenkins/agent/workspace/m2e-sonarqube/.repository/org/eclipse/m2e/org.eclipse.m2e.editor.lemminx.tests/1.16.0-SNAPSHOT/org.eclipse.m2e.editor.lemminx.tests-1.16.0-SNAPSHOT-sources.jar
10:33:13 [INFO] Installing /home/jenkins/agent/workspace/m2e-sonarqube/org.eclipse.m2e.editor.lemminx.tests/target/p2content.xml to /home/jenkins/agent/workspace/m2e-sonarqube/.repository/org/eclipse/m2e/org.eclipse.m2e.editor.lemminx.tests/1.16.0-SNAPSHOT/org.eclipse.m2e.editor.lemminx.tests-1.16.0-SNAPSHOT-p2metadata.xml
10:33:13 [INFO] Installing /home/jenkins/agent/workspace/m2e-sonarqube/org.eclipse.m2e.editor.lemminx.tests/target/p2artifacts.xml to /home/jenkins/agent/workspace/m2e-sonarqube/.repository/org/eclipse/m2e/org.eclipse.m2e.editor.lemminx.tests/1.16.0-SNAPSHOT/org.eclipse.m2e.editor.lemminx.tests-1.16.0-SNAPSHOT-p2artifacts.xml
10:33:13 [INFO] 
10:33:13 [INFO] --- tycho-p2-plugin:1.6.0:update-local-index (default-update-local-index) @ org.eclipse.m2e.editor.lemminx.tests ---
10:33:13 [INFO] 
10:33:13 [INFO] -------------< org.eclipse.m2e:org.eclipse.m2e.jdt.tests >--------------
10:33:13 [INFO] Building org.eclipse.m2e.jdt.tests 1.16.0-SNAPSHOT               [35/40]
10:33:13 [INFO] ------------------------[ eclipse-test-plugin ]-------------------------
10:33:13 [INFO] 
10:33:13 [INFO] --- maven-clean-plugin:2.4.1:clean (default-clean) @ org.eclipse.m2e.jdt.tests ---
10:33:13 [INFO] 
10:33:13 [INFO] --- tycho-packaging-plugin:1.6.0:build-qualifier (default-build-qualifier) @ org.eclipse.m2e.jdt.tests ---
10:33:13 [INFO] The project's OSGi version is 1.16.0.20200514-1409
10:33:13 [INFO] 
10:33:13 [INFO] --- tycho-packaging-plugin:1.6.0:validate-id (default-validate-id) @ org.eclipse.m2e.jdt.tests ---
10:33:13 [INFO] 
10:33:13 [INFO] --- tycho-packaging-plugin:1.6.0:validate-version (default-validate-version) @ org.eclipse.m2e.jdt.tests ---
10:33:13 [INFO] 
10:33:13 [INFO] --- jacoco-maven-plugin:0.8.5:prepare-agent (default) @ org.eclipse.m2e.jdt.tests ---
10:33:13 [INFO] tycho.testArgLine set to -javaagent:/home/jenkins/agent/workspace/m2e-sonarqube/.repository/org/jacoco/org.jacoco.agent/0.8.5/org.jacoco.agent-0.8.5-runtime.jar=destfile=/home/jenkins/agent/workspace/m2e-sonarqube/jacoco.exec,append=true,includes=org.eclipse.m2e*:org.apache.maven*:org.eclipse.aether* -Xmx800m
10:33:13 [INFO] 
10:33:13 [INFO] --- maven-resources-plugin:2.5:resources (default-resources) @ org.eclipse.m2e.jdt.tests ---
10:33:13 [debug] execute contextualize
10:33:13 [INFO] Using 'UTF-8' encoding to copy filtered resources.
10:33:13 [INFO] skip non existing resourceDirectory /home/jenkins/agent/workspace/m2e-sonarqube/org.eclipse.m2e.jdt.tests/src/main/resources
10:33:13 [INFO] 
10:33:13 [INFO] --- tycho-compiler-plugin:1.6.0:compile (default-compile) @ org.eclipse.m2e.jdt.tests ---
10:33:13 [WARNING] Parameter 'useProjectSettings' is set to true, but preferences file '/home/jenkins/agent/workspace/m2e-sonarqube/org.eclipse.m2e.jdt.tests/.settings/org.eclipse.jdt.core.prefs' could not be found!
10:33:13 [INFO] Compiling 1 source file to /home/jenkins/agent/workspace/m2e-sonarqube/org.eclipse.m2e.jdt.tests/target/classes
10:33:13 [INFO] 
10:33:13 [INFO] --- maven-resources-plugin:2.5:testResources (default-testResources) @ org.eclipse.m2e.jdt.tests ---
10:33:13 [debug] execute contextualize
10:33:13 [INFO] Using 'UTF-8' encoding to copy filtered resources.
10:33:13 [INFO] skip non existing resourceDirectory /home/jenkins/agent/workspace/m2e-sonarqube/org.eclipse.m2e.jdt.tests/src/test/resources
10:33:13 [INFO] 
10:33:13 [INFO] --- tycho-source-plugin:1.6.0:plugin-source (plugin-source) @ org.eclipse.m2e.jdt.tests ---
10:33:13 [WARNING] Bundle-Name header not found in /home/jenkins/agent/workspace/m2e-sonarqube/org.eclipse.m2e.jdt.tests/META-INF/MANIFEST.MF, fallback to Bundle-SymbolicName for source bundle
10:33:13 [WARNING] Bundle-Vendor header not found in /home/jenkins/agent/workspace/m2e-sonarqube/org.eclipse.m2e.jdt.tests/META-INF/MANIFEST.MF, fallback to 'unknown' for source bundle
10:33:13 [INFO] Building jar: /home/jenkins/agent/workspace/m2e-sonarqube/org.eclipse.m2e.jdt.tests/target/org.eclipse.m2e.jdt.tests-1.16.0-SNAPSHOT-sources.jar
10:33:13 [INFO] 
10:33:13 [INFO] --- target-platform-configuration:1.6.0:target-platform (default-target-platform) @ org.eclipse.m2e.jdt.tests ---
10:33:13 [INFO] 
10:33:13 [INFO] --- tycho-packaging-plugin:1.6.0:package-plugin (default-package-plugin) @ org.eclipse.m2e.jdt.tests ---
10:33:13 [INFO] Building jar: /home/jenkins/agent/workspace/m2e-sonarqube/org.eclipse.m2e.jdt.tests/target/org.eclipse.m2e.jdt.tests-1.16.0-SNAPSHOT.jar
10:33:13 [INFO] 
10:33:13 [INFO] --- tycho-p2-plugin:1.6.0:p2-metadata-default (default-p2-metadata-default) @ org.eclipse.m2e.jdt.tests ---
10:33:13 [INFO] No baseline version MavenProject: org.eclipse.m2e:org.eclipse.m2e.jdt.tests:1.16.0-SNAPSHOT @ /home/jenkins/agent/workspace/m2e-sonarqube/org.eclipse.m2e.jdt.tests/pom.xml
10:33:13 [INFO] 
10:33:13 [INFO] --- tycho-surefire-plugin:1.6.0:test (default-test) @ org.eclipse.m2e.jdt.tests ---
10:33:14 [INFO] Expected eclipse log file: /home/jenkins/agent/workspace/m2e-sonarqube/org.eclipse.m2e.jdt.tests/target/work/data/.metadata/.log
10:33:14 [INFO] Command line:
10:33:14 	[/opt/tools/java/oracle/jdk-8/1.8.0_202/jre/bin/java, -Dosgi.noShutdown=false, -Dosgi.os=linux, -Dosgi.ws=gtk, -Dosgi.arch=x86_64, -javaagent:/home/jenkins/agent/workspace/m2e-sonarqube/.repository/org/jacoco/org.jacoco.agent/0.8.5/org.jacoco.agent-0.8.5-runtime.jar=destfile=/home/jenkins/agent/workspace/m2e-sonarqube/jacoco.exec,append=true,includes=org.eclipse.m2e*:org.apache.maven*:org.eclipse.aether*, -Xmx800m, -Dosgi.clean=true, -jar, /home/jenkins/agent/workspace/m2e-sonarqube/.repository/p2/osgi/bundle/org.eclipse.equinox.launcher/1.5.700.v20200207-2156/org.eclipse.equinox.launcher-1.5.700.v20200207-2156.jar, -data, /home/jenkins/agent/workspace/m2e-sonarqube/org.eclipse.m2e.jdt.tests/target/work/data, -install, /home/jenkins/agent/workspace/m2e-sonarqube/org.eclipse.m2e.jdt.tests/target/work, -configuration, /home/jenkins/agent/workspace/m2e-sonarqube/org.eclipse.m2e.jdt.tests/target/work/configuration, -application, org.eclipse.tycho.surefire.osgibooter.uitest, -testproperties, /home/jenkins/agent/workspace/m2e-sonarqube/org.eclipse.m2e.jdt.tests/target/surefire.properties, -timeout, 7200000]
10:33:14 Picked up JAVA_TOOL_OPTIONS: -XX:+IgnoreUnrecognizedVMOptions -XX:+UseContainerSupport -XX:+UnlockExperimentalVMOptions -XX:+UseCGroupMemoryLimitForHeap
10:33:14 Picked up _JAVA_OPTIONS: -XX:MaxRAMPercentage=64.0
10:33:21 Running org.eclipse.m2e.jdt.tests.JavaConfigurationTest
10:33:21 SLF4J: Failed to load class "org.slf4j.impl.StaticLoggerBinder".
10:33:21 SLF4J: Defaulting to no-operation (NOP) logger implementation
10:33:21 SLF4J: See http://www.slf4j.org/codes.html#StaticLoggerBinder for further details.
10:35:56 Tests run: 1, Failures: 0, Errors: 0, Skipped: 0, Time elapsed: 155.186 s - in org.eclipse.m2e.jdt.tests.JavaConfigurationTest
10:35:56 testFileChangeUpdatesJDTSettings(org.eclipse.m2e.jdt.tests.JavaConfigurationTest)  Time elapsed: 153.138 s
10:35:56 
10:35:56 Results:
10:35:56 
10:35:56 Tests run: 1, Failures: 0, Errors: 0, Skipped: 0
10:35:56 
10:36:15 [INFO] All tests passed!
10:36:15 [INFO] 
10:36:15 [INFO] --- tycho-p2-extras-plugin:1.6.0:compare-version-with-baselines (check-no-version-regression) @ org.eclipse.m2e.jdt.tests ---
10:36:15 [INFO] 
10:36:15 [INFO] --- maven-install-plugin:2.3.1:install (default-install) @ org.eclipse.m2e.jdt.tests ---
10:36:15 [INFO] Installing /home/jenkins/agent/workspace/m2e-sonarqube/org.eclipse.m2e.jdt.tests/target/org.eclipse.m2e.jdt.tests-1.16.0-SNAPSHOT.jar to /home/jenkins/agent/workspace/m2e-sonarqube/.repository/org/eclipse/m2e/org.eclipse.m2e.jdt.tests/1.16.0-SNAPSHOT/org.eclipse.m2e.jdt.tests-1.16.0-SNAPSHOT.jar
10:36:15 [INFO] Installing /home/jenkins/agent/workspace/m2e-sonarqube/org.eclipse.m2e.jdt.tests/pom.xml to /home/jenkins/agent/workspace/m2e-sonarqube/.repository/org/eclipse/m2e/org.eclipse.m2e.jdt.tests/1.16.0-SNAPSHOT/org.eclipse.m2e.jdt.tests-1.16.0-SNAPSHOT.pom
10:36:16 [INFO] Installing /home/jenkins/agent/workspace/m2e-sonarqube/org.eclipse.m2e.jdt.tests/target/org.eclipse.m2e.jdt.tests-1.16.0-SNAPSHOT-sources.jar to /home/jenkins/agent/workspace/m2e-sonarqube/.repository/org/eclipse/m2e/org.eclipse.m2e.jdt.tests/1.16.0-SNAPSHOT/org.eclipse.m2e.jdt.tests-1.16.0-SNAPSHOT-sources.jar
10:36:16 [INFO] Installing /home/jenkins/agent/workspace/m2e-sonarqube/org.eclipse.m2e.jdt.tests/target/p2content.xml to /home/jenkins/agent/workspace/m2e-sonarqube/.repository/org/eclipse/m2e/org.eclipse.m2e.jdt.tests/1.16.0-SNAPSHOT/org.eclipse.m2e.jdt.tests-1.16.0-SNAPSHOT-p2metadata.xml
10:36:16 [INFO] Installing /home/jenkins/agent/workspace/m2e-sonarqube/org.eclipse.m2e.jdt.tests/target/p2artifacts.xml to /home/jenkins/agent/workspace/m2e-sonarqube/.repository/org/eclipse/m2e/org.eclipse.m2e.jdt.tests/1.16.0-SNAPSHOT/org.eclipse.m2e.jdt.tests-1.16.0-SNAPSHOT-p2artifacts.xml
10:36:16 [INFO] 
10:36:16 [INFO] --- tycho-p2-plugin:1.6.0:update-local-index (default-update-local-index) @ org.eclipse.m2e.jdt.tests ---
10:36:16 [INFO] 
10:36:16 [INFO] --------< org.eclipse.m2e:org.eclipse.m2e.editor.xml.sse.tests >--------
10:36:16 [INFO] Building org.eclipse.m2e.editor.xml.sse.tests 1.16.0-SNAPSHOT    [36/40]
10:36:16 [INFO] ------------------------[ eclipse-test-plugin ]-------------------------
10:36:16 [INFO] 
10:36:16 [INFO] --- maven-clean-plugin:2.4.1:clean (default-clean) @ org.eclipse.m2e.editor.xml.sse.tests ---
10:36:16 [INFO] 
10:36:16 [INFO] --- tycho-packaging-plugin:1.6.0:build-qualifier (default-build-qualifier) @ org.eclipse.m2e.editor.xml.sse.tests ---
10:36:16 [INFO] The project's OSGi version is 1.16.0.20200514-2159
10:36:16 [INFO] 
10:36:16 [INFO] --- tycho-packaging-plugin:1.6.0:validate-id (default-validate-id) @ org.eclipse.m2e.editor.xml.sse.tests ---
10:36:16 [INFO] 
10:36:16 [INFO] --- tycho-packaging-plugin:1.6.0:validate-version (default-validate-version) @ org.eclipse.m2e.editor.xml.sse.tests ---
10:36:16 [INFO] 
10:36:16 [INFO] --- jacoco-maven-plugin:0.8.5:prepare-agent (default) @ org.eclipse.m2e.editor.xml.sse.tests ---
10:36:16 [INFO] tycho.testArgLine set to -javaagent:/home/jenkins/agent/workspace/m2e-sonarqube/.repository/org/jacoco/org.jacoco.agent/0.8.5/org.jacoco.agent-0.8.5-runtime.jar=destfile=/home/jenkins/agent/workspace/m2e-sonarqube/jacoco.exec,append=true,includes=org.eclipse.m2e*:org.apache.maven*:org.eclipse.aether* -Xmx800m
10:36:16 [INFO] 
10:36:16 [INFO] --- maven-resources-plugin:2.5:resources (default-resources) @ org.eclipse.m2e.editor.xml.sse.tests ---
10:36:16 [debug] execute contextualize
10:36:16 [INFO] Using 'UTF-8' encoding to copy filtered resources.
10:36:16 [INFO] skip non existing resourceDirectory /home/jenkins/agent/workspace/m2e-sonarqube/org.eclipse.m2e.editor.xml.sse.tests/src/main/resources
10:36:16 [INFO] 
10:36:16 [INFO] --- tycho-compiler-plugin:1.6.0:compile (default-compile) @ org.eclipse.m2e.editor.xml.sse.tests ---
10:36:16 [WARNING] Parameter 'useProjectSettings' is set to true, but preferences file '/home/jenkins/agent/workspace/m2e-sonarqube/org.eclipse.m2e.editor.xml.sse.tests/.settings/org.eclipse.jdt.core.prefs' could not be found!
10:36:16 [INFO] Compiling 1 source file to /home/jenkins/agent/workspace/m2e-sonarqube/org.eclipse.m2e.editor.xml.sse.tests/target/classes
10:36:16 [INFO] 
10:36:16 [INFO] --- maven-resources-plugin:2.5:testResources (default-testResources) @ org.eclipse.m2e.editor.xml.sse.tests ---
10:36:16 [debug] execute contextualize
10:36:16 [INFO] Using 'UTF-8' encoding to copy filtered resources.
10:36:16 [INFO] skip non existing resourceDirectory /home/jenkins/agent/workspace/m2e-sonarqube/org.eclipse.m2e.editor.xml.sse.tests/src/test/resources
10:36:16 [INFO] 
10:36:16 [INFO] --- tycho-source-plugin:1.6.0:plugin-source (plugin-source) @ org.eclipse.m2e.editor.xml.sse.tests ---
10:36:16 [INFO] Building jar: /home/jenkins/agent/workspace/m2e-sonarqube/org.eclipse.m2e.editor.xml.sse.tests/target/org.eclipse.m2e.editor.xml.sse.tests-1.16.0-SNAPSHOT-sources.jar
10:36:16 [INFO] 
10:36:16 [INFO] --- target-platform-configuration:1.6.0:target-platform (default-target-platform) @ org.eclipse.m2e.editor.xml.sse.tests ---
10:36:16 [INFO] 
10:36:16 [INFO] --- tycho-packaging-plugin:1.6.0:package-plugin (default-package-plugin) @ org.eclipse.m2e.editor.xml.sse.tests ---
10:36:16 [INFO] Building jar: /home/jenkins/agent/workspace/m2e-sonarqube/org.eclipse.m2e.editor.xml.sse.tests/target/org.eclipse.m2e.editor.xml.sse.tests-1.16.0-SNAPSHOT.jar
10:36:16 [INFO] 
10:36:16 [INFO] --- tycho-p2-plugin:1.6.0:p2-metadata-default (default-p2-metadata-default) @ org.eclipse.m2e.editor.xml.sse.tests ---
10:36:16 [INFO] No baseline version MavenProject: org.eclipse.m2e:org.eclipse.m2e.editor.xml.sse.tests:1.16.0-SNAPSHOT @ /home/jenkins/agent/workspace/m2e-sonarqube/org.eclipse.m2e.editor.xml.sse.tests/pom.xml
10:36:16 [INFO] 
10:36:16 [INFO] --- tycho-surefire-plugin:1.6.0:test (default-test) @ org.eclipse.m2e.editor.xml.sse.tests ---
10:36:17 [INFO] Expected eclipse log file: /home/jenkins/agent/workspace/m2e-sonarqube/org.eclipse.m2e.editor.xml.sse.tests/target/work/data/.metadata/.log
10:36:17 [INFO] Command line:
10:36:17 	[/opt/tools/java/oracle/jdk-8/1.8.0_202/jre/bin/java, -Dosgi.noShutdown=false, -Dosgi.os=linux, -Dosgi.ws=gtk, -Dosgi.arch=x86_64, -javaagent:/home/jenkins/agent/workspace/m2e-sonarqube/.repository/org/jacoco/org.jacoco.agent/0.8.5/org.jacoco.agent-0.8.5-runtime.jar=destfile=/home/jenkins/agent/workspace/m2e-sonarqube/jacoco.exec,append=true,includes=org.eclipse.m2e*:org.apache.maven*:org.eclipse.aether*, -Xmx800m, -Dosgi.clean=true, -jar, /home/jenkins/agent/workspace/m2e-sonarqube/.repository/p2/osgi/bundle/org.eclipse.equinox.launcher/1.5.700.v20200207-2156/org.eclipse.equinox.launcher-1.5.700.v20200207-2156.jar, -data, /home/jenkins/agent/workspace/m2e-sonarqube/org.eclipse.m2e.editor.xml.sse.tests/target/work/data, -install, /home/jenkins/agent/workspace/m2e-sonarqube/org.eclipse.m2e.editor.xml.sse.tests/target/work, -configuration, /home/jenkins/agent/workspace/m2e-sonarqube/org.eclipse.m2e.editor.xml.sse.tests/target/work/configuration, -application, org.eclipse.tycho.surefire.osgibooter.uitest, -testproperties, /home/jenkins/agent/workspace/m2e-sonarqube/org.eclipse.m2e.editor.xml.sse.tests/target/surefire.properties, -timeout, 7200000]
10:36:17 Picked up JAVA_TOOL_OPTIONS: -XX:+IgnoreUnrecognizedVMOptions -XX:+UseContainerSupport -XX:+UnlockExperimentalVMOptions -XX:+UseCGroupMemoryLimitForHeap
10:36:17 Picked up _JAVA_OPTIONS: -XX:MaxRAMPercentage=64.0
10:36:25 Running org.eclipse.m2e.editor.xml.sse.tests.WTPEditorTest
10:36:25 SLF4J: Failed to load class "org.slf4j.impl.StaticLoggerBinder".
10:36:25 SLF4J: Defaulting to no-operation (NOP) logger implementation
10:36:25 SLF4J: See http://www.slf4j.org/codes.html#StaticLoggerBinder for further details.
10:36:27 Warning: NLS missing message: MavenImpl_error_lookup in: org.eclipse.m2e.editor.internal.messages
10:36:29 Warning: NLS unused message: MarkerHoverControl_openDiscoveryPrefs in: org.eclipse.m2e.editor.xml.internal.messages
10:36:29 Warning: NLS unused message: MarkerHoverControl_openLifecyclePrefs in: org.eclipse.m2e.editor.xml.internal.messages
10:36:29 Warning: NLS unused message: MarkerHoverControl_openParentDefinition in: org.eclipse.m2e.editor.xml.internal.messages
10:36:29 Warning: NLS unused message: MarkerHoverControl_openWarningsPrefs in: org.eclipse.m2e.editor.xml.internal.messages
10:36:29 Warning: NLS unused message: MavenMarkerResolution_error in: org.eclipse.m2e.editor.xml.internal.messages
10:36:29 Warning: NLS unused message: MavenMarkerResolution_error_title in: org.eclipse.m2e.editor.xml.internal.messages
10:36:29 Warning: NLS unused message: MavenMarkerResolution_schema_label in: org.eclipse.m2e.editor.xml.internal.messages
10:36:30 Tests run: 1, Failures: 0, Errors: 0, Skipped: 0, Time elapsed: 4.696 s - in org.eclipse.m2e.editor.xml.sse.tests.WTPEditorTest
10:36:30 testXSDCompletion(org.eclipse.m2e.editor.xml.sse.tests.WTPEditorTest)  Time elapsed: 4.67 s
10:36:30 
10:36:30 Results:
10:36:30 
10:36:30 Tests run: 1, Failures: 0, Errors: 0, Skipped: 0
10:36:30 
10:36:54 [INFO] All tests passed!
10:36:54 [INFO] 
10:36:54 [INFO] --- tycho-p2-extras-plugin:1.6.0:compare-version-with-baselines (check-no-version-regression) @ org.eclipse.m2e.editor.xml.sse.tests ---
10:36:57 [INFO] 
10:36:57 [INFO] --- maven-install-plugin:2.3.1:install (default-install) @ org.eclipse.m2e.editor.xml.sse.tests ---
10:36:57 [INFO] Installing /home/jenkins/agent/workspace/m2e-sonarqube/org.eclipse.m2e.editor.xml.sse.tests/target/org.eclipse.m2e.editor.xml.sse.tests-1.16.0-SNAPSHOT.jar to /home/jenkins/agent/workspace/m2e-sonarqube/.repository/org/eclipse/m2e/org.eclipse.m2e.editor.xml.sse.tests/1.16.0-SNAPSHOT/org.eclipse.m2e.editor.xml.sse.tests-1.16.0-SNAPSHOT.jar
10:36:57 [INFO] Installing /home/jenkins/agent/workspace/m2e-sonarqube/org.eclipse.m2e.editor.xml.sse.tests/pom.xml to /home/jenkins/agent/workspace/m2e-sonarqube/.repository/org/eclipse/m2e/org.eclipse.m2e.editor.xml.sse.tests/1.16.0-SNAPSHOT/org.eclipse.m2e.editor.xml.sse.tests-1.16.0-SNAPSHOT.pom
10:36:57 [INFO] Installing /home/jenkins/agent/workspace/m2e-sonarqube/org.eclipse.m2e.editor.xml.sse.tests/target/org.eclipse.m2e.editor.xml.sse.tests-1.16.0-SNAPSHOT-sources.jar to /home/jenkins/agent/workspace/m2e-sonarqube/.repository/org/eclipse/m2e/org.eclipse.m2e.editor.xml.sse.tests/1.16.0-SNAPSHOT/org.eclipse.m2e.editor.xml.sse.tests-1.16.0-SNAPSHOT-sources.jar
10:36:57 [INFO] Installing /home/jenkins/agent/workspace/m2e-sonarqube/org.eclipse.m2e.editor.xml.sse.tests/target/p2content.xml to /home/jenkins/agent/workspace/m2e-sonarqube/.repository/org/eclipse/m2e/org.eclipse.m2e.editor.xml.sse.tests/1.16.0-SNAPSHOT/org.eclipse.m2e.editor.xml.sse.tests-1.16.0-SNAPSHOT-p2metadata.xml
10:36:57 [INFO] Installing /home/jenkins/agent/workspace/m2e-sonarqube/org.eclipse.m2e.editor.xml.sse.tests/target/p2artifacts.xml to /home/jenkins/agent/workspace/m2e-sonarqube/.repository/org/eclipse/m2e/org.eclipse.m2e.editor.xml.sse.tests/1.16.0-SNAPSHOT/org.eclipse.m2e.editor.xml.sse.tests-1.16.0-SNAPSHOT-p2artifacts.xml
10:36:57 [INFO] 
10:36:57 [INFO] --- tycho-p2-plugin:1.6.0:update-local-index (default-update-local-index) @ org.eclipse.m2e.editor.xml.sse.tests ---
10:36:57 [INFO] 
10:36:57 [INFO] -------------------< org.eclipse.m2e:m2e-core-tests >-------------------
10:36:57 [INFO] Building m2e-core-tests 1.16.0-SNAPSHOT                          [37/40]
10:36:57 [INFO] --------------------------------[ pom ]---------------------------------
10:36:57 [INFO] 
10:36:57 [INFO] --- maven-clean-plugin:2.4.1:clean (default-clean) @ m2e-core-tests ---
10:36:57 [INFO] 
10:36:57 [INFO] --- jacoco-maven-plugin:0.8.5:prepare-agent (default) @ m2e-core-tests ---
10:36:57 [INFO] argLine set to -javaagent:/home/jenkins/agent/workspace/m2e-sonarqube/.repository/org/jacoco/org.jacoco.agent/0.8.5/org.jacoco.agent-0.8.5-runtime.jar=destfile=/home/jenkins/agent/workspace/m2e-sonarqube/jacoco.exec,append=true,includes=org.eclipse.m2e*:org.apache.maven*:org.eclipse.aether*
10:36:57 [INFO] 
10:36:57 [INFO] --- tycho-source-plugin:1.6.0:plugin-source (plugin-source) @ m2e-core-tests ---
10:36:57 [INFO] 
10:36:57 [INFO] --- tycho-p2-extras-plugin:1.6.0:compare-version-with-baselines (check-no-version-regression) @ m2e-core-tests ---
10:36:57 [INFO] 
10:36:57 [INFO] --- maven-install-plugin:2.3.1:install (default-install) @ m2e-core-tests ---
10:36:57 [INFO] Installing /home/jenkins/agent/workspace/m2e-sonarqube/m2e-core-tests/pom.xml to /home/jenkins/agent/workspace/m2e-sonarqube/.repository/org/eclipse/m2e/m2e-core-tests/1.16.0-SNAPSHOT/m2e-core-tests-1.16.0-SNAPSHOT.pom
10:36:57 [INFO] 
10:36:57 [INFO] ---------------< org.eclipse.m2e:org.eclipse.m2e.tests >----------------
10:36:57 [INFO] Building Maven Integration for Eclipse tests 1.16.0-SNAPSHOT     [38/40]
10:36:57 [INFO] ------------------------[ eclipse-test-plugin ]-------------------------
10:36:57 [INFO] 
10:36:57 [INFO] --- maven-clean-plugin:2.4.1:clean (default-clean) @ org.eclipse.m2e.tests ---
10:36:57 [INFO] 
10:36:57 [INFO] --- tycho-packaging-plugin:1.6.0:build-qualifier (default-build-qualifier) @ org.eclipse.m2e.tests ---
10:36:57 [INFO] The project's OSGi version is 1.16.0.20200429-0948
10:36:57 [INFO] 
10:36:57 [INFO] --- tycho-packaging-plugin:1.6.0:validate-id (default-validate-id) @ org.eclipse.m2e.tests ---
10:36:57 [INFO] 
10:36:57 [INFO] --- tycho-packaging-plugin:1.6.0:validate-version (default-validate-version) @ org.eclipse.m2e.tests ---
10:36:57 [INFO] 
10:36:57 [INFO] --- jacoco-maven-plugin:0.8.5:prepare-agent (default) @ org.eclipse.m2e.tests ---
10:36:57 [INFO] tycho.testArgLine set to -javaagent:/home/jenkins/agent/workspace/m2e-sonarqube/.repository/org/jacoco/org.jacoco.agent/0.8.5/org.jacoco.agent-0.8.5-runtime.jar=destfile=/home/jenkins/agent/workspace/m2e-sonarqube/jacoco.exec,append=true,includes=org.eclipse.m2e*:org.apache.maven*:org.eclipse.aether* -Xmx800m
10:36:57 [INFO] 
10:36:57 [INFO] --- maven-resources-plugin:2.5:resources (default-resources) @ org.eclipse.m2e.tests ---
10:36:57 [debug] execute contextualize
10:36:57 [INFO] Using 'UTF-8' encoding to copy filtered resources.
10:36:57 [INFO] skip non existing resourceDirectory /home/jenkins/agent/workspace/m2e-sonarqube/m2e-core-tests/org.eclipse.m2e.tests/src/main/resources
10:36:57 [INFO] 
10:36:57 [INFO] --- tycho-compiler-plugin:1.6.0:compile (default-compile) @ org.eclipse.m2e.tests ---
10:36:57 [INFO] Compiling 113 source files to /home/jenkins/agent/workspace/m2e-sonarqube/m2e-core-tests/org.eclipse.m2e.tests/target/classes
10:37:00 [WARNING] /home/jenkins/agent/workspace/m2e-sonarqube/m2e-core-tests/org.eclipse.m2e.tests/src/org/eclipse/m2e/tests/internal/project/ImportSortOrderTestCase.java:[82] 
10:37:00 	manager.refresh(updateRequest, monitor);
10:37:00 	        ^^^^^^^^^^^^^^^^^^^^^^^^^^^^^^^
10:37:00 The method refresh(MavenUpdateRequest, IProgressMonitor) from the type ProjectRegistryManager is deprecated
10:37:00 [WARNING] /home/jenkins/agent/workspace/m2e-sonarqube/m2e-core-tests/org.eclipse.m2e.tests/src/org/eclipse/m2e/tests/internal/refactoring/ExcludeArtifactRefactoringTest.java:[482] 
10:37:00 	waitForJobsToComplete();
10:37:00 	^^^^^^^^^^^^^^^^^^^^^^^
10:37:00 Access to enclosing method waitForJobsToComplete() from the type AbstractMavenProjectTestCase is emulated by a synthetic accessor method
10:37:00 [WARNING] /home/jenkins/agent/workspace/m2e-sonarqube/m2e-core-tests/org.eclipse.m2e.tests/src/org/eclipse/m2e/tests/internal/refactoring/ExcludeArtifactRefactoringTest.java:[483] 
10:37:00 	return editor;
10:37:00 	       ^^^^^^
10:37:00 Read access to enclosing field ExcludeArtifactRefactoringTest.editor is emulated by a synthetic accessor method
10:37:00 [WARNING] /home/jenkins/agent/workspace/m2e-sonarqube/m2e-core-tests/org.eclipse.m2e.tests/src/org/eclipse/m2e/tests/internal/refactoring/ExcludeArtifactRefactoringTest.java:[489] 
10:37:00 	editor = (MavenPomEditor) getActivePage()
10:37:00 	^^^^^^
10:37:00 Write access to enclosing field ExcludeArtifactRefactoringTest.editor is emulated by a synthetic accessor method
10:37:00 [WARNING] /home/jenkins/agent/workspace/m2e-sonarqube/m2e-core-tests/org.eclipse.m2e.tests/src/org/eclipse/m2e/tests/internal/refactoring/ExcludeArtifactRefactoringTest.java:[576] 
10:37:00 	resource.load(new HashMap());
10:37:00 	                  ^^^^^^^
10:37:00 HashMap is a raw type. References to generic type HashMap<K,V> should be parameterized
10:37:00 6. INFO in /home/jenkins/agent/workspace/m2e-sonarqube/m2e-core-tests/org.eclipse.m2e.tests/src/org/eclipse/m2e/tests/SourceLocationHelperTest.java (at line 36)
10:37:00 	@SuppressWarnings("restriction")
10:37:00 	                  ^^^^^^^^^^^^^
10:37:00 At least one of the problems in category 'restriction' is not analysed due to a compiler option being ignored
10:37:00 7. INFO in /home/jenkins/agent/workspace/m2e-sonarqube/m2e-core-tests/org.eclipse.m2e.tests/src/org/eclipse/m2e/tests/discovery/MavenDiscoveryInstallOperationTest.java (at line 26)
10:37:00 	@SuppressWarnings("restriction")
10:37:00 	                  ^^^^^^^^^^^^^
10:37:00 At least one of the problems in category 'restriction' is not analysed due to a compiler option being ignored
10:37:00 8. INFO in /home/jenkins/agent/workspace/m2e-sonarqube/m2e-core-tests/org.eclipse.m2e.tests/src/org/eclipse/m2e/tests/BuildPathManagerTest.java (at line 94)
10:37:00 	@SuppressWarnings("restriction")
10:37:00 	                  ^^^^^^^^^^^^^
10:37:00 At least one of the problems in category 'restriction' is not analysed due to a compiler option being ignored
10:37:00 [WARNING] /home/jenkins/agent/workspace/m2e-sonarqube/m2e-core-tests/org.eclipse.m2e.tests/src/org/eclipse/m2e/tests/BuildPathManagerTest.java:[1179] 
10:37:00 	MavenPlugin.getProjectConfigurationManager().createArchetypeProject(project, location, archetype, //
10:37:00           projectName, projectName, "0.0.1-SNAPSHOT", "jar", new Properties(), pic, monitor);
10:37:00 	                                             ^^^^^^^^^^^^^^^^^^^^^^^^^^^^^^^^^^^^^^^^^^^^^^^^^^^^^^^^^^^^^^^^^^^^^^^^^^^^^^^^^^^^^^^^^^^^^^^^^^^^^^^^^^^^^^^^^^^^^^^^^^^^^^^^^^^^^^^^^^^^^^^^^^^^
10:37:00 The method createArchetypeProject(IProject, IPath, Archetype, String, String, String, String, Properties, ProjectImportConfiguration, IProgressMonitor) from the type IProjectConfigurationManager is deprecated
10:37:00 10. INFO in /home/jenkins/agent/workspace/m2e-sonarqube/m2e-core-tests/org.eclipse.m2e.tests/src/org/eclipse/m2e/tests/lifecycle/PluginExecutionMetadataPrioritiesTest.java (at line 32)
10:37:00 	@SuppressWarnings("restriction")
10:37:00 	                  ^^^^^^^^^^^^^
10:37:00 At least one of the problems in category 'restriction' is not analysed due to a compiler option being ignored
10:37:00 11. INFO in /home/jenkins/agent/workspace/m2e-sonarqube/m2e-core-tests/org.eclipse.m2e.tests/src/org/eclipse/m2e/tests/internal/index/NexusIndexManagerSearchTest.java (at line 51)
10:37:00 	@SuppressWarnings("restriction")
10:37:00 	                  ^^^^^^^^^^^^^
10:37:00 At least one of the problems in category 'restriction' is not analysed due to a compiler option being ignored
10:37:00 [WARNING] /home/jenkins/agent/workspace/m2e-sonarqube/m2e-core-tests/org.eclipse.m2e.tests/src/org/eclipse/m2e/tests/internal/embedder/EclipseClassRealmManagerDelegateTest.java:[61] 
10:37:00 	public List<String> getImports() {
10:37:00 	                    ^^^^^^^^^^^^
10:37:00 The method new ClassRealmRequest(){}.getImports() overrides a deprecated method from ClassRealmRequest
10:37:00 13. INFO in /home/jenkins/agent/workspace/m2e-sonarqube/m2e-core-tests/org.eclipse.m2e.tests/src/org/eclipse/m2e/tests/lifecycle/LifecycleComparisonTest.java (at line 19)
10:37:00 	@SuppressWarnings("restriction")
10:37:00 	                  ^^^^^^^^^^^^^
10:37:00 At least one of the problems in category 'restriction' is not analysed due to a compiler option being ignored
10:37:00 14. INFO in /home/jenkins/agent/workspace/m2e-sonarqube/m2e-core-tests/org.eclipse.m2e.tests/src/org/eclipse/m2e/tests/ui/editing/AddDependencyOperationTest.java (at line 37)
10:37:00 	@SuppressWarnings("restriction")
10:37:00 	                  ^^^^^^^^^^^^^
10:37:00 At least one of the problems in category 'restriction' is not analysed due to a compiler option being ignored
10:37:00 15. INFO in /home/jenkins/agent/workspace/m2e-sonarqube/m2e-core-tests/org.eclipse.m2e.tests/src/org/eclipse/m2e/tests/lifecycle/LifecycleMappingTest.java (at line 87)
10:37:00 	@SuppressWarnings("restriction")
10:37:00 	                  ^^^^^^^^^^^^^
10:37:00 At least one of the problems in category 'restriction' is not analysed due to a compiler option being ignored
10:37:00 [WARNING] /home/jenkins/agent/workspace/m2e-sonarqube/m2e-core-tests/org.eclipse.m2e.tests/src/org/eclipse/m2e/tests/internal/embedder/MavenEmbeddedRuntimeTest.java:[22] 
10:37:00 	import org.eclipse.m2e.core.embedder.MavenRuntime;
10:37:00 	       ^^^^^^^^^^^^^^^^^^^^^^^^^^^^^^^^^^^^^^^^^^
10:37:00 The type MavenRuntime is deprecated
10:37:00 [WARNING] /home/jenkins/agent/workspace/m2e-sonarqube/m2e-core-tests/org.eclipse.m2e.tests/src/org/eclipse/m2e/tests/internal/embedder/MavenEmbeddedRuntimeTest.java:[23] 
10:37:00 	import org.eclipse.m2e.core.embedder.MavenRuntimeManager;
10:37:00 	       ^^^^^^^^^^^^^^^^^^^^^^^^^^^^^^^^^^^^^^^^^^^^^^^^^
10:37:00 The type MavenRuntimeManager is deprecated
10:37:00 18. INFO in /home/jenkins/agent/workspace/m2e-sonarqube/m2e-core-tests/org.eclipse.m2e.tests/src/org/eclipse/m2e/tests/internal/embedder/MavenEmbeddedRuntimeTest.java (at line 27)
10:37:00 	@SuppressWarnings("restriction")
10:37:00 	                  ^^^^^^^^^^^^^
10:37:00 At least one of the problems in category 'restriction' is not analysed due to a compiler option being ignored
10:37:00 [WARNING] /home/jenkins/agent/workspace/m2e-sonarqube/m2e-core-tests/org.eclipse.m2e.tests/src/org/eclipse/m2e/tests/internal/embedder/MavenEmbeddedRuntimeTest.java:[31] 
10:37:00 	MavenRuntimeManager runtimeManager = MavenPlugin.getMavenRuntimeManager();
10:37:00 	^^^^^^^^^^^^^^^^^^^
10:37:00 The type MavenRuntimeManager is deprecated
10:37:00 [WARNING] /home/jenkins/agent/workspace/m2e-sonarqube/m2e-core-tests/org.eclipse.m2e.tests/src/org/eclipse/m2e/tests/internal/embedder/MavenEmbeddedRuntimeTest.java:[31] 
10:37:00 	MavenRuntimeManager runtimeManager = MavenPlugin.getMavenRuntimeManager();
10:37:00 	                                                 ^^^^^^^^^^^^^^^^^^^^^^^^
10:37:00 The method getMavenRuntimeManager() from the type MavenPlugin is deprecated
10:37:00 [WARNING] /home/jenkins/agent/workspace/m2e-sonarqube/m2e-core-tests/org.eclipse.m2e.tests/src/org/eclipse/m2e/tests/internal/embedder/MavenEmbeddedRuntimeTest.java:[32] 
10:37:00 	MavenRuntime embeddedRuntime = runtimeManager.getRuntime(MavenRuntimeManager.EMBEDDED);
10:37:00 	^^^^^^^^^^^^
10:37:00 The type MavenRuntime is deprecated
10:37:00 [WARNING] /home/jenkins/agent/workspace/m2e-sonarqube/m2e-core-tests/org.eclipse.m2e.tests/src/org/eclipse/m2e/tests/internal/embedder/MavenEmbeddedRuntimeTest.java:[32] 
10:37:00 	MavenRuntime embeddedRuntime = runtimeManager.getRuntime(MavenRuntimeManager.EMBEDDED);
10:37:00 	                                              ^^^^^^^^^^^^^^^^^^^^^^^^^^^^^^^^^^^^^^^^
10:37:00 The method getRuntime(String) from the type MavenRuntimeManager is deprecated
10:37:00 [WARNING] /home/jenkins/agent/workspace/m2e-sonarqube/m2e-core-tests/org.eclipse.m2e.tests/src/org/eclipse/m2e/tests/internal/embedder/MavenEmbeddedRuntimeTest.java:[32] 
10:37:00 	MavenRuntime embeddedRuntime = runtimeManager.getRuntime(MavenRuntimeManager.EMBEDDED);
10:37:00 	                                                         ^^^^^^^^^^^^^^^^^^^
10:37:00 The type MavenRuntimeManager is deprecated
10:37:00 [WARNING] /home/jenkins/agent/workspace/m2e-sonarqube/m2e-core-tests/org.eclipse.m2e.tests/src/org/eclipse/m2e/tests/internal/embedder/MavenEmbeddedRuntimeTest.java:[32] 
10:37:00 	MavenRuntime embeddedRuntime = runtimeManager.getRuntime(MavenRuntimeManager.EMBEDDED);
10:37:00 	                                                                             ^^^^^^^^
10:37:00 The field MavenRuntimeManager.EMBEDDED is deprecated
10:37:00 [WARNING] /home/jenkins/agent/workspace/m2e-sonarqube/m2e-core-tests/org.eclipse.m2e.tests/src/org/eclipse/m2e/tests/internal/embedder/MavenEmbeddedRuntimeTest.java:[33] 
10:37:00 	String mavenVersion = embeddedRuntime.getVersion();
10:37:00 	                                      ^^^^^^^^^^^^
10:37:00 The method getVersion() from the type MavenRuntime is deprecated
10:37:00 [WARNING] /home/jenkins/agent/workspace/m2e-sonarqube/m2e-core-tests/org.eclipse.m2e.tests/src/org/eclipse/m2e/tests/TestFancyClassifierClasspathProvider.java:[42] 
10:37:00 	public void setRuntimeClasspath(Set<IRuntimeClasspathEntry> runtimeClasspath, IMavenProjectFacade mavenProjectFacade,
10:37:00       IProgressMonitor monitor) {
10:37:00 	            ^^^^^^^^^^^^^^^^^^^^^^^^^^^^^^^^^^^^^^^^^^^^^^^^^^^^^^^^^^^^^^^^^^^^^^^^^^^^^^^^^^^^^^^^^^^^^^^^^^^^^^^^^^^^^^^^^^^^^^^^^^^^^^^^^^^^^^^^^
10:37:00 The method TestFancyClassifierClasspathProvider.setRuntimeClasspath(Set<IRuntimeClasspathEntry>, IMavenProjectFacade, IProgressMonitor) overrides a deprecated method from AbstractClassifierClasspathProvider
10:37:00 [WARNING] /home/jenkins/agent/workspace/m2e-sonarqube/m2e-core-tests/org.eclipse.m2e.tests/src/org/eclipse/m2e/tests/TestFancyClassifierClasspathProvider.java:[47] 
10:37:00 	addFolders(runtimeClasspath, mavenProjectFacade.getProject(), folders);
10:37:00 	^^^^^^^^^^^^^^^^^^^^^^^^^^^^^^^^^^^^^^^^^^^^^^^^^^^^^^^^^^^^^^^^^^^^^^
10:37:00 The method addFolders(Set<IRuntimeClasspathEntry>, IProject, Set<IPath>) from the type AbstractClassifierClasspathProvider is deprecated
10:37:00 [WARNING] /home/jenkins/agent/workspace/m2e-sonarqube/m2e-core-tests/org.eclipse.m2e.tests/src/org/eclipse/m2e/tests/TestFancyClassifierClasspathProvider.java:[52] 
10:37:00 	public void setTestClasspath(Set<IRuntimeClasspathEntry> testClasspath, IMavenProjectFacade mavenProjectFacade,
10:37:00       IProgressMonitor monitor) {
10:37:00 	            ^^^^^^^^^^^^^^^^^^^^^^^^^^^^^^^^^^^^^^^^^^^^^^^^^^^^^^^^^^^^^^^^^^^^^^^^^^^^^^^^^^^^^^^^^^^^^^^^^^^^^^^^^^^^^^^^^^^^^^^^^^^^^^^^^^^
10:37:00 The method TestFancyClassifierClasspathProvider.setTestClasspath(Set<IRuntimeClasspathEntry>, IMavenProjectFacade, IProgressMonitor) overrides a deprecated method from AbstractClassifierClasspathProvider
10:37:00 [WARNING] /home/jenkins/agent/workspace/m2e-sonarqube/m2e-core-tests/org.eclipse.m2e.tests/src/org/eclipse/m2e/tests/TestFancyClassifierClasspathProvider.java:[57] 
10:37:00 	addFolders(testClasspath, mavenProjectFacade.getProject(), folders);
10:37:00 	^^^^^^^^^^^^^^^^^^^^^^^^^^^^^^^^^^^^^^^^^^^^^^^^^^^^^^^^^^^^^^^^^^^
10:37:00 The method addFolders(Set<IRuntimeClasspathEntry>, IProject, Set<IPath>) from the type AbstractClassifierClasspathProvider is deprecated
10:37:00 [WARNING] /home/jenkins/agent/workspace/m2e-sonarqube/m2e-core-tests/org.eclipse.m2e.tests/src/org/eclipse/m2e/tests/discovery/TestM2EBundleStrategy.java:[9] 
10:37:00 	import org.eclipse.core.runtime.SubProgressMonitor;
10:37:00 	       ^^^^^^^^^^^^^^^^^^^^^^^^^^^^^^^^^^^^^^^^^^^
10:37:00 The type SubProgressMonitor is deprecated
10:37:00 31. INFO in /home/jenkins/agent/workspace/m2e-sonarqube/m2e-core-tests/org.eclipse.m2e.tests/src/org/eclipse/m2e/tests/discovery/TestM2EBundleStrategy.java (at line 18)
10:37:00 	@SuppressWarnings("restriction")
10:37:00 	                  ^^^^^^^^^^^^^
10:37:00 At least one of the problems in category 'restriction' is not analysed due to a compiler option being ignored
10:37:00 [WARNING] /home/jenkins/agent/workspace/m2e-sonarqube/m2e-core-tests/org.eclipse.m2e.tests/src/org/eclipse/m2e/tests/discovery/TestM2EBundleStrategy.java:[32] 
10:37:00 	processExtensions(new SubProgressMonitor(monitor, extensions.length), extensions);
10:37:00 	                      ^^^^^^^^^^^^^^^^^^
10:37:00 The type SubProgressMonitor is deprecated
10:37:00 [WARNING] /home/jenkins/agent/workspace/m2e-sonarqube/m2e-core-tests/org.eclipse.m2e.tests/src/org/eclipse/m2e/tests/discovery/TestM2EBundleStrategy.java:[32] 
10:37:00 	processExtensions(new SubProgressMonitor(monitor, extensions.length), extensions);
10:37:00 	                      ^^^^^^^^^^^^^^^^^^^^^^^^^^^^^^^^^^^^^^^^^^^^^^
10:37:00 The constructor SubProgressMonitor(IProgressMonitor, int) is deprecated
10:37:00 34. INFO in /home/jenkins/agent/workspace/m2e-sonarqube/m2e-core-tests/org.eclipse.m2e.tests/src/org/eclipse/m2e/tests/ui/editing/AbstractOperationTest.java (at line 27)
10:37:00 	@SuppressWarnings("restriction")
10:37:00 	                  ^^^^^^^^^^^^^
10:37:00 At least one of the problems in category 'restriction' is not analysed due to a compiler option being ignored
10:37:00 [WARNING] /home/jenkins/agent/workspace/m2e-sonarqube/m2e-core-tests/org.eclipse.m2e.tests/src/org/eclipse/m2e/tests/jdt/internal/MavenClasspathContainerSaveHelperTest.java:[64] 
10:37:00 	ByteArrayOutputStream os = new ByteArrayOutputStream();
10:37:00 	                      ^^
10:37:00 Resource 'os' should be managed by try-with-resource
10:37:00 36. INFO in /home/jenkins/agent/workspace/m2e-sonarqube/m2e-core-tests/org.eclipse.m2e.tests/src/org/eclipse/m2e/tests/ui/editing/AddExclusionOperationTest.java (at line 34)
10:37:00 	@SuppressWarnings("restriction")
10:37:00 	                  ^^^^^^^^^^^^^
10:37:00 At least one of the problems in category 'restriction' is not analysed due to a compiler option being ignored
10:37:00 [WARNING] /home/jenkins/agent/workspace/m2e-sonarqube/m2e-core-tests/org.eclipse.m2e.tests/src/org/eclipse/m2e/tests/discovery/MavenDiscoveryTest.java:[239] 
10:37:00 	return new File(emptydir, resourceName).toURL();
10:37:00 	                                        ^^^^^^^
10:37:00 The method toURL() from the type File is deprecated
10:37:00 [WARNING] /home/jenkins/agent/workspace/m2e-sonarqube/m2e-core-tests/org.eclipse.m2e.tests/src/org/eclipse/m2e/tests/discovery/MavenDiscoveryTest.java:[264] 
10:37:00 	return pluginxml.toURL();
10:37:00 	                 ^^^^^^^
10:37:00 The method toURL() from the type File is deprecated
10:37:00 [WARNING] /home/jenkins/agent/workspace/m2e-sonarqube/m2e-core-tests/org.eclipse.m2e.tests/src/org/eclipse/m2e/tests/ProjectRegistryManagerTest.java:[417] 
10:37:00 	manager.refresh(request, monitor);
10:37:00 	        ^^^^^^^^^^^^^^^^^^^^^^^^^
10:37:00 The method refresh(MavenUpdateRequest, IProgressMonitor) from the type ProjectRegistryManager is deprecated
10:37:00 [WARNING] /home/jenkins/agent/workspace/m2e-sonarqube/m2e-core-tests/org.eclipse.m2e.tests/src/org/eclipse/m2e/tests/ProjectRegistryManagerTest.java:[423] 
10:37:00 	manager.refresh(request, monitor);
10:37:00 	        ^^^^^^^^^^^^^^^^^^^^^^^^^
10:37:00 The method refresh(MavenUpdateRequest, IProgressMonitor) from the type ProjectRegistryManager is deprecated
10:37:00 [WARNING] /home/jenkins/agent/workspace/m2e-sonarqube/m2e-core-tests/org.eclipse.m2e.tests/src/org/eclipse/m2e/tests/ProjectRegistryManagerTest.java:[544] 
10:37:00 	manager.refresh(new MavenUpdateRequest(p2, false, false), monitor);
10:37:00 	        ^^^^^^^^^^^^^^^^^^^^^^^^^^^^^^^^^^^^^^^^^^^^^^^^^^^^^^^^^^
10:37:00 The method refresh(MavenUpdateRequest, IProgressMonitor) from the type ProjectRegistryManager is deprecated
10:37:00 [WARNING] /home/jenkins/agent/workspace/m2e-sonarqube/m2e-core-tests/org.eclipse.m2e.tests/src/org/eclipse/m2e/tests/ProjectRegistryManagerTest.java:[758] 
10:37:00 	manager.refresh(updateRequest, monitor);
10:37:00 	        ^^^^^^^^^^^^^^^^^^^^^^^^^^^^^^^
10:37:00 The method refresh(MavenUpdateRequest, IProgressMonitor) from the type ProjectRegistryManager is deprecated
10:37:00 [WARNING] /home/jenkins/agent/workspace/m2e-sonarqube/m2e-core-tests/org.eclipse.m2e.tests/src/org/eclipse/m2e/tests/ProjectRegistryManagerTest.java:[769] 
10:37:00 	manager.refresh(updateRequest, monitor);
10:37:00 	        ^^^^^^^^^^^^^^^^^^^^^^^^^^^^^^^
10:37:00 The method refresh(MavenUpdateRequest, IProgressMonitor) from the type ProjectRegistryManager is deprecated
10:37:00 [WARNING] /home/jenkins/agent/workspace/m2e-sonarqube/m2e-core-tests/org.eclipse.m2e.tests/src/org/eclipse/m2e/tests/ProjectRegistryManagerTest.java:[1062] 
10:37:00 	manager.refresh(new MavenUpdateRequest(p1, false, false), monitor);
10:37:00 	        ^^^^^^^^^^^^^^^^^^^^^^^^^^^^^^^^^^^^^^^^^^^^^^^^^^^^^^^^^^
10:37:00 The method refresh(MavenUpdateRequest, IProgressMonitor) from the type ProjectRegistryManager is deprecated
10:37:00 [WARNING] /home/jenkins/agent/workspace/m2e-sonarqube/m2e-core-tests/org.eclipse.m2e.tests/src/org/eclipse/m2e/tests/ProjectRegistryManagerTest.java:[1072] 
10:37:00 	manager.refresh(new MavenUpdateRequest(p1, false, false), monitor);
10:37:00 	        ^^^^^^^^^^^^^^^^^^^^^^^^^^^^^^^^^^^^^^^^^^^^^^^^^^^^^^^^^^
10:37:00 The method refresh(MavenUpdateRequest, IProgressMonitor) from the type ProjectRegistryManager is deprecated
10:37:00 [WARNING] /home/jenkins/agent/workspace/m2e-sonarqube/m2e-core-tests/org.eclipse.m2e.tests/src/org/eclipse/m2e/tests/ProjectRegistryManagerTest.java:[1111] 
10:37:00 	manager.refresh(new MavenUpdateRequest(projects[0], false, true), monitor);
10:37:00 	        ^^^^^^^^^^^^^^^^^^^^^^^^^^^^^^^^^^^^^^^^^^^^^^^^^^^^^^^^^^^^^^^^^^
10:37:00 The method refresh(MavenUpdateRequest, IProgressMonitor) from the type ProjectRegistryManager is deprecated
10:37:00 [WARNING] /home/jenkins/agent/workspace/m2e-sonarqube/m2e-core-tests/org.eclipse.m2e.tests/src/org/eclipse/m2e/tests/ProjectRegistryManagerTest.java:[1140] 
10:37:00 	manager.refresh(new MavenUpdateRequest(p, false, true), monitor);
10:37:00 	        ^^^^^^^^^^^^^^^^^^^^^^^^^^^^^^^^^^^^^^^^^^^^^^^^^^^^^^^^
10:37:00 The method refresh(MavenUpdateRequest, IProgressMonitor) from the type ProjectRegistryManager is deprecated
10:37:00 [WARNING] /home/jenkins/agent/workspace/m2e-sonarqube/m2e-core-tests/org.eclipse.m2e.tests/src/org/eclipse/m2e/tests/ProjectRegistryManagerTest.java:[1190] 
10:37:00 	manager.refresh(request, monitor);
10:37:00 	        ^^^^^^^^^^^^^^^^^^^^^^^^^
10:37:00 The method refresh(MavenUpdateRequest, IProgressMonitor) from the type ProjectRegistryManager is deprecated
10:37:00 [WARNING] /home/jenkins/agent/workspace/m2e-sonarqube/m2e-core-tests/org.eclipse.m2e.tests/src/org/eclipse/m2e/tests/ProjectRegistryManagerTest.java:[1216] 
10:37:00 	manager.refresh(request, monitor);
10:37:00 	        ^^^^^^^^^^^^^^^^^^^^^^^^^
10:37:00 The method refresh(MavenUpdateRequest, IProgressMonitor) from the type ProjectRegistryManager is deprecated
10:37:00 [WARNING] /home/jenkins/agent/workspace/m2e-sonarqube/m2e-core-tests/org.eclipse.m2e.tests/src/org/eclipse/m2e/tests/ProjectRegistryManagerTest.java:[1242] 
10:37:00 	manager.refresh(request, monitor);
10:37:00 	        ^^^^^^^^^^^^^^^^^^^^^^^^^
10:37:00 The method refresh(MavenUpdateRequest, IProgressMonitor) from the type ProjectRegistryManager is deprecated
10:37:00 [WARNING] /home/jenkins/agent/workspace/m2e-sonarqube/m2e-core-tests/org.eclipse.m2e.tests/src/org/eclipse/m2e/tests/ProjectRegistryManagerTest.java:[1287] 
10:37:00 	manager.refresh(request, monitor);
10:37:00 	        ^^^^^^^^^^^^^^^^^^^^^^^^^
10:37:00 The method refresh(MavenUpdateRequest, IProgressMonitor) from the type ProjectRegistryManager is deprecated
10:37:00 [WARNING] /home/jenkins/agent/workspace/m2e-sonarqube/m2e-core-tests/org.eclipse.m2e.tests/src/org/eclipse/m2e/tests/ProjectRegistryManagerTest.java:[1411] 
10:37:00 	manager.refresh(request, monitor);
10:37:00 	        ^^^^^^^^^^^^^^^^^^^^^^^^^
10:37:00 The method refresh(MavenUpdateRequest, IProgressMonitor) from the type ProjectRegistryManager is deprecated
10:37:00 [WARNING] /home/jenkins/agent/workspace/m2e-sonarqube/m2e-core-tests/org.eclipse.m2e.tests/src/org/eclipse/m2e/tests/ProjectRegistryManagerTest.java:[1433] 
10:37:00 	manager.refresh(request, monitor);
10:37:00 	        ^^^^^^^^^^^^^^^^^^^^^^^^^
10:37:00 The method refresh(MavenUpdateRequest, IProgressMonitor) from the type ProjectRegistryManager is deprecated
10:37:00 [WARNING] /home/jenkins/agent/workspace/m2e-sonarqube/m2e-core-tests/org.eclipse.m2e.tests/src/org/eclipse/m2e/tests/ProjectRegistryManagerTest.java:[1461] 
10:37:00 	manager.refresh(request, monitor);
10:37:00 	        ^^^^^^^^^^^^^^^^^^^^^^^^^
10:37:00 The method refresh(MavenUpdateRequest, IProgressMonitor) from the type ProjectRegistryManager is deprecated
10:37:00 [WARNING] /home/jenkins/agent/workspace/m2e-sonarqube/m2e-core-tests/org.eclipse.m2e.tests/src/org/eclipse/m2e/tests/ProjectRegistryManagerTest.java:[1478] 
10:37:00 	manager.refresh(request, monitor); // shouldn't throw any exceptions
10:37:00 	        ^^^^^^^^^^^^^^^^^^^^^^^^^
10:37:00 The method refresh(MavenUpdateRequest, IProgressMonitor) from the type ProjectRegistryManager is deprecated
10:37:00 [WARNING] /home/jenkins/agent/workspace/m2e-sonarqube/m2e-core-tests/org.eclipse.m2e.tests/src/org/eclipse/m2e/tests/ProjectRegistryManagerTest.java:[1504] 
10:37:00 	manager.refresh(request, monitor); // shouldn't throw any exceptions
10:37:00 	        ^^^^^^^^^^^^^^^^^^^^^^^^^
10:37:00 The method refresh(MavenUpdateRequest, IProgressMonitor) from the type ProjectRegistryManager is deprecated
10:37:00 [WARNING] /home/jenkins/agent/workspace/m2e-sonarqube/m2e-core-tests/org.eclipse.m2e.tests/src/org/eclipse/m2e/tests/ProjectRegistryManagerTest.java:[1519] 
10:37:00 	manager.refresh(request, monitor);
10:37:00 	        ^^^^^^^^^^^^^^^^^^^^^^^^^
10:37:00 The method refresh(MavenUpdateRequest, IProgressMonitor) from the type ProjectRegistryManager is deprecated
10:37:00 58. INFO in /home/jenkins/agent/workspace/m2e-sonarqube/m2e-core-tests/org.eclipse.m2e.tests/src/org/eclipse/m2e/tests/internal/conversion/ProjectConversionParticipantSorterTest.java (at line 43)
10:37:00 	@SuppressWarnings("restriction")
10:37:00 	                  ^^^^^^^^^^^^^
10:37:00 At least one of the problems in category 'restriction' is not analysed due to a compiler option being ignored
10:37:00 59. INFO in /home/jenkins/agent/workspace/m2e-sonarqube/m2e-core-tests/org.eclipse.m2e.tests/src/org/eclipse/m2e/tests/ui/editing/PomHelperTest.java (at line 37)
10:37:00 	@SuppressWarnings("restriction")
10:37:00 	                  ^^^^^^^^^^^^^
10:37:00 At least one of the problems in category 'restriction' is not analysed due to a compiler option being ignored
10:37:00 60. INFO in /home/jenkins/agent/workspace/m2e-sonarqube/m2e-core-tests/org.eclipse.m2e.tests/src/org/eclipse/m2e/tests/ui/editing/PomEditsTest.java (at line 46)
10:37:00 	@SuppressWarnings("restriction")
10:37:00 	                  ^^^^^^^^^^^^^
10:37:00 At least one of the problems in category 'restriction' is not analysed due to a compiler option being ignored
10:37:00 61. INFO in /home/jenkins/agent/workspace/m2e-sonarqube/m2e-core-tests/org.eclipse.m2e.tests/src/org/eclipse/m2e/tests/MutableProjectRegistryTest.java (at line 54)
10:37:00 	@SuppressWarnings("restriction")
10:37:00 	                  ^^^^^^^^^^^^^
10:37:00 At least one of the problems in category 'restriction' is not analysed due to a compiler option being ignored
10:37:00 62. INFO in /home/jenkins/agent/workspace/m2e-sonarqube/m2e-core-tests/org.eclipse.m2e.tests/src/org/eclipse/m2e/tests/profiles/MavenProfileManagerTest.java (at line 40)
10:37:00 	@SuppressWarnings("restriction")
10:37:00 	                  ^^^^^^^^^^^^^
10:37:00 At least one of the problems in category 'restriction' is not analysed due to a compiler option being ignored
10:37:00 63. INFO in /home/jenkins/agent/workspace/m2e-sonarqube/m2e-core-tests/org.eclipse.m2e.tests/src/org/eclipse/m2e/tests/embedder/MavenImplTest.java (at line 64)
10:37:00 	@SuppressWarnings("restriction")
10:37:00 	                  ^^^^^^^^^^^^^
10:37:00 At least one of the problems in category 'restriction' is not analysed due to a compiler option being ignored
10:37:00 [WARNING] /home/jenkins/agent/workspace/m2e-sonarqube/m2e-core-tests/org.eclipse.m2e.tests/src/org/eclipse/m2e/tests/ProjectRegistryRefreshJobTest.java:[247] 
10:37:00 	event = new ResourceChangeEvent(project, IResourceChangeEvent.PRE_CLOSE, IncrementalProjectBuilder.FULL_BUILD,
10:37:00         delta) {
10:37:00 	            ^^^^^^^^^^^^^^^^^^^^^^^^^^^^^^^^^^^^^^^^^^^^^^^^^^^^^^^^^^^^^^^^^^^^^^^^^^^^^^^^^^^^^^^^^^^^^^^^^^^^^^^^^^^^^^^^^
10:37:00 The serializable class  does not declare a static final serialVersionUID field of type long
10:37:00 [WARNING] /home/jenkins/agent/workspace/m2e-sonarqube/m2e-core-tests/org.eclipse.m2e.tests/src/org/eclipse/m2e/tests/ProjectRegistryRefreshJobTest.java:[251] 
10:37:00 	return project;
10:37:00 	       ^^^^^^^
10:37:00 Read access to enclosing field ProjectRegistryRefreshJobTest.project is emulated by a synthetic accessor method
10:37:00 [WARNING] /home/jenkins/agent/workspace/m2e-sonarqube/m2e-core-tests/org.eclipse.m2e.tests/src/org/eclipse/m2e/tests/project/MavenProjectFacadeTest.java:[180] 
10:37:00 	MavenPluginActivator.getDefault().getMavenProjectManagerImpl().refresh(updateRequest, monitor);
10:37:00 	                                                               ^^^^^^^^^^^^^^^^^^^^^^^^^^^^^^^
10:37:00 The method refresh(MavenUpdateRequest, IProgressMonitor) from the type ProjectRegistryManager is deprecated
10:37:00 67. INFO in /home/jenkins/agent/workspace/m2e-sonarqube/m2e-core-tests/org.eclipse.m2e.tests/src/org/eclipse/m2e/tests/builder/EclipseBuildContextTest.java (at line 34)
10:37:00 	@SuppressWarnings("restriction")
10:37:00 	                  ^^^^^^^^^^^^^
10:37:00 At least one of the problems in category 'restriction' is not analysed due to a compiler option being ignored
10:37:00 [WARNING] /home/jenkins/agent/workspace/m2e-sonarqube/m2e-core-tests/org.eclipse.m2e.tests/src/org/eclipse/m2e/tests/mocks/MockLaunchConfiguration.java:[90] 
10:37:00 	List<String> attr = (List<String>) attributes.get(attributeName);
10:37:00 	                    ^^^^^^^^^^^^^^^^^^^^^^^^^^^^^^^^^^^^^^^^^^^^
10:37:00 Type safety: Unchecked cast from capture#6-of ? to List<String>
10:37:00 [WARNING] /home/jenkins/agent/workspace/m2e-sonarqube/m2e-core-tests/org.eclipse.m2e.tests/src/org/eclipse/m2e/tests/mocks/MockLaunchConfiguration.java:[96] 
10:37:00 	Set<String> attr = (Set<String>) attributes.get(attributeName);
10:37:00 	                   ^^^^^^^^^^^^^^^^^^^^^^^^^^^^^^^^^^^^^^^^^^^
10:37:00 Type safety: Unchecked cast from capture#7-of ? to Set<String>
10:37:00 [WARNING] /home/jenkins/agent/workspace/m2e-sonarqube/m2e-core-tests/org.eclipse.m2e.tests/src/org/eclipse/m2e/tests/mocks/MockLaunchConfiguration.java:[102] 
10:37:00 	Map<String, String> attr = (Map<String, String>) attributes.get(attributeName);
10:37:00 	                           ^^^^^^^^^^^^^^^^^^^^^^^^^^^^^^^^^^^^^^^^^^^^^^^^^^^
10:37:00 Type safety: Unchecked cast from capture#8-of ? to Map<String,String>
10:37:00 [WARNING] /home/jenkins/agent/workspace/m2e-sonarqube/m2e-core-tests/org.eclipse.m2e.tests/src/org/eclipse/m2e/tests/mocks/MockLaunchConfiguration.java:[114] 
10:37:00 	return (Map<String, Object>) attributes;
10:37:00 	       ^^^^^^^^^^^^^^^^^^^^^^^^^^^^^^^^
10:37:00 Type safety: Unchecked cast from Map<String,capture#10-of ?> to Map<String,Object>
10:37:00 [WARNING] /home/jenkins/agent/workspace/m2e-sonarqube/m2e-core-tests/org.eclipse.m2e.tests/src/org/eclipse/m2e/tests/mocks/MockLaunchConfiguration.java:[129] 
10:37:00 	public IPath getLocation() {
10:37:00 	             ^^^^^^^^^^^^^
10:37:00 The method MockLaunchConfiguration.getLocation() overrides a deprecated method from ILaunchConfiguration
10:37:00 [WARNING] /home/jenkins/agent/workspace/m2e-sonarqube/m2e-core-tests/org.eclipse.m2e.tests/src/org/eclipse/m2e/tests/internal/lifecyclemapping/ConfigElementMock.java:[42] 
10:37:00 	public String getAttributeAsIs(String name) {
10:37:00 	              ^^^^^^^^^^^^^^^^^^^^^^^^^^^^^
10:37:00 The method ConfigElementMock.getAttributeAsIs(String) overrides a deprecated method from IConfigurationElement
10:37:00 [WARNING] /home/jenkins/agent/workspace/m2e-sonarqube/m2e-core-tests/org.eclipse.m2e.tests/src/org/eclipse/m2e/tests/internal/lifecyclemapping/ConfigElementMock.java:[88] 
10:37:00 	public String getValueAsIs() {
10:37:00 	              ^^^^^^^^^^^^^^
10:37:00 The method ConfigElementMock.getValueAsIs() overrides a deprecated method from IConfigurationElement
10:37:00 [WARNING] /home/jenkins/agent/workspace/m2e-sonarqube/m2e-core-tests/org.eclipse.m2e.tests/src/org/eclipse/m2e/tests/internal/lifecyclemapping/ConfigElementMock.java:[94] 
10:37:00 	public String getNamespace() {
10:37:00 	              ^^^^^^^^^^^^^^
10:37:00 The method ConfigElementMock.getNamespace() overrides a deprecated method from IConfigurationElement
10:37:00 76. INFO in /home/jenkins/agent/workspace/m2e-sonarqube/m2e-core-tests/org.eclipse.m2e.tests/src/org/eclipse/m2e/tests/builder/EclipseIncrementalBuildContextTest.java (at line 34)
10:37:00 	@SuppressWarnings("restriction")
10:37:00 	                  ^^^^^^^^^^^^^
10:37:00 At least one of the problems in category 'restriction' is not analysed due to a compiler option being ignored
10:37:00 [WARNING] /home/jenkins/agent/workspace/m2e-sonarqube/m2e-core-tests/org.eclipse.m2e.tests/src/org/eclipse/m2e/tests/MavenProjectMutableStateTest.java:[103] 
10:37:00 	assertMutableState(project);
10:37:00 	^^^^^^^^^^^^^^^^^^^^^^^^^^^
10:37:00 Access to enclosing method assertMutableState(IProject) from the type MavenProjectMutableStateTest is emulated by a synthetic accessor method
10:37:00 78. INFO in /home/jenkins/agent/workspace/m2e-sonarqube/m2e-core-tests/org.eclipse.m2e.tests/src/org/eclipse/m2e/tests/ui/editing/RemoveDependencyOperationTest.java (at line 32)
10:37:00 	@SuppressWarnings("restriction")
10:37:00 	                  ^^^^^^^^^^^^^
10:37:00 At least one of the problems in category 'restriction' is not analysed due to a compiler option being ignored
10:37:00 78 problems (0 errors, 57 warnings, 57 info)
10:37:00 [INFO] 
10:37:00 [INFO] --- maven-resources-plugin:2.5:testResources (default-testResources) @ org.eclipse.m2e.tests ---
10:37:00 [debug] execute contextualize
10:37:00 [INFO] Using 'UTF-8' encoding to copy filtered resources.
10:37:00 [INFO] skip non existing resourceDirectory /home/jenkins/agent/workspace/m2e-sonarqube/m2e-core-tests/org.eclipse.m2e.tests/src/test/resources
10:37:00 [INFO] 
10:37:00 [INFO] --- tycho-source-plugin:1.6.0:plugin-source (plugin-source) @ org.eclipse.m2e.tests ---
10:37:00 [INFO] Building jar: /home/jenkins/agent/workspace/m2e-sonarqube/m2e-core-tests/org.eclipse.m2e.tests/target/org.eclipse.m2e.tests-1.16.0-SNAPSHOT-sources.jar
10:37:00 [INFO] 
10:37:00 [INFO] --- target-platform-configuration:1.6.0:target-platform (default-target-platform) @ org.eclipse.m2e.tests ---
10:37:00 [INFO] 
10:37:00 [INFO] --- tycho-packaging-plugin:1.6.0:package-plugin (default-package-plugin) @ org.eclipse.m2e.tests ---
10:37:00 [INFO] Building jar: /home/jenkins/agent/workspace/m2e-sonarqube/m2e-core-tests/org.eclipse.m2e.tests/target/org.eclipse.m2e.tests-1.16.0-SNAPSHOT.jar
10:37:00 [INFO] 
10:37:00 [INFO] --- tycho-p2-plugin:1.6.0:p2-metadata-default (default-p2-metadata-default) @ org.eclipse.m2e.tests ---
10:37:00 [INFO] No baseline version MavenProject: org.eclipse.m2e:org.eclipse.m2e.tests:1.16.0-SNAPSHOT @ /home/jenkins/agent/workspace/m2e-sonarqube/m2e-core-tests/org.eclipse.m2e.tests/pom.xml
10:37:00 [INFO] 
10:37:00 [INFO] --- tycho-surefire-plugin:1.6.0:test (default-test) @ org.eclipse.m2e.tests ---
10:37:01 [INFO] Expected eclipse log file: /home/jenkins/agent/workspace/m2e-sonarqube/m2e-core-tests/org.eclipse.m2e.tests/target/work/data/.metadata/.log
10:37:01 [INFO] Command line:
10:37:01 	[/opt/tools/java/oracle/jdk-8/1.8.0_202/jre/bin/java, -Dosgi.noShutdown=false, -Dosgi.os=linux, -Dosgi.ws=gtk, -Dosgi.arch=x86_64, -javaagent:/home/jenkins/agent/workspace/m2e-sonarqube/.repository/org/jacoco/org.jacoco.agent/0.8.5/org.jacoco.agent-0.8.5-runtime.jar=destfile=/home/jenkins/agent/workspace/m2e-sonarqube/jacoco.exec,append=true,includes=org.eclipse.m2e*:org.apache.maven*:org.eclipse.aether*, -Xmx800m, -Dosgi.clean=true, -jar, /home/jenkins/agent/workspace/m2e-sonarqube/.repository/p2/osgi/bundle/org.eclipse.equinox.launcher/1.5.700.v20200207-2156/org.eclipse.equinox.launcher-1.5.700.v20200207-2156.jar, -data, /home/jenkins/agent/workspace/m2e-sonarqube/m2e-core-tests/org.eclipse.m2e.tests/target/work/data, -install, /home/jenkins/agent/workspace/m2e-sonarqube/m2e-core-tests/org.eclipse.m2e.tests/target/work, -configuration, /home/jenkins/agent/workspace/m2e-sonarqube/m2e-core-tests/org.eclipse.m2e.tests/target/work/configuration, -application, org.eclipse.tycho.surefire.osgibooter.uitest, -testproperties, /home/jenkins/agent/workspace/m2e-sonarqube/m2e-core-tests/org.eclipse.m2e.tests/target/surefire.properties, -pluginCustomization, /home/jenkins/agent/workspace/m2e-sonarqube/m2e-core-tests/org.eclipse.m2e.tests/plugin_customization.ini, -timeout, 7200000]
10:37:01 Picked up JAVA_TOOL_OPTIONS: -XX:+IgnoreUnrecognizedVMOptions -XX:+UseContainerSupport -XX:+UnlockExperimentalVMOptions -XX:+UseCGroupMemoryLimitForHeap
10:37:01 Picked up _JAVA_OPTIONS: -XX:MaxRAMPercentage=64.0
10:37:12 SLF4J: Failed to load class "org.slf4j.impl.StaticLoggerBinder".
10:37:12 SLF4J: Defaulting to no-operation (NOP) logger implementation
10:37:12 SLF4J: See http://www.slf4j.org/codes.html#StaticLoggerBinder for further details.
10:37:14 Running org.eclipse.m2e.tests.discovery.ConfigurationUpdateStartupTest
10:48:01 Tests run: 6, Failures: 0, Errors: 0, Skipped: 0, Time elapsed: 646.567 s - in org.eclipse.m2e.tests.discovery.ConfigurationUpdateStartupTest
10:48:01 testNoMavenProjects(org.eclipse.m2e.tests.discovery.ConfigurationUpdateStartupTest)  Time elapsed: 36.599 s
10:48:01 testToggleEarlyStartup(org.eclipse.m2e.tests.discovery.ConfigurationUpdateStartupTest)  Time elapsed: 46.54 s
10:48:01 testMavenProjectsErrors(org.eclipse.m2e.tests.discovery.ConfigurationUpdateStartupTest)  Time elapsed: 386.021 s
10:48:01 testConfigureSpecifiedProjects(org.eclipse.m2e.tests.discovery.ConfigurationUpdateStartupTest)  Time elapsed: 55.227 s
10:48:01 testMavenProjectsNoErrors(org.eclipse.m2e.tests.discovery.ConfigurationUpdateStartupTest)  Time elapsed: 66.135 s
10:48:01 testEmptyWorkspace(org.eclipse.m2e.tests.discovery.ConfigurationUpdateStartupTest)  Time elapsed: 56.016 s
10:48:01 Running org.eclipse.m2e.tests.discovery.MavenDiscoveryInstallOperationTest
10:48:02 Tests run: 5, Failures: 0, Errors: 0, Skipped: 0, Time elapsed: 0.99 s - in org.eclipse.m2e.tests.discovery.MavenDiscoveryInstallOperationTest
10:48:02 testMissingRepository(org.eclipse.m2e.tests.discovery.MavenDiscoveryInstallOperationTest)  Time elapsed: 0.43 s
10:48:02 testMatchNoVersion(org.eclipse.m2e.tests.discovery.MavenDiscoveryInstallOperationTest)  Time elapsed: 0.22 s
10:48:02 testMatchHighestVersion(org.eclipse.m2e.tests.discovery.MavenDiscoveryInstallOperationTest)  Time elapsed: 0.072 s
10:48:02 testMissingIU(org.eclipse.m2e.tests.discovery.MavenDiscoveryInstallOperationTest)  Time elapsed: 0.074 s
10:48:02 testMatchLowestVersion(org.eclipse.m2e.tests.discovery.MavenDiscoveryInstallOperationTest)  Time elapsed: 0.076 s
10:48:02 Running org.eclipse.m2e.tests.discovery.MavenDiscoveryMarkerResolutionGeneratorTest
10:54:17 Tests run: 4, Failures: 0, Errors: 0, Skipped: 0, Time elapsed: 375.162 s - in org.eclipse.m2e.tests.discovery.MavenDiscoveryMarkerResolutionGeneratorTest
10:54:17 testCanResolveMojoExecutionMarker(org.eclipse.m2e.tests.discovery.MavenDiscoveryMarkerResolutionGeneratorTest)  Time elapsed: 78.265 s
10:54:17 testCanResolveConfiguratorMarker(org.eclipse.m2e.tests.discovery.MavenDiscoveryMarkerResolutionGeneratorTest)  Time elapsed: 138.62 s
10:54:17 testResolveMultipleMarkers(org.eclipse.m2e.tests.discovery.MavenDiscoveryMarkerResolutionGeneratorTest)  Time elapsed: 87.085 s
10:54:17 testCanResolveLifecycleIdMarker(org.eclipse.m2e.tests.discovery.MavenDiscoveryMarkerResolutionGeneratorTest)  Time elapsed: 71.19 s
10:54:17 Running org.eclipse.m2e.tests.discovery.LifecycleMappingDiscoveryTest
11:00:50 Tests run: 11, Failures: 0, Errors: 0, Skipped: 0, Time elapsed: 393.524 s - in org.eclipse.m2e.tests.discovery.LifecycleMappingDiscoveryTest
11:00:50 testAutomaticSelectionOfSingleProposal(org.eclipse.m2e.tests.discovery.LifecycleMappingDiscoveryTest)  Time elapsed: 25.083 s
11:00:50 testPreselectedProposals(org.eclipse.m2e.tests.discovery.LifecycleMappingDiscoveryTest)  Time elapsed: 52.04 s
11:00:50 testIsMappingComplete(org.eclipse.m2e.tests.discovery.LifecycleMappingDiscoveryTest)  Time elapsed: 52.252 s
11:00:50 testProposalToReplaceDefaultMapping(org.eclipse.m2e.tests.discovery.LifecycleMappingDiscoveryTest)  Time elapsed: 38.818 s
11:00:50 testPackagingPom(org.eclipse.m2e.tests.discovery.LifecycleMappingDiscoveryTest)  Time elapsed: 57.473 s
11:00:50 testAutomaticSelectionWithAmbiguousProposals(org.eclipse.m2e.tests.discovery.LifecycleMappingDiscoveryTest)  Time elapsed: 22.715 s
11:00:50 testDiscoverProjectConfigurators(org.eclipse.m2e.tests.discovery.LifecycleMappingDiscoveryTest)  Time elapsed: 26.481 s
11:00:50 testNoProposals(org.eclipse.m2e.tests.discovery.LifecycleMappingDiscoveryTest)  Time elapsed: 12.588 s
11:00:50 testProposalMatching(org.eclipse.m2e.tests.discovery.LifecycleMappingDiscoveryTest)  Time elapsed: 4.509 s
11:00:50 testDiscoverLifecycleMappingStrategy(org.eclipse.m2e.tests.discovery.LifecycleMappingDiscoveryTest)  Time elapsed: 45.782 s
11:00:50 testDefaultNonConfiguratorMapping(org.eclipse.m2e.tests.discovery.LifecycleMappingDiscoveryTest)  Time elapsed: 55.781 s
11:00:50 Running org.eclipse.m2e.tests.discovery.MavenDiscoveryTest
11:00:51 Tests run: 9, Failures: 0, Errors: 0, Skipped: 0, Time elapsed: 0.995 s - in org.eclipse.m2e.tests.discovery.MavenDiscoveryTest
11:00:51 testCatalogSelectedByConfiguratorId(org.eclipse.m2e.tests.discovery.MavenDiscoveryTest)  Time elapsed: 0.415 s
11:00:51 testCatalogItemWithoutMappingMetadata(org.eclipse.m2e.tests.discovery.MavenDiscoveryTest)  Time elapsed: 0.004 s
11:00:51 testCatalogItemExtensionsMetadata(org.eclipse.m2e.tests.discovery.MavenDiscoveryTest)  Time elapsed: 0.003 s
11:00:51 testNotMatchPluginSelection(org.eclipse.m2e.tests.discovery.MavenDiscoveryTest)  Time elapsed: 0.084 s
11:00:51 testCatalogSelectedByLifecycleId(org.eclipse.m2e.tests.discovery.MavenDiscoveryTest)  Time elapsed: 0.098 s
11:00:51 testMultipleSelections(org.eclipse.m2e.tests.discovery.MavenDiscoveryTest)  Time elapsed: 0.112 s
11:00:51 testCatalogSelectedByPackaging(org.eclipse.m2e.tests.discovery.MavenDiscoveryTest)  Time elapsed: 0.105 s
11:00:51 testCatalogSelectedByMojoExecution(org.eclipse.m2e.tests.discovery.MavenDiscoveryTest)  Time elapsed: 0.093 s
11:00:51 testCatalogUnselected(org.eclipse.m2e.tests.discovery.MavenDiscoveryTest)  Time elapsed: 0.079 s
11:00:51 Running org.eclipse.m2e.tests.internal.project.MavenProjectChangedListenerExtensionTest
11:01:28 Tests run: 1, Failures: 0, Errors: 0, Skipped: 0, Time elapsed: 37.118 s - in org.eclipse.m2e.tests.internal.project.MavenProjectChangedListenerExtensionTest
11:01:28 testExtension(org.eclipse.m2e.tests.internal.project.MavenProjectChangedListenerExtensionTest)  Time elapsed: 37.117 s
11:01:28 Running org.eclipse.m2e.tests.internal.refactoring.ExcludeArtifactRefactoringTest
11:02:11 Warning: NLS missing message: MavenImpl_error_lookup in: org.eclipse.m2e.editor.internal.messages
11:09:27 Tests run: 12, Failures: 0, Errors: 0, Skipped: 0, Time elapsed: 478.862 s - in org.eclipse.m2e.tests.internal.refactoring.ExcludeArtifactRefactoringTest
11:09:27 testSingleArtifactKeyRemoteParent(org.eclipse.m2e.tests.internal.refactoring.ExcludeArtifactRefactoringTest)  Time elapsed: 52.65 s
11:09:27 testSingleArtifactMissing(org.eclipse.m2e.tests.internal.refactoring.ExcludeArtifactRefactoringTest)  Time elapsed: 55.588 s
11:09:27 testSingleArtifactKeyInWorkspaceParent(org.eclipse.m2e.tests.internal.refactoring.ExcludeArtifactRefactoringTest)  Time elapsed: 57.289 s
11:09:27 testStrangePomName(org.eclipse.m2e.tests.internal.refactoring.ExcludeArtifactRefactoringTest)  Time elapsed: 48.235 s
11:09:27 testArtifactsInMultiplePom(org.eclipse.m2e.tests.internal.refactoring.ExcludeArtifactRefactoringTest)  Time elapsed: 72.734 s
11:09:27 testCopyDown(org.eclipse.m2e.tests.internal.refactoring.ExcludeArtifactRefactoringTest)  Time elapsed: 41.758 s
11:09:27 testSingleArtifactKeyWorkspaceParent(org.eclipse.m2e.tests.internal.refactoring.ExcludeArtifactRefactoringTest)  Time elapsed: 34.368 s
11:09:27 testMultipleArtifactWithMissing(org.eclipse.m2e.tests.internal.refactoring.ExcludeArtifactRefactoringTest)  Time elapsed: 21.998 s
11:09:27 testSingleArtifactNoParentBadFormat(org.eclipse.m2e.tests.internal.refactoring.ExcludeArtifactRefactoringTest)  Time elapsed: 15.421 s
11:09:27 testMultipleArtifactKeySinglePom(org.eclipse.m2e.tests.internal.refactoring.ExcludeArtifactRefactoringTest)  Time elapsed: 18.877 s
11:09:27 testSingleArtifactNoParent(org.eclipse.m2e.tests.internal.refactoring.ExcludeArtifactRefactoringTest)  Time elapsed: 22.633 s
11:09:27 testPullUp(org.eclipse.m2e.tests.internal.refactoring.ExcludeArtifactRefactoringTest)  Time elapsed: 37.31 s
11:09:27 Running org.eclipse.m2e.tests.internal.wizard.MavenImportWizardTest
11:10:56 Tests run: 3, Failures: 0, Errors: 0, Skipped: 0, Time elapsed: 88.738 s - in org.eclipse.m2e.tests.internal.wizard.MavenImportWizardTest
11:10:56 testNoRenameOnMavenImport(org.eclipse.m2e.tests.internal.wizard.MavenImportWizardTest)  Time elapsed: 32.085 s
11:10:56 testRenameOnMavenImport(org.eclipse.m2e.tests.internal.wizard.MavenImportWizardTest)  Time elapsed: 32.976 s
11:10:56 testNoRenameOnMavenImportInWorkspaceRoot(org.eclipse.m2e.tests.internal.wizard.MavenImportWizardTest)  Time elapsed: 23.676 s
11:10:56 Running org.eclipse.m2e.tests.internal.wizard.MavenImportWizardPageTest
11:13:26 Tests run: 6, Failures: 0, Errors: 0, Skipped: 0, Time elapsed: 150.362 s - in org.eclipse.m2e.tests.internal.wizard.MavenImportWizardPageTest
11:13:26 test408042_multimoduleProject(org.eclipse.m2e.tests.internal.wizard.MavenImportWizardPageTest)  Time elapsed: 30.699 s
11:13:26 test408042_nestedproject(org.eclipse.m2e.tests.internal.wizard.MavenImportWizardPageTest)  Time elapsed: 25.063 s
11:13:26 test408042_noRootProject(org.eclipse.m2e.tests.internal.wizard.MavenImportWizardPageTest)  Time elapsed: 10.673 s
11:13:26 test533463_noArtifactId(org.eclipse.m2e.tests.internal.wizard.MavenImportWizardPageTest)  Time elapsed: 32.694 s
11:13:26 test408042_simpleProject(org.eclipse.m2e.tests.internal.wizard.MavenImportWizardPageTest)  Time elapsed: 17.657 s
11:13:26 test422008_preselectedWorkingSet(org.eclipse.m2e.tests.internal.wizard.MavenImportWizardPageTest)  Time elapsed: 33.575 s
11:13:26 Running org.eclipse.m2e.tests.internal.wizard.MappingDiscoveryJobTest
11:14:49 Tests run: 2, Failures: 0, Errors: 0, Skipped: 0, Time elapsed: 82.949 s - in org.eclipse.m2e.tests.internal.wizard.MappingDiscoveryJobTest
11:14:49 testDontOpenMappingDiscoveryWizard(org.eclipse.m2e.tests.internal.wizard.MappingDiscoveryJobTest)  Time elapsed: 32.249 s
11:14:49 testOpensMappingDiscoveryWizard(org.eclipse.m2e.tests.internal.wizard.MappingDiscoveryJobTest)  Time elapsed: 50.698 s
11:14:49 Running org.eclipse.m2e.tests.internal.lifecyclemapping.ProjectConfigurationElementSorterTest
11:14:49 Tests run: 6, Failures: 0, Errors: 0, Skipped: 0, Time elapsed: 0.007 s - in org.eclipse.m2e.tests.internal.lifecyclemapping.ProjectConfigurationElementSorterTest
11:14:49 testSortConfigurators_MissingPreviousConfigurator(org.eclipse.m2e.tests.internal.lifecyclemapping.ProjectConfigurationElementSorterTest)  Time elapsed: 0.004 s
11:14:49 testSortConfigurators_isRoot(org.eclipse.m2e.tests.internal.lifecyclemapping.ProjectConfigurationElementSorterTest)  Time elapsed: 0.001 s
11:14:49 testSortConfigurators_HappyPath(org.eclipse.m2e.tests.internal.lifecyclemapping.ProjectConfigurationElementSorterTest)  Time elapsed: 0 s
11:14:49 testSortConfigurators_MissingFollowingConfigurator(org.eclipse.m2e.tests.internal.lifecyclemapping.ProjectConfigurationElementSorterTest)  Time elapsed: 0 s
11:14:49 testSortConfigurators_CycleDetected(org.eclipse.m2e.tests.internal.lifecyclemapping.ProjectConfigurationElementSorterTest)  Time elapsed: 0 s
11:14:49 testSortConfigurators_471840(org.eclipse.m2e.tests.internal.lifecyclemapping.ProjectConfigurationElementSorterTest)  Time elapsed: 0.001 s
11:14:49 Running org.eclipse.m2e.tests.internal.index.NexusIndexManagerSearchTest
11:29:27 FATAL: command execution failed
11:29:27 java.nio.channels.ClosedChannelException
11:29:27 	at org.jenkinsci.remoting.protocol.NetworkLayer.onRecvClosed(NetworkLayer.java:154)
11:29:27 	at org.jenkinsci.remoting.protocol.impl.NIONetworkLayer.ready(NIONetworkLayer.java:142)
11:29:27 	at org.jenkinsci.remoting.protocol.IOHub$OnReady.run(IOHub.java:795)
11:29:27 	at jenkins.util.ContextResettingExecutorService$1.run(ContextResettingExecutorService.java:28)
11:29:27 	at jenkins.security.ImpersonatingExecutorService$1.run(ImpersonatingExecutorService.java:59)
11:29:27 	at java.util.concurrent.ThreadPoolExecutor.runWorker(Unknown Source)
11:29:27 	at java.util.concurrent.ThreadPoolExecutor$Worker.run(Unknown Source)
11:29:27 	at java.lang.Thread.run(Unknown Source)
11:29:27 Caused: java.io.IOException: Backing channel 'JNLP4-connect connection from 10.130.4.1/10.130.4.1:37120' is disconnected.
11:29:27 	at hudson.remoting.RemoteInvocationHandler.channelOrFail(RemoteInvocationHandler.java:214)
11:29:27 	at hudson.remoting.RemoteInvocationHandler.invoke(RemoteInvocationHandler.java:283)
11:29:27 	at com.sun.proxy.$Proxy93.isAlive(Unknown Source)
11:29:27 	at hudson.Launcher$RemoteLauncher$ProcImpl.isAlive(Launcher.java:1150)
11:29:27 	at hudson.Launcher$RemoteLauncher$ProcImpl.join(Launcher.java:1142)
11:29:27 	at hudson.Launcher$ProcStarter.join(Launcher.java:470)
11:29:27 	at hudson.tasks.Maven.perform(Maven.java:368)
11:29:27 	at hudson.tasks.BuildStepMonitor$1.perform(BuildStepMonitor.java:20)
11:29:27 	at hudson.model.AbstractBuild$AbstractBuildExecution.perform(AbstractBuild.java:741)
11:29:27 	at hudson.model.Build$BuildExecution.build(Build.java:206)
11:29:27 	at hudson.model.Build$BuildExecution.doRun(Build.java:163)
11:29:27 	at hudson.model.AbstractBuild$AbstractBuildExecution.run(AbstractBuild.java:504)
11:29:27 	at hudson.model.Run.execute(Run.java:1815)
11:29:27 	at hudson.model.FreeStyleBuild.run(FreeStyleBuild.java:43)
11:29:27 	at hudson.model.ResourceController.execute(ResourceController.java:97)
11:29:27 	at hudson.model.Executor.run(Executor.java:429)
11:29:27 Build step 'Invoke top-level Maven targets' marked build as failure
11:29:27 Terminating xvnc.
11:29:27 FATAL: Channel "unknown": Remote call on JNLP4-connect connection from 10.130.4.1/10.130.4.1:37120 failed. The channel is closing down or has closed down
11:29:27 java.nio.channels.ClosedChannelException
11:29:27 	at org.jenkinsci.remoting.protocol.NetworkLayer.onRecvClosed(NetworkLayer.java:154)
11:29:27 	at org.jenkinsci.remoting.protocol.impl.NIONetworkLayer.ready(NIONetworkLayer.java:142)
11:29:27 	at org.jenkinsci.remoting.protocol.IOHub$OnReady.run(IOHub.java:795)
11:29:27 	at jenkins.util.ContextResettingExecutorService$1.run(ContextResettingExecutorService.java:28)
11:29:27 	at jenkins.security.ImpersonatingExecutorService$1.run(ImpersonatingExecutorService.java:59)
11:29:27 	at java.util.concurrent.ThreadPoolExecutor.runWorker(Unknown Source)
11:29:27 	at java.util.concurrent.ThreadPoolExecutor$Worker.run(Unknown Source)
11:29:27 	at java.lang.Thread.run(Unknown Source)
11:29:27 Caused: hudson.remoting.ChannelClosedException: Channel "unknown": Remote call on JNLP4-connect connection from 10.130.4.1/10.130.4.1:37120 failed. The channel is closing down or has closed down
11:29:27 	at hudson.remoting.Channel.call(Channel.java:950)
11:29:27 	at hudson.Launcher$RemoteLauncher.kill(Launcher.java:1086)
11:29:27 	at hudson.plugins.xvnc.Xvnc$DisposerImpl.tearDown(Xvnc.java:237)
11:29:27 	at jenkins.tasks.SimpleBuildWrapper$EnvironmentWrapper.tearDown(SimpleBuildWrapper.java:175)
11:29:27 	at hudson.model.Build$BuildExecution.doRun(Build.java:174)
11:29:27 	at hudson.model.AbstractBuild$AbstractBuildExecution.run(AbstractBuild.java:504)
11:29:27 	at hudson.model.Run.execute(Run.java:1815)
11:29:27 	at hudson.model.FreeStyleBuild.run(FreeStyleBuild.java:43)
11:29:27 	at hudson.model.ResourceController.execute(ResourceController.java:97)
11:29:27 	at hudson.model.Executor.run(Executor.java:429)
11:29:27 ERROR: Step ‘Publish JUnit test result report’ failed: no workspace for m2e-sonarqube #1610
11:29:27 ERROR: Step ‘Archive the artifacts’ failed: no workspace for m2e-sonarqube #1610
11:29:27 ERROR: migration-agent-vst7g is offline; cannot locate oracle-jdk8-latest
11:29:27 Finished: FAILURE