FailedConsole Output

Skipping 2,732 KB.. Full Log
ntent/repositories/cbi-releases/org/apache/maven/maven-core/2.0/maven-core-2.0.pom
Downloading from eclipse.maven.central.mirror: https://repo.eclipse.org/content/repositories/maven_central/org/apache/maven/maven-core/2.0/maven-core-2.0.pom
Progress (1): 4.1 kB
Progress (1): 5.6 kB
                    
Downloaded from eclipse.maven.central.mirror: https://repo.eclipse.org/content/repositories/maven_central/org/apache/maven/maven-core/2.0/maven-core-2.0.pom (5.6 kB at 311 kB/s)
Downloading from cbi-releases: https://repo.eclipse.org/content/repositories/cbi-releases/org/apache/maven/maven-settings/2.0/maven-settings-2.0.pom
Downloading from eclipse.maven.central.mirror: https://repo.eclipse.org/content/repositories/maven_central/org/apache/maven/maven-settings/2.0/maven-settings-2.0.pom
Progress (1): 1.4 kB
                    
Downloaded from eclipse.maven.central.mirror: https://repo.eclipse.org/content/repositories/maven_central/org/apache/maven/maven-settings/2.0/maven-settings-2.0.pom (1.4 kB at 51 kB/s)
Downloading from cbi-releases: https://repo.eclipse.org/content/repositories/cbi-releases/org/apache/maven/maven-plugin-parameter-documenter/2.0/maven-plugin-parameter-documenter-2.0.pom
Downloading from eclipse.maven.central.mirror: https://repo.eclipse.org/content/repositories/maven_central/org/apache/maven/maven-plugin-parameter-documenter/2.0/maven-plugin-parameter-documenter-2.0.pom
Progress (1): 1.5 kB
                    
Downloaded from eclipse.maven.central.mirror: https://repo.eclipse.org/content/repositories/maven_central/org/apache/maven/maven-plugin-parameter-documenter/2.0/maven-plugin-parameter-documenter-2.0.pom (1.5 kB at 3.6 kB/s)
Downloading from cbi-releases: https://repo.eclipse.org/content/repositories/cbi-releases/org/apache/maven/reporting/maven-reporting-api/2.0/maven-reporting-api-2.0.pom
Downloading from eclipse.maven.central.mirror: https://repo.eclipse.org/content/repositories/maven_central/org/apache/maven/reporting/maven-reporting-api/2.0/maven-reporting-api-2.0.pom
Progress (1): 1.1 kB
                    
Downloaded from eclipse.maven.central.mirror: https://repo.eclipse.org/content/repositories/maven_central/org/apache/maven/reporting/maven-reporting-api/2.0/maven-reporting-api-2.0.pom (1.1 kB at 35 kB/s)
Downloading from cbi-releases: https://repo.eclipse.org/content/repositories/cbi-releases/org/apache/maven/reporting/maven-reporting/2.0/maven-reporting-2.0.pom
Downloading from eclipse.maven.central.mirror: https://repo.eclipse.org/content/repositories/maven_central/org/apache/maven/reporting/maven-reporting/2.0/maven-reporting-2.0.pom
Progress (1): 504 B
                   
Downloaded from eclipse.maven.central.mirror: https://repo.eclipse.org/content/repositories/maven_central/org/apache/maven/reporting/maven-reporting/2.0/maven-reporting-2.0.pom (504 B at 19 kB/s)
Downloading from cbi-releases: https://repo.eclipse.org/content/repositories/cbi-releases/doxia/doxia-sink-api/1.0-alpha-4/doxia-sink-api-1.0-alpha-4.pom
Downloading from eclipse.maven.central.mirror: https://repo.eclipse.org/content/repositories/maven_central/doxia/doxia-sink-api/1.0-alpha-4/doxia-sink-api-1.0-alpha-4.pom
Progress (1): 1.1 kB
                    
Downloaded from eclipse.maven.central.mirror: https://repo.eclipse.org/content/repositories/maven_central/doxia/doxia-sink-api/1.0-alpha-4/doxia-sink-api-1.0-alpha-4.pom (1.1 kB at 42 kB/s)
Downloading from cbi-releases: https://repo.eclipse.org/content/repositories/cbi-releases/org/apache/maven/maven-error-diagnostics/2.0/maven-error-diagnostics-2.0.pom
Downloading from eclipse.maven.central.mirror: https://repo.eclipse.org/content/repositories/maven_central/org/apache/maven/maven-error-diagnostics/2.0/maven-error-diagnostics-2.0.pom
Progress (1): 812 B
                   
Downloaded from eclipse.maven.central.mirror: https://repo.eclipse.org/content/repositories/maven_central/org/apache/maven/maven-error-diagnostics/2.0/maven-error-diagnostics-2.0.pom (812 B at 51 kB/s)
Downloading from cbi-releases: https://repo.eclipse.org/content/repositories/cbi-releases/org/apache/maven/maven-plugin-registry/2.0/maven-plugin-registry-2.0.pom
Downloading from eclipse.maven.central.mirror: https://repo.eclipse.org/content/repositories/maven_central/org/apache/maven/maven-plugin-registry/2.0/maven-plugin-registry-2.0.pom
Progress (1): 1.3 kB
                    
Downloaded from eclipse.maven.central.mirror: https://repo.eclipse.org/content/repositories/maven_central/org/apache/maven/maven-plugin-registry/2.0/maven-plugin-registry-2.0.pom (1.3 kB at 86 kB/s)
Downloading from cbi-releases: https://repo.eclipse.org/content/repositories/cbi-releases/org/apache/maven/maven-plugin-descriptor/2.0/maven-plugin-descriptor-2.0.pom
Downloading from eclipse.maven.central.mirror: https://repo.eclipse.org/content/repositories/maven_central/org/apache/maven/maven-plugin-descriptor/2.0/maven-plugin-descriptor-2.0.pom
Progress (1): 1.5 kB
                    
Downloaded from eclipse.maven.central.mirror: https://repo.eclipse.org/content/repositories/maven_central/org/apache/maven/maven-plugin-descriptor/2.0/maven-plugin-descriptor-2.0.pom (1.5 kB at 56 kB/s)
Downloading from cbi-releases: https://repo.eclipse.org/content/repositories/cbi-releases/org/apache/maven/maven-monitor/2.0/maven-monitor-2.0.pom
Downloading from eclipse.maven.central.mirror: https://repo.eclipse.org/content/repositories/maven_central/org/apache/maven/maven-monitor/2.0/maven-monitor-2.0.pom
Progress (1): 400 B
                   
Downloaded from eclipse.maven.central.mirror: https://repo.eclipse.org/content/repositories/maven_central/org/apache/maven/maven-monitor/2.0/maven-monitor-2.0.pom (400 B at 14 kB/s)
Downloading from cbi-releases: https://repo.eclipse.org/content/repositories/cbi-releases/org/codehaus/plexus/plexus-archiver/1.0-alpha-7/plexus-archiver-1.0-alpha-7.pom
Downloading from eclipse.maven.central.mirror: https://repo.eclipse.org/content/repositories/maven_central/org/codehaus/plexus/plexus-archiver/1.0-alpha-7/plexus-archiver-1.0-alpha-7.pom
Progress (1): 1.0 kB
                    
Downloaded from eclipse.maven.central.mirror: https://repo.eclipse.org/content/repositories/maven_central/org/codehaus/plexus/plexus-archiver/1.0-alpha-7/plexus-archiver-1.0-alpha-7.pom (1.0 kB at 65 kB/s)
Downloading from cbi-releases: https://repo.eclipse.org/content/repositories/cbi-releases/org/codehaus/plexus/plexus-components/1.1.6/plexus-components-1.1.6.pom
Downloading from eclipse.maven.central.mirror: https://repo.eclipse.org/content/repositories/maven_central/org/codehaus/plexus/plexus-components/1.1.6/plexus-components-1.1.6.pom
Progress (1): 1.9 kB
                    
Downloaded from eclipse.maven.central.mirror: https://repo.eclipse.org/content/repositories/maven_central/org/codehaus/plexus/plexus-components/1.1.6/plexus-components-1.1.6.pom (1.9 kB at 73 kB/s)
Downloading from cbi-releases: https://repo.eclipse.org/content/repositories/cbi-releases/org/apache/maven/shared/maven-invoker/2.0.7/maven-invoker-2.0.7.pom
Downloading from eclipse.maven.central.mirror: https://repo.eclipse.org/content/repositories/maven_central/org/apache/maven/shared/maven-invoker/2.0.7/maven-invoker-2.0.7.pom
Progress (1): 2.4 kB
                    
Downloaded from eclipse.maven.central.mirror: https://repo.eclipse.org/content/repositories/maven_central/org/apache/maven/shared/maven-invoker/2.0.7/maven-invoker-2.0.7.pom (2.4 kB at 56 kB/s)
Downloading from cbi-releases: https://repo.eclipse.org/content/repositories/cbi-releases/org/codehaus/plexus/plexus-utils/1.4.7/plexus-utils-1.4.7.pom
Downloading from eclipse.maven.central.mirror: https://repo.eclipse.org/content/repositories/maven_central/org/codehaus/plexus/plexus-utils/1.4.7/plexus-utils-1.4.7.pom
Progress (1): 2.3 kB
                    
Downloaded from eclipse.maven.central.mirror: https://repo.eclipse.org/content/repositories/maven_central/org/codehaus/plexus/plexus-utils/1.4.7/plexus-utils-1.4.7.pom (2.3 kB at 61 kB/s)
Downloading from cbi-releases: https://repo.eclipse.org/content/repositories/cbi-releases/org/apache/maven/reporting/maven-reporting-impl/2.0.5/maven-reporting-impl-2.0.5.jar
Downloading from cbi-releases: https://repo.eclipse.org/content/repositories/cbi-releases/commons-io/commons-io/1.4/commons-io-1.4.jar
Downloading from cbi-releases: https://repo.eclipse.org/content/repositories/cbi-releases/org/codehaus/plexus/plexus-utils/1.5.1/plexus-utils-1.5.1.jar
Downloading from cbi-releases: https://repo.eclipse.org/content/repositories/cbi-releases/org/codehaus/plexus/plexus-archiver/1.0-alpha-12/plexus-archiver-1.0-alpha-12.jar
Downloading from cbi-releases: https://repo.eclipse.org/content/repositories/cbi-releases/org/apache/maven/shared/maven-doxia-tools/1.0.2/maven-doxia-tools-1.0.2.jar
Downloading from cbi-releases: https://repo.eclipse.org/content/repositories/cbi-releases/org/apache/maven/shared/maven-shared-io/1.0/maven-shared-io-1.0.jar
Downloading from cbi-releases: https://repo.eclipse.org/content/repositories/cbi-releases/org/codehaus/plexus/plexus-io/1.0-alpha-5/plexus-io-1.0-alpha-5.jar
Downloading from cbi-releases: https://repo.eclipse.org/content/repositories/cbi-releases/org/apache/maven/shared/maven-dependency-analyzer/1.2/maven-dependency-analyzer-1.2.jar
Downloading from cbi-releases: https://repo.eclipse.org/content/repositories/cbi-releases/asm/asm/3.0/asm-3.0.jar
Downloading from cbi-releases: https://repo.eclipse.org/content/repositories/cbi-releases/org/apache/maven/shared/maven-dependency-tree/1.2/maven-dependency-tree-1.2.jar
Downloading from cbi-releases: https://repo.eclipse.org/content/repositories/cbi-releases/org/apache/maven/shared/maven-common-artifact-filters/1.2/maven-common-artifact-filters-1.2.jar
Downloading from cbi-releases: https://repo.eclipse.org/content/repositories/cbi-releases/org/apache/maven/shared/maven-plugin-testing-harness/1.1/maven-plugin-testing-harness-1.1.jar
Downloading from cbi-releases: https://repo.eclipse.org/content/repositories/cbi-releases/org/apache/maven/shared/maven-invoker/2.0.7/maven-invoker-2.0.7.jar
Downloading from eclipse.maven.central.mirror: https://repo.eclipse.org/content/repositories/maven_central/org/apache/maven/reporting/maven-reporting-impl/2.0.5/maven-reporting-impl-2.0.5.jar
Downloading from eclipse.maven.central.mirror: https://repo.eclipse.org/content/repositories/maven_central/org/codehaus/plexus/plexus-archiver/1.0-alpha-12/plexus-archiver-1.0-alpha-12.jar
Downloading from eclipse.maven.central.mirror: https://repo.eclipse.org/content/repositories/maven_central/commons-io/commons-io/1.4/commons-io-1.4.jar
Downloading from eclipse.maven.central.mirror: https://repo.eclipse.org/content/repositories/maven_central/org/apache/maven/shared/maven-doxia-tools/1.0.2/maven-doxia-tools-1.0.2.jar
Downloading from eclipse.maven.central.mirror: https://repo.eclipse.org/content/repositories/maven_central/org/codehaus/plexus/plexus-utils/1.5.1/plexus-utils-1.5.1.jar
Progress (1): 4.1/41 kB
Progress (1): 7.7/41 kB
Progress (1): 12/41 kB 
Progress (2): 12/41 kB | 4.1/211 kB
Progress (2): 16/41 kB | 4.1/211 kB
Progress (2): 16/41 kB | 7.7/211 kB
Progress (2): 16/41 kB | 12/211 kB 
Progress (2): 16/41 kB | 16/211 kB
Progress (2): 20/41 kB | 16/211 kB
Progress (2): 24/41 kB | 16/211 kB
Progress (2): 28/41 kB | 16/211 kB
Progress (3): 28/41 kB | 16/211 kB | 4.1/109 kB
Progress (3): 28/41 kB | 20/211 kB | 4.1/109 kB
Progress (3): 28/41 kB | 20/211 kB | 7.7/109 kB
Progress (3): 32/41 kB | 20/211 kB | 7.7/109 kB
Progress (3): 32/41 kB | 20/211 kB | 12/109 kB 
Progress (3): 32/41 kB | 24/211 kB | 12/109 kB
Progress (3): 32/41 kB | 24/211 kB | 16/109 kB
Progress (3): 32/41 kB | 28/211 kB | 16/109 kB
Progress (3): 36/41 kB | 28/211 kB | 16/109 kB
Progress (3): 36/41 kB | 32/211 kB | 16/109 kB
Progress (3): 40/41 kB | 32/211 kB | 16/109 kB
Progress (3): 41 kB | 32/211 kB | 16/109 kB   
Progress (3): 41 kB | 32/211 kB | 20/109 kB
Progress (3): 41 kB | 32/211 kB | 24/109 kB
Progress (3): 41 kB | 36/211 kB | 24/109 kB
Progress (3): 41 kB | 36/211 kB | 28/109 kB
Progress (3): 41 kB | 40/211 kB | 28/109 kB
Progress (3): 41 kB | 40/211 kB | 32/109 kB
Progress (3): 41 kB | 45/211 kB | 32/109 kB
Progress (3): 41 kB | 49/211 kB | 32/109 kB
Progress (3): 41 kB | 49/211 kB | 36/109 kB
Progress (4): 41 kB | 49/211 kB | 36/109 kB | 4.1/21 kB
Progress (4): 41 kB | 49/211 kB | 40/109 kB | 4.1/21 kB
Progress (4): 41 kB | 53/211 kB | 40/109 kB | 4.1/21 kB
Progress (4): 41 kB | 53/211 kB | 45/109 kB | 4.1/21 kB
Progress (4): 41 kB | 53/211 kB | 45/109 kB | 7.7/21 kB
Progress (4): 41 kB | 53/211 kB | 49/109 kB | 7.7/21 kB
Progress (4): 41 kB | 57/211 kB | 49/109 kB | 7.7/21 kB
                                                       
Downloaded from eclipse.maven.central.mirror: https://repo.eclipse.org/content/repositories/maven_central/org/apache/maven/shared/maven-doxia-tools/1.0.2/maven-doxia-tools-1.0.2.jar (41 kB at 1.4 MB/s)
Progress (3): 57/211 kB | 49/109 kB | 12/21 kB
                                              
Downloading from eclipse.maven.central.mirror: https://repo.eclipse.org/content/repositories/maven_central/org/apache/maven/shared/maven-shared-io/1.0/maven-shared-io-1.0.jar
Progress (3): 57/211 kB | 53/109 kB | 12/21 kB
Progress (3): 61/211 kB | 53/109 kB | 12/21 kB
Progress (3): 61/211 kB | 57/109 kB | 12/21 kB
Progress (3): 61/211 kB | 57/109 kB | 16/21 kB
Progress (3): 61/211 kB | 61/109 kB | 16/21 kB
Progress (3): 65/211 kB | 61/109 kB | 16/21 kB
Progress (3): 65/211 kB | 65/109 kB | 16/21 kB
Progress (3): 65/211 kB | 65/109 kB | 20/21 kB
Progress (3): 65/211 kB | 65/109 kB | 21 kB   
Progress (3): 65/211 kB | 69/109 kB | 21 kB
Progress (3): 69/211 kB | 69/109 kB | 21 kB
Progress (3): 69/211 kB | 73/109 kB | 21 kB
Progress (3): 73/211 kB | 73/109 kB | 21 kB
Progress (3): 73/211 kB | 77/109 kB | 21 kB
Progress (3): 77/211 kB | 77/109 kB | 21 kB
Progress (3): 77/211 kB | 81/109 kB | 21 kB
Progress (3): 81/211 kB | 81/109 kB | 21 kB
Progress (3): 81/211 kB | 85/109 kB | 21 kB
Progress (3): 81/211 kB | 90/109 kB | 21 kB
Progress (3): 81/211 kB | 94/109 kB | 21 kB
Progress (3): 85/211 kB | 94/109 kB | 21 kB
                                           
Downloaded from eclipse.maven.central.mirror: https://repo.eclipse.org/content/repositories/maven_central/org/apache/maven/reporting/maven-reporting-impl/2.0.5/maven-reporting-impl-2.0.5.jar (21 kB at 606 kB/s)
Progress (2): 85/211 kB | 98/109 kB
                                   
Downloading from eclipse.maven.central.mirror: https://repo.eclipse.org/content/repositories/maven_central/org/codehaus/plexus/plexus-io/1.0-alpha-5/plexus-io-1.0-alpha-5.jar
Progress (2): 90/211 kB | 98/109 kB
Progress (2): 90/211 kB | 102/109 kB
Progress (2): 94/211 kB | 102/109 kB
Progress (2): 94/211 kB | 106/109 kB
Progress (2): 98/211 kB | 106/109 kB
Progress (2): 98/211 kB | 109 kB    
Progress (2): 102/211 kB | 109 kB
Progress (2): 106/211 kB | 109 kB
Progress (2): 110/211 kB | 109 kB
Progress (2): 114/211 kB | 109 kB
Progress (2): 118/211 kB | 109 kB
                                 
Downloaded from eclipse.maven.central.mirror: https://repo.eclipse.org/content/repositories/maven_central/commons-io/commons-io/1.4/commons-io-1.4.jar (109 kB at 3.0 MB/s)
Progress (1): 122/211 kB
                        
Downloading from eclipse.maven.central.mirror: https://repo.eclipse.org/content/repositories/maven_central/org/apache/maven/shared/maven-dependency-analyzer/1.2/maven-dependency-analyzer-1.2.jar
Progress (1): 126/211 kB
Progress (1): 131/211 kB
Progress (1): 135/211 kB
Progress (1): 139/211 kB
Progress (1): 143/211 kB
Progress (1): 147/211 kB
Progress (1): 151/211 kB
Progress (1): 155/211 kB
Progress (1): 159/211 kB
Progress (1): 163/211 kB
Progress (1): 167/211 kB
Progress (1): 171/211 kB
Progress (1): 176/211 kB
Progress (1): 180/211 kB
Progress (1): 184/211 kB
Progress (1): 188/211 kB
Progress (1): 192/211 kB
Progress (1): 196/211 kB
Progress (1): 200/211 kB
Progress (1): 204/211 kB
Progress (1): 208/211 kB
Progress (1): 211 kB    
                    
Downloaded from eclipse.maven.central.mirror: https://repo.eclipse.org/content/repositories/maven_central/org/codehaus/plexus/plexus-utils/1.5.1/plexus-utils-1.5.1.jar (211 kB at 5.0 MB/s)
Downloading from eclipse.maven.central.mirror: https://repo.eclipse.org/content/repositories/maven_central/asm/asm/3.0/asm-3.0.jar
Progress (1): 4.1/28 kB
Progress (1): 7.7/28 kB
Progress (1): 12/28 kB 
Progress (1): 16/28 kB
Progress (1): 20/28 kB
Progress (1): 24/28 kB
Progress (1): 28 kB   
Progress (2): 28 kB | 4.1/43 kB
Progress (2): 28 kB | 7.7/43 kB
Progress (2): 28 kB | 12/43 kB 
Progress (2): 28 kB | 16/43 kB
Progress (2): 28 kB | 20/43 kB
Progress (2): 28 kB | 24/43 kB
Progress (2): 28 kB | 28/43 kB
Progress (2): 28 kB | 32/43 kB
Progress (3): 28 kB | 32/43 kB | 4.1/51 kB
Progress (3): 28 kB | 32/43 kB | 7.7/51 kB
Progress (3): 28 kB | 36/43 kB | 7.7/51 kB
Progress (3): 28 kB | 36/43 kB | 12/51 kB 
Progress (3): 28 kB | 40/43 kB | 12/51 kB
Progress (3): 28 kB | 40/43 kB | 16/51 kB
Progress (3): 28 kB | 43 kB | 16/51 kB   
Progress (3): 28 kB | 43 kB | 20/51 kB
Progress (3): 28 kB | 43 kB | 24/51 kB
Progress (3): 28 kB | 43 kB | 28/51 kB
Progress (3): 28 kB | 43 kB | 32/51 kB
Progress (3): 28 kB | 43 kB | 36/51 kB
                                      
Downloaded from eclipse.maven.central.mirror: https://repo.eclipse.org/content/repositories/maven_central/asm/asm/3.0/asm-3.0.jar (43 kB at 890 kB/s)
Progress (3): 28 kB | 36/51 kB | 4.1/177 kB
Progress (3): 28 kB | 40/51 kB | 4.1/177 kB
Progress (3): 28 kB | 40/51 kB | 7.7/177 kB
                                           
Downloading from eclipse.maven.central.mirror: https://repo.eclipse.org/content/repositories/maven_central/org/apache/maven/shared/maven-dependency-tree/1.2/maven-dependency-tree-1.2.jar
Progress (3): 28 kB | 40/51 kB | 12/177 kB
Progress (3): 28 kB | 45/51 kB | 12/177 kB
Progress (3): 28 kB | 45/51 kB | 16/177 kB
Progress (3): 28 kB | 49/51 kB | 16/177 kB
Progress (3): 28 kB | 51 kB | 16/177 kB   
Progress (3): 28 kB | 51 kB | 20/177 kB
Progress (3): 28 kB | 51 kB | 24/177 kB
Progress (3): 28 kB | 51 kB | 28/177 kB
Progress (3): 28 kB | 51 kB | 32/177 kB
Progress (3): 28 kB | 51 kB | 36/177 kB
Progress (3): 28 kB | 51 kB | 40/177 kB
Progress (3): 28 kB | 51 kB | 45/177 kB
Progress (3): 28 kB | 51 kB | 49/177 kB
Progress (3): 28 kB | 51 kB | 53/177 kB
Progress (3): 28 kB | 51 kB | 57/177 kB
Progress (3): 28 kB | 51 kB | 61/177 kB
Progress (4): 28 kB | 51 kB | 61/177 kB | 4.1/33 kB
Progress (4): 28 kB | 51 kB | 65/177 kB | 4.1/33 kB
Progress (4): 28 kB | 51 kB | 65/177 kB | 7.7/33 kB
                                                   
Downloaded from eclipse.maven.central.mirror: https://repo.eclipse.org/content/repositories/maven_central/org/apache/maven/shared/maven-dependency-analyzer/1.2/maven-dependency-analyzer-1.2.jar (28 kB at 515 kB/s)
Progress (3): 51 kB | 65/177 kB | 12/33 kB
Progress (3): 51 kB | 69/177 kB | 12/33 kB
                                          
Downloading from eclipse.maven.central.mirror: https://repo.eclipse.org/content/repositories/maven_central/org/apache/maven/shared/maven-common-artifact-filters/1.2/maven-common-artifact-filters-1.2.jar
Progress (3): 51 kB | 73/177 kB | 12/33 kB
Progress (3): 51 kB | 73/177 kB | 16/33 kB
Progress (3): 51 kB | 77/177 kB | 16/33 kB
Progress (3): 51 kB | 81/177 kB | 16/33 kB
Progress (3): 51 kB | 81/177 kB | 20/33 kB
Progress (3): 51 kB | 81/177 kB | 24/33 kB
Progress (3): 51 kB | 81/177 kB | 28/33 kB
Progress (3): 51 kB | 81/177 kB | 32/33 kB
Progress (3): 51 kB | 85/177 kB | 32/33 kB
Progress (3): 51 kB | 85/177 kB | 33 kB   
Progress (3): 51 kB | 90/177 kB | 33 kB
Progress (3): 51 kB | 94/177 kB | 33 kB
Progress (3): 51 kB | 98/177 kB | 33 kB
Progress (4): 51 kB | 98/177 kB | 33 kB | 4.1/32 kB
Progress (4): 51 kB | 102/177 kB | 33 kB | 4.1/32 kB
Progress (4): 51 kB | 102/177 kB | 33 kB | 7.7/32 kB
Progress (4): 51 kB | 106/177 kB | 33 kB | 7.7/32 kB
Progress (4): 51 kB | 106/177 kB | 33 kB | 12/32 kB 
Progress (4): 51 kB | 110/177 kB | 33 kB | 12/32 kB
Progress (4): 51 kB | 110/177 kB | 33 kB | 16/32 kB
Progress (4): 51 kB | 114/177 kB | 33 kB | 16/32 kB
Progress (4): 51 kB | 114/177 kB | 33 kB | 20/32 kB
Progress (4): 51 kB | 118/177 kB | 33 kB | 20/32 kB
Progress (4): 51 kB | 118/177 kB | 33 kB | 24/32 kB
Progress (4): 51 kB | 122/177 kB | 33 kB | 24/32 kB
Progress (4): 51 kB | 122/177 kB | 33 kB | 28/32 kB
Progress (4): 51 kB | 126/177 kB | 33 kB | 28/32 kB
Progress (4): 51 kB | 126/177 kB | 33 kB | 32 kB   
Progress (4): 51 kB | 131/177 kB | 33 kB | 32 kB
Progress (4): 51 kB | 135/177 kB | 33 kB | 32 kB
Progress (4): 51 kB | 139/177 kB | 33 kB | 32 kB
Progress (4): 51 kB | 143/177 kB | 33 kB | 32 kB
Progress (4): 51 kB | 147/177 kB | 33 kB | 32 kB
Progress (4): 51 kB | 151/177 kB | 33 kB | 32 kB
Progress (4): 51 kB | 155/177 kB | 33 kB | 32 kB
Progress (4): 51 kB | 159/177 kB | 33 kB | 32 kB
Progress (4): 51 kB | 163/177 kB | 33 kB | 32 kB
Progress (4): 51 kB | 167/177 kB | 33 kB | 32 kB
Progress (4): 51 kB | 171/177 kB | 33 kB | 32 kB
Progress (4): 51 kB | 176/177 kB | 33 kB | 32 kB
Progress (4): 51 kB | 177 kB | 33 kB | 32 kB    
                                            
Downloaded from eclipse.maven.central.mirror: https://repo.eclipse.org/content/repositories/maven_central/org/apache/maven/shared/maven-common-artifact-filters/1.2/maven-common-artifact-filters-1.2.jar (32 kB at 518 kB/s)
Downloading from eclipse.maven.central.mirror: https://repo.eclipse.org/content/repositories/maven_central/org/apache/maven/shared/maven-plugin-testing-harness/1.1/maven-plugin-testing-harness-1.1.jar
Downloaded from eclipse.maven.central.mirror: https://repo.eclipse.org/content/repositories/maven_central/org/codehaus/plexus/plexus-io/1.0-alpha-5/plexus-io-1.0-alpha-5.jar (51 kB at 692 kB/s)
Downloading from eclipse.maven.central.mirror: https://repo.eclipse.org/content/repositories/maven_central/org/apache/maven/shared/maven-invoker/2.0.7/maven-invoker-2.0.7.jar
Progress (3): 177 kB | 33 kB | 4.1/35 kB
Progress (3): 177 kB | 33 kB | 7.7/35 kB
Progress (3): 177 kB | 33 kB | 12/35 kB 
Progress (3): 177 kB | 33 kB | 16/35 kB
Progress (3): 177 kB | 33 kB | 20/35 kB
Progress (3): 177 kB | 33 kB | 24/35 kB
Progress (3): 177 kB | 33 kB | 28/35 kB
Progress (3): 177 kB | 33 kB | 32/35 kB
Progress (3): 177 kB | 33 kB | 35 kB   
                                    
Downloaded from eclipse.maven.central.mirror: https://repo.eclipse.org/content/repositories/maven_central/org/apache/maven/shared/maven-dependency-tree/1.2/maven-dependency-tree-1.2.jar (35 kB at 112 kB/s)
Downloaded from eclipse.maven.central.mirror: https://repo.eclipse.org/content/repositories/maven_central/org/apache/maven/shared/maven-shared-io/1.0/maven-shared-io-1.0.jar (33 kB at 88 kB/s)
Progress (2): 177 kB | 4.1/32 kB
Progress (2): 177 kB | 7.7/32 kB
Progress (2): 177 kB | 12/32 kB 
Progress (2): 177 kB | 16/32 kB
Progress (2): 177 kB | 20/32 kB
Progress (2): 177 kB | 24/32 kB
Progress (2): 177 kB | 28/32 kB
Progress (2): 177 kB | 32/32 kB
Progress (2): 177 kB | 32 kB   
                            
Downloaded from eclipse.maven.central.mirror: https://repo.eclipse.org/content/repositories/maven_central/org/apache/maven/shared/maven-plugin-testing-harness/1.1/maven-plugin-testing-harness-1.1.jar (32 kB at 84 kB/s)
Progress (2): 177 kB | 4.1/25 kB
Progress (2): 177 kB | 7.7/25 kB
Progress (2): 177 kB | 12/25 kB 
Progress (2): 177 kB | 16/25 kB
                               
Downloaded from eclipse.maven.central.mirror: https://repo.eclipse.org/content/repositories/maven_central/org/codehaus/plexus/plexus-archiver/1.0-alpha-12/plexus-archiver-1.0-alpha-12.jar (177 kB at 449 kB/s)
Progress (1): 20/25 kB
Progress (1): 24/25 kB
Progress (1): 25 kB   
                   
Downloaded from eclipse.maven.central.mirror: https://repo.eclipse.org/content/repositories/maven_central/org/apache/maven/shared/maven-invoker/2.0.7/maven-invoker-2.0.7.jar (25 kB at 19 kB/s)
[INFO] Configured Artifact: org.eclipse.lemminx:lemminx-maven:0.0.1:jar
Downloading from lemminx-maven: https://repo.eclipse.org/content/repositories/lemminx/org/eclipse/lemminx/lemminx-maven/0.0.1/lemminx-maven-0.0.1.jar
Progress (1): 4.1/92 kB
Progress (1): 7.7/92 kB
Progress (1): 12/92 kB 
Progress (1): 16/92 kB
Progress (1): 20/92 kB
Progress (1): 24/92 kB
Progress (1): 28/92 kB
Progress (1): 32/92 kB
Progress (1): 36/92 kB
Progress (1): 40/92 kB
Progress (1): 45/92 kB
Progress (1): 49/92 kB
Progress (1): 53/92 kB
Progress (1): 57/92 kB
Progress (1): 61/92 kB
Progress (1): 65/92 kB
Progress (1): 69/92 kB
Progress (1): 73/92 kB
Progress (1): 77/92 kB
Progress (1): 81/92 kB
Progress (1): 85/92 kB
Progress (1): 90/92 kB
Progress (1): 92 kB   
                   
Downloaded from lemminx-maven: https://repo.eclipse.org/content/repositories/lemminx/org/eclipse/lemminx/lemminx-maven/0.0.1/lemminx-maven-0.0.1.jar (92 kB at 420 kB/s)
[INFO] Copying lemminx-maven-0.0.1.jar to /home/jenkins/agent/workspace/m2e-master/org.eclipse.m2e.editor.lemminx/lemminx-maven.jar
[INFO] 
[INFO] --- maven-resources-plugin:2.5:resources (default-resources) @ org.eclipse.m2e.editor.lemminx ---
[debug] execute contextualize
[INFO] Using 'UTF-8' encoding to copy filtered resources.
[INFO] skip non existing resourceDirectory /home/jenkins/agent/workspace/m2e-master/org.eclipse.m2e.editor.lemminx/src/main/resources
[INFO] 
[INFO] --- tycho-compiler-plugin:1.6.0:compile (default-compile) @ org.eclipse.m2e.editor.lemminx ---
[WARNING] Parameter 'useProjectSettings' is set to true, but preferences file '/home/jenkins/agent/workspace/m2e-master/org.eclipse.m2e.editor.lemminx/.settings/org.eclipse.jdt.core.prefs' could not be found!
[INFO] Compiling 3 source files to /home/jenkins/agent/workspace/m2e-master/org.eclipse.m2e.editor.lemminx/target/classes
[INFO] 
[INFO] --- maven-resources-plugin:2.5:testResources (default-testResources) @ org.eclipse.m2e.editor.lemminx ---
[debug] execute contextualize
[INFO] Using 'UTF-8' encoding to copy filtered resources.
[INFO] skip non existing resourceDirectory /home/jenkins/agent/workspace/m2e-master/org.eclipse.m2e.editor.lemminx/src/test/resources
[INFO] 
[INFO] --- tycho-source-plugin:1.6.0:plugin-source (plugin-source) @ org.eclipse.m2e.editor.lemminx ---
[INFO] Building jar: /home/jenkins/agent/workspace/m2e-master/org.eclipse.m2e.editor.lemminx/target/org.eclipse.m2e.editor.lemminx-1.16.0-SNAPSHOT-sources.jar
[INFO] 
[INFO] --- target-platform-configuration:1.6.0:target-platform (default-target-platform) @ org.eclipse.m2e.editor.lemminx ---
[INFO] 
[INFO] --- tycho-packaging-plugin:1.6.0:package-plugin (default-package-plugin) @ org.eclipse.m2e.editor.lemminx ---
[INFO] Building jar: /home/jenkins/agent/workspace/m2e-master/org.eclipse.m2e.editor.lemminx/target/org.eclipse.m2e.editor.lemminx-1.16.0-SNAPSHOT.jar
[INFO] 
[INFO] --- tycho-p2-plugin:1.6.0:p2-metadata-default (default-p2-metadata-default) @ org.eclipse.m2e.editor.lemminx ---
[INFO] 
[INFO] --- tycho-pack200a-plugin:1.6.0:normalize (pack200-normalize) @ org.eclipse.m2e.editor.lemminx ---
[INFO] Pack200 normalizing jar /home/jenkins/agent/workspace/m2e-master/org.eclipse.m2e.editor.lemminx/target/org.eclipse.m2e.editor.lemminx-1.16.0-SNAPSHOT.jar
[INFO] 
[INFO] --- eclipse-jarsigner-plugin:1.1.5:sign (sign) @ org.eclipse.m2e.editor.lemminx ---
[INFO] Signing of nested jars of '/home/jenkins/agent/workspace/m2e-master/org.eclipse.m2e.editor.lemminx/target/org.eclipse.m2e.editor.lemminx-1.16.0-SNAPSHOT.jar' is disabled.
[INFO] Signing jar: /home/jenkins/agent/workspace/m2e-master/org.eclipse.m2e.editor.lemminx/target/org.eclipse.m2e.editor.lemminx-1.16.0-SNAPSHOT.jar
[INFO] Signing of nested jars of '/home/jenkins/agent/workspace/m2e-master/org.eclipse.m2e.editor.lemminx/target/org.eclipse.m2e.editor.lemminx-1.16.0-SNAPSHOT-sources.jar' is disabled.
[INFO] Signing jar: /home/jenkins/agent/workspace/m2e-master/org.eclipse.m2e.editor.lemminx/target/org.eclipse.m2e.editor.lemminx-1.16.0-SNAPSHOT-sources.jar
[INFO] 
[INFO] --- tycho-pack200b-plugin:1.6.0:pack (pack200-pack) @ org.eclipse.m2e.editor.lemminx ---
[INFO] Pack200 packing jar /home/jenkins/agent/workspace/m2e-master/org.eclipse.m2e.editor.lemminx/target/org.eclipse.m2e.editor.lemminx-1.16.0-SNAPSHOT.jar
[INFO] 
[INFO] --- tycho-p2-plugin:1.6.0:p2-metadata (p2-metadata) @ org.eclipse.m2e.editor.lemminx ---
[WARNING] MavenProject: org.eclipse.m2e:org.eclipse.m2e.editor.lemminx:1.16.0-SNAPSHOT @ /home/jenkins/agent/workspace/m2e-master/org.eclipse.m2e.editor.lemminx/pom.xml: baseline and build artifacts have same version but different contents
   no-classifier: different
      META-INF/ECLIPSE_.RSA: different
      META-INF/ECLIPSE_.SF: different
      lemminx-maven.jar: different
         org/eclipse/lemminx/maven/MavenCompletionParticipant.class: different
   classifier-sources: not present in baseline

[INFO] MavenProject: org.eclipse.m2e:org.eclipse.m2e.editor.lemminx:1.16.0-SNAPSHOT @ /home/jenkins/agent/workspace/m2e-master/org.eclipse.m2e.editor.lemminx/pom.xml
    The main artifact has been replaced with the baseline version.
    The following attached artifacts have been replaced with the baseline version: [pack200]
    The following attached artifacts are not present in the baseline and have been removed: [sources]

[INFO] 
[INFO] --- tycho-p2-extras-plugin:1.6.0:compare-version-with-baselines (check-no-version-regression) @ org.eclipse.m2e.editor.lemminx ---
[INFO] 
[INFO] --- maven-install-plugin:2.3.1:install (default-install) @ org.eclipse.m2e.editor.lemminx ---
[INFO] Installing /home/jenkins/agent/workspace/m2e-master/org.eclipse.m2e.editor.lemminx/target/org.eclipse.m2e.editor.lemminx-1.16.0-SNAPSHOT.jar to /home/jenkins/agent/workspace/m2e-master/.repository/org/eclipse/m2e/org.eclipse.m2e.editor.lemminx/1.16.0-SNAPSHOT/org.eclipse.m2e.editor.lemminx-1.16.0-SNAPSHOT.jar
[INFO] Installing /home/jenkins/agent/workspace/m2e-master/org.eclipse.m2e.editor.lemminx/pom.xml to /home/jenkins/agent/workspace/m2e-master/.repository/org/eclipse/m2e/org.eclipse.m2e.editor.lemminx/1.16.0-SNAPSHOT/org.eclipse.m2e.editor.lemminx-1.16.0-SNAPSHOT.pom
[INFO] Installing /home/jenkins/agent/workspace/m2e-master/org.eclipse.m2e.editor.lemminx/target/org.eclipse.m2e.editor.lemminx-1.16.0-SNAPSHOT.jar.pack.gz to /home/jenkins/agent/workspace/m2e-master/.repository/org/eclipse/m2e/org.eclipse.m2e.editor.lemminx/1.16.0-SNAPSHOT/org.eclipse.m2e.editor.lemminx-1.16.0-SNAPSHOT-pack200.jar.pack.gz
[INFO] Installing /home/jenkins/agent/workspace/m2e-master/org.eclipse.m2e.editor.lemminx/target/p2content.xml to /home/jenkins/agent/workspace/m2e-master/.repository/org/eclipse/m2e/org.eclipse.m2e.editor.lemminx/1.16.0-SNAPSHOT/org.eclipse.m2e.editor.lemminx-1.16.0-SNAPSHOT-p2metadata.xml
[INFO] Installing /home/jenkins/agent/workspace/m2e-master/org.eclipse.m2e.editor.lemminx/target/p2artifacts.xml to /home/jenkins/agent/workspace/m2e-master/.repository/org/eclipse/m2e/org.eclipse.m2e.editor.lemminx/1.16.0-SNAPSHOT/org.eclipse.m2e.editor.lemminx-1.16.0-SNAPSHOT-p2artifacts.xml
[INFO] 
[INFO] --- tycho-p2-plugin:1.6.0:update-local-index (default-update-local-index) @ org.eclipse.m2e.editor.lemminx ---
[INFO] 
[INFO] ------------< org.eclipse.m2e:org.eclipse.m2e.tests.common >------------
[INFO] Building M2E Testing Helpers 1.16.0-SNAPSHOT                     [22/36]
[INFO] ---------------------------[ eclipse-plugin ]---------------------------
[INFO] 
[INFO] --- maven-clean-plugin:2.4.1:clean (default-clean) @ org.eclipse.m2e.tests.common ---
[INFO] 
[INFO] --- tycho-packaging-plugin:1.6.0:build-qualifier (default-build-qualifier) @ org.eclipse.m2e.tests.common ---
[INFO] The project's OSGi version is 1.16.0.20200514-1409
[INFO] 
[INFO] --- tycho-packaging-plugin:1.6.0:validate-id (default-validate-id) @ org.eclipse.m2e.tests.common ---
[INFO] 
[INFO] --- tycho-packaging-plugin:1.6.0:validate-version (default-validate-version) @ org.eclipse.m2e.tests.common ---
[INFO] 
[INFO] --- jacoco-maven-plugin:0.8.5:prepare-agent (default) @ org.eclipse.m2e.tests.common ---
[INFO] argLine set to -javaagent:/home/jenkins/agent/workspace/m2e-master/.repository/org/jacoco/org.jacoco.agent/0.8.5/org.jacoco.agent-0.8.5-runtime.jar=destfile=/home/jenkins/agent/workspace/m2e-master/target/jacoco.exec,append=true,includes=org.eclipse.m2e*:org.apache.maven*:org.eclipse.aether*
[INFO] 
[INFO] --- maven-resources-plugin:2.5:resources (default-resources) @ org.eclipse.m2e.tests.common ---
[debug] execute contextualize
[INFO] Using 'UTF-8' encoding to copy filtered resources.
[INFO] skip non existing resourceDirectory /home/jenkins/agent/workspace/m2e-master/org.eclipse.m2e.tests.common/src/main/resources
[INFO] 
[INFO] --- tycho-compiler-plugin:1.6.0:compile (default-compile) @ org.eclipse.m2e.tests.common ---
[INFO] Compiling 11 source files to /home/jenkins/agent/workspace/m2e-master/org.eclipse.m2e.tests.common/target/classes
[WARNING] /home/jenkins/agent/workspace/m2e-master/org.eclipse.m2e.tests.common/src/org/eclipse/m2e/tests/common/MavenRunner.java:[26] 
	import org.eclipse.m2e.core.internal.embedder.AbstractRunnable;
	       ^^^^^^^^^^^^^^^^^^^^^^^^^^^^^^^^^^^^^^^^^^^^^^^^^^^^^^^
Discouraged access: The type 'AbstractRunnable' is not API (restriction on classpath entry '/home/jenkins/agent/workspace/m2e-master/org.eclipse.m2e.core/target/classes')
[WARNING] /home/jenkins/agent/workspace/m2e-master/org.eclipse.m2e.tests.common/src/org/eclipse/m2e/tests/common/MavenRunner.java:[42] 
	class WrappedThrowable extends RuntimeException {
	      ^^^^^^^^^^^^^^^^
The serializable class WrappedThrowable does not declare a static final serialVersionUID field of type long
[WARNING] /home/jenkins/agent/workspace/m2e-master/org.eclipse.m2e.tests.common/src/org/eclipse/m2e/tests/common/MavenRunner.java:[48] 
	MavenPlugin.getMaven().execute(new AbstractRunnable() {
	                                   ^^^^^^^^^^^^^^^^
Discouraged access: The type 'AbstractRunnable' is not API (restriction on classpath entry '/home/jenkins/agent/workspace/m2e-master/org.eclipse.m2e.core/target/classes')
[WARNING] /home/jenkins/agent/workspace/m2e-master/org.eclipse.m2e.tests.common/src/org/eclipse/m2e/tests/common/MavenRunner.java:[48] 
	MavenPlugin.getMaven().execute(new AbstractRunnable() {
	                                   ^^^^^^^^^^^^^^^^
Discouraged access: The constructor 'AbstractRunnable()' is not API (restriction on classpath entry '/home/jenkins/agent/workspace/m2e-master/org.eclipse.m2e.core/target/classes')
[WARNING] /home/jenkins/agent/workspace/m2e-master/org.eclipse.m2e.tests.common/src/org/eclipse/m2e/tests/common/WorkspaceHelpers.java:[249] 
	marker.isSubtypeOf(IMarker.PROBLEM));
	^^^^^^
Potential null pointer access: The variable marker may be null at this location
6. INFO in /home/jenkins/agent/workspace/m2e-master/org.eclipse.m2e.tests.common/src/org/eclipse/m2e/tests/common/HttpServer.java (at line 666)
	if(HttpMethod.HEAD.equals(request.getMethod())) {
	                          ^^^^^^^^^^^^^^^^^^^
Unlikely argument type for equals(): String seems to be unrelated to HttpMethod
7. INFO in /home/jenkins/agent/workspace/m2e-master/org.eclipse.m2e.tests.common/src/org/eclipse/m2e/tests/common/HttpServer.java (at line 673)
	} else if(HttpMethod.PUT.equals(request.getMethod()) || HttpMethod.POST.equals(request.getMethod())) {
	                                ^^^^^^^^^^^^^^^^^^^
Unlikely argument type for equals(): String seems to be unrelated to HttpMethod
8. INFO in /home/jenkins/agent/workspace/m2e-master/org.eclipse.m2e.tests.common/src/org/eclipse/m2e/tests/common/HttpServer.java (at line 673)
	} else if(HttpMethod.PUT.equals(request.getMethod()) || HttpMethod.POST.equals(request.getMethod())) {
	                                                                               ^^^^^^^^^^^^^^^^^^^
Unlikely argument type for equals(): String seems to be unrelated to HttpMethod
[WARNING] /home/jenkins/agent/workspace/m2e-master/org.eclipse.m2e.tests.common/src/org/eclipse/m2e/tests/common/AbstractMavenProjectTestCase.java:[464] 
	IProject project = workspace.getRoot().getProject(importConfiguration.getProjectName(projectInfo.getModel()));
	                                                                      ^^^^^^^^^^^^^^^^^^^^^^^^^^^^^^^^^^^^^^
The method getProjectName(Model) from the type ProjectImportConfiguration is deprecated
9 problems (0 errors, 6 warnings, 6 info)
[INFO] 
[INFO] --- maven-resources-plugin:2.5:testResources (default-testResources) @ org.eclipse.m2e.tests.common ---
[debug] execute contextualize
[INFO] Using 'UTF-8' encoding to copy filtered resources.
[INFO] skip non existing resourceDirectory /home/jenkins/agent/workspace/m2e-master/org.eclipse.m2e.tests.common/src/test/resources
[INFO] 
[INFO] --- tycho-source-plugin:1.6.0:plugin-source (plugin-source) @ org.eclipse.m2e.tests.common ---
[INFO] Building jar: /home/jenkins/agent/workspace/m2e-master/org.eclipse.m2e.tests.common/target/org.eclipse.m2e.tests.common-1.16.0-SNAPSHOT-sources.jar
[INFO] 
[INFO] --- target-platform-configuration:1.6.0:target-platform (default-target-platform) @ org.eclipse.m2e.tests.common ---
[INFO] 
[INFO] --- tycho-packaging-plugin:1.6.0:package-plugin (default-package-plugin) @ org.eclipse.m2e.tests.common ---
[INFO] Building jar: /home/jenkins/agent/workspace/m2e-master/org.eclipse.m2e.tests.common/target/org.eclipse.m2e.tests.common-1.16.0-SNAPSHOT.jar
[INFO] 
[INFO] --- tycho-p2-plugin:1.6.0:p2-metadata-default (default-p2-metadata-default) @ org.eclipse.m2e.tests.common ---
[INFO] 
[INFO] --- tycho-pack200a-plugin:1.6.0:normalize (pack200-normalize) @ org.eclipse.m2e.tests.common ---
[INFO] Pack200 normalizing jar /home/jenkins/agent/workspace/m2e-master/org.eclipse.m2e.tests.common/target/org.eclipse.m2e.tests.common-1.16.0-SNAPSHOT.jar
[INFO] 
[INFO] --- eclipse-jarsigner-plugin:1.1.5:sign (sign) @ org.eclipse.m2e.tests.common ---
[INFO] Signing of nested jars of '/home/jenkins/agent/workspace/m2e-master/org.eclipse.m2e.tests.common/target/org.eclipse.m2e.tests.common-1.16.0-SNAPSHOT.jar' is disabled.
[INFO] Signing jar: /home/jenkins/agent/workspace/m2e-master/org.eclipse.m2e.tests.common/target/org.eclipse.m2e.tests.common-1.16.0-SNAPSHOT.jar
[INFO] Signing of nested jars of '/home/jenkins/agent/workspace/m2e-master/org.eclipse.m2e.tests.common/target/org.eclipse.m2e.tests.common-1.16.0-SNAPSHOT-sources.jar' is disabled.
[INFO] Signing jar: /home/jenkins/agent/workspace/m2e-master/org.eclipse.m2e.tests.common/target/org.eclipse.m2e.tests.common-1.16.0-SNAPSHOT-sources.jar
[INFO] 
[INFO] --- tycho-pack200b-plugin:1.6.0:pack (pack200-pack) @ org.eclipse.m2e.tests.common ---
[INFO] Pack200 packing jar /home/jenkins/agent/workspace/m2e-master/org.eclipse.m2e.tests.common/target/org.eclipse.m2e.tests.common-1.16.0-SNAPSHOT.jar
[INFO] 
[INFO] --- tycho-p2-plugin:1.6.0:p2-metadata (p2-metadata) @ org.eclipse.m2e.tests.common ---
[WARNING] MavenProject: org.eclipse.m2e:org.eclipse.m2e.tests.common:1.16.0-SNAPSHOT @ /home/jenkins/agent/workspace/m2e-master/org.eclipse.m2e.tests.common/pom.xml: baseline and build artifacts have same version but different contents
   no-classifier: different
      META-INF/ECLIPSE_.RSA: different
      META-INF/ECLIPSE_.SF: different
   classifier-sources: different
      META-INF/ECLIPSE_.RSA: different
      META-INF/ECLIPSE_.SF: different

[INFO] MavenProject: org.eclipse.m2e:org.eclipse.m2e.tests.common:1.16.0-SNAPSHOT @ /home/jenkins/agent/workspace/m2e-master/org.eclipse.m2e.tests.common/pom.xml
    The main artifact has been replaced with the baseline version.
    The following attached artifacts have been replaced with the baseline version: [pack200, sources]

[INFO] 
[INFO] --- tycho-p2-extras-plugin:1.6.0:compare-version-with-baselines (check-no-version-regression) @ org.eclipse.m2e.tests.common ---
[INFO] Fetching org.eclipse.m2e.tests.common_1.15.0.20200109-0905.jar.pack.gz from https://download.eclipse.org/technology/m2e/releases/1.15/1.15.0.20200310-1746/plugins/ (29.48kB)
[INFO] Fetching org.eclipse.m2e.tests.common.source_1.15.0.20200109-0905.jar from https://download.eclipse.org/technology/m2e/releases/1.15/1.15.0.20200310-1746/plugins/ (34.12kB)
[INFO] 
[INFO] --- maven-install-plugin:2.3.1:install (default-install) @ org.eclipse.m2e.tests.common ---
[INFO] Installing /home/jenkins/agent/workspace/m2e-master/org.eclipse.m2e.tests.common/target/org.eclipse.m2e.tests.common-1.16.0-SNAPSHOT.jar to /home/jenkins/agent/workspace/m2e-master/.repository/org/eclipse/m2e/org.eclipse.m2e.tests.common/1.16.0-SNAPSHOT/org.eclipse.m2e.tests.common-1.16.0-SNAPSHOT.jar
[INFO] Installing /home/jenkins/agent/workspace/m2e-master/org.eclipse.m2e.tests.common/pom.xml to /home/jenkins/agent/workspace/m2e-master/.repository/org/eclipse/m2e/org.eclipse.m2e.tests.common/1.16.0-SNAPSHOT/org.eclipse.m2e.tests.common-1.16.0-SNAPSHOT.pom
[INFO] Installing /home/jenkins/agent/workspace/m2e-master/org.eclipse.m2e.tests.common/target/org.eclipse.m2e.tests.common-1.16.0-SNAPSHOT-sources.jar to /home/jenkins/agent/workspace/m2e-master/.repository/org/eclipse/m2e/org.eclipse.m2e.tests.common/1.16.0-SNAPSHOT/org.eclipse.m2e.tests.common-1.16.0-SNAPSHOT-sources.jar
[INFO] Installing /home/jenkins/agent/workspace/m2e-master/org.eclipse.m2e.tests.common/target/org.eclipse.m2e.tests.common-1.16.0-SNAPSHOT.jar.pack.gz to /home/jenkins/agent/workspace/m2e-master/.repository/org/eclipse/m2e/org.eclipse.m2e.tests.common/1.16.0-SNAPSHOT/org.eclipse.m2e.tests.common-1.16.0-SNAPSHOT-pack200.jar.pack.gz
[INFO] Installing /home/jenkins/agent/workspace/m2e-master/org.eclipse.m2e.tests.common/target/p2content.xml to /home/jenkins/agent/workspace/m2e-master/.repository/org/eclipse/m2e/org.eclipse.m2e.tests.common/1.16.0-SNAPSHOT/org.eclipse.m2e.tests.common-1.16.0-SNAPSHOT-p2metadata.xml
[INFO] Installing /home/jenkins/agent/workspace/m2e-master/org.eclipse.m2e.tests.common/target/p2artifacts.xml to /home/jenkins/agent/workspace/m2e-master/.repository/org/eclipse/m2e/org.eclipse.m2e.tests.common/1.16.0-SNAPSHOT/org.eclipse.m2e.tests.common-1.16.0-SNAPSHOT-p2artifacts.xml
[INFO] 
[INFO] --- tycho-p2-plugin:1.6.0:update-local-index (default-update-local-index) @ org.eclipse.m2e.tests.common ---
[INFO] 
[INFO] ----------< org.eclipse.m2e:org.eclipse.m2e.logback.appender >----------
[INFO] Building org.eclipse.m2e.logback.appender 1.16.0-SNAPSHOT        [23/36]
[INFO] ---------------------------[ eclipse-plugin ]---------------------------
[INFO] 
[INFO] --- maven-clean-plugin:2.4.1:clean (default-clean) @ org.eclipse.m2e.logback.appender ---
[INFO] 
[INFO] --- tycho-packaging-plugin:1.6.0:build-qualifier (default-build-qualifier) @ org.eclipse.m2e.logback.appender ---
[INFO] The project's OSGi version is 1.16.0.20200318-1040
[INFO] 
[INFO] --- tycho-packaging-plugin:1.6.0:validate-id (default-validate-id) @ org.eclipse.m2e.logback.appender ---
[INFO] 
[INFO] --- tycho-packaging-plugin:1.6.0:validate-version (default-validate-version) @ org.eclipse.m2e.logback.appender ---
[INFO] 
[INFO] --- jacoco-maven-plugin:0.8.5:prepare-agent (default) @ org.eclipse.m2e.logback.appender ---
[INFO] argLine set to -javaagent:/home/jenkins/agent/workspace/m2e-master/.repository/org/jacoco/org.jacoco.agent/0.8.5/org.jacoco.agent-0.8.5-runtime.jar=destfile=/home/jenkins/agent/workspace/m2e-master/target/jacoco.exec,append=true,includes=org.eclipse.m2e*:org.apache.maven*:org.eclipse.aether*
[INFO] 
[INFO] --- maven-resources-plugin:2.5:resources (default-resources) @ org.eclipse.m2e.logback.appender ---
[debug] execute contextualize
[INFO] Using 'UTF-8' encoding to copy filtered resources.
[INFO] skip non existing resourceDirectory /home/jenkins/agent/workspace/m2e-master/org.eclipse.m2e.logback.appender/src/main/resources
[INFO] 
[INFO] --- tycho-compiler-plugin:1.6.0:compile (default-compile) @ org.eclipse.m2e.logback.appender ---
[INFO] Compiling 3 source files to /home/jenkins/agent/workspace/m2e-master/org.eclipse.m2e.logback.appender/target/classes
[INFO] 
[INFO] --- maven-resources-plugin:2.5:testResources (default-testResources) @ org.eclipse.m2e.logback.appender ---
[debug] execute contextualize
[INFO] Using 'UTF-8' encoding to copy filtered resources.
[INFO] skip non existing resourceDirectory /home/jenkins/agent/workspace/m2e-master/org.eclipse.m2e.logback.appender/src/test/resources
[INFO] 
[INFO] --- tycho-source-plugin:1.6.0:plugin-source (plugin-source) @ org.eclipse.m2e.logback.appender ---
[INFO] Building jar: /home/jenkins/agent/workspace/m2e-master/org.eclipse.m2e.logback.appender/target/org.eclipse.m2e.logback.appender-1.16.0-SNAPSHOT-sources.jar
[INFO] 
[INFO] --- target-platform-configuration:1.6.0:target-platform (default-target-platform) @ org.eclipse.m2e.logback.appender ---
[INFO] 
[INFO] --- tycho-packaging-plugin:1.6.0:package-plugin (default-package-plugin) @ org.eclipse.m2e.logback.appender ---
[INFO] Building jar: /home/jenkins/agent/workspace/m2e-master/org.eclipse.m2e.logback.appender/target/org.eclipse.m2e.logback.appender-1.16.0-SNAPSHOT.jar
[INFO] 
[INFO] --- tycho-p2-plugin:1.6.0:p2-metadata-default (default-p2-metadata-default) @ org.eclipse.m2e.logback.appender ---
[INFO] 
[INFO] --- tycho-pack200a-plugin:1.6.0:normalize (pack200-normalize) @ org.eclipse.m2e.logback.appender ---
[INFO] Pack200 normalizing jar /home/jenkins/agent/workspace/m2e-master/org.eclipse.m2e.logback.appender/target/org.eclipse.m2e.logback.appender-1.16.0-SNAPSHOT.jar
[INFO] 
[INFO] --- eclipse-jarsigner-plugin:1.1.5:sign (sign) @ org.eclipse.m2e.logback.appender ---
[INFO] Signing of nested jars of '/home/jenkins/agent/workspace/m2e-master/org.eclipse.m2e.logback.appender/target/org.eclipse.m2e.logback.appender-1.16.0-SNAPSHOT.jar' is disabled.
[INFO] Signing jar: /home/jenkins/agent/workspace/m2e-master/org.eclipse.m2e.logback.appender/target/org.eclipse.m2e.logback.appender-1.16.0-SNAPSHOT.jar
[INFO] Signing of nested jars of '/home/jenkins/agent/workspace/m2e-master/org.eclipse.m2e.logback.appender/target/org.eclipse.m2e.logback.appender-1.16.0-SNAPSHOT-sources.jar' is disabled.
[INFO] Signing jar: /home/jenkins/agent/workspace/m2e-master/org.eclipse.m2e.logback.appender/target/org.eclipse.m2e.logback.appender-1.16.0-SNAPSHOT-sources.jar
[INFO] 
[INFO] --- tycho-pack200b-plugin:1.6.0:pack (pack200-pack) @ org.eclipse.m2e.logback.appender ---
[INFO] Pack200 packing jar /home/jenkins/agent/workspace/m2e-master/org.eclipse.m2e.logback.appender/target/org.eclipse.m2e.logback.appender-1.16.0-SNAPSHOT.jar
[INFO] 
[INFO] --- tycho-p2-plugin:1.6.0:p2-metadata (p2-metadata) @ org.eclipse.m2e.logback.appender ---
[WARNING] MavenProject: org.eclipse.m2e:org.eclipse.m2e.logback.appender:1.16.0-SNAPSHOT @ /home/jenkins/agent/workspace/m2e-master/org.eclipse.m2e.logback.appender/pom.xml: baseline and build artifacts have same version but different contents
   no-classifier: different
      META-INF/ECLIPSE_.RSA: different
      META-INF/ECLIPSE_.SF: different
   classifier-sources: different
      META-INF/ECLIPSE_.RSA: different
      META-INF/ECLIPSE_.SF: different

[INFO] MavenProject: org.eclipse.m2e:org.eclipse.m2e.logback.appender:1.16.0-SNAPSHOT @ /home/jenkins/agent/workspace/m2e-master/org.eclipse.m2e.logback.appender/pom.xml
    The main artifact has been replaced with the baseline version.
    The following attached artifacts have been replaced with the baseline version: [pack200, sources]

[INFO] 
[INFO] --- tycho-p2-extras-plugin:1.6.0:compare-version-with-baselines (check-no-version-regression) @ org.eclipse.m2e.logback.appender ---
[INFO] Fetching org.eclipse.m2e.logback.appender_1.15.0.20200108-1649.jar.pack.gz from https://download.eclipse.org/technology/m2e/releases/1.15/1.15.0.20200310-1746/plugins/ (8.77kB)
[INFO] Fetching org.eclipse.m2e.logback.appender.source_1.15.0.20200108-1649.jar from https://download.eclipse.org/technology/m2e/releases/1.15/1.15.0.20200310-1746/plugins/ (10.92kB)
[INFO] 
[INFO] --- maven-install-plugin:2.3.1:install (default-install) @ org.eclipse.m2e.logback.appender ---
[INFO] Installing /home/jenkins/agent/workspace/m2e-master/org.eclipse.m2e.logback.appender/target/org.eclipse.m2e.logback.appender-1.16.0-SNAPSHOT.jar to /home/jenkins/agent/workspace/m2e-master/.repository/org/eclipse/m2e/org.eclipse.m2e.logback.appender/1.16.0-SNAPSHOT/org.eclipse.m2e.logback.appender-1.16.0-SNAPSHOT.jar
[INFO] Installing /home/jenkins/agent/workspace/m2e-master/org.eclipse.m2e.logback.appender/pom.xml to /home/jenkins/agent/workspace/m2e-master/.repository/org/eclipse/m2e/org.eclipse.m2e.logback.appender/1.16.0-SNAPSHOT/org.eclipse.m2e.logback.appender-1.16.0-SNAPSHOT.pom
[INFO] Installing /home/jenkins/agent/workspace/m2e-master/org.eclipse.m2e.logback.appender/target/org.eclipse.m2e.logback.appender-1.16.0-SNAPSHOT-sources.jar to /home/jenkins/agent/workspace/m2e-master/.repository/org/eclipse/m2e/org.eclipse.m2e.logback.appender/1.16.0-SNAPSHOT/org.eclipse.m2e.logback.appender-1.16.0-SNAPSHOT-sources.jar
[INFO] Installing /home/jenkins/agent/workspace/m2e-master/org.eclipse.m2e.logback.appender/target/org.eclipse.m2e.logback.appender-1.16.0-SNAPSHOT.jar.pack.gz to /home/jenkins/agent/workspace/m2e-master/.repository/org/eclipse/m2e/org.eclipse.m2e.logback.appender/1.16.0-SNAPSHOT/org.eclipse.m2e.logback.appender-1.16.0-SNAPSHOT-pack200.jar.pack.gz
[INFO] Installing /home/jenkins/agent/workspace/m2e-master/org.eclipse.m2e.logback.appender/target/p2content.xml to /home/jenkins/agent/workspace/m2e-master/.repository/org/eclipse/m2e/org.eclipse.m2e.logback.appender/1.16.0-SNAPSHOT/org.eclipse.m2e.logback.appender-1.16.0-SNAPSHOT-p2metadata.xml
[INFO] Installing /home/jenkins/agent/workspace/m2e-master/org.eclipse.m2e.logback.appender/target/p2artifacts.xml to /home/jenkins/agent/workspace/m2e-master/.repository/org/eclipse/m2e/org.eclipse.m2e.logback.appender/1.16.0-SNAPSHOT/org.eclipse.m2e.logback.appender-1.16.0-SNAPSHOT-p2artifacts.xml
[INFO] 
[INFO] --- tycho-p2-plugin:1.6.0:update-local-index (default-update-local-index) @ org.eclipse.m2e.logback.appender ---
[INFO] 
[INFO] -------< org.eclipse.m2e:org.eclipse.m2e.logback.configuration >--------
[INFO] Building org.eclipse.m2e.logback.configuration 1.16.0-SNAPSHOT   [24/36]
[INFO] ---------------------------[ eclipse-plugin ]---------------------------
[INFO] 
[INFO] --- maven-clean-plugin:2.4.1:clean (default-clean) @ org.eclipse.m2e.logback.configuration ---
[INFO] 
[INFO] --- tycho-packaging-plugin:1.6.0:build-qualifier (default-build-qualifier) @ org.eclipse.m2e.logback.configuration ---
[INFO] The project's OSGi version is 1.16.0.20200318-1040
[INFO] 
[INFO] --- tycho-packaging-plugin:1.6.0:validate-id (default-validate-id) @ org.eclipse.m2e.logback.configuration ---
[INFO] 
[INFO] --- tycho-packaging-plugin:1.6.0:validate-version (default-validate-version) @ org.eclipse.m2e.logback.configuration ---
[INFO] 
[INFO] --- jacoco-maven-plugin:0.8.5:prepare-agent (default) @ org.eclipse.m2e.logback.configuration ---
[INFO] argLine set to -javaagent:/home/jenkins/agent/workspace/m2e-master/.repository/org/jacoco/org.jacoco.agent/0.8.5/org.jacoco.agent-0.8.5-runtime.jar=destfile=/home/jenkins/agent/workspace/m2e-master/target/jacoco.exec,append=true,includes=org.eclipse.m2e*:org.apache.maven*:org.eclipse.aether*
[INFO] 
[INFO] --- maven-resources-plugin:2.5:resources (default-resources) @ org.eclipse.m2e.logback.configuration ---
[debug] execute contextualize
[INFO] Using 'UTF-8' encoding to copy filtered resources.
[INFO] skip non existing resourceDirectory /home/jenkins/agent/workspace/m2e-master/org.eclipse.m2e.logback.configuration/src/main/resources
[INFO] 
[INFO] --- tycho-compiler-plugin:1.6.0:compile (default-compile) @ org.eclipse.m2e.logback.configuration ---
[INFO] Compiling 2 source files to /home/jenkins/agent/workspace/m2e-master/org.eclipse.m2e.logback.configuration/target/classes
[WARNING] /home/jenkins/agent/workspace/m2e-master/org.eclipse.m2e.logback.configuration/src/org/eclipse/m2e/logback/configuration/LogPlugin.java:[146] 
	loadConfiguration(configFile.toURL());
	                             ^^^^^^^
The method toURL() from the type File is deprecated
1 problem (1 warning)
[INFO] 
[INFO] --- maven-resources-plugin:2.5:testResources (default-testResources) @ org.eclipse.m2e.logback.configuration ---
[debug] execute contextualize
[INFO] Using 'UTF-8' encoding to copy filtered resources.
[INFO] skip non existing resourceDirectory /home/jenkins/agent/workspace/m2e-master/org.eclipse.m2e.logback.configuration/src/test/resources
[INFO] 
[INFO] --- tycho-source-plugin:1.6.0:plugin-source (plugin-source) @ org.eclipse.m2e.logback.configuration ---
[INFO] Building jar: /home/jenkins/agent/workspace/m2e-master/org.eclipse.m2e.logback.configuration/target/org.eclipse.m2e.logback.configuration-1.16.0-SNAPSHOT-sources.jar
[INFO] 
[INFO] --- target-platform-configuration:1.6.0:target-platform (default-target-platform) @ org.eclipse.m2e.logback.configuration ---
[INFO] 
[INFO] --- tycho-packaging-plugin:1.6.0:package-plugin (default-package-plugin) @ org.eclipse.m2e.logback.configuration ---
[INFO] Building jar: /home/jenkins/agent/workspace/m2e-master/org.eclipse.m2e.logback.configuration/target/org.eclipse.m2e.logback.configuration-1.16.0-SNAPSHOT.jar
[INFO] 
[INFO] --- tycho-p2-plugin:1.6.0:p2-metadata-default (default-p2-metadata-default) @ org.eclipse.m2e.logback.configuration ---
[INFO] 
[INFO] --- tycho-pack200a-plugin:1.6.0:normalize (pack200-normalize) @ org.eclipse.m2e.logback.configuration ---
[INFO] Pack200 normalizing jar /home/jenkins/agent/workspace/m2e-master/org.eclipse.m2e.logback.configuration/target/org.eclipse.m2e.logback.configuration-1.16.0-SNAPSHOT.jar
[INFO] 
[INFO] --- eclipse-jarsigner-plugin:1.1.5:sign (sign) @ org.eclipse.m2e.logback.configuration ---
[INFO] Signing of nested jars of '/home/jenkins/agent/workspace/m2e-master/org.eclipse.m2e.logback.configuration/target/org.eclipse.m2e.logback.configuration-1.16.0-SNAPSHOT.jar' is disabled.
[INFO] Signing jar: /home/jenkins/agent/workspace/m2e-master/org.eclipse.m2e.logback.configuration/target/org.eclipse.m2e.logback.configuration-1.16.0-SNAPSHOT.jar
[INFO] Signing of nested jars of '/home/jenkins/agent/workspace/m2e-master/org.eclipse.m2e.logback.configuration/target/org.eclipse.m2e.logback.configuration-1.16.0-SNAPSHOT-sources.jar' is disabled.
[INFO] Signing jar: /home/jenkins/agent/workspace/m2e-master/org.eclipse.m2e.logback.configuration/target/org.eclipse.m2e.logback.configuration-1.16.0-SNAPSHOT-sources.jar
[INFO] 
[INFO] --- tycho-pack200b-plugin:1.6.0:pack (pack200-pack) @ org.eclipse.m2e.logback.configuration ---
[INFO] Pack200 packing jar /home/jenkins/agent/workspace/m2e-master/org.eclipse.m2e.logback.configuration/target/org.eclipse.m2e.logback.configuration-1.16.0-SNAPSHOT.jar
[INFO] 
[INFO] --- tycho-p2-plugin:1.6.0:p2-metadata (p2-metadata) @ org.eclipse.m2e.logback.configuration ---
[WARNING] MavenProject: org.eclipse.m2e:org.eclipse.m2e.logback.configuration:1.16.0-SNAPSHOT @ /home/jenkins/agent/workspace/m2e-master/org.eclipse.m2e.logback.configuration/pom.xml: baseline and build artifacts have same version but different contents
   no-classifier: different
      META-INF/ECLIPSE_.RSA: different
      META-INF/ECLIPSE_.SF: different
   classifier-sources: different
      META-INF/ECLIPSE_.RSA: different
      META-INF/ECLIPSE_.SF: different

[INFO] MavenProject: org.eclipse.m2e:org.eclipse.m2e.logback.configuration:1.16.0-SNAPSHOT @ /home/jenkins/agent/workspace/m2e-master/org.eclipse.m2e.logback.configuration/pom.xml
    The main artifact has been replaced with the baseline version.
    The following attached artifacts have been replaced with the baseline version: [pack200, sources]

[INFO] 
[INFO] --- tycho-p2-extras-plugin:1.6.0:compare-version-with-baselines (check-no-version-regression) @ org.eclipse.m2e.logback.configuration ---
[INFO] Fetching org.eclipse.m2e.logback.configuration_1.15.0.20191217-1149.jar.pack.gz from https://download.eclipse.org/technology/m2e/releases/1.15/1.15.0.20200310-1746/plugins/ (10.98kB)
[INFO] Fetching org.eclipse.m2e.logback.configuration.source_1.15.0.20191217-1149.jar from https://download.eclipse.org/technology/m2e/releases/1.15/1.15.0.20200310-1746/plugins/ (11.06kB)
[INFO] 
[INFO] --- maven-install-plugin:2.3.1:install (default-install) @ org.eclipse.m2e.logback.configuration ---
[INFO] Installing /home/jenkins/agent/workspace/m2e-master/org.eclipse.m2e.logback.configuration/target/org.eclipse.m2e.logback.configuration-1.16.0-SNAPSHOT.jar to /home/jenkins/agent/workspace/m2e-master/.repository/org/eclipse/m2e/org.eclipse.m2e.logback.configuration/1.16.0-SNAPSHOT/org.eclipse.m2e.logback.configuration-1.16.0-SNAPSHOT.jar
[INFO] Installing /home/jenkins/agent/workspace/m2e-master/org.eclipse.m2e.logback.configuration/pom.xml to /home/jenkins/agent/workspace/m2e-master/.repository/org/eclipse/m2e/org.eclipse.m2e.logback.configuration/1.16.0-SNAPSHOT/org.eclipse.m2e.logback.configuration-1.16.0-SNAPSHOT.pom
[INFO] Installing /home/jenkins/agent/workspace/m2e-master/org.eclipse.m2e.logback.configuration/target/org.eclipse.m2e.logback.configuration-1.16.0-SNAPSHOT-sources.jar to /home/jenkins/agent/workspace/m2e-master/.repository/org/eclipse/m2e/org.eclipse.m2e.logback.configuration/1.16.0-SNAPSHOT/org.eclipse.m2e.logback.configuration-1.16.0-SNAPSHOT-sources.jar
[INFO] Installing /home/jenkins/agent/workspace/m2e-master/org.eclipse.m2e.logback.configuration/target/org.eclipse.m2e.logback.configuration-1.16.0-SNAPSHOT.jar.pack.gz to /home/jenkins/agent/workspace/m2e-master/.repository/org/eclipse/m2e/org.eclipse.m2e.logback.configuration/1.16.0-SNAPSHOT/org.eclipse.m2e.logback.configuration-1.16.0-SNAPSHOT-pack200.jar.pack.gz
[INFO] Installing /home/jenkins/agent/workspace/m2e-master/org.eclipse.m2e.logback.configuration/target/p2content.xml to /home/jenkins/agent/workspace/m2e-master/.repository/org/eclipse/m2e/org.eclipse.m2e.logback.configuration/1.16.0-SNAPSHOT/org.eclipse.m2e.logback.configuration-1.16.0-SNAPSHOT-p2metadata.xml
[INFO] Installing /home/jenkins/agent/workspace/m2e-master/org.eclipse.m2e.logback.configuration/target/p2artifacts.xml to /home/jenkins/agent/workspace/m2e-master/.repository/org/eclipse/m2e/org.eclipse.m2e.logback.configuration/1.16.0-SNAPSHOT/org.eclipse.m2e.logback.configuration-1.16.0-SNAPSHOT-p2artifacts.xml
[INFO] 
[INFO] --- tycho-p2-plugin:1.6.0:update-local-index (default-update-local-index) @ org.eclipse.m2e.logback.configuration ---
[INFO] 
[INFO] -----------< org.eclipse.m2e:org.eclipse.m2e.sse.ui.feature >-----------
[INFO] Building org.eclipse.m2e.sse.ui.feature 1.16.0-SNAPSHOT          [25/36]
[INFO] --------------------------[ eclipse-feature ]---------------------------
[INFO] 
[INFO] --- maven-clean-plugin:2.4.1:clean (default-clean) @ org.eclipse.m2e.sse.ui.feature ---
[INFO] 
[INFO] --- tycho-packaging-plugin:1.6.0:build-qualifier-aggregator (default-build-qualifier-aggregator) @ org.eclipse.m2e.sse.ui.feature ---
[INFO] The project's OSGi version is 1.16.0.20200514-2159
[INFO] 
[INFO] --- tycho-packaging-plugin:1.6.0:validate-id (default-validate-id) @ org.eclipse.m2e.sse.ui.feature ---
[INFO] 
[INFO] --- tycho-packaging-plugin:1.6.0:validate-version (default-validate-version) @ org.eclipse.m2e.sse.ui.feature ---
[INFO] 
[INFO] --- jacoco-maven-plugin:0.8.5:prepare-agent (default) @ org.eclipse.m2e.sse.ui.feature ---
[INFO] argLine set to -javaagent:/home/jenkins/agent/workspace/m2e-master/.repository/org/jacoco/org.jacoco.agent/0.8.5/org.jacoco.agent-0.8.5-runtime.jar=destfile=/home/jenkins/agent/workspace/m2e-master/target/jacoco.exec,append=true,includes=org.eclipse.m2e*:org.apache.maven*:org.eclipse.aether*
[INFO] 
[INFO] --- tycho-source-plugin:1.6.0:plugin-source (plugin-source) @ org.eclipse.m2e.sse.ui.feature ---
[INFO] 
[INFO] --- target-platform-configuration:1.6.0:target-platform (default-target-platform) @ org.eclipse.m2e.sse.ui.feature ---
[INFO] 
[INFO] --- tycho-packaging-plugin:1.6.0:package-feature (default-package-feature) @ org.eclipse.m2e.sse.ui.feature ---
[INFO] Building jar: /home/jenkins/agent/workspace/m2e-master/org.eclipse.m2e.sse.ui.feature/target/org.eclipse.m2e.sse.ui.feature-1.16.0-SNAPSHOT.jar
[INFO] 
[INFO] --- tycho-p2-plugin:1.6.0:p2-metadata-default (default-p2-metadata-default) @ org.eclipse.m2e.sse.ui.feature ---
[INFO] 
[INFO] --- tycho-p2-plugin:1.6.0:feature-p2-metadata (default-feature-p2-metadata) @ org.eclipse.m2e.sse.ui.feature ---
[INFO] 
[INFO] --- tycho-pack200a-plugin:1.6.0:normalize (pack200-normalize) @ org.eclipse.m2e.sse.ui.feature ---
[INFO] 
[INFO] --- eclipse-jarsigner-plugin:1.1.5:sign (sign) @ org.eclipse.m2e.sse.ui.feature ---
[INFO] Signing of nested jars of '/home/jenkins/agent/workspace/m2e-master/org.eclipse.m2e.sse.ui.feature/target/org.eclipse.m2e.sse.ui.feature-1.16.0-SNAPSHOT.jar' is disabled.
[INFO] Signing jar: /home/jenkins/agent/workspace/m2e-master/org.eclipse.m2e.sse.ui.feature/target/org.eclipse.m2e.sse.ui.feature-1.16.0-SNAPSHOT.jar
[INFO] 
[INFO] --- tycho-pack200b-plugin:1.6.0:pack (pack200-pack) @ org.eclipse.m2e.sse.ui.feature ---
[INFO] 
[INFO] --- tycho-p2-plugin:1.6.0:p2-metadata (p2-metadata) @ org.eclipse.m2e.sse.ui.feature ---
[WARNING] MavenProject: org.eclipse.m2e:org.eclipse.m2e.sse.ui.feature:1.16.0-SNAPSHOT @ /home/jenkins/agent/workspace/m2e-master/org.eclipse.m2e.sse.ui.feature/pom.xml: baseline and build artifacts have same version but different contents
   no-classifier: different
      META-INF/ECLIPSE_.RSA: different

[INFO] MavenProject: org.eclipse.m2e:org.eclipse.m2e.sse.ui.feature:1.16.0-SNAPSHOT @ /home/jenkins/agent/workspace/m2e-master/org.eclipse.m2e.sse.ui.feature/pom.xml
    The main artifact has been replaced with the baseline version.

[INFO] 
[INFO] --- tycho-p2-extras-plugin:1.6.0:compare-version-with-baselines (check-no-version-regression) @ org.eclipse.m2e.sse.ui.feature ---
[INFO] 
[INFO] --- maven-install-plugin:2.3.1:install (default-install) @ org.eclipse.m2e.sse.ui.feature ---
[INFO] Installing /home/jenkins/agent/workspace/m2e-master/org.eclipse.m2e.sse.ui.feature/target/org.eclipse.m2e.sse.ui.feature-1.16.0-SNAPSHOT.jar to /home/jenkins/agent/workspace/m2e-master/.repository/org/eclipse/m2e/org.eclipse.m2e.sse.ui.feature/1.16.0-SNAPSHOT/org.eclipse.m2e.sse.ui.feature-1.16.0-SNAPSHOT.jar
[INFO] Installing /home/jenkins/agent/workspace/m2e-master/org.eclipse.m2e.sse.ui.feature/pom.xml to /home/jenkins/agent/workspace/m2e-master/.repository/org/eclipse/m2e/org.eclipse.m2e.sse.ui.feature/1.16.0-SNAPSHOT/org.eclipse.m2e.sse.ui.feature-1.16.0-SNAPSHOT.pom
[INFO] Installing /home/jenkins/agent/workspace/m2e-master/org.eclipse.m2e.sse.ui.feature/target/p2content.xml to /home/jenkins/agent/workspace/m2e-master/.repository/org/eclipse/m2e/org.eclipse.m2e.sse.ui.feature/1.16.0-SNAPSHOT/org.eclipse.m2e.sse.ui.feature-1.16.0-SNAPSHOT-p2metadata.xml
[INFO] Installing /home/jenkins/agent/workspace/m2e-master/org.eclipse.m2e.sse.ui.feature/target/p2artifacts.xml to /home/jenkins/agent/workspace/m2e-master/.repository/org/eclipse/m2e/org.eclipse.m2e.sse.ui.feature/1.16.0-SNAPSHOT/org.eclipse.m2e.sse.ui.feature-1.16.0-SNAPSHOT-p2artifacts.xml
[INFO] 
[INFO] --- tycho-p2-plugin:1.6.0:update-local-index (default-update-local-index) @ org.eclipse.m2e.sse.ui.feature ---
[INFO] 
[INFO] --------------< org.eclipse.m2e:org.eclipse.m2e.feature >---------------
[INFO] Building Maven Integration for Eclipse 1.16.0-SNAPSHOT           [26/36]
[INFO] --------------------------[ eclipse-feature ]---------------------------
[INFO] 
[INFO] --- maven-clean-plugin:2.4.1:clean (default-clean) @ org.eclipse.m2e.feature ---
[INFO] 
[INFO] --- tycho-packaging-plugin:1.6.0:build-qualifier-aggregator (default-build-qualifier-aggregator) @ org.eclipse.m2e.feature ---
[INFO] The project's OSGi version is 1.16.0.20200609-1545
[INFO] 
[INFO] --- tycho-packaging-plugin:1.6.0:validate-id (default-validate-id) @ org.eclipse.m2e.feature ---
[INFO] 
[INFO] --- tycho-packaging-plugin:1.6.0:validate-version (default-validate-version) @ org.eclipse.m2e.feature ---
[INFO] 
[INFO] --- jacoco-maven-plugin:0.8.5:prepare-agent (default) @ org.eclipse.m2e.feature ---
[INFO] argLine set to -javaagent:/home/jenkins/agent/workspace/m2e-master/.repository/org/jacoco/org.jacoco.agent/0.8.5/org.jacoco.agent-0.8.5-runtime.jar=destfile=/home/jenkins/agent/workspace/m2e-master/target/jacoco.exec,append=true,includes=org.eclipse.m2e*:org.apache.maven*:org.eclipse.aether*
[INFO] 
[INFO] --- tycho-source-plugin:1.6.0:plugin-source (plugin-source) @ org.eclipse.m2e.feature ---
[INFO] 
[INFO] --- target-platform-configuration:1.6.0:target-platform (default-target-platform) @ org.eclipse.m2e.feature ---
[INFO] 
[INFO] --- tycho-packaging-plugin:1.6.0:package-feature (default-package-feature) @ org.eclipse.m2e.feature ---
[INFO] Building jar: /home/jenkins/agent/workspace/m2e-master/org.eclipse.m2e.feature/target/org.eclipse.m2e.feature-1.16.0-SNAPSHOT.jar
[INFO] 
[INFO] --- tycho-p2-plugin:1.6.0:p2-metadata-default (default-p2-metadata-default) @ org.eclipse.m2e.feature ---
[INFO] 
[INFO] --- tycho-p2-plugin:1.6.0:feature-p2-metadata (default-feature-p2-metadata) @ org.eclipse.m2e.feature ---
[INFO] 
[INFO] --- tycho-pack200a-plugin:1.6.0:normalize (pack200-normalize) @ org.eclipse.m2e.feature ---
[INFO] 
[INFO] --- eclipse-jarsigner-plugin:1.1.5:sign (sign) @ org.eclipse.m2e.feature ---
[INFO] Signing of nested jars of '/home/jenkins/agent/workspace/m2e-master/org.eclipse.m2e.feature/target/org.eclipse.m2e.feature-1.16.0-SNAPSHOT.jar' is disabled.
[INFO] Signing jar: /home/jenkins/agent/workspace/m2e-master/org.eclipse.m2e.feature/target/org.eclipse.m2e.feature-1.16.0-SNAPSHOT.jar
[INFO] 
[INFO] --- tycho-pack200b-plugin:1.6.0:pack (pack200-pack) @ org.eclipse.m2e.feature ---
[INFO] 
[INFO] --- tycho-p2-plugin:1.6.0:p2-metadata (p2-metadata) @ org.eclipse.m2e.feature ---
[INFO] No baseline version MavenProject: org.eclipse.m2e:org.eclipse.m2e.feature:1.16.0-SNAPSHOT @ /home/jenkins/agent/workspace/m2e-master/org.eclipse.m2e.feature/pom.xml
[INFO] 
[INFO] --- tycho-p2-extras-plugin:1.6.0:compare-version-with-baselines (check-no-version-regression) @ org.eclipse.m2e.feature ---
[INFO] Fetching org.eclipse.m2e.feature_1.15.0.20200310-1832.jar from https://download.eclipse.org/technology/m2e/releases/1.15/1.15.0.20200310-1746/features/ (19.99kB)
[INFO] 
[INFO] --- maven-install-plugin:2.3.1:install (default-install) @ org.eclipse.m2e.feature ---
[INFO] Installing /home/jenkins/agent/workspace/m2e-master/org.eclipse.m2e.feature/target/org.eclipse.m2e.feature-1.16.0-SNAPSHOT.jar to /home/jenkins/agent/workspace/m2e-master/.repository/org/eclipse/m2e/org.eclipse.m2e.feature/1.16.0-SNAPSHOT/org.eclipse.m2e.feature-1.16.0-SNAPSHOT.jar
[INFO] Installing /home/jenkins/agent/workspace/m2e-master/org.eclipse.m2e.feature/pom.xml to /home/jenkins/agent/workspace/m2e-master/.repository/org/eclipse/m2e/org.eclipse.m2e.feature/1.16.0-SNAPSHOT/org.eclipse.m2e.feature-1.16.0-SNAPSHOT.pom
[INFO] Installing /home/jenkins/agent/workspace/m2e-master/org.eclipse.m2e.feature/target/p2content.xml to /home/jenkins/agent/workspace/m2e-master/.repository/org/eclipse/m2e/org.eclipse.m2e.feature/1.16.0-SNAPSHOT/org.eclipse.m2e.feature-1.16.0-SNAPSHOT-p2metadata.xml
[INFO] Installing /home/jenkins/agent/workspace/m2e-master/org.eclipse.m2e.feature/target/p2artifacts.xml to /home/jenkins/agent/workspace/m2e-master/.repository/org/eclipse/m2e/org.eclipse.m2e.feature/1.16.0-SNAPSHOT/org.eclipse.m2e.feature-1.16.0-SNAPSHOT-p2artifacts.xml
[INFO] 
[INFO] --- tycho-p2-plugin:1.6.0:update-local-index (default-update-local-index) @ org.eclipse.m2e.feature ---
[INFO] 
[INFO] ----------< org.eclipse.m2e:org.eclipse.m2e.lemminx.feature >-----------
[INFO] Building org.eclipse.m2e.lemminx.feature 1.16.0-SNAPSHOT         [27/36]
[INFO] --------------------------[ eclipse-feature ]---------------------------
[INFO] 
[INFO] --- maven-clean-plugin:2.4.1:clean (default-clean) @ org.eclipse.m2e.lemminx.feature ---
[INFO] 
[INFO] --- tycho-packaging-plugin:1.6.0:build-qualifier-aggregator (default-build-qualifier-aggregator) @ org.eclipse.m2e.lemminx.feature ---
[INFO] The project's OSGi version is 1.16.0.20200527-2124
[INFO] 
[INFO] --- tycho-packaging-plugin:1.6.0:validate-id (default-validate-id) @ org.eclipse.m2e.lemminx.feature ---
[INFO] 
[INFO] --- tycho-packaging-plugin:1.6.0:validate-version (default-validate-version) @ org.eclipse.m2e.lemminx.feature ---
[INFO] 
[INFO] --- jacoco-maven-plugin:0.8.5:prepare-agent (default) @ org.eclipse.m2e.lemminx.feature ---
[INFO] argLine set to -javaagent:/home/jenkins/agent/workspace/m2e-master/.repository/org/jacoco/org.jacoco.agent/0.8.5/org.jacoco.agent-0.8.5-runtime.jar=destfile=/home/jenkins/agent/workspace/m2e-master/target/jacoco.exec,append=true,includes=org.eclipse.m2e*:org.apache.maven*:org.eclipse.aether*
[INFO] 
[INFO] --- tycho-source-plugin:1.6.0:plugin-source (plugin-source) @ org.eclipse.m2e.lemminx.feature ---
[INFO] 
[INFO] --- target-platform-configuration:1.6.0:target-platform (default-target-platform) @ org.eclipse.m2e.lemminx.feature ---
[INFO] 
[INFO] --- tycho-packaging-plugin:1.6.0:package-feature (default-package-feature) @ org.eclipse.m2e.lemminx.feature ---
[INFO] Building jar: /home/jenkins/agent/workspace/m2e-master/org.eclipse.m2e.lemminx.feature/target/org.eclipse.m2e.lemminx.feature-1.16.0-SNAPSHOT.jar
[INFO] 
[INFO] --- tycho-p2-plugin:1.6.0:p2-metadata-default (default-p2-metadata-default) @ org.eclipse.m2e.lemminx.feature ---
[INFO] 
[INFO] --- tycho-p2-plugin:1.6.0:feature-p2-metadata (default-feature-p2-metadata) @ org.eclipse.m2e.lemminx.feature ---
[INFO] 
[INFO] --- tycho-pack200a-plugin:1.6.0:normalize (pack200-normalize) @ org.eclipse.m2e.lemminx.feature ---
[INFO] 
[INFO] --- eclipse-jarsigner-plugin:1.1.5:sign (sign) @ org.eclipse.m2e.lemminx.feature ---
[INFO] Signing of nested jars of '/home/jenkins/agent/workspace/m2e-master/org.eclipse.m2e.lemminx.feature/target/org.eclipse.m2e.lemminx.feature-1.16.0-SNAPSHOT.jar' is disabled.
[INFO] Signing jar: /home/jenkins/agent/workspace/m2e-master/org.eclipse.m2e.lemminx.feature/target/org.eclipse.m2e.lemminx.feature-1.16.0-SNAPSHOT.jar
[INFO] 
[INFO] --- tycho-pack200b-plugin:1.6.0:pack (pack200-pack) @ org.eclipse.m2e.lemminx.feature ---
[INFO] 
[INFO] --- tycho-p2-plugin:1.6.0:p2-metadata (p2-metadata) @ org.eclipse.m2e.lemminx.feature ---
[WARNING] MavenProject: org.eclipse.m2e:org.eclipse.m2e.lemminx.feature:1.16.0-SNAPSHOT @ /home/jenkins/agent/workspace/m2e-master/org.eclipse.m2e.lemminx.feature/pom.xml: baseline and build artifacts have same version but different contents
   no-classifier: different
      META-INF/ECLIPSE_.RSA: different

[INFO] MavenProject: org.eclipse.m2e:org.eclipse.m2e.lemminx.feature:1.16.0-SNAPSHOT @ /home/jenkins/agent/workspace/m2e-master/org.eclipse.m2e.lemminx.feature/pom.xml
    The main artifact has been replaced with the baseline version.

[INFO] 
[INFO] --- tycho-p2-extras-plugin:1.6.0:compare-version-with-baselines (check-no-version-regression) @ org.eclipse.m2e.lemminx.feature ---
[INFO] 
[INFO] --- maven-install-plugin:2.3.1:install (default-install) @ org.eclipse.m2e.lemminx.feature ---
[INFO] Installing /home/jenkins/agent/workspace/m2e-master/org.eclipse.m2e.lemminx.feature/target/org.eclipse.m2e.lemminx.feature-1.16.0-SNAPSHOT.jar to /home/jenkins/agent/workspace/m2e-master/.repository/org/eclipse/m2e/org.eclipse.m2e.lemminx.feature/1.16.0-SNAPSHOT/org.eclipse.m2e.lemminx.feature-1.16.0-SNAPSHOT.jar
[INFO] Installing /home/jenkins/agent/workspace/m2e-master/org.eclipse.m2e.lemminx.feature/pom.xml to /home/jenkins/agent/workspace/m2e-master/.repository/org/eclipse/m2e/org.eclipse.m2e.lemminx.feature/1.16.0-SNAPSHOT/org.eclipse.m2e.lemminx.feature-1.16.0-SNAPSHOT.pom
[INFO] Installing /home/jenkins/agent/workspace/m2e-master/org.eclipse.m2e.lemminx.feature/target/p2content.xml to /home/jenkins/agent/workspace/m2e-master/.repository/org/eclipse/m2e/org.eclipse.m2e.lemminx.feature/1.16.0-SNAPSHOT/org.eclipse.m2e.lemminx.feature-1.16.0-SNAPSHOT-p2metadata.xml
[INFO] Installing /home/jenkins/agent/workspace/m2e-master/org.eclipse.m2e.lemminx.feature/target/p2artifacts.xml to /home/jenkins/agent/workspace/m2e-master/.repository/org/eclipse/m2e/org.eclipse.m2e.lemminx.feature/1.16.0-SNAPSHOT/org.eclipse.m2e.lemminx.feature-1.16.0-SNAPSHOT-p2artifacts.xml
[INFO] 
[INFO] --- tycho-p2-plugin:1.6.0:update-local-index (default-update-local-index) @ org.eclipse.m2e.lemminx.feature ---
[INFO] 
[INFO] ------------< org.eclipse.m2e:org.eclipse.m2e.sdk.feature >-------------
[INFO] Building m2e extensions development support (Optional) 1.16.0-SNAPSHOT [28/36]
[INFO] --------------------------[ eclipse-feature ]---------------------------
[INFO] 
[INFO] --- maven-clean-plugin:2.4.1:clean (default-clean) @ org.eclipse.m2e.sdk.feature ---
[INFO] 
[INFO] --- tycho-packaging-plugin:1.6.0:build-qualifier-aggregator (default-build-qualifier-aggregator) @ org.eclipse.m2e.sdk.feature ---
[INFO] The project's OSGi version is 1.16.0.20200605-0817
[INFO] 
[INFO] --- tycho-packaging-plugin:1.6.0:validate-id (default-validate-id) @ org.eclipse.m2e.sdk.feature ---
[INFO] 
[INFO] --- tycho-packaging-plugin:1.6.0:validate-version (default-validate-version) @ org.eclipse.m2e.sdk.feature ---
[INFO] 
[INFO] --- jacoco-maven-plugin:0.8.5:prepare-agent (default) @ org.eclipse.m2e.sdk.feature ---
[INFO] argLine set to -javaagent:/home/jenkins/agent/workspace/m2e-master/.repository/org/jacoco/org.jacoco.agent/0.8.5/org.jacoco.agent-0.8.5-runtime.jar=destfile=/home/jenkins/agent/workspace/m2e-master/target/jacoco.exec,append=true,includes=org.eclipse.m2e*:org.apache.maven*:org.eclipse.aether*
[INFO] 
[INFO] --- tycho-source-plugin:1.6.0:plugin-source (plugin-source) @ org.eclipse.m2e.sdk.feature ---
[INFO] 
[INFO] --- target-platform-configuration:1.6.0:target-platform (default-target-platform) @ org.eclipse.m2e.sdk.feature ---
[INFO] 
[INFO] --- tycho-packaging-plugin:1.6.0:package-feature (default-package-feature) @ org.eclipse.m2e.sdk.feature ---
[INFO] Building jar: /home/jenkins/agent/workspace/m2e-master/org.eclipse.m2e.sdk.feature/target/org.eclipse.m2e.sdk.feature-1.16.0-SNAPSHOT.jar
[INFO] 
[INFO] --- tycho-p2-plugin:1.6.0:p2-metadata-default (default-p2-metadata-default) @ org.eclipse.m2e.sdk.feature ---
[INFO] 
[INFO] --- tycho-p2-plugin:1.6.0:feature-p2-metadata (default-feature-p2-metadata) @ org.eclipse.m2e.sdk.feature ---
[INFO] 
[INFO] --- tycho-pack200a-plugin:1.6.0:normalize (pack200-normalize) @ org.eclipse.m2e.sdk.feature ---
[INFO] 
[INFO] --- eclipse-jarsigner-plugin:1.1.5:sign (sign) @ org.eclipse.m2e.sdk.feature ---
[INFO] Signing of nested jars of '/home/jenkins/agent/workspace/m2e-master/org.eclipse.m2e.sdk.feature/target/org.eclipse.m2e.sdk.feature-1.16.0-SNAPSHOT.jar' is disabled.
[INFO] Signing jar: /home/jenkins/agent/workspace/m2e-master/org.eclipse.m2e.sdk.feature/target/org.eclipse.m2e.sdk.feature-1.16.0-SNAPSHOT.jar
[INFO] 
[INFO] --- tycho-pack200b-plugin:1.6.0:pack (pack200-pack) @ org.eclipse.m2e.sdk.feature ---
[INFO] 
[INFO] --- tycho-p2-plugin:1.6.0:p2-metadata (p2-metadata) @ org.eclipse.m2e.sdk.feature ---
[INFO] No baseline version MavenProject: org.eclipse.m2e:org.eclipse.m2e.sdk.feature:1.16.0-SNAPSHOT @ /home/jenkins/agent/workspace/m2e-master/org.eclipse.m2e.sdk.feature/pom.xml
[INFO] 
[INFO] --- tycho-p2-extras-plugin:1.6.0:compare-version-with-baselines (check-no-version-regression) @ org.eclipse.m2e.sdk.feature ---
[INFO] Fetching org.eclipse.m2e.sdk.feature_1.15.0.20200305-1308.jar from https://download.eclipse.org/technology/m2e/releases/1.15/1.15.0.20200310-1746/features/ (19.36kB)
[INFO] 
[INFO] --- maven-install-plugin:2.3.1:install (default-install) @ org.eclipse.m2e.sdk.feature ---
[INFO] Installing /home/jenkins/agent/workspace/m2e-master/org.eclipse.m2e.sdk.feature/target/org.eclipse.m2e.sdk.feature-1.16.0-SNAPSHOT.jar to /home/jenkins/agent/workspace/m2e-master/.repository/org/eclipse/m2e/org.eclipse.m2e.sdk.feature/1.16.0-SNAPSHOT/org.eclipse.m2e.sdk.feature-1.16.0-SNAPSHOT.jar
[INFO] Installing /home/jenkins/agent/workspace/m2e-master/org.eclipse.m2e.sdk.feature/pom.xml to /home/jenkins/agent/workspace/m2e-master/.repository/org/eclipse/m2e/org.eclipse.m2e.sdk.feature/1.16.0-SNAPSHOT/org.eclipse.m2e.sdk.feature-1.16.0-SNAPSHOT.pom
[INFO] Installing /home/jenkins/agent/workspace/m2e-master/org.eclipse.m2e.sdk.feature/target/p2content.xml to /home/jenkins/agent/workspace/m2e-master/.repository/org/eclipse/m2e/org.eclipse.m2e.sdk.feature/1.16.0-SNAPSHOT/org.eclipse.m2e.sdk.feature-1.16.0-SNAPSHOT-p2metadata.xml
[INFO] Installing /home/jenkins/agent/workspace/m2e-master/org.eclipse.m2e.sdk.feature/target/p2artifacts.xml to /home/jenkins/agent/workspace/m2e-master/.repository/org/eclipse/m2e/org.eclipse.m2e.sdk.feature/1.16.0-SNAPSHOT/org.eclipse.m2e.sdk.feature-1.16.0-SNAPSHOT-p2artifacts.xml
[INFO] 
[INFO] --- tycho-p2-plugin:1.6.0:update-local-index (default-update-local-index) @ org.eclipse.m2e.sdk.feature ---
[INFO] 
[INFO] ----------< org.eclipse.m2e:org.eclipse.m2e.logback.feature >-----------
[INFO] Building Maven Integration for Eclipse slf4j over logback logging (Optional) 1.16.0-SNAPSHOT [29/36]
[INFO] --------------------------[ eclipse-feature ]---------------------------
[INFO] 
[INFO] --- maven-clean-plugin:2.4.1:clean (default-clean) @ org.eclipse.m2e.logback.feature ---
[INFO] 
[INFO] --- tycho-packaging-plugin:1.6.0:build-qualifier-aggregator (default-build-qualifier-aggregator) @ org.eclipse.m2e.logback.feature ---
[INFO] The project's OSGi version is 1.16.0.20200318-1040
[INFO] 
[INFO] --- tycho-packaging-plugin:1.6.0:validate-id (default-validate-id) @ org.eclipse.m2e.logback.feature ---
[INFO] 
[INFO] --- tycho-packaging-plugin:1.6.0:validate-version (default-validate-version) @ org.eclipse.m2e.logback.feature ---
[INFO] 
[INFO] --- jacoco-maven-plugin:0.8.5:prepare-agent (default) @ org.eclipse.m2e.logback.feature ---
[INFO] argLine set to -javaagent:/home/jenkins/agent/workspace/m2e-master/.repository/org/jacoco/org.jacoco.agent/0.8.5/org.jacoco.agent-0.8.5-runtime.jar=destfile=/home/jenkins/agent/workspace/m2e-master/target/jacoco.exec,append=true,includes=org.eclipse.m2e*:org.apache.maven*:org.eclipse.aether*
[INFO] 
[INFO] --- tycho-source-plugin:1.6.0:plugin-source (plugin-source) @ org.eclipse.m2e.logback.feature ---
[INFO] 
[INFO] --- target-platform-configuration:1.6.0:target-platform (default-target-platform) @ org.eclipse.m2e.logback.feature ---
[INFO] 
[INFO] --- tycho-packaging-plugin:1.6.0:package-feature (default-package-feature) @ org.eclipse.m2e.logback.feature ---
[INFO] Building jar: /home/jenkins/agent/workspace/m2e-master/org.eclipse.m2e.logback.feature/target/org.eclipse.m2e.logback.feature-1.16.0-SNAPSHOT.jar
[INFO] 
[INFO] --- tycho-p2-plugin:1.6.0:p2-metadata-default (default-p2-metadata-default) @ org.eclipse.m2e.logback.feature ---
[INFO] 
[INFO] --- tycho-p2-plugin:1.6.0:feature-p2-metadata (default-feature-p2-metadata) @ org.eclipse.m2e.logback.feature ---
[INFO] 
[INFO] --- tycho-pack200a-plugin:1.6.0:normalize (pack200-normalize) @ org.eclipse.m2e.logback.feature ---
[INFO] 
[INFO] --- eclipse-jarsigner-plugin:1.1.5:sign (sign) @ org.eclipse.m2e.logback.feature ---
[INFO] Signing of nested jars of '/home/jenkins/agent/workspace/m2e-master/org.eclipse.m2e.logback.feature/target/org.eclipse.m2e.logback.feature-1.16.0-SNAPSHOT.jar' is disabled.
[INFO] Signing jar: /home/jenkins/agent/workspace/m2e-master/org.eclipse.m2e.logback.feature/target/org.eclipse.m2e.logback.feature-1.16.0-SNAPSHOT.jar
[INFO] 
[INFO] --- tycho-pack200b-plugin:1.6.0:pack (pack200-pack) @ org.eclipse.m2e.logback.feature ---
[INFO] 
[INFO] --- tycho-p2-plugin:1.6.0:p2-metadata (p2-metadata) @ org.eclipse.m2e.logback.feature ---
[WARNING] MavenProject: org.eclipse.m2e:org.eclipse.m2e.logback.feature:1.16.0-SNAPSHOT @ /home/jenkins/agent/workspace/m2e-master/org.eclipse.m2e.logback.feature/pom.xml: baseline and build artifacts have same version but different contents
   no-classifier: different
      META-INF/ECLIPSE_.RSA: different

[INFO] MavenProject: org.eclipse.m2e:org.eclipse.m2e.logback.feature:1.16.0-SNAPSHOT @ /home/jenkins/agent/workspace/m2e-master/org.eclipse.m2e.logback.feature/pom.xml
    The main artifact has been replaced with the baseline version.

[INFO] 
[INFO] --- tycho-p2-extras-plugin:1.6.0:compare-version-with-baselines (check-no-version-regression) @ org.eclipse.m2e.logback.feature ---
[INFO] Fetching org.eclipse.m2e.logback.feature_1.15.0.20200108-1649.jar from https://download.eclipse.org/technology/m2e/releases/1.15/1.15.0.20200310-1746/features/ (19.01kB)
[INFO] 
[INFO] --- maven-install-plugin:2.3.1:install (default-install) @ org.eclipse.m2e.logback.feature ---
[INFO] Installing /home/jenkins/agent/workspace/m2e-master/org.eclipse.m2e.logback.feature/target/org.eclipse.m2e.logback.feature-1.16.0-SNAPSHOT.jar to /home/jenkins/agent/workspace/m2e-master/.repository/org/eclipse/m2e/org.eclipse.m2e.logback.feature/1.16.0-SNAPSHOT/org.eclipse.m2e.logback.feature-1.16.0-SNAPSHOT.jar
[INFO] Installing /home/jenkins/agent/workspace/m2e-master/org.eclipse.m2e.logback.feature/pom.xml to /home/jenkins/agent/workspace/m2e-master/.repository/org/eclipse/m2e/org.eclipse.m2e.logback.feature/1.16.0-SNAPSHOT/org.eclipse.m2e.logback.feature-1.16.0-SNAPSHOT.pom
[INFO] Installing /home/jenkins/agent/workspace/m2e-master/org.eclipse.m2e.logback.feature/target/p2content.xml to /home/jenkins/agent/workspace/m2e-master/.repository/org/eclipse/m2e/org.eclipse.m2e.logback.feature/1.16.0-SNAPSHOT/org.eclipse.m2e.logback.feature-1.16.0-SNAPSHOT-p2metadata.xml
[INFO] Installing /home/jenkins/agent/workspace/m2e-master/org.eclipse.m2e.logback.feature/target/p2artifacts.xml to /home/jenkins/agent/workspace/m2e-master/.repository/org/eclipse/m2e/org.eclipse.m2e.logback.feature/1.16.0-SNAPSHOT/org.eclipse.m2e.logback.feature-1.16.0-SNAPSHOT-p2artifacts.xml
[INFO] 
[INFO] --- tycho-p2-plugin:1.6.0:update-local-index (default-update-local-index) @ org.eclipse.m2e.logback.feature ---
[INFO] 
[INFO] ----------------< org.eclipse.m2e:org.eclipse.m2e.site >----------------
[INFO] Building Maven Integration for Eclipse Update Site 1.16.0-SNAPSHOT [30/36]
[INFO] -------------------------[ eclipse-repository ]-------------------------
[INFO] 
[INFO] --- maven-clean-plugin:2.4.1:clean (default-clean) @ org.eclipse.m2e.site ---
[INFO] 
[INFO] --- tycho-packaging-plugin:1.6.0:build-qualifier-aggregator (default-build-qualifier-aggregator) @ org.eclipse.m2e.site ---
[INFO] The project's OSGi version is 1.16.0.20200609-1545
[INFO] 
[INFO] --- maven-clean-plugin:2.4.1:clean (default-clean-1) @ org.eclipse.m2e.site ---
[INFO] 
[INFO] --- jacoco-maven-plugin:0.8.5:prepare-agent (default) @ org.eclipse.m2e.site ---
[INFO] argLine set to -javaagent:/home/jenkins/agent/workspace/m2e-master/.repository/org/jacoco/org.jacoco.agent/0.8.5/org.jacoco.agent-0.8.5-runtime.jar=destfile=/home/jenkins/agent/workspace/m2e-master/target/jacoco.exec,append=true,includes=org.eclipse.m2e*:org.apache.maven*:org.eclipse.aether*
[INFO] 
[INFO] --- maven-resources-plugin:2.5:resources (default-resources) @ org.eclipse.m2e.site ---
[debug] execute contextualize
[INFO] Using 'UTF-8' encoding to copy filtered resources.
[INFO] skip non existing resourceDirectory /home/jenkins/agent/workspace/m2e-master/org.eclipse.m2e.site/src/main/resources
[INFO] 
[INFO] --- tycho-source-plugin:1.6.0:plugin-source (plugin-source) @ org.eclipse.m2e.site ---
[INFO] 
[INFO] --- target-platform-configuration:1.6.0:target-platform (default-target-platform) @ org.eclipse.m2e.site ---
[INFO] 
[INFO] --- tycho-p2-publisher-plugin:1.6.0:publish-osgi-ee (default-publish-osgi-ee) @ org.eclipse.m2e.site ---
[INFO] Published profile IUs: [a.jre 9.0.0, config.a.jre 9.0.0]
[INFO] Published profile IUs: [a.jre.javase 11.0.0, config.a.jre.javase 11.0.0]
[INFO] Published profile IUs: [a.jre 9.0.0, config.a.jre 9.0.0]
[INFO] Published profile IUs: [a.jre.javase 13.0.0, config.a.jre.javase 13.0.0]
[INFO] Published profile IUs: [a.jre.javase 14.0.0, config.a.jre.javase 14.0.0]
[INFO] 
[INFO] --- tycho-p2-publisher-plugin:1.6.0:publish-products (default-publish-products) @ org.eclipse.m2e.site ---
[INFO] 
[INFO] --- tycho-p2-publisher-plugin:1.6.0:publish-categories (default-publish-categories) @ org.eclipse.m2e.site ---
[INFO] 
[INFO] --- tycho-p2-publisher-plugin:1.6.0:attach-artifacts (default-attach-artifacts) @ org.eclipse.m2e.site ---
[INFO] 
[INFO] --- tycho-p2-repository-plugin:1.6.0:assemble-repository (default-assemble-repository) @ org.eclipse.m2e.site ---
[INFO] 
[INFO] --- tycho-p2-repository-plugin:1.6.0:archive-repository (default-archive-repository) @ org.eclipse.m2e.site ---
[INFO] Building zip: /home/jenkins/agent/workspace/m2e-master/org.eclipse.m2e.site/target/org.eclipse.m2e.site-1.16.0-SNAPSHOT.zip
[INFO] 
[INFO] --- tycho-pack200a-plugin:1.6.0:normalize (pack200-normalize) @ org.eclipse.m2e.site ---
[INFO] 
[INFO] --- eclipse-jarsigner-plugin:1.1.5:sign (sign) @ org.eclipse.m2e.site ---
[INFO] 
[INFO] --- tycho-pack200b-plugin:1.6.0:pack (pack200-pack) @ org.eclipse.m2e.site ---
[INFO] 
[INFO] --- tycho-p2-plugin:1.6.0:p2-metadata (p2-metadata) @ org.eclipse.m2e.site ---
[INFO] 
[INFO] --- tycho-p2-extras-plugin:1.6.0:compare-version-with-baselines (check-no-version-regression) @ org.eclipse.m2e.site ---
[INFO] 
[INFO] --- maven-install-plugin:2.3.1:install (default-install) @ org.eclipse.m2e.site ---
[INFO] Installing /home/jenkins/agent/workspace/m2e-master/org.eclipse.m2e.site/target/org.eclipse.m2e.site-1.16.0-SNAPSHOT.zip to /home/jenkins/agent/workspace/m2e-master/.repository/org/eclipse/m2e/org.eclipse.m2e.site/1.16.0-SNAPSHOT/org.eclipse.m2e.site-1.16.0-SNAPSHOT.zip
[INFO] Installing /home/jenkins/agent/workspace/m2e-master/org.eclipse.m2e.site/pom.xml to /home/jenkins/agent/workspace/m2e-master/.repository/org/eclipse/m2e/org.eclipse.m2e.site/1.16.0-SNAPSHOT/org.eclipse.m2e.site-1.16.0-SNAPSHOT.pom
[INFO] Installing /home/jenkins/agent/workspace/m2e-master/org.eclipse.m2e.site/target/p2content.xml to /home/jenkins/agent/workspace/m2e-master/.repository/org/eclipse/m2e/org.eclipse.m2e.site/1.16.0-SNAPSHOT/org.eclipse.m2e.site-1.16.0-SNAPSHOT-p2metadata.xml
[INFO] Installing /home/jenkins/agent/workspace/m2e-master/org.eclipse.m2e.site/target/p2artifacts.xml to /home/jenkins/agent/workspace/m2e-master/.repository/org/eclipse/m2e/org.eclipse.m2e.site/1.16.0-SNAPSHOT/org.eclipse.m2e.site-1.16.0-SNAPSHOT-p2artifacts.xml
[INFO] 
[INFO] --- tycho-p2-plugin:1.6.0:update-local-index (default-update-local-index) @ org.eclipse.m2e.site ---
[INFO] 
[INFO] -------------< org.eclipse.m2e:org.eclipse.m2e.core.tests >-------------
[INFO] Building org.eclipse.m2e.core.tests 1.16.0-SNAPSHOT              [31/36]
[INFO] ------------------------[ eclipse-test-plugin ]-------------------------
[INFO] 
[INFO] --- maven-clean-plugin:2.4.1:clean (default-clean) @ org.eclipse.m2e.core.tests ---
[INFO] 
[INFO] --- tycho-packaging-plugin:1.6.0:build-qualifier (default-build-qualifier) @ org.eclipse.m2e.core.tests ---
[INFO] The project's OSGi version is 1.16.0.20200318-0852
[INFO] 
[INFO] --- tycho-packaging-plugin:1.6.0:validate-id (default-validate-id) @ org.eclipse.m2e.core.tests ---
[INFO] 
[INFO] --- tycho-packaging-plugin:1.6.0:validate-version (default-validate-version) @ org.eclipse.m2e.core.tests ---
[INFO] 
[INFO] --- jacoco-maven-plugin:0.8.5:prepare-agent (default) @ org.eclipse.m2e.core.tests ---
[INFO] tycho.testArgLine set to -javaagent:/home/jenkins/agent/workspace/m2e-master/.repository/org/jacoco/org.jacoco.agent/0.8.5/org.jacoco.agent-0.8.5-runtime.jar=destfile=/home/jenkins/agent/workspace/m2e-master/target/jacoco.exec,append=true,includes=org.eclipse.m2e*:org.apache.maven*:org.eclipse.aether* -Xmx800m
[INFO] 
[INFO] --- maven-resources-plugin:2.5:resources (default-resources) @ org.eclipse.m2e.core.tests ---
[debug] execute contextualize
[INFO] Using 'UTF-8' encoding to copy filtered resources.
[INFO] skip non existing resourceDirectory /home/jenkins/agent/workspace/m2e-master/org.eclipse.m2e.core.tests/src/main/resources
[INFO] 
[INFO] --- tycho-compiler-plugin:1.6.0:compile (default-compile) @ org.eclipse.m2e.core.tests ---
[WARNING] Parameter 'useProjectSettings' is set to true, but preferences file '/home/jenkins/agent/workspace/m2e-master/org.eclipse.m2e.core.tests/.settings/org.eclipse.jdt.core.prefs' could not be found!
[INFO] Compiling 4 source files to /home/jenkins/agent/workspace/m2e-master/org.eclipse.m2e.core.tests/target/classes
[INFO] 
[INFO] --- maven-resources-plugin:2.5:testResources (default-testResources) @ org.eclipse.m2e.core.tests ---
[debug] execute contextualize
[INFO] Using 'UTF-8' encoding to copy filtered resources.
[INFO] skip non existing resourceDirectory /home/jenkins/agent/workspace/m2e-master/org.eclipse.m2e.core.tests/src/test/resources
[INFO] 
[INFO] --- tycho-source-plugin:1.6.0:plugin-source (plugin-source) @ org.eclipse.m2e.core.tests ---
[INFO] Building jar: /home/jenkins/agent/workspace/m2e-master/org.eclipse.m2e.core.tests/target/org.eclipse.m2e.core.tests-1.16.0-SNAPSHOT-sources.jar
[INFO] 
[INFO] --- target-platform-configuration:1.6.0:target-platform (default-target-platform) @ org.eclipse.m2e.core.tests ---
[INFO] 
[INFO] --- tycho-packaging-plugin:1.6.0:package-plugin (default-package-plugin) @ org.eclipse.m2e.core.tests ---
[INFO] Building jar: /home/jenkins/agent/workspace/m2e-master/org.eclipse.m2e.core.tests/target/org.eclipse.m2e.core.tests-1.16.0-SNAPSHOT.jar
[INFO] 
[INFO] --- tycho-p2-plugin:1.6.0:p2-metadata-default (default-p2-metadata-default) @ org.eclipse.m2e.core.tests ---
[INFO] 
[INFO] --- tycho-pack200a-plugin:1.6.0:normalize (pack200-normalize) @ org.eclipse.m2e.core.tests ---
[INFO] Pack200 normalizing jar /home/jenkins/agent/workspace/m2e-master/org.eclipse.m2e.core.tests/target/org.eclipse.m2e.core.tests-1.16.0-SNAPSHOT.jar
[INFO] 
[INFO] --- eclipse-jarsigner-plugin:1.1.5:sign (sign) @ org.eclipse.m2e.core.tests ---
[INFO] Signing of nested jars of '/home/jenkins/agent/workspace/m2e-master/org.eclipse.m2e.core.tests/target/org.eclipse.m2e.core.tests-1.16.0-SNAPSHOT.jar' is disabled.
[INFO] Signing jar: /home/jenkins/agent/workspace/m2e-master/org.eclipse.m2e.core.tests/target/org.eclipse.m2e.core.tests-1.16.0-SNAPSHOT.jar
[INFO] Signing of nested jars of '/home/jenkins/agent/workspace/m2e-master/org.eclipse.m2e.core.tests/target/org.eclipse.m2e.core.tests-1.16.0-SNAPSHOT-sources.jar' is disabled.
[INFO] Signing jar: /home/jenkins/agent/workspace/m2e-master/org.eclipse.m2e.core.tests/target/org.eclipse.m2e.core.tests-1.16.0-SNAPSHOT-sources.jar
[INFO] 
[INFO] --- tycho-pack200b-plugin:1.6.0:pack (pack200-pack) @ org.eclipse.m2e.core.tests ---
[INFO] Pack200 packing jar /home/jenkins/agent/workspace/m2e-master/org.eclipse.m2e.core.tests/target/org.eclipse.m2e.core.tests-1.16.0-SNAPSHOT.jar
[INFO] 
[INFO] --- tycho-p2-plugin:1.6.0:p2-metadata (p2-metadata) @ org.eclipse.m2e.core.tests ---
[INFO] No baseline version MavenProject: org.eclipse.m2e:org.eclipse.m2e.core.tests:1.16.0-SNAPSHOT @ /home/jenkins/agent/workspace/m2e-master/org.eclipse.m2e.core.tests/pom.xml
[INFO] 
[INFO] --- tycho-surefire-plugin:1.6.0:test (default-test) @ org.eclipse.m2e.core.tests ---
[INFO] Expected eclipse log file: /home/jenkins/agent/workspace/m2e-master/org.eclipse.m2e.core.tests/target/work/data/.metadata/.log
[INFO] Command line:
	[/opt/tools/java/oracle/jdk-8/1.8.0_202/jre/bin/java, -Dosgi.noShutdown=false, -Dosgi.os=linux, -Dosgi.ws=gtk, -Dosgi.arch=x86_64, -javaagent:/home/jenkins/agent/workspace/m2e-master/.repository/org/jacoco/org.jacoco.agent/0.8.5/org.jacoco.agent-0.8.5-runtime.jar=destfile=/home/jenkins/agent/workspace/m2e-master/target/jacoco.exec,append=true,includes=org.eclipse.m2e*:org.apache.maven*:org.eclipse.aether*, -Xmx800m, -Dosgi.clean=true, -jar, /home/jenkins/agent/workspace/m2e-master/.repository/p2/osgi/bundle/org.eclipse.equinox.launcher/1.5.700.v20200207-2156/org.eclipse.equinox.launcher-1.5.700.v20200207-2156.jar, -data, /home/jenkins/agent/workspace/m2e-master/org.eclipse.m2e.core.tests/target/work/data, -install, /home/jenkins/agent/workspace/m2e-master/org.eclipse.m2e.core.tests/target/work, -configuration, /home/jenkins/agent/workspace/m2e-master/org.eclipse.m2e.core.tests/target/work/configuration, -application, org.eclipse.tycho.surefire.osgibooter.headlesstest, -testproperties, /home/jenkins/agent/workspace/m2e-master/org.eclipse.m2e.core.tests/target/surefire.properties, -timeout, 7200000]
Picked up JAVA_TOOL_OPTIONS: -XX:+IgnoreUnrecognizedVMOptions -XX:+UseContainerSupport -XX:+UnlockExperimentalVMOptions -XX:+UseCGroupMemoryLimitForHeap
Picked up _JAVA_OPTIONS: -XX:MaxRAMPercentage=64.0
SLF4J: Failed to load class "org.slf4j.impl.StaticLoggerBinder".
SLF4J: Defaulting to no-operation (NOP) logger implementation
SLF4J: See http://www.slf4j.org/codes.html#StaticLoggerBinder for further details.
Running org.eclipse.m2e.core.AllTests
Tests run: 7, Failures: 0, Errors: 0, Skipped: 1, Time elapsed: 315.353 s - in org.eclipse.m2e.core.AllTests
testMNG6530(org.eclipse.m2e.core.MavenBugsTest)  Time elapsed: 25.683 s
testMissingParentCapabilityStored(org.eclipse.m2e.core.internal.project.registry.RegistryTest)  Time elapsed: 0.999 s
testMultiRefreshKeepsCapabilities(org.eclipse.m2e.core.internal.project.registry.RegistryTest)  Time elapsed: 140.497 s
testDeletedFacadeIsRemoved(org.eclipse.m2e.core.internal.project.registry.RegistryTest)  Time elapsed: 6.493 s
testInvalidParent(org.eclipse.m2e.core.internal.project.registry.RegistryTest) skipped
testResolvedParentConfiguration(org.eclipse.m2e.core.internal.project.registry.RegistryTest)  Time elapsed: 26.465 s
testImportLongBuildChain(org.eclipse.m2e.core.internal.project.registry.MemoryConsumptionTest)  Time elapsed: 114.759 s

Results:

Tests run: 7, Failures: 0, Errors: 0, Skipped: 1

[INFO] All tests passed!
[INFO] 
[INFO] --- tycho-p2-extras-plugin:1.6.0:compare-version-with-baselines (check-no-version-regression) @ org.eclipse.m2e.core.tests ---
[INFO] 
[INFO] --- maven-install-plugin:2.3.1:install (default-install) @ org.eclipse.m2e.core.tests ---
[INFO] Installing /home/jenkins/agent/workspace/m2e-master/org.eclipse.m2e.core.tests/target/org.eclipse.m2e.core.tests-1.16.0-SNAPSHOT.jar to /home/jenkins/agent/workspace/m2e-master/.repository/org/eclipse/m2e/org.eclipse.m2e.core.tests/1.16.0-SNAPSHOT/org.eclipse.m2e.core.tests-1.16.0-SNAPSHOT.jar
[INFO] Installing /home/jenkins/agent/workspace/m2e-master/org.eclipse.m2e.core.tests/pom.xml to /home/jenkins/agent/workspace/m2e-master/.repository/org/eclipse/m2e/org.eclipse.m2e.core.tests/1.16.0-SNAPSHOT/org.eclipse.m2e.core.tests-1.16.0-SNAPSHOT.pom
[INFO] Installing /home/jenkins/agent/workspace/m2e-master/org.eclipse.m2e.core.tests/target/org.eclipse.m2e.core.tests-1.16.0-SNAPSHOT-sources.jar to /home/jenkins/agent/workspace/m2e-master/.repository/org/eclipse/m2e/org.eclipse.m2e.core.tests/1.16.0-SNAPSHOT/org.eclipse.m2e.core.tests-1.16.0-SNAPSHOT-sources.jar
[INFO] Installing /home/jenkins/agent/workspace/m2e-master/org.eclipse.m2e.core.tests/target/org.eclipse.m2e.core.tests-1.16.0-SNAPSHOT.jar.pack.gz to /home/jenkins/agent/workspace/m2e-master/.repository/org/eclipse/m2e/org.eclipse.m2e.core.tests/1.16.0-SNAPSHOT/org.eclipse.m2e.core.tests-1.16.0-SNAPSHOT-pack200.jar.pack.gz
[INFO] Installing /home/jenkins/agent/workspace/m2e-master/org.eclipse.m2e.core.tests/target/p2content.xml to /home/jenkins/agent/workspace/m2e-master/.repository/org/eclipse/m2e/org.eclipse.m2e.core.tests/1.16.0-SNAPSHOT/org.eclipse.m2e.core.tests-1.16.0-SNAPSHOT-p2metadata.xml
[INFO] Installing /home/jenkins/agent/workspace/m2e-master/org.eclipse.m2e.core.tests/target/p2artifacts.xml to /home/jenkins/agent/workspace/m2e-master/.repository/org/eclipse/m2e/org.eclipse.m2e.core.tests/1.16.0-SNAPSHOT/org.eclipse.m2e.core.tests-1.16.0-SNAPSHOT-p2artifacts.xml
[INFO] 
[INFO] --- tycho-p2-plugin:1.6.0:update-local-index (default-update-local-index) @ org.eclipse.m2e.core.tests ---
[INFO] 
[INFO] -----------< org.eclipse.m2e:org.eclipse.m2e.importer.tests >-----------
[INFO] Building Tests for Maven Integration for Eclipse Importer framework 1.16.0-SNAPSHOT [32/36]
[INFO] ------------------------[ eclipse-test-plugin ]-------------------------
[INFO] 
[INFO] --- maven-clean-plugin:2.4.1:clean (default-clean) @ org.eclipse.m2e.importer.tests ---
[INFO] 
[INFO] --- tycho-packaging-plugin:1.6.0:build-qualifier (default-build-qualifier) @ org.eclipse.m2e.importer.tests ---
[INFO] The project's OSGi version is 1.16.0.20200318-0852
[INFO] 
[INFO] --- tycho-packaging-plugin:1.6.0:validate-id (default-validate-id) @ org.eclipse.m2e.importer.tests ---
[INFO] 
[INFO] --- tycho-packaging-plugin:1.6.0:validate-version (default-validate-version) @ org.eclipse.m2e.importer.tests ---
[INFO] 
[INFO] --- jacoco-maven-plugin:0.8.5:prepare-agent (default) @ org.eclipse.m2e.importer.tests ---
[INFO] tycho.testArgLine set to -javaagent:/home/jenkins/agent/workspace/m2e-master/.repository/org/jacoco/org.jacoco.agent/0.8.5/org.jacoco.agent-0.8.5-runtime.jar=destfile=/home/jenkins/agent/workspace/m2e-master/target/jacoco.exec,append=true,includes=org.eclipse.m2e*:org.apache.maven*:org.eclipse.aether* -Xmx800m
[INFO] 
[INFO] --- maven-resources-plugin:2.5:resources (default-resources) @ org.eclipse.m2e.importer.tests ---
[debug] execute contextualize
[INFO] Using 'UTF-8' encoding to copy filtered resources.
[INFO] skip non existing resourceDirectory /home/jenkins/agent/workspace/m2e-master/org.eclipse.m2e.importer.tests/src/main/resources
[INFO] 
[INFO] --- tycho-compiler-plugin:1.6.0:compile (default-compile) @ org.eclipse.m2e.importer.tests ---
[WARNING] Parameter 'useProjectSettings' is set to true, but preferences file '/home/jenkins/agent/workspace/m2e-master/org.eclipse.m2e.importer.tests/.settings/org.eclipse.jdt.core.prefs' could not be found!
[INFO] Compiling 1 source file to /home/jenkins/agent/workspace/m2e-master/org.eclipse.m2e.importer.tests/target/classes
[INFO] 
[INFO] --- maven-resources-plugin:2.5:testResources (default-testResources) @ org.eclipse.m2e.importer.tests ---
[debug] execute contextualize
[INFO] Using 'UTF-8' encoding to copy filtered resources.
[INFO] skip non existing resourceDirectory /home/jenkins/agent/workspace/m2e-master/org.eclipse.m2e.importer.tests/src/test/resources
[INFO] 
[INFO] --- tycho-source-plugin:1.6.0:plugin-source (plugin-source) @ org.eclipse.m2e.importer.tests ---
[INFO] Building jar: /home/jenkins/agent/workspace/m2e-master/org.eclipse.m2e.importer.tests/target/org.eclipse.m2e.importer.tests-1.16.0-SNAPSHOT-sources.jar
[INFO] 
[INFO] --- target-platform-configuration:1.6.0:target-platform (default-target-platform) @ org.eclipse.m2e.importer.tests ---
[INFO] 
[INFO] --- tycho-packaging-plugin:1.6.0:package-plugin (default-package-plugin) @ org.eclipse.m2e.importer.tests ---
[INFO] Building jar: /home/jenkins/agent/workspace/m2e-master/org.eclipse.m2e.importer.tests/target/org.eclipse.m2e.importer.tests-1.16.0-SNAPSHOT.jar
[INFO] 
[INFO] --- tycho-p2-plugin:1.6.0:p2-metadata-default (default-p2-metadata-default) @ org.eclipse.m2e.importer.tests ---
[INFO] 
[INFO] --- tycho-pack200a-plugin:1.6.0:normalize (pack200-normalize) @ org.eclipse.m2e.importer.tests ---
[INFO] Pack200 normalizing jar /home/jenkins/agent/workspace/m2e-master/org.eclipse.m2e.importer.tests/target/org.eclipse.m2e.importer.tests-1.16.0-SNAPSHOT.jar
[INFO] 
[INFO] --- eclipse-jarsigner-plugin:1.1.5:sign (sign) @ org.eclipse.m2e.importer.tests ---
[INFO] Signing of nested jars of '/home/jenkins/agent/workspace/m2e-master/org.eclipse.m2e.importer.tests/target/org.eclipse.m2e.importer.tests-1.16.0-SNAPSHOT.jar' is disabled.
[INFO] Signing jar: /home/jenkins/agent/workspace/m2e-master/org.eclipse.m2e.importer.tests/target/org.eclipse.m2e.importer.tests-1.16.0-SNAPSHOT.jar
[INFO] Signing of nested jars of '/home/jenkins/agent/workspace/m2e-master/org.eclipse.m2e.importer.tests/target/org.eclipse.m2e.importer.tests-1.16.0-SNAPSHOT-sources.jar' is disabled.
[INFO] Signing jar: /home/jenkins/agent/workspace/m2e-master/org.eclipse.m2e.importer.tests/target/org.eclipse.m2e.importer.tests-1.16.0-SNAPSHOT-sources.jar
[INFO] 
[INFO] --- tycho-pack200b-plugin:1.6.0:pack (pack200-pack) @ org.eclipse.m2e.importer.tests ---
[INFO] Pack200 packing jar /home/jenkins/agent/workspace/m2e-master/org.eclipse.m2e.importer.tests/target/org.eclipse.m2e.importer.tests-1.16.0-SNAPSHOT.jar
[INFO] 
[INFO] --- tycho-p2-plugin:1.6.0:p2-metadata (p2-metadata) @ org.eclipse.m2e.importer.tests ---
[INFO] No baseline version MavenProject: org.eclipse.m2e:org.eclipse.m2e.importer.tests:1.16.0-SNAPSHOT @ /home/jenkins/agent/workspace/m2e-master/org.eclipse.m2e.importer.tests/pom.xml
[INFO] 
[INFO] --- tycho-surefire-plugin:1.6.0:test (default-test) @ org.eclipse.m2e.importer.tests ---
[INFO] Expected eclipse log file: /home/jenkins/agent/workspace/m2e-master/org.eclipse.m2e.importer.tests/target/work/data/.metadata/.log
[INFO] Command line:
	[/opt/tools/java/oracle/jdk-8/1.8.0_202/jre/bin/java, -Dosgi.noShutdown=false, -Dosgi.os=linux, -Dosgi.ws=gtk, -Dosgi.arch=x86_64, -javaagent:/home/jenkins/agent/workspace/m2e-master/.repository/org/jacoco/org.jacoco.agent/0.8.5/org.jacoco.agent-0.8.5-runtime.jar=destfile=/home/jenkins/agent/workspace/m2e-master/target/jacoco.exec,append=true,includes=org.eclipse.m2e*:org.apache.maven*:org.eclipse.aether*, -Xmx800m, -Dosgi.clean=true, -jar, /home/jenkins/agent/workspace/m2e-master/.repository/p2/osgi/bundle/org.eclipse.equinox.launcher/1.5.700.v20200207-2156/org.eclipse.equinox.launcher-1.5.700.v20200207-2156.jar, -data, /home/jenkins/agent/workspace/m2e-master/org.eclipse.m2e.importer.tests/target/work/data, -install, /home/jenkins/agent/workspace/m2e-master/org.eclipse.m2e.importer.tests/target/work, -configuration, /home/jenkins/agent/workspace/m2e-master/org.eclipse.m2e.importer.tests/target/work/configuration, -application, org.eclipse.tycho.surefire.osgibooter.uitest, -testproperties, /home/jenkins/agent/workspace/m2e-master/org.eclipse.m2e.importer.tests/target/surefire.properties, -nouithread, -timeout, 7200000]
Picked up JAVA_TOOL_OPTIONS: -XX:+IgnoreUnrecognizedVMOptions -XX:+UseContainerSupport -XX:+UnlockExperimentalVMOptions -XX:+UseCGroupMemoryLimitForHeap
Picked up _JAVA_OPTIONS: -XX:MaxRAMPercentage=64.0
Running org.eclipse.m2e.importer.tests.MavenImporterTest
SLF4J: Failed to load class "org.slf4j.impl.StaticLoggerBinder".
SLF4J: Defaulting to no-operation (NOP) logger implementation
SLF4J: See http://www.slf4j.org/codes.html#StaticLoggerBinder for further details.
Tests run: 2, Failures: 1, Errors: 0, Skipped: 0, Time elapsed: 165.798 s <<< FAILURE! - in org.eclipse.m2e.importer.tests.MavenImporterTest
testRootWithoutPom(org.eclipse.m2e.importer.tests.MavenImporterTest)  Time elapsed: 61.784 s  <<< FAILURE!
java.lang.AssertionError: Timeout while waiting for completion of job: Building(4)
	at org.eclipse.m2e.importer.tests.MavenImporterTest.testRootWithoutPom(MavenImporterTest.java:129)

test(org.eclipse.m2e.importer.tests.MavenImporterTest)  Time elapsed: 101.828 s

Results:

Failures: 
  MavenImporterTest.testRootWithoutPom:129->AbstractMavenProjectTestCase.waitForJobsToComplete:472->AbstractMavenProjectTestCase.waitForJobsToComplete:476 Timeout while waiting for completion of job: Building(4)

Tests run: 2, Failures: 1, Errors: 0, Skipped: 0

[INFO] ------------------------------------------------------------------------
[INFO] Reactor Summary for Maven Integration for Eclipse (parent) 1.16.0-SNAPSHOT:
[INFO] 
[INFO] Maven Integration for Eclipse (parent) ............. SUCCESS [01:19 min]
[INFO] Maven Project Model Edit Bundle .................... SUCCESS [ 56.764 s]
[INFO] Maven Integration for Eclipse Core Plug-in ......... SUCCESS [ 40.534 s]
[INFO] Maven Integration for Eclipse UI Plug-in ........... SUCCESS [ 18.515 s]
[INFO] Maven Integration for Eclipse Launching ............ SUCCESS [  5.980 s]
[INFO] Maven Integration for Eclipse JDT .................. SUCCESS [  9.410 s]
[INFO] Maven Integration for Eclipse JDT UI ............... SUCCESS [ 11.272 s]
[INFO] Maven POM Refactoring .............................. SUCCESS [  9.105 s]
[INFO] m2e Marketplace .................................... SUCCESS [  7.095 s]
[INFO] Maven POM Editor ................................... SUCCESS [ 12.287 s]
[INFO] Maven POM XML Editor ............................... SUCCESS [ 10.993 s]
[INFO] org.eclipse.m2e.lifecyclemapping.defaults .......... SUCCESS [ 11.018 s]
[INFO] org.eclipse.m2e.scm ................................ SUCCESS [ 12.720 s]
[INFO] Maven Profile Manager Core ......................... SUCCESS [  9.652 s]
[INFO] Maven Profile Manager UI ........................... SUCCESS [  8.205 s]
[INFO] Maven Integration for Eclipse Importer framework ... SUCCESS [  8.244 s]
[INFO] org.eclipse.m2e.sourcelookup ....................... SUCCESS [  8.993 s]
[INFO] org.eclipse.m2e.binaryproject ...................... SUCCESS [  8.762 s]
[INFO] org.eclipse.m2e.binaryproject.ui ................... SUCCESS [  6.351 s]
[INFO] org.eclipse.m2e.sourcelookup.ui .................... SUCCESS [  6.673 s]
[INFO] org.eclipse.m2e.editor.lemminx ..................... SUCCESS [01:15 min]
[INFO] M2E Testing Helpers ................................ SUCCESS [  6.963 s]
[INFO] org.eclipse.m2e.logback.appender ................... SUCCESS [  7.166 s]
[INFO] org.eclipse.m2e.logback.configuration .............. SUCCESS [  3.891 s]
[INFO] org.eclipse.m2e.sse.ui.feature ..................... SUCCESS [  1.781 s]
[INFO] Maven Integration for Eclipse ...................... SUCCESS [  3.246 s]
[INFO] org.eclipse.m2e.lemminx.feature .................... SUCCESS [  1.946 s]
[INFO] m2e extensions development support (Optional) ...... SUCCESS [  5.534 s]
[INFO] Maven Integration for Eclipse slf4j over logback logging (Optional) SUCCESS [  4.226 s]
[INFO] Maven Integration for Eclipse Update Site .......... SUCCESS [ 27.971 s]
[INFO] org.eclipse.m2e.core.tests ......................... SUCCESS [06:11 min]
[INFO] Tests for Maven Integration for Eclipse Importer framework FAILURE [03:06 min]
[INFO] org.eclipse.m2e.binaryproject.tests ................ SKIPPED
[INFO] org.eclipse.m2e.editor.lemminx.tests ............... SKIPPED
[INFO] org.eclipse.m2e.jdt.tests .......................... SKIPPED
[INFO] org.eclipse.m2e.editor.xml.sse.tests ............... SKIPPED
[INFO] ------------------------------------------------------------------------
[INFO] BUILD FAILURE
[INFO] ------------------------------------------------------------------------
[INFO] Total time:  23:10 min
[INFO] Finished at: 2020-06-09T16:18:11Z
[INFO] ------------------------------------------------------------------------
[ERROR] Failed to execute goal org.eclipse.tycho:tycho-surefire-plugin:1.6.0:test (default-test) on project org.eclipse.m2e.importer.tests: There are test failures.
[ERROR] 
[ERROR] Please refer to /home/jenkins/agent/workspace/m2e-master/org.eclipse.m2e.importer.tests/target/surefire-reports for the individual test results.
[ERROR] -> [Help 1]
[ERROR] 
[ERROR] To see the full stack trace of the errors, re-run Maven with the -e switch.
[ERROR] Re-run Maven using the -X switch to enable full debug logging.
[ERROR] 
[ERROR] For more information about the errors and possible solutions, please read the following articles:
[ERROR] [Help 1] http://cwiki.apache.org/confluence/display/MAVEN/MojoFailureException
[ERROR] 
[ERROR] After correcting the problems, you can resume the build with the command
[ERROR]   mvn <args> -rf :org.eclipse.m2e.importer.tests
Build step 'Invoke top-level Maven targets' marked build as failure
Terminating xvnc.
$ ssh-agent -k
unset SSH_AUTH_SOCK;
unset SSH_AGENT_PID;
echo Agent pid 55 killed;
[ssh-agent] Stopped.
Sending e-mails to: fbricon@gmail.com mistria@redhat.com
Recording test results
Archiving artifacts
Finished: FAILURE