UnstableConsole Output

Skipping 702 KB.. Full Log
.internal.LifecycleStarter.execute (LifecycleStarter.java:128)
    at org.apache.maven.DefaultMaven.doExecute (DefaultMaven.java:305)
    at org.apache.maven.DefaultMaven.doExecute (DefaultMaven.java:192)
    at org.apache.maven.DefaultMaven.execute (DefaultMaven.java:105)
    at org.apache.maven.cli.MavenCli.execute (MavenCli.java:957)
    at org.apache.maven.cli.MavenCli.doMain (MavenCli.java:289)
    at org.apache.maven.cli.MavenCli.main (MavenCli.java:193)
    at sun.reflect.NativeMethodAccessorImpl.invoke0 (Native Method)
    at sun.reflect.NativeMethodAccessorImpl.invoke (NativeMethodAccessorImpl.java:62)
    at sun.reflect.DelegatingMethodAccessorImpl.invoke (DelegatingMethodAccessorImpl.java:43)
    at java.lang.reflect.Method.invoke (Method.java:498)
    at org.codehaus.plexus.classworlds.launcher.Launcher.launchEnhanced (Launcher.java:282)
    at org.codehaus.plexus.classworlds.launcher.Launcher.launch (Launcher.java:225)
    at org.codehaus.plexus.classworlds.launcher.Launcher.mainWithExitCode (Launcher.java:406)
    at org.codehaus.plexus.classworlds.launcher.Launcher.main (Launcher.java:347)
[INFO] No baseline version MavenProject: org.eclipse.m2e:org.eclipse.m2e.editor.xml.sse.tests:1.16.0-SNAPSHOT @ /home/jenkins/agent/workspace/m2e-gerrit/org.eclipse.m2e.editor.xml.sse.tests/pom.xml
[INFO] 
[INFO] --- tycho-surefire-plugin:1.7.0:test (default-test) @ org.eclipse.m2e.editor.xml.sse.tests ---
[INFO] Executing Test Runtime with timeout 7200, logs (if any) will be placed at: /home/jenkins/agent/workspace/m2e-gerrit/org.eclipse.m2e.editor.xml.sse.tests/target/work/data/.metadata/.log
[INFO] Command line:
	[/opt/tools/java/oracle/jdk-8/1.8.0_202/jre/bin/java, -Dosgi.noShutdown=false, -Dosgi.os=linux, -Dosgi.ws=gtk, -Dosgi.arch=x86_64, -javaagent:/home/jenkins/agent/workspace/m2e-gerrit/.repository/org/jacoco/org.jacoco.agent/0.8.5/org.jacoco.agent-0.8.5-runtime.jar=destfile=/home/jenkins/agent/workspace/m2e-gerrit/target/jacoco.exec,append=true,includes=org.eclipse.m2e*:org.apache.maven*:org.eclipse.aether*, -Xmx800m, -Dosgi.clean=true, -jar, /home/jenkins/agent/workspace/m2e-gerrit/.repository/p2/osgi/bundle/org.eclipse.equinox.launcher/1.5.700.v20200207-2156/org.eclipse.equinox.launcher-1.5.700.v20200207-2156.jar, -data, /home/jenkins/agent/workspace/m2e-gerrit/org.eclipse.m2e.editor.xml.sse.tests/target/work/data, -install, /home/jenkins/agent/workspace/m2e-gerrit/org.eclipse.m2e.editor.xml.sse.tests/target/work, -configuration, /home/jenkins/agent/workspace/m2e-gerrit/org.eclipse.m2e.editor.xml.sse.tests/target/work/configuration, -application, org.eclipse.tycho.surefire.osgibooter.uitest, -testproperties, /home/jenkins/agent/workspace/m2e-gerrit/org.eclipse.m2e.editor.xml.sse.tests/target/surefire.properties, -timeout, 7200000]

(process:2024): Gtk-WARNING **: 07:26:42.141: Locale not supported by C library.
	Using the fallback 'C' locale.
SWT SessionManagerDBus: Failed to connect to org.gnome.SessionManager: Failed to execute child process ?dbus-launch? (No such file or directory)
SWT SessionManagerDBus: Failed to connect to org.xfce.SessionManager: Failed to execute child process ?dbus-launch? (No such file or directory)
Running org.eclipse.m2e.editor.xml.sse.tests.WTPEditorTest
SLF4J: Failed to load class "org.slf4j.impl.StaticLoggerBinder".
SLF4J: Defaulting to no-operation (NOP) logger implementation
SLF4J: See http://www.slf4j.org/codes.html#StaticLoggerBinder for further details.
Warning: NLS missing message: MavenImpl_error_lookup in: org.eclipse.m2e.editor.internal.messages
Warning: NLS unused message: MarkerHoverControl_openDiscoveryPrefs in: org.eclipse.m2e.editor.xml.internal.messages
Warning: NLS unused message: MarkerHoverControl_openLifecyclePrefs in: org.eclipse.m2e.editor.xml.internal.messages
Warning: NLS unused message: MarkerHoverControl_openParentDefinition in: org.eclipse.m2e.editor.xml.internal.messages
Warning: NLS unused message: MarkerHoverControl_openWarningsPrefs in: org.eclipse.m2e.editor.xml.internal.messages
Warning: NLS unused message: MavenMarkerResolution_error in: org.eclipse.m2e.editor.xml.internal.messages
Warning: NLS unused message: MavenMarkerResolution_error_title in: org.eclipse.m2e.editor.xml.internal.messages
Warning: NLS unused message: MavenMarkerResolution_schema_label in: org.eclipse.m2e.editor.xml.internal.messages
Tests run: 1, Failures: 0, Errors: 0, Skipped: 0, Time elapsed: 3.524 s - in org.eclipse.m2e.editor.xml.sse.tests.WTPEditorTest
testXSDCompletion(org.eclipse.m2e.editor.xml.sse.tests.WTPEditorTest)  Time elapsed: 3.5 s

Results:

Tests run: 1, Failures: 0, Errors: 0, Skipped: 0

[INFO] All tests passed!
[INFO] 
[INFO] --- tycho-p2-extras-plugin:1.7.0:compare-version-with-baselines (check-no-version-regression) @ org.eclipse.m2e.editor.xml.sse.tests ---
[INFO] 
[INFO] --- maven-install-plugin:2.3.1:install (default-install) @ org.eclipse.m2e.editor.xml.sse.tests ---
[INFO] Installing /home/jenkins/agent/workspace/m2e-gerrit/org.eclipse.m2e.editor.xml.sse.tests/target/org.eclipse.m2e.editor.xml.sse.tests-1.16.0-SNAPSHOT.jar to /home/jenkins/agent/workspace/m2e-gerrit/.repository/org/eclipse/m2e/org.eclipse.m2e.editor.xml.sse.tests/1.16.0-SNAPSHOT/org.eclipse.m2e.editor.xml.sse.tests-1.16.0-SNAPSHOT.jar
[INFO] Installing /home/jenkins/agent/workspace/m2e-gerrit/org.eclipse.m2e.editor.xml.sse.tests/pom.xml to /home/jenkins/agent/workspace/m2e-gerrit/.repository/org/eclipse/m2e/org.eclipse.m2e.editor.xml.sse.tests/1.16.0-SNAPSHOT/org.eclipse.m2e.editor.xml.sse.tests-1.16.0-SNAPSHOT.pom
[INFO] Installing /home/jenkins/agent/workspace/m2e-gerrit/org.eclipse.m2e.editor.xml.sse.tests/target/org.eclipse.m2e.editor.xml.sse.tests-1.16.0-SNAPSHOT-sources.jar to /home/jenkins/agent/workspace/m2e-gerrit/.repository/org/eclipse/m2e/org.eclipse.m2e.editor.xml.sse.tests/1.16.0-SNAPSHOT/org.eclipse.m2e.editor.xml.sse.tests-1.16.0-SNAPSHOT-sources.jar
[INFO] Installing /home/jenkins/agent/workspace/m2e-gerrit/org.eclipse.m2e.editor.xml.sse.tests/target/org.eclipse.m2e.editor.xml.sse.tests-1.16.0-SNAPSHOT.jar.pack.gz to /home/jenkins/agent/workspace/m2e-gerrit/.repository/org/eclipse/m2e/org.eclipse.m2e.editor.xml.sse.tests/1.16.0-SNAPSHOT/org.eclipse.m2e.editor.xml.sse.tests-1.16.0-SNAPSHOT-pack200.jar.pack.gz
[INFO] Installing /home/jenkins/agent/workspace/m2e-gerrit/org.eclipse.m2e.editor.xml.sse.tests/target/p2content.xml to /home/jenkins/agent/workspace/m2e-gerrit/.repository/org/eclipse/m2e/org.eclipse.m2e.editor.xml.sse.tests/1.16.0-SNAPSHOT/org.eclipse.m2e.editor.xml.sse.tests-1.16.0-SNAPSHOT-p2metadata.xml
[INFO] Installing /home/jenkins/agent/workspace/m2e-gerrit/org.eclipse.m2e.editor.xml.sse.tests/target/p2artifacts.xml to /home/jenkins/agent/workspace/m2e-gerrit/.repository/org/eclipse/m2e/org.eclipse.m2e.editor.xml.sse.tests/1.16.0-SNAPSHOT/org.eclipse.m2e.editor.xml.sse.tests-1.16.0-SNAPSHOT-p2artifacts.xml
[INFO] 
[INFO] --- tycho-p2-plugin:1.7.0:update-local-index (default-update-local-index) @ org.eclipse.m2e.editor.xml.sse.tests ---
[INFO] 
[INFO] -------------------< org.eclipse.m2e:m2e-core-tests >-------------------
[INFO] Building m2e-core-tests 1.16.0-SNAPSHOT                          [37/40]
[INFO] --------------------------------[ pom ]---------------------------------
[INFO] 
[INFO] --- maven-clean-plugin:2.4.1:clean (default-clean) @ m2e-core-tests ---
[INFO] 
[INFO] --- jacoco-maven-plugin:0.8.5:prepare-agent (default) @ m2e-core-tests ---
[INFO] argLine set to -javaagent:/home/jenkins/agent/workspace/m2e-gerrit/.repository/org/jacoco/org.jacoco.agent/0.8.5/org.jacoco.agent-0.8.5-runtime.jar=destfile=/home/jenkins/agent/workspace/m2e-gerrit/target/jacoco.exec,append=true,includes=org.eclipse.m2e*:org.apache.maven*:org.eclipse.aether*
[INFO] 
[INFO] --- tycho-source-plugin:1.7.0:plugin-source (plugin-source) @ m2e-core-tests ---
[INFO] 
[INFO] --- tycho-pack200a-plugin:1.7.0:normalize (pack200-normalize) @ m2e-core-tests ---
[INFO] 
[INFO] --- eclipse-jarsigner-plugin:1.1.5:sign (sign) @ m2e-core-tests ---
[INFO] 
[INFO] --- tycho-pack200b-plugin:1.7.0:pack (pack200-pack) @ m2e-core-tests ---
[INFO] 
[INFO] --- tycho-p2-plugin:1.7.0:p2-metadata (p2-metadata) @ m2e-core-tests ---
[INFO] 
[INFO] --- tycho-p2-extras-plugin:1.7.0:compare-version-with-baselines (check-no-version-regression) @ m2e-core-tests ---
[INFO] 
[INFO] --- maven-install-plugin:2.3.1:install (default-install) @ m2e-core-tests ---
[INFO] Installing /home/jenkins/agent/workspace/m2e-gerrit/m2e-core-tests/pom.xml to /home/jenkins/agent/workspace/m2e-gerrit/.repository/org/eclipse/m2e/m2e-core-tests/1.16.0-SNAPSHOT/m2e-core-tests-1.16.0-SNAPSHOT.pom
[INFO] 
[INFO] ---------------< org.eclipse.m2e:org.eclipse.m2e.tests >----------------
[INFO] Building Maven Integration for Eclipse tests 1.16.0-SNAPSHOT     [38/40]
[INFO] ------------------------[ eclipse-test-plugin ]-------------------------
[INFO] 
[INFO] --- maven-clean-plugin:2.4.1:clean (default-clean) @ org.eclipse.m2e.tests ---
[INFO] 
[INFO] --- tycho-packaging-plugin:1.7.0:build-qualifier (default-build-qualifier) @ org.eclipse.m2e.tests ---
[INFO] The project's OSGi version is 1.16.0.20200429-0948
[INFO] 
[INFO] --- tycho-packaging-plugin:1.7.0:validate-id (default-validate-id) @ org.eclipse.m2e.tests ---
[INFO] 
[INFO] --- tycho-packaging-plugin:1.7.0:validate-version (default-validate-version) @ org.eclipse.m2e.tests ---
[INFO] 
[INFO] --- jacoco-maven-plugin:0.8.5:prepare-agent (default) @ org.eclipse.m2e.tests ---
[INFO] tycho.testArgLine set to -javaagent:/home/jenkins/agent/workspace/m2e-gerrit/.repository/org/jacoco/org.jacoco.agent/0.8.5/org.jacoco.agent-0.8.5-runtime.jar=destfile=/home/jenkins/agent/workspace/m2e-gerrit/m2e-core-tests/target/jacoco.exec,append=true,includes=org.eclipse.m2e*:org.apache.maven*:org.eclipse.aether* -Xmx800m
[INFO] 
[INFO] --- maven-resources-plugin:2.5:resources (default-resources) @ org.eclipse.m2e.tests ---
[debug] execute contextualize
[INFO] Using 'UTF-8' encoding to copy filtered resources.
[INFO] skip non existing resourceDirectory /home/jenkins/agent/workspace/m2e-gerrit/m2e-core-tests/org.eclipse.m2e.tests/src/main/resources
[INFO] 
[INFO] --- tycho-compiler-plugin:1.7.0:compile (default-compile) @ org.eclipse.m2e.tests ---
[INFO] Compiling 113 source files to /home/jenkins/agent/workspace/m2e-gerrit/m2e-core-tests/org.eclipse.m2e.tests/target/classes
[INFO] 
[INFO] --- maven-resources-plugin:2.5:testResources (default-testResources) @ org.eclipse.m2e.tests ---
[debug] execute contextualize
[INFO] Using 'UTF-8' encoding to copy filtered resources.
[INFO] skip non existing resourceDirectory /home/jenkins/agent/workspace/m2e-gerrit/m2e-core-tests/org.eclipse.m2e.tests/src/test/resources
[INFO] 
[INFO] --- tycho-source-plugin:1.7.0:plugin-source (plugin-source) @ org.eclipse.m2e.tests ---
[INFO] Building jar: /home/jenkins/agent/workspace/m2e-gerrit/m2e-core-tests/org.eclipse.m2e.tests/target/org.eclipse.m2e.tests-1.16.0-SNAPSHOT-sources.jar
[INFO] 
[INFO] --- target-platform-configuration:1.7.0:target-platform (default-target-platform) @ org.eclipse.m2e.tests ---
[INFO] 
[INFO] --- tycho-packaging-plugin:1.7.0:package-plugin (default-package-plugin) @ org.eclipse.m2e.tests ---
[INFO] Building jar: /home/jenkins/agent/workspace/m2e-gerrit/m2e-core-tests/org.eclipse.m2e.tests/target/org.eclipse.m2e.tests-1.16.0-SNAPSHOT.jar
[INFO] 
[INFO] --- tycho-p2-plugin:1.7.0:p2-metadata-default (default-p2-metadata-default) @ org.eclipse.m2e.tests ---
[INFO] 
[INFO] --- tycho-pack200a-plugin:1.7.0:normalize (pack200-normalize) @ org.eclipse.m2e.tests ---
[INFO] Pack200 normalizing jar /home/jenkins/agent/workspace/m2e-gerrit/m2e-core-tests/org.eclipse.m2e.tests/target/org.eclipse.m2e.tests-1.16.0-SNAPSHOT.jar
[INFO] 
[INFO] --- eclipse-jarsigner-plugin:1.1.5:sign (sign) @ org.eclipse.m2e.tests ---
[INFO] Signing of nested jars of '/home/jenkins/agent/workspace/m2e-gerrit/m2e-core-tests/org.eclipse.m2e.tests/target/org.eclipse.m2e.tests-1.16.0-SNAPSHOT.jar' is disabled.
[INFO] Signing jar: /home/jenkins/agent/workspace/m2e-gerrit/m2e-core-tests/org.eclipse.m2e.tests/target/org.eclipse.m2e.tests-1.16.0-SNAPSHOT.jar
[INFO] Signing of nested jars of '/home/jenkins/agent/workspace/m2e-gerrit/m2e-core-tests/org.eclipse.m2e.tests/target/org.eclipse.m2e.tests-1.16.0-SNAPSHOT-sources.jar' is disabled.
[INFO] Signing jar: /home/jenkins/agent/workspace/m2e-gerrit/m2e-core-tests/org.eclipse.m2e.tests/target/org.eclipse.m2e.tests-1.16.0-SNAPSHOT-sources.jar
[INFO] 
[INFO] --- tycho-pack200b-plugin:1.7.0:pack (pack200-pack) @ org.eclipse.m2e.tests ---
[INFO] Pack200 packing jar /home/jenkins/agent/workspace/m2e-gerrit/m2e-core-tests/org.eclipse.m2e.tests/target/org.eclipse.m2e.tests-1.16.0-SNAPSHOT.jar
[INFO] 
[INFO] --- tycho-p2-plugin:1.7.0:p2-metadata (p2-metadata) @ org.eclipse.m2e.tests ---
[WARNING] No repository found at https://download.eclipse.org/technology/m2e/snapshots/1.16.1/latest.
org.eclipse.equinox.p2.core.ProvisionException: No repository found at https://download.eclipse.org/technology/m2e/snapshots/1.16.1/latest.
    at org.eclipse.equinox.internal.p2.repository.helpers.AbstractRepositoryManager.fail (AbstractRepositoryManager.java:396)
    at org.eclipse.equinox.internal.p2.repository.helpers.AbstractRepositoryManager.loadRepository (AbstractRepositoryManager.java:661)
    at org.eclipse.equinox.internal.p2.metadata.repository.MetadataRepositoryManager.loadRepository (MetadataRepositoryManager.java:110)
    at org.eclipse.tycho.p2.remote.RemoteMetadataRepositoryManager.loadRepository (RemoteMetadataRepositoryManager.java:61)
    at org.eclipse.tycho.p2.remote.RemoteMetadataRepositoryManager.loadRepository (RemoteMetadataRepositoryManager.java:53)
    at org.eclipse.tycho.p2.tools.baseline.BaselineServiceImpl.getProjectBaseline (BaselineServiceImpl.java:95)
    at org.eclipse.tycho.plugins.p2.BaselineValidator.validateAndReplace (BaselineValidator.java:88)
    at org.eclipse.tycho.plugins.p2.P2MetadataMojo.attachP2Metadata (P2MetadataMojo.java:183)
    at org.eclipse.tycho.plugins.p2.P2MetadataMojo.execute (P2MetadataMojo.java:137)
    at org.apache.maven.plugin.DefaultBuildPluginManager.executeMojo (DefaultBuildPluginManager.java:137)
    at org.apache.maven.lifecycle.internal.MojoExecutor.execute (MojoExecutor.java:210)
    at org.apache.maven.lifecycle.internal.MojoExecutor.execute (MojoExecutor.java:156)
    at org.apache.maven.lifecycle.internal.MojoExecutor.execute (MojoExecutor.java:148)
    at org.apache.maven.lifecycle.internal.LifecycleModuleBuilder.buildProject (LifecycleModuleBuilder.java:117)
    at org.apache.maven.lifecycle.internal.LifecycleModuleBuilder.buildProject (LifecycleModuleBuilder.java:81)
    at org.apache.maven.lifecycle.internal.builder.singlethreaded.SingleThreadedBuilder.build (SingleThreadedBuilder.java:56)
    at org.apache.maven.lifecycle.internal.LifecycleStarter.execute (LifecycleStarter.java:128)
    at org.apache.maven.DefaultMaven.doExecute (DefaultMaven.java:305)
    at org.apache.maven.DefaultMaven.doExecute (DefaultMaven.java:192)
    at org.apache.maven.DefaultMaven.execute (DefaultMaven.java:105)
    at org.apache.maven.cli.MavenCli.execute (MavenCli.java:957)
    at org.apache.maven.cli.MavenCli.doMain (MavenCli.java:289)
    at org.apache.maven.cli.MavenCli.main (MavenCli.java:193)
    at sun.reflect.NativeMethodAccessorImpl.invoke0 (Native Method)
    at sun.reflect.NativeMethodAccessorImpl.invoke (NativeMethodAccessorImpl.java:62)
    at sun.reflect.DelegatingMethodAccessorImpl.invoke (DelegatingMethodAccessorImpl.java:43)
    at java.lang.reflect.Method.invoke (Method.java:498)
    at org.codehaus.plexus.classworlds.launcher.Launcher.launchEnhanced (Launcher.java:282)
    at org.codehaus.plexus.classworlds.launcher.Launcher.launch (Launcher.java:225)
    at org.codehaus.plexus.classworlds.launcher.Launcher.mainWithExitCode (Launcher.java:406)
    at org.codehaus.plexus.classworlds.launcher.Launcher.main (Launcher.java:347)
[INFO] No baseline version MavenProject: org.eclipse.m2e:org.eclipse.m2e.tests:1.16.0-SNAPSHOT @ /home/jenkins/agent/workspace/m2e-gerrit/m2e-core-tests/org.eclipse.m2e.tests/pom.xml
[INFO] 
[INFO] --- tycho-surefire-plugin:1.7.0:test (default-test) @ org.eclipse.m2e.tests ---
[INFO] Executing Test Runtime with timeout 7200, logs (if any) will be placed at: /home/jenkins/agent/workspace/m2e-gerrit/m2e-core-tests/org.eclipse.m2e.tests/target/work/data/.metadata/.log
[INFO] Command line:
	[/opt/tools/java/oracle/jdk-8/1.8.0_202/jre/bin/java, -Dosgi.noShutdown=false, -Dosgi.os=linux, -Dosgi.ws=gtk, -Dosgi.arch=x86_64, -javaagent:/home/jenkins/agent/workspace/m2e-gerrit/.repository/org/jacoco/org.jacoco.agent/0.8.5/org.jacoco.agent-0.8.5-runtime.jar=destfile=/home/jenkins/agent/workspace/m2e-gerrit/m2e-core-tests/target/jacoco.exec,append=true,includes=org.eclipse.m2e*:org.apache.maven*:org.eclipse.aether*, -Xmx800m, -Dosgi.clean=true, -jar, /home/jenkins/agent/workspace/m2e-gerrit/.repository/p2/osgi/bundle/org.eclipse.equinox.launcher/1.5.700.v20200207-2156/org.eclipse.equinox.launcher-1.5.700.v20200207-2156.jar, -data, /home/jenkins/agent/workspace/m2e-gerrit/m2e-core-tests/org.eclipse.m2e.tests/target/work/data, -install, /home/jenkins/agent/workspace/m2e-gerrit/m2e-core-tests/org.eclipse.m2e.tests/target/work, -configuration, /home/jenkins/agent/workspace/m2e-gerrit/m2e-core-tests/org.eclipse.m2e.tests/target/work/configuration, -application, org.eclipse.tycho.surefire.osgibooter.uitest, -testproperties, /home/jenkins/agent/workspace/m2e-gerrit/m2e-core-tests/org.eclipse.m2e.tests/target/surefire.properties, -pluginCustomization, /home/jenkins/agent/workspace/m2e-gerrit/m2e-core-tests/org.eclipse.m2e.tests/plugin_customization.ini, -timeout, 7200000]

(process:2088): Gtk-WARNING **: 07:26:56.281: Locale not supported by C library.
	Using the fallback 'C' locale.
SWT SessionManagerDBus: Failed to connect to org.gnome.SessionManager: Failed to execute child process ?dbus-launch? (No such file or directory)
SWT SessionManagerDBus: Failed to connect to org.xfce.SessionManager: Failed to execute child process ?dbus-launch? (No such file or directory)
SLF4J: Failed to load class "org.slf4j.impl.StaticLoggerBinder".
SLF4J: Defaulting to no-operation (NOP) logger implementation
SLF4J: See http://www.slf4j.org/codes.html#StaticLoggerBinder for further details.
Running org.eclipse.m2e.tests.discovery.ConfigurationUpdateStartupTest
Tests run: 6, Failures: 0, Errors: 0, Skipped: 0, Time elapsed: 14.401 s - in org.eclipse.m2e.tests.discovery.ConfigurationUpdateStartupTest
testNoMavenProjects(org.eclipse.m2e.tests.discovery.ConfigurationUpdateStartupTest)  Time elapsed: 1.961 s
testToggleEarlyStartup(org.eclipse.m2e.tests.discovery.ConfigurationUpdateStartupTest)  Time elapsed: 0.801 s
testMavenProjectsErrors(org.eclipse.m2e.tests.discovery.ConfigurationUpdateStartupTest)  Time elapsed: 9.161 s
testConfigureSpecifiedProjects(org.eclipse.m2e.tests.discovery.ConfigurationUpdateStartupTest)  Time elapsed: 0.727 s
testMavenProjectsNoErrors(org.eclipse.m2e.tests.discovery.ConfigurationUpdateStartupTest)  Time elapsed: 1.011 s
testEmptyWorkspace(org.eclipse.m2e.tests.discovery.ConfigurationUpdateStartupTest)  Time elapsed: 0.718 s
Running org.eclipse.m2e.tests.discovery.MavenDiscoveryTest
Tests run: 9, Failures: 0, Errors: 0, Skipped: 0, Time elapsed: 0.819 s - in org.eclipse.m2e.tests.discovery.MavenDiscoveryTest
testCatalogSelectedByConfiguratorId(org.eclipse.m2e.tests.discovery.MavenDiscoveryTest)  Time elapsed: 0.292 s
testCatalogItemWithoutMappingMetadata(org.eclipse.m2e.tests.discovery.MavenDiscoveryTest)  Time elapsed: 0.003 s
testCatalogItemExtensionsMetadata(org.eclipse.m2e.tests.discovery.MavenDiscoveryTest)  Time elapsed: 0.002 s
testNotMatchPluginSelection(org.eclipse.m2e.tests.discovery.MavenDiscoveryTest)  Time elapsed: 0.071 s
testCatalogSelectedByLifecycleId(org.eclipse.m2e.tests.discovery.MavenDiscoveryTest)  Time elapsed: 0.088 s
testMultipleSelections(org.eclipse.m2e.tests.discovery.MavenDiscoveryTest)  Time elapsed: 0.108 s
testCatalogSelectedByPackaging(org.eclipse.m2e.tests.discovery.MavenDiscoveryTest)  Time elapsed: 0.089 s
testCatalogSelectedByMojoExecution(org.eclipse.m2e.tests.discovery.MavenDiscoveryTest)  Time elapsed: 0.092 s
testCatalogUnselected(org.eclipse.m2e.tests.discovery.MavenDiscoveryTest)  Time elapsed: 0.073 s
Running org.eclipse.m2e.tests.discovery.MavenDiscoveryMarkerResolutionGeneratorTest
Tests run: 4, Failures: 0, Errors: 0, Skipped: 0, Time elapsed: 6.036 s - in org.eclipse.m2e.tests.discovery.MavenDiscoveryMarkerResolutionGeneratorTest
testCanResolveMojoExecutionMarker(org.eclipse.m2e.tests.discovery.MavenDiscoveryMarkerResolutionGeneratorTest)  Time elapsed: 1.13 s
testCanResolveConfiguratorMarker(org.eclipse.m2e.tests.discovery.MavenDiscoveryMarkerResolutionGeneratorTest)  Time elapsed: 1.305 s
testResolveMultipleMarkers(org.eclipse.m2e.tests.discovery.MavenDiscoveryMarkerResolutionGeneratorTest)  Time elapsed: 2.564 s
testCanResolveLifecycleIdMarker(org.eclipse.m2e.tests.discovery.MavenDiscoveryMarkerResolutionGeneratorTest)  Time elapsed: 1.036 s
Running org.eclipse.m2e.tests.discovery.LifecycleMappingDiscoveryTest
Tests run: 11, Failures: 0, Errors: 0, Skipped: 0, Time elapsed: 11.819 s - in org.eclipse.m2e.tests.discovery.LifecycleMappingDiscoveryTest
testAutomaticSelectionOfSingleProposal(org.eclipse.m2e.tests.discovery.LifecycleMappingDiscoveryTest)  Time elapsed: 0.99 s
testPreselectedProposals(org.eclipse.m2e.tests.discovery.LifecycleMappingDiscoveryTest)  Time elapsed: 0.986 s
testIsMappingComplete(org.eclipse.m2e.tests.discovery.LifecycleMappingDiscoveryTest)  Time elapsed: 1.044 s
testProposalToReplaceDefaultMapping(org.eclipse.m2e.tests.discovery.LifecycleMappingDiscoveryTest)  Time elapsed: 1.272 s
testPackagingPom(org.eclipse.m2e.tests.discovery.LifecycleMappingDiscoveryTest)  Time elapsed: 1.084 s
testAutomaticSelectionWithAmbiguousProposals(org.eclipse.m2e.tests.discovery.LifecycleMappingDiscoveryTest)  Time elapsed: 0.994 s
testDiscoverProjectConfigurators(org.eclipse.m2e.tests.discovery.LifecycleMappingDiscoveryTest)  Time elapsed: 1.036 s
testNoProposals(org.eclipse.m2e.tests.discovery.LifecycleMappingDiscoveryTest)  Time elapsed: 1.296 s
testProposalMatching(org.eclipse.m2e.tests.discovery.LifecycleMappingDiscoveryTest)  Time elapsed: 1.119 s
testDiscoverLifecycleMappingStrategy(org.eclipse.m2e.tests.discovery.LifecycleMappingDiscoveryTest)  Time elapsed: 1.019 s
testDefaultNonConfiguratorMapping(org.eclipse.m2e.tests.discovery.LifecycleMappingDiscoveryTest)  Time elapsed: 0.978 s
Running org.eclipse.m2e.tests.discovery.MavenDiscoveryInstallOperationTest
Tests run: 5, Failures: 0, Errors: 0, Skipped: 0, Time elapsed: 0.641 s - in org.eclipse.m2e.tests.discovery.MavenDiscoveryInstallOperationTest
testMissingRepository(org.eclipse.m2e.tests.discovery.MavenDiscoveryInstallOperationTest)  Time elapsed: 0.143 s
testMatchNoVersion(org.eclipse.m2e.tests.discovery.MavenDiscoveryInstallOperationTest)  Time elapsed: 0.198 s
testMatchHighestVersion(org.eclipse.m2e.tests.discovery.MavenDiscoveryInstallOperationTest)  Time elapsed: 0.069 s
testMissingIU(org.eclipse.m2e.tests.discovery.MavenDiscoveryInstallOperationTest)  Time elapsed: 0.069 s
testMatchLowestVersion(org.eclipse.m2e.tests.discovery.MavenDiscoveryInstallOperationTest)  Time elapsed: 0.072 s
Running org.eclipse.m2e.tests.internal.project.MavenProjectChangedListenerExtensionTest
Tests run: 1, Failures: 0, Errors: 0, Skipped: 0, Time elapsed: 1.831 s - in org.eclipse.m2e.tests.internal.project.MavenProjectChangedListenerExtensionTest
testExtension(org.eclipse.m2e.tests.internal.project.MavenProjectChangedListenerExtensionTest)  Time elapsed: 1.83 s
Running org.eclipse.m2e.tests.internal.embedder.MavenEmbeddedRuntimeTest
Tests run: 1, Failures: 0, Errors: 0, Skipped: 0, Time elapsed: 0.048 s - in org.eclipse.m2e.tests.internal.embedder.MavenEmbeddedRuntimeTest
testGetVersion(org.eclipse.m2e.tests.internal.embedder.MavenEmbeddedRuntimeTest)  Time elapsed: 0.047 s
Running org.eclipse.m2e.tests.internal.lifecyclemapping.ProjectConfigurationElementSorterTest
Tests run: 6, Failures: 0, Errors: 0, Skipped: 0, Time elapsed: 0.004 s - in org.eclipse.m2e.tests.internal.lifecyclemapping.ProjectConfigurationElementSorterTest
testSortConfigurators_MissingPreviousConfigurator(org.eclipse.m2e.tests.internal.lifecyclemapping.ProjectConfigurationElementSorterTest)  Time elapsed: 0.002 s
testSortConfigurators_isRoot(org.eclipse.m2e.tests.internal.lifecyclemapping.ProjectConfigurationElementSorterTest)  Time elapsed: 0.001 s
testSortConfigurators_HappyPath(org.eclipse.m2e.tests.internal.lifecyclemapping.ProjectConfigurationElementSorterTest)  Time elapsed: 0 s
testSortConfigurators_MissingFollowingConfigurator(org.eclipse.m2e.tests.internal.lifecyclemapping.ProjectConfigurationElementSorterTest)  Time elapsed: 0 s
testSortConfigurators_CycleDetected(org.eclipse.m2e.tests.internal.lifecyclemapping.ProjectConfigurationElementSorterTest)  Time elapsed: 0 s
testSortConfigurators_471840(org.eclipse.m2e.tests.internal.lifecyclemapping.ProjectConfigurationElementSorterTest)  Time elapsed: 0 s
Running org.eclipse.m2e.tests.internal.repository.RepositoryRegistryTest
Tests run: 1, Failures: 0, Errors: 0, Skipped: 0, Time elapsed: 0.752 s - in org.eclipse.m2e.tests.internal.repository.RepositoryRegistryTest
testSettingsDecryption(org.eclipse.m2e.tests.internal.repository.RepositoryRegistryTest)  Time elapsed: 0.75 s
Running org.eclipse.m2e.tests.internal.index.NexusIndexManagerTest
Tests run: 14, Failures: 0, Errors: 0, Skipped: 0, Time elapsed: 35.797 s - in org.eclipse.m2e.tests.internal.index.NexusIndexManagerTest
testIndexedPublicArtifactGroups(org.eclipse.m2e.tests.internal.index.NexusIndexManagerTest)  Time elapsed: 3.317 s
test512006_nonProxyHost(org.eclipse.m2e.tests.internal.index.NexusIndexManagerTest)  Time elapsed: 2.183 s
testFetchIndexFromRepositoryWithAuthentication(org.eclipse.m2e.tests.internal.index.NexusIndexManagerTest)  Time elapsed: 2.007 s
testIndexedArtifactGroups(org.eclipse.m2e.tests.internal.index.NexusIndexManagerTest)  Time elapsed: 2.816 s
testWorkspaceIndex(org.eclipse.m2e.tests.internal.index.NexusIndexManagerTest)  Time elapsed: 3.012 s
testDisableIndex(org.eclipse.m2e.tests.internal.index.NexusIndexManagerTest)  Time elapsed: 2.112 s
testPublicNonMirrored(org.eclipse.m2e.tests.internal.index.NexusIndexManagerTest)  Time elapsed: 1.972 s
testMngEclipse1621(org.eclipse.m2e.tests.internal.index.NexusIndexManagerTest)  Time elapsed: 2.755 s
testMngEclipse1710(org.eclipse.m2e.tests.internal.index.NexusIndexManagerTest)  Time elapsed: 2.341 s
testMngEclipse1907(org.eclipse.m2e.tests.internal.index.NexusIndexManagerTest)  Time elapsed: 2.834 s
testProjectSpecificThenInSettings(org.eclipse.m2e.tests.internal.index.NexusIndexManagerTest)  Time elapsed: 3.513 s
testNoMirror(org.eclipse.m2e.tests.internal.index.NexusIndexManagerTest)  Time elapsed: 1.914 s
testPublicMirror(org.eclipse.m2e.tests.internal.index.NexusIndexManagerTest)  Time elapsed: 2.813 s
testProjectIndexes(org.eclipse.m2e.tests.internal.index.NexusIndexManagerTest)  Time elapsed: 2.206 s
Running org.eclipse.m2e.tests.internal.index.filter.IndexFilterTest
Tests run: 3, Failures: 0, Errors: 0, Skipped: 0, Time elapsed: 0.004 s - in org.eclipse.m2e.tests.internal.index.filter.IndexFilterTest
testIndexedArtifactFileNodeAdapter(org.eclipse.m2e.tests.internal.index.filter.IndexFilterTest)  Time elapsed: 0.001 s
testFilteredIndex_nonEmptyResult(org.eclipse.m2e.tests.internal.index.filter.IndexFilterTest)  Time elapsed: 0.002 s
testFilteredIndex_emptyResult(org.eclipse.m2e.tests.internal.index.filter.IndexFilterTest)  Time elapsed: 0 s
Running org.eclipse.m2e.tests.internal.index.NexusIndexManagerSearchTest
Tests run: 9, Failures: 0, Errors: 0, Skipped: 0, Time elapsed: 26.916 s - in org.eclipse.m2e.tests.internal.index.NexusIndexManagerSearchTest
testPluginSearch(org.eclipse.m2e.tests.internal.index.NexusIndexManagerSearchTest)  Time elapsed: 3.007 s
testSearchGroups2(org.eclipse.m2e.tests.internal.index.NexusIndexManagerSearchTest)  Time elapsed: 3.206 s
testSearchGroups3(org.eclipse.m2e.tests.internal.index.NexusIndexManagerSearchTest)  Time elapsed: 3.221 s
testSha1Search(org.eclipse.m2e.tests.internal.index.NexusIndexManagerSearchTest)  Time elapsed: 2.771 s
testBogusSearchType(org.eclipse.m2e.tests.internal.index.NexusIndexManagerSearchTest)  Time elapsed: 3.049 s
testGroupSearch(org.eclipse.m2e.tests.internal.index.NexusIndexManagerSearchTest)  Time elapsed: 2.754 s
testSearchGroups(org.eclipse.m2e.tests.internal.index.NexusIndexManagerSearchTest)  Time elapsed: 2.938 s
testArtifactSearch(org.eclipse.m2e.tests.internal.index.NexusIndexManagerSearchTest)  Time elapsed: 2.872 s
testSorting(org.eclipse.m2e.tests.internal.index.NexusIndexManagerSearchTest)  Time elapsed: 3.098 s
Running org.eclipse.m2e.tests.internal.index.IndexedArtifactTest
Tests run: 3, Failures: 0, Errors: 0, Skipped: 0, Time elapsed: 0.001 s - in org.eclipse.m2e.tests.internal.index.IndexedArtifactTest
testHash(org.eclipse.m2e.tests.internal.index.IndexedArtifactTest)  Time elapsed: 0.001 s
testPackageName(org.eclipse.m2e.tests.internal.index.IndexedArtifactTest)  Time elapsed: 0 s
testEquals(org.eclipse.m2e.tests.internal.index.IndexedArtifactTest)  Time elapsed: 0 s
Running org.eclipse.m2e.tests.internal.refactoring.ExcludeArtifactRefactoringTest
Warning: NLS missing message: MavenImpl_error_lookup in: org.eclipse.m2e.editor.internal.messages
Tests run: 12, Failures: 0, Errors: 0, Skipped: 0, Time elapsed: 18.574 s - in org.eclipse.m2e.tests.internal.refactoring.ExcludeArtifactRefactoringTest
testSingleArtifactKeyRemoteParent(org.eclipse.m2e.tests.internal.refactoring.ExcludeArtifactRefactoringTest)  Time elapsed: 2.898 s
testSingleArtifactMissing(org.eclipse.m2e.tests.internal.refactoring.ExcludeArtifactRefactoringTest)  Time elapsed: 1.324 s
testSingleArtifactKeyInWorkspaceParent(org.eclipse.m2e.tests.internal.refactoring.ExcludeArtifactRefactoringTest)  Time elapsed: 1.518 s
testStrangePomName(org.eclipse.m2e.tests.internal.refactoring.ExcludeArtifactRefactoringTest)  Time elapsed: 1.32 s
testArtifactsInMultiplePom(org.eclipse.m2e.tests.internal.refactoring.ExcludeArtifactRefactoringTest)  Time elapsed: 2.163 s
testCopyDown(org.eclipse.m2e.tests.internal.refactoring.ExcludeArtifactRefactoringTest)  Time elapsed: 2.07 s
testSingleArtifactKeyWorkspaceParent(org.eclipse.m2e.tests.internal.refactoring.ExcludeArtifactRefactoringTest)  Time elapsed: 1.37 s
testMultipleArtifactWithMissing(org.eclipse.m2e.tests.internal.refactoring.ExcludeArtifactRefactoringTest)  Time elapsed: 1.061 s
testSingleArtifactNoParentBadFormat(org.eclipse.m2e.tests.internal.refactoring.ExcludeArtifactRefactoringTest)  Time elapsed: 1.101 s
testMultipleArtifactKeySinglePom(org.eclipse.m2e.tests.internal.refactoring.ExcludeArtifactRefactoringTest)  Time elapsed: 1.102 s
testSingleArtifactNoParent(org.eclipse.m2e.tests.internal.refactoring.ExcludeArtifactRefactoringTest)  Time elapsed: 1.186 s
testPullUp(org.eclipse.m2e.tests.internal.refactoring.ExcludeArtifactRefactoringTest)  Time elapsed: 1.46 s
Running org.eclipse.m2e.tests.internal.wizard.MappingDiscoveryJobTest
Tests run: 2, Failures: 0, Errors: 0, Skipped: 0, Time elapsed: 2.158 s - in org.eclipse.m2e.tests.internal.wizard.MappingDiscoveryJobTest
testDontOpenMappingDiscoveryWizard(org.eclipse.m2e.tests.internal.wizard.MappingDiscoveryJobTest)  Time elapsed: 1.162 s
testOpensMappingDiscoveryWizard(org.eclipse.m2e.tests.internal.wizard.MappingDiscoveryJobTest)  Time elapsed: 0.994 s
Running org.eclipse.m2e.tests.internal.wizard.MavenImportWizardTest
Tests run: 3, Failures: 0, Errors: 0, Skipped: 0, Time elapsed: 3.871 s - in org.eclipse.m2e.tests.internal.wizard.MavenImportWizardTest
testNoRenameOnMavenImport(org.eclipse.m2e.tests.internal.wizard.MavenImportWizardTest)  Time elapsed: 1.375 s
testRenameOnMavenImport(org.eclipse.m2e.tests.internal.wizard.MavenImportWizardTest)  Time elapsed: 1.323 s
testNoRenameOnMavenImportInWorkspaceRoot(org.eclipse.m2e.tests.internal.wizard.MavenImportWizardTest)  Time elapsed: 1.173 s
Running org.eclipse.m2e.tests.internal.wizard.MavenImportWizardPageTest
Tests run: 6, Failures: 0, Errors: 0, Skipped: 0, Time elapsed: 8.124 s - in org.eclipse.m2e.tests.internal.wizard.MavenImportWizardPageTest
test408042_multimoduleProject(org.eclipse.m2e.tests.internal.wizard.MavenImportWizardPageTest)  Time elapsed: 0.845 s
test408042_nestedproject(org.eclipse.m2e.tests.internal.wizard.MavenImportWizardPageTest)  Time elapsed: 1.458 s
test408042_noRootProject(org.eclipse.m2e.tests.internal.wizard.MavenImportWizardPageTest)  Time elapsed: 1.242 s
test533463_noArtifactId(org.eclipse.m2e.tests.internal.wizard.MavenImportWizardPageTest)  Time elapsed: 1.303 s
test408042_simpleProject(org.eclipse.m2e.tests.internal.wizard.MavenImportWizardPageTest)  Time elapsed: 1.251 s
test422008_preselectedWorkingSet(org.eclipse.m2e.tests.internal.wizard.MavenImportWizardPageTest)  Time elapsed: 2.025 s
Running org.eclipse.m2e.tests.internal.conversion.ProjectConversionParticipantSorterTest
Tests run: 6, Failures: 0, Errors: 0, Skipped: 0, Time elapsed: 0.003 s - in org.eclipse.m2e.tests.internal.conversion.ProjectConversionParticipantSorterTest
testSortConverters_AfterBefore(org.eclipse.m2e.tests.internal.conversion.ProjectConversionParticipantSorterTest)  Time elapsed: 0.002 s
testSortConverters_After2(org.eclipse.m2e.tests.internal.conversion.ProjectConversionParticipantSorterTest)  Time elapsed: 0 s
testSortConverters_After(org.eclipse.m2e.tests.internal.conversion.ProjectConversionParticipantSorterTest)  Time elapsed: 0 s
testSortConverters_Cycle_After(org.eclipse.m2e.tests.internal.conversion.ProjectConversionParticipantSorterTest)  Time elapsed: 0 s
testSortConverters_DuplicateConverters(org.eclipse.m2e.tests.internal.conversion.ProjectConversionParticipantSorterTest)  Time elapsed: 0 s
testSortConverters_Cycle_Before(org.eclipse.m2e.tests.internal.conversion.ProjectConversionParticipantSorterTest)  Time elapsed: 0 s
Running org.eclipse.m2e.tests.project.CompilerSettings18Test
Tests run: 1, Failures: 0, Errors: 0, Skipped: 0, Time elapsed: 1.094 s - in org.eclipse.m2e.tests.project.CompilerSettings18Test
testCompilerSettings18(org.eclipse.m2e.tests.project.CompilerSettings18Test)  Time elapsed: 1.093 s
Running org.eclipse.m2e.tests.project.CompilerSynonymTest
Tests run: 1, Failures: 0, Errors: 0, Skipped: 0, Time elapsed: 2.638 s - in org.eclipse.m2e.tests.project.CompilerSynonymTest
testSynonym(org.eclipse.m2e.tests.project.CompilerSynonymTest)  Time elapsed: 2.637 s
Running org.eclipse.m2e.tests.project.MavenProjectInfoTest
Tests run: 1, Failures: 0, Errors: 0, Skipped: 0, Time elapsed: 0.001 s - in org.eclipse.m2e.tests.project.MavenProjectInfoTest
testTwoChildProjectInfosWithSameLabel(org.eclipse.m2e.tests.project.MavenProjectInfoTest)  Time elapsed: 0 s
Running org.eclipse.m2e.tests.project.MavenProjectFacadeTest
Tests run: 9, Failures: 0, Errors: 0, Skipped: 0, Time elapsed: 10.951 s - in org.eclipse.m2e.tests.project.MavenProjectFacadeTest
testGetProjectConfiguratorsAfterWorkspaceRestart(org.eclipse.m2e.tests.project.MavenProjectFacadeTest)  Time elapsed: 1.274 s
testGetMojoExecutionAfterWorkspaceRestart(org.eclipse.m2e.tests.project.MavenProjectFacadeTest)  Time elapsed: 1.169 s
testGetMojoExecutionsWithoutMavenExecutionContext(org.eclipse.m2e.tests.project.MavenProjectFacadeTest)  Time elapsed: 1.62 s
testGetProjectConfigurators(org.eclipse.m2e.tests.project.MavenProjectFacadeTest)  Time elapsed: 1.061 s
test436668_EclipseProjectMetadataNotStale(org.eclipse.m2e.tests.project.MavenProjectFacadeTest)  Time elapsed: 1.218 s
testGetMojoExecution(org.eclipse.m2e.tests.project.MavenProjectFacadeTest)  Time elapsed: 1.135 s
testGetMojoExecutions(org.eclipse.m2e.tests.project.MavenProjectFacadeTest)  Time elapsed: 1.119 s
testIsStale(org.eclipse.m2e.tests.project.MavenProjectFacadeTest)  Time elapsed: 1.285 s
testGetMojoExecutionsAfterWorkspaceRestart(org.eclipse.m2e.tests.project.MavenProjectFacadeTest)  Time elapsed: 1.069 s
Running org.eclipse.m2e.tests.profiles.MavenProfileManagerTest
Tests run: 5, Failures: 0, Errors: 0, Skipped: 0, Time elapsed: 15.103 s - in org.eclipse.m2e.tests.profiles.MavenProfileManagerTest
testGetAvailableSettingsProfiles(org.eclipse.m2e.tests.profiles.MavenProfileManagerTest)  Time elapsed: 1.272 s
test441112_InheritParentActiveProfiles(org.eclipse.m2e.tests.profiles.MavenProfileManagerTest)  Time elapsed: 6.832 s
testUserSelectedProfiles(org.eclipse.m2e.tests.profiles.MavenProfileManagerTest)  Time elapsed: 2.599 s
testParentFromRemote(org.eclipse.m2e.tests.profiles.MavenProfileManagerTest)  Time elapsed: 2.248 s
testDisabledProfiles(org.eclipse.m2e.tests.profiles.MavenProfileManagerTest)  Time elapsed: 2.148 s
Running org.eclipse.m2e.tests.util.search.IndexSearchEngineTest
Tests run: 1, Failures: 0, Errors: 0, Skipped: 0, Time elapsed: 0.736 s - in org.eclipse.m2e.tests.util.search.IndexSearchEngineTest
testGroupIDProposal(org.eclipse.m2e.tests.util.search.IndexSearchEngineTest)  Time elapsed: 0.736 s
Running org.eclipse.m2e.tests.ProjectRegistryManagerTest
Tests run: 50, Failures: 0, Errors: 0, Skipped: 1, Time elapsed: 39.255 s - in org.eclipse.m2e.tests.ProjectRegistryManagerTest
test020_moduleWithPomErrors(org.eclipse.m2e.tests.ProjectRegistryManagerTest)  Time elapsed: 0.717 s
test356645_redundantSnapshotResolution(org.eclipse.m2e.tests.ProjectRegistryManagerTest)  Time elapsed: 0.695 s
test000_pom_simple(org.eclipse.m2e.tests.ProjectRegistryManagerTest)  Time elapsed: 0.704 s
test008_staleMissingParent(org.eclipse.m2e.tests.ProjectRegistryManagerTest)  Time elapsed: 0.758 s
_testExtensionPluginResolution(org.eclipse.m2e.tests.ProjectRegistryManagerTest) skipped
test435692_affected_changes(org.eclipse.m2e.tests.ProjectRegistryManagerTest)  Time elapsed: 0.852 s
test007_staleDependencies(org.eclipse.m2e.tests.ProjectRegistryManagerTest)  Time elapsed: 0.722 s
test001_missingParent(org.eclipse.m2e.tests.ProjectRegistryManagerTest)  Time elapsed: 0.687 s
testWorkspaceDependencyVersionRange(org.eclipse.m2e.tests.ProjectRegistryManagerTest)  Time elapsed: 0.747 s
test000_removeClosed(org.eclipse.m2e.tests.ProjectRegistryManagerTest)  Time elapsed: 1.523 s
test013_missingDependencyMarker(org.eclipse.m2e.tests.ProjectRegistryManagerTest)  Time elapsed: 0.731 s
test436929_import_refresh(org.eclipse.m2e.tests.ProjectRegistryManagerTest)  Time elapsed: 0.735 s
testGlobalUpdatePolicyNever(org.eclipse.m2e.tests.ProjectRegistryManagerTest)  Time elapsed: 0.77 s
testRepositoryMetadataCacheUsed(org.eclipse.m2e.tests.ProjectRegistryManagerTest)  Time elapsed: 0.735 s
test008_staleMissingParent2(org.eclipse.m2e.tests.ProjectRegistryManagerTest)  Time elapsed: 0.754 s
test015_refreshOffline(org.eclipse.m2e.tests.ProjectRegistryManagerTest)  Time elapsed: 0.955 s
test017_moduleRefresh(org.eclipse.m2e.tests.ProjectRegistryManagerTest)  Time elapsed: 0.899 s
test000_simple(org.eclipse.m2e.tests.ProjectRegistryManagerTest)  Time elapsed: 0.898 s
test005_dependencyAvailableFromLocalRepoAndWorkspace(org.eclipse.m2e.tests.ProjectRegistryManagerTest)  Time elapsed: 0.897 s
test463075_extensionAndPluginRealm(org.eclipse.m2e.tests.ProjectRegistryManagerTest)  Time elapsed: 0.687 s
testPropertiesSubstitution(org.eclipse.m2e.tests.ProjectRegistryManagerTest)  Time elapsed: 0.683 s
test000_deletePom(org.eclipse.m2e.tests.ProjectRegistryManagerTest)  Time elapsed: 0.696 s
test006_parentAvailableFromLocalRepoAndWorkspace(org.eclipse.m2e.tests.ProjectRegistryManagerTest)  Time elapsed: 0.752 s
test005_snapshotAvailableFromLocalRepoAndWorkspace(org.eclipse.m2e.tests.ProjectRegistryManagerTest)  Time elapsed: 0.696 s
test007_changedVersion(org.eclipse.m2e.tests.ProjectRegistryManagerTest)  Time elapsed: 0.792 s
test000_eventMerge(org.eclipse.m2e.tests.ProjectRegistryManagerTest)  Time elapsed: 0.734 s
testWorkspaceResolutionApi(org.eclipse.m2e.tests.ProjectRegistryManagerTest)  Time elapsed: 0.74 s
testOptionalDependencies(org.eclipse.m2e.tests.ProjectRegistryManagerTest)  Time elapsed: 0.751 s
test460983_parentVersionRange(org.eclipse.m2e.tests.ProjectRegistryManagerTest)  Time elapsed: 0.76 s
test009_noworkspaceResolution(org.eclipse.m2e.tests.ProjectRegistryManagerTest)  Time elapsed: 0.773 s
test001_dependencyOnModuleWithInheritedGroupAndVersion(org.eclipse.m2e.tests.ProjectRegistryManagerTest)  Time elapsed: 1.079 s
testDependencyScopeChanged(org.eclipse.m2e.tests.ProjectRegistryManagerTest)  Time elapsed: 0.863 s
test007_newTransitiveDependency(org.eclipse.m2e.tests.ProjectRegistryManagerTest)  Time elapsed: 0.931 s
testCorrelatedMissingDependency(org.eclipse.m2e.tests.ProjectRegistryManagerTest)  Time elapsed: 0.699 s
test013_cantParsePomMarker(org.eclipse.m2e.tests.ProjectRegistryManagerTest)  Time elapsed: 0.69 s
test006_parentAvailableFromLocalRepoAndWorkspace01(org.eclipse.m2e.tests.ProjectRegistryManagerTest)  Time elapsed: 0.733 s
testPluginMainArtifactNotResolvedFromWorkspace(org.eclipse.m2e.tests.ProjectRegistryManagerTest)  Time elapsed: 0.783 s
test000_removeDeleted(org.eclipse.m2e.tests.ProjectRegistryManagerTest)  Time elapsed: 0.754 s
testEnvironmentVariablesConsidered(org.eclipse.m2e.tests.ProjectRegistryManagerTest)  Time elapsed: 0.668 s
test441257_stalePluginRealms(org.eclipse.m2e.tests.ProjectRegistryManagerTest)  Time elapsed: 0.71 s
test418674_ChecksumPolicyFail(org.eclipse.m2e.tests.ProjectRegistryManagerTest)  Time elapsed: 0.729 s
test418674_ChecksumPolicyWarn(org.eclipse.m2e.tests.ProjectRegistryManagerTest)  Time elapsed: 0.738 s
test021_dependencyVersionRange(org.eclipse.m2e.tests.ProjectRegistryManagerTest)  Time elapsed: 0.723 s
test405090_staleBuildExtensionsResolutionError(org.eclipse.m2e.tests.ProjectRegistryManagerTest)  Time elapsed: 0.804 s
test007_dependentRefreshAfterWorkspaceRestart(org.eclipse.m2e.tests.ProjectRegistryManagerTest)  Time elapsed: 0.737 s
testJdkProfileActivation(org.eclipse.m2e.tests.ProjectRegistryManagerTest)  Time elapsed: 0.697 s
test022_noChangeReloadWithUnrelatedRemoveProject(org.eclipse.m2e.tests.ProjectRegistryManagerTest)  Time elapsed: 0.911 s
test012_downloadExternalDependency(org.eclipse.m2e.tests.ProjectRegistryManagerTest)  Time elapsed: 1.627 s
test441257_stalePluginRealms_withParent(org.eclipse.m2e.tests.ProjectRegistryManagerTest)  Time elapsed: 0.795 s
test453995_dependencyManagementVersionless(org.eclipse.m2e.tests.ProjectRegistryManagerTest)  Time elapsed: 0.738 s
Running org.eclipse.m2e.tests.jdt.ProjectLayoutTest
Tests run: 1, Failures: 0, Errors: 0, Skipped: 0, Time elapsed: 1.434 s - in org.eclipse.m2e.tests.jdt.ProjectLayoutTest
test472726_basedirResources(org.eclipse.m2e.tests.jdt.ProjectLayoutTest)  Time elapsed: 1.434 s
Running org.eclipse.m2e.tests.jdt.JavaClasspathTest
Tests run: 22, Failures: 0, Errors: 0, Skipped: 0, Time elapsed: 36.187 s - in org.eclipse.m2e.tests.jdt.JavaClasspathTest
testStaleDerivedEntries(org.eclipse.m2e.tests.jdt.JavaClasspathTest)  Time elapsed: 1.441 s
test398121_PreserveOrderOfClasspathContainersOnUpdate(org.eclipse.m2e.tests.jdt.JavaClasspathTest)  Time elapsed: 1.478 s
test370685_PreserveResourcesOnUpdate(org.eclipse.m2e.tests.jdt.JavaClasspathTest)  Time elapsed: 1.478 s
test480137_addingResourceFoldersAreNotRemovedDuringConfigurationUpdate(org.eclipse.m2e.tests.jdt.JavaClasspathTest)  Time elapsed: 4.054 s
test537851_DisableTestClasspathFlag(org.eclipse.m2e.tests.jdt.JavaClasspathTest)  Time elapsed: 1.712 s
test526858_ProjectExportingTests(org.eclipse.m2e.tests.jdt.JavaClasspathTest)  Time elapsed: 1.836 s
test466518_classpathJREOrder(org.eclipse.m2e.tests.jdt.JavaClasspathTest)  Time elapsed: 2.029 s
test518218_configureMethodParametersGenerationWithCompilerArgs(org.eclipse.m2e.tests.jdt.JavaClasspathTest)  Time elapsed: 2.171 s
test518218_configureMethodParametersGenerationWithParameters(org.eclipse.m2e.tests.jdt.JavaClasspathTest)  Time elapsed: 1.052 s
test388541_KeepClasspathAttributes(org.eclipse.m2e.tests.jdt.JavaClasspathTest)  Time elapsed: 1.302 s
test526858_TestClasspathAttributeOnProject(org.eclipse.m2e.tests.jdt.JavaClasspathTest)  Time elapsed: 1.27 s
test526858_TestClasspathAttributeOnJar(org.eclipse.m2e.tests.jdt.JavaClasspathTest)  Time elapsed: 1.36 s
test518218_configureMethodParametersGenerationWithCompilerArgument(org.eclipse.m2e.tests.jdt.JavaClasspathTest)  Time elapsed: 1.627 s
testClasspathContainers(org.eclipse.m2e.tests.jdt.JavaClasspathTest)  Time elapsed: 1.327 s
test414645_TestClasspathAttributeOnRuntimeProjectDependencies(org.eclipse.m2e.tests.jdt.JavaClasspathTest)  Time elapsed: 1.605 s
test394042_ClasspathEntry4(org.eclipse.m2e.tests.jdt.JavaClasspathTest)  Time elapsed: 2.245 s
test414645_TestClasspathAttributeOnRuntimeJarDependencies(org.eclipse.m2e.tests.jdt.JavaClasspathTest)  Time elapsed: 1.385 s
test525880_JavaAccessRulesArePreservedOnUpdate(org.eclipse.m2e.tests.jdt.JavaClasspathTest)  Time elapsed: 1.436 s
test534049_SetReleaseFlag(org.eclipse.m2e.tests.jdt.JavaClasspathTest)  Time elapsed: 1.536 s
test549312_fallbackToLatestEE(org.eclipse.m2e.tests.jdt.JavaClasspathTest)  Time elapsed: 1.211 s
testImport(org.eclipse.m2e.tests.jdt.JavaClasspathTest)  Time elapsed: 1.202 s
test486739_PreserveExportedOnUpdate(org.eclipse.m2e.tests.jdt.JavaClasspathTest)  Time elapsed: 1.427 s
Running org.eclipse.m2e.tests.jdt.internal.ClasspathEntryDescriptorTest
Tests run: 1, Failures: 0, Errors: 0, Skipped: 0, Time elapsed: 0.001 s - in org.eclipse.m2e.tests.jdt.internal.ClasspathEntryDescriptorTest
testArtifactKeyDeserialization(org.eclipse.m2e.tests.jdt.internal.ClasspathEntryDescriptorTest)  Time elapsed: 0 s
Running org.eclipse.m2e.tests.jdt.internal.MavenClasspathContainerSaveHelperTest
Tests run: 1, Failures: 0, Errors: 0, Skipped: 0, Time elapsed: 0.003 s - in org.eclipse.m2e.tests.jdt.internal.MavenClasspathContainerSaveHelperTest
testClasspathContainerSace(org.eclipse.m2e.tests.jdt.internal.MavenClasspathContainerSaveHelperTest)  Time elapsed: 0.003 s
Running org.eclipse.m2e.tests.jdt.JavaCodeGenerationProjectConfiguratorTest
Tests run: 1, Failures: 0, Errors: 0, Skipped: 0, Time elapsed: 2.154 s - in org.eclipse.m2e.tests.jdt.JavaCodeGenerationProjectConfiguratorTest
test368333_generatedSourcesFoldersAreNotRemovedDuringConfigurationUpdate(org.eclipse.m2e.tests.jdt.JavaCodeGenerationProjectConfiguratorTest)  Time elapsed: 2.154 s
Running org.eclipse.m2e.tests.scm.ScmHandlerFactoryTest
Tests run: 1, Failures: 0, Errors: 0, Skipped: 0, Time elapsed: 0.003 s - in org.eclipse.m2e.tests.scm.ScmHandlerFactoryTest
testScmHandlerFactory(org.eclipse.m2e.tests.scm.ScmHandlerFactoryTest)  Time elapsed: 0.003 s
Running org.eclipse.m2e.tests.configurators.CompilerSettingsWithEncodingConfiguratorTest
Tests run: 2, Failures: 0, Errors: 0, Skipped: 0, Time elapsed: 4.116 s - in org.eclipse.m2e.tests.configurators.CompilerSettingsWithEncodingConfiguratorTest
test002_shouldResetToContainerDefinedEncoding(org.eclipse.m2e.tests.configurators.CompilerSettingsWithEncodingConfiguratorTest)  Time elapsed: 2.522 s
test001_shouldSetEncodingForBasicProject(org.eclipse.m2e.tests.configurators.CompilerSettingsWithEncodingConfiguratorTest)  Time elapsed: 1.594 s
Running org.eclipse.m2e.tests.configurators.ResourcesEncodingConfiguratorTest
Tests run: 3, Failures: 0, Errors: 0, Skipped: 0, Time elapsed: 4.222 s - in org.eclipse.m2e.tests.configurators.ResourcesEncodingConfiguratorTest
test002_shouldConfigureEncodingForProjectWithSeveralResourceFolders(org.eclipse.m2e.tests.configurators.ResourcesEncodingConfiguratorTest)  Time elapsed: 1.384 s
test001_shouldConfigureEncodingForBasicProject(org.eclipse.m2e.tests.configurators.ResourcesEncodingConfiguratorTest)  Time elapsed: 1.336 s
test003_shouldResetToContainerDefinedEncoding(org.eclipse.m2e.tests.configurators.ResourcesEncodingConfiguratorTest)  Time elapsed: 1.502 s
Running org.eclipse.m2e.tests.ResourceChangeListenerTest
Tests run: 7, Failures: 0, Errors: 0, Skipped: 0, Time elapsed: 11.665 s - in org.eclipse.m2e.tests.ResourceChangeListenerTest
testPomChanges(org.eclipse.m2e.tests.ResourceChangeListenerTest)  Time elapsed: 1.657 s
testMarkerOnlyChange(org.eclipse.m2e.tests.ResourceChangeListenerTest)  Time elapsed: 1.414 s
testPomMove001(org.eclipse.m2e.tests.ResourceChangeListenerTest)  Time elapsed: 1.954 s
testPomMove002(org.eclipse.m2e.tests.ResourceChangeListenerTest)  Time elapsed: 1.997 s
testProjectDelete(org.eclipse.m2e.tests.ResourceChangeListenerTest)  Time elapsed: 1.386 s
testPomDelete(org.eclipse.m2e.tests.ResourceChangeListenerTest)  Time elapsed: 1.778 s
testPomRename(org.eclipse.m2e.tests.ResourceChangeListenerTest)  Time elapsed: 1.477 s
Running org.eclipse.m2e.tests.lifecycle.LifecycleMappingMetadataPrioritiesTest
Tests run: 5, Failures: 0, Errors: 0, Skipped: 0, Time elapsed: 5.587 s - in org.eclipse.m2e.tests.lifecycle.LifecycleMappingMetadataPrioritiesTest
testEclipseExtension(org.eclipse.m2e.tests.lifecycle.LifecycleMappingMetadataPrioritiesTest)  Time elapsed: 1.058 s
testDefaultMetadataSource(org.eclipse.m2e.tests.lifecycle.LifecycleMappingMetadataPrioritiesTest)  Time elapsed: 1.035 s
testEmbeddedInPom(org.eclipse.m2e.tests.lifecycle.LifecycleMappingMetadataPrioritiesTest)  Time elapsed: 1.019 s
testReferencedFromPom(org.eclipse.m2e.tests.lifecycle.LifecycleMappingMetadataPrioritiesTest)  Time elapsed: 1.004 s
testParent(org.eclipse.m2e.tests.lifecycle.LifecycleMappingMetadataPrioritiesTest)  Time elapsed: 1.471 s
Running org.eclipse.m2e.tests.lifecycle.LifecycleMappingTest
running TEST_SECONDARY3
running TEST_SECONDARY4
running TEST_SECONDARY6
running TEST_SECONDARY5
Tests run: 35, Failures: 0, Errors: 0, Skipped: 0, Time elapsed: 40.562 s - in org.eclipse.m2e.tests.lifecycle.LifecycleMappingTest
testGetLifecycleMappingMetadata(org.eclipse.m2e.tests.lifecycle.LifecycleMappingTest)  Time elapsed: 1.497 s
test387736_missingAction(org.eclipse.m2e.tests.lifecycle.LifecycleMappingTest)  Time elapsed: 1.173 s
testProfilesAndProperties(org.eclipse.m2e.tests.lifecycle.LifecycleMappingTest)  Time elapsed: 1.215 s
testConfiguratorsFollowPhaseOrder(org.eclipse.m2e.tests.lifecycle.LifecycleMappingTest)  Time elapsed: 1.115 s
testSecondaryConfiguratorsCustom(org.eclipse.m2e.tests.lifecycle.LifecycleMappingTest)  Time elapsed: 1.354 s
testDuplicatePluginExecution1(org.eclipse.m2e.tests.lifecycle.LifecycleMappingTest)  Time elapsed: 0.966 s
testDuplicatePluginExecution2(org.eclipse.m2e.tests.lifecycle.LifecycleMappingTest)  Time elapsed: 0.745 s
testNondeafaultLifecycles(org.eclipse.m2e.tests.lifecycle.LifecycleMappingTest)  Time elapsed: 1.112 s
testOrder(org.eclipse.m2e.tests.lifecycle.LifecycleMappingTest)  Time elapsed: 1.094 s
testSetNoopMappingDuringImport(org.eclipse.m2e.tests.lifecycle.LifecycleMappingTest)  Time elapsed: 1.028 s
testUseDefaultLifecycleMappingMetadataSource(org.eclipse.m2e.tests.lifecycle.LifecycleMappingTest)  Time elapsed: 0.717 s
testNotCoveredMojoExecutionIgnored(org.eclipse.m2e.tests.lifecycle.LifecycleMappingTest)  Time elapsed: 1.035 s
testNonresolvableExecutionPlan(org.eclipse.m2e.tests.lifecycle.LifecycleMappingTest)  Time elapsed: 1.323 s
testFailToGetPluginParameterValue(org.eclipse.m2e.tests.lifecycle.LifecycleMappingTest)  Time elapsed: 0.974 s
testSetCustomizableMappingDuringImport(org.eclipse.m2e.tests.lifecycle.LifecycleMappingTest)  Time elapsed: 1.104 s
testSameConfiguratorUsedTwice(org.eclipse.m2e.tests.lifecycle.LifecycleMappingTest)  Time elapsed: 1.61 s
testUnknownPackagingType(org.eclipse.m2e.tests.lifecycle.LifecycleMappingTest)  Time elapsed: 1.45 s
testGetLifecycleMappingMetadataMerge(org.eclipse.m2e.tests.lifecycle.LifecycleMappingTest)  Time elapsed: 1.098 s
testSecondaryConfiguratorsCustomizable(org.eclipse.m2e.tests.lifecycle.LifecycleMappingTest)  Time elapsed: 1.032 s
testIncompatibleVersion(org.eclipse.m2e.tests.lifecycle.LifecycleMappingTest)  Time elapsed: 1.497 s
testCompatibleVersion(org.eclipse.m2e.tests.lifecycle.LifecycleMappingTest)  Time elapsed: 1.186 s
testLifecycleMappingSpecifiedInMetadata(org.eclipse.m2e.tests.lifecycle.LifecycleMappingTest)  Time elapsed: 1.328 s
testPomPackagingType(org.eclipse.m2e.tests.lifecycle.LifecycleMappingTest)  Time elapsed: 1.088 s
testNotCoveredMojoExecutions(org.eclipse.m2e.tests.lifecycle.LifecycleMappingTest)  Time elapsed: 1.071 s
test494858ProcessingInstructions(org.eclipse.m2e.tests.lifecycle.LifecycleMappingTest)  Time elapsed: 1.428 s
testPackagingTypeMismatch(org.eclipse.m2e.tests.lifecycle.LifecycleMappingTest)  Time elapsed: 1.528 s
testGetLifecycleMappingMetadataOverride(org.eclipse.m2e.tests.lifecycle.LifecycleMappingTest)  Time elapsed: 1.202 s
testMissingLifecycleMappingMetadata(org.eclipse.m2e.tests.lifecycle.LifecycleMappingTest)  Time elapsed: 1.17 s
testMissingMapping(org.eclipse.m2e.tests.lifecycle.LifecycleMappingTest)  Time elapsed: 1.323 s
testDefaultJarLifecycleMapping(org.eclipse.m2e.tests.lifecycle.LifecycleMappingTest)  Time elapsed: 1.094 s
testMissingVersionRangeInPluginExecutionFilter(org.eclipse.m2e.tests.lifecycle.LifecycleMappingTest)  Time elapsed: 0.829 s
testDuplicatePackagingTypeMetadata(org.eclipse.m2e.tests.lifecycle.LifecycleMappingTest)  Time elapsed: 0.757 s
test371618_NullLifecycleMappingPluginVersion(org.eclipse.m2e.tests.lifecycle.LifecycleMappingTest)  Time elapsed: 1.204 s
testNotCoveredMojoExecutionWarnings(org.eclipse.m2e.tests.lifecycle.LifecycleMappingTest)  Time elapsed: 1.143 s
testNotInterestingPhaseConfigurator(org.eclipse.m2e.tests.lifecycle.LifecycleMappingTest)  Time elapsed: 1.071 s
Running org.eclipse.m2e.tests.lifecycle.MavenPluginMetadataSourceTest
Tests run: 2, Failures: 0, Errors: 0, Skipped: 0, Time elapsed: 3.012 s - in org.eclipse.m2e.tests.lifecycle.MavenPluginMetadataSourceTest
testBasic(org.eclipse.m2e.tests.lifecycle.MavenPluginMetadataSourceTest)  Time elapsed: 1.214 s
test422135_mavenPluginSourceWorkspaceResolution(org.eclipse.m2e.tests.lifecycle.MavenPluginMetadataSourceTest)  Time elapsed: 1.797 s
Running org.eclipse.m2e.tests.lifecycle.PluginExecutionMetadataPrioritiesTest
Tests run: 8, Failures: 0, Errors: 0, Skipped: 0, Time elapsed: 9.347 s - in org.eclipse.m2e.tests.lifecycle.PluginExecutionMetadataPrioritiesTest
testWorkspaceOverridesEclipseExtensions(org.eclipse.m2e.tests.lifecycle.PluginExecutionMetadataPrioritiesTest)  Time elapsed: 1.067 s
testEclipseExtension(org.eclipse.m2e.tests.lifecycle.PluginExecutionMetadataPrioritiesTest)  Time elapsed: 1.053 s
testDefaultMetadataSource(org.eclipse.m2e.tests.lifecycle.PluginExecutionMetadataPrioritiesTest)  Time elapsed: 1.043 s
testPomOverridesWorkspace(org.eclipse.m2e.tests.lifecycle.PluginExecutionMetadataPrioritiesTest)  Time elapsed: 1.211 s
testEmbeddedInPom(org.eclipse.m2e.tests.lifecycle.PluginExecutionMetadataPrioritiesTest)  Time elapsed: 1.048 s
testReferencedFromPom(org.eclipse.m2e.tests.lifecycle.PluginExecutionMetadataPrioritiesTest)  Time elapsed: 1.043 s
testParent(org.eclipse.m2e.tests.lifecycle.PluginExecutionMetadataPrioritiesTest)  Time elapsed: 1.42 s
testWorkspace(org.eclipse.m2e.tests.lifecycle.PluginExecutionMetadataPrioritiesTest)  Time elapsed: 1.462 s
Running org.eclipse.m2e.tests.lifecycle.LifecycleComparisonTest
Tests run: 3, Failures: 0, Errors: 0, Skipped: 0, Time elapsed: 2.96 s - in org.eclipse.m2e.tests.lifecycle.LifecycleComparisonTest
testPluginConfigurationChange(org.eclipse.m2e.tests.lifecycle.LifecycleComparisonTest)  Time elapsed: 1.157 s
testSameProject(org.eclipse.m2e.tests.lifecycle.LifecycleComparisonTest)  Time elapsed: 0.847 s
testPluginVersionChange(org.eclipse.m2e.tests.lifecycle.LifecycleComparisonTest)  Time elapsed: 0.956 s
Running org.eclipse.m2e.tests.lifecycle.PluginExecutionActionsTest
Tests run: 7, Failures: 0, Errors: 0, Skipped: 0, Time elapsed: 7.265 s - in org.eclipse.m2e.tests.lifecycle.PluginExecutionActionsTest
testMojoExecutionIgnore(org.eclipse.m2e.tests.lifecycle.PluginExecutionActionsTest)  Time elapsed: 1.011 s
testMojoExecutionErrorWithMessage(org.eclipse.m2e.tests.lifecycle.PluginExecutionActionsTest)  Time elapsed: 1.018 s
testMojoExecutionError(org.eclipse.m2e.tests.lifecycle.PluginExecutionActionsTest)  Time elapsed: 1.043 s
testMojoExecutionConfigurator(org.eclipse.m2e.tests.lifecycle.PluginExecutionActionsTest)  Time elapsed: 0.994 s
testMojoExecutionExecute(org.eclipse.m2e.tests.lifecycle.PluginExecutionActionsTest)  Time elapsed: 1.094 s
testMojoExecutionIgnoreWithMessage(org.eclipse.m2e.tests.lifecycle.PluginExecutionActionsTest)  Time elapsed: 1.069 s
testMojoExecutionExecuteWithMessage(org.eclipse.m2e.tests.lifecycle.PluginExecutionActionsTest)  Time elapsed: 1.036 s
Running org.eclipse.m2e.tests.conversion.ProjectConversionEnablerTest
Tests run: 3, Failures: 0, Errors: 0, Skipped: 0, Time elapsed: 2.655 s - in org.eclipse.m2e.tests.conversion.ProjectConversionEnablerTest
testProjectCanBeConverted(org.eclipse.m2e.tests.conversion.ProjectConversionEnablerTest)  Time elapsed: 0.788 s
testProjectCannotBeConverted(org.eclipse.m2e.tests.conversion.ProjectConversionEnablerTest)  Time elapsed: 1.067 s
testEnablerNotFound(org.eclipse.m2e.tests.conversion.ProjectConversionEnablerTest)  Time elapsed: 0.798 s
Running org.eclipse.m2e.tests.conversion.ProjectConversionManagerTest
Tests run: 3, Failures: 0, Errors: 0, Skipped: 0, Time elapsed: 2.673 s - in org.eclipse.m2e.tests.conversion.ProjectConversionManagerTest
test393613_SortConversionParticipants(org.eclipse.m2e.tests.conversion.ProjectConversionManagerTest)  Time elapsed: 0.936 s
testConversionParticipantsPerProject(org.eclipse.m2e.tests.conversion.ProjectConversionManagerTest)  Time elapsed: 0.793 s
testRestrictedPackagings(org.eclipse.m2e.tests.conversion.ProjectConversionManagerTest)  Time elapsed: 0.944 s
Running org.eclipse.m2e.tests.conversion.ProjectConversionTest
Tests run: 7, Failures: 0, Errors: 0, Skipped: 0, Time elapsed: 12.776 s - in org.eclipse.m2e.tests.conversion.ProjectConversionTest
testMultipleSourcesProjectConversion(org.eclipse.m2e.tests.conversion.ProjectConversionTest)  Time elapsed: 2.155 s
testProjectConversionWithSvn(org.eclipse.m2e.tests.conversion.ProjectConversionTest)  Time elapsed: 1.311 s
testJavaMixedWithResourcesProjectConversion(org.eclipse.m2e.tests.conversion.ProjectConversionTest)  Time elapsed: 1.611 s
testInheritJavaSettingsDuringConversion(org.eclipse.m2e.tests.conversion.ProjectConversionTest)  Time elapsed: 2.112 s
testOptionalSourceProjectConversion(org.eclipse.m2e.tests.conversion.ProjectConversionTest)  Time elapsed: 2.172 s
testNoCustomizationNeededProjectConversion(org.eclipse.m2e.tests.conversion.ProjectConversionTest)  Time elapsed: 1.894 s
testMavenLayoutProjectConversion(org.eclipse.m2e.tests.conversion.ProjectConversionTest)  Time elapsed: 1.52 s
Running org.eclipse.m2e.tests.ui.editing.PomEditsTest
Tests run: 5, Failures: 0, Errors: 0, Skipped: 0, Time elapsed: 0.007 s - in org.eclipse.m2e.tests.ui.editing.PomEditsTest
testFindChildren(org.eclipse.m2e.tests.ui.editing.PomEditsTest)  Time elapsed: 0.001 s
testRemoveChild(org.eclipse.m2e.tests.ui.editing.PomEditsTest)  Time elapsed: 0.003 s
testMatchers(org.eclipse.m2e.tests.ui.editing.PomEditsTest)  Time elapsed: 0.001 s
testFindChild(org.eclipse.m2e.tests.ui.editing.PomEditsTest)  Time elapsed: 0.001 s
testRemoveIfNoChildElement(org.eclipse.m2e.tests.ui.editing.PomEditsTest)  Time elapsed: 0.001 s
Running org.eclipse.m2e.tests.ui.editing.AddDependencyOperationTest
Tests run: 5, Failures: 0, Errors: 0, Skipped: 0, Time elapsed: 0.031 s - in org.eclipse.m2e.tests.ui.editing.AddDependencyOperationTest
testNoDependenciesElement(org.eclipse.m2e.tests.ui.editing.AddDependencyOperationTest)  Time elapsed: 0.008 s
testEmptyDependenciesElement(org.eclipse.m2e.tests.ui.editing.AddDependencyOperationTest)  Time elapsed: 0.01 s
testDuplicatedDependency(org.eclipse.m2e.tests.ui.editing.AddDependencyOperationTest)  Time elapsed: 0.001 s
testWithDependencies(org.eclipse.m2e.tests.ui.editing.AddDependencyOperationTest)  Time elapsed: 0.004 s
testExclusionsAdded(org.eclipse.m2e.tests.ui.editing.AddDependencyOperationTest)  Time elapsed: 0.008 s
Running org.eclipse.m2e.tests.ui.editing.RemoveDependencyOperationTest
Tests run: 4, Failures: 0, Errors: 0, Skipped: 0, Time elapsed: 0.03 s - in org.eclipse.m2e.tests.ui.editing.RemoveDependencyOperationTest
testMissingDependency_withDependencies(org.eclipse.m2e.tests.ui.editing.RemoveDependencyOperationTest)  Time elapsed: 0.028 s
testRemoveDependency(org.eclipse.m2e.tests.ui.editing.RemoveDependencyOperationTest)  Time elapsed: 0.001 s
testMissingDependency_emptyDependenciesElement(org.eclipse.m2e.tests.ui.editing.RemoveDependencyOperationTest)  Time elapsed: 0 s
testMissingDependency_noDependenciesElement(org.eclipse.m2e.tests.ui.editing.RemoveDependencyOperationTest)  Time elapsed: 0 s
Running org.eclipse.m2e.tests.ui.editing.PomHelperTest
Tests run: 7, Failures: 0, Errors: 0, Skipped: 0, Time elapsed: 0.018 s - in org.eclipse.m2e.tests.ui.editing.PomHelperTest
testCreateDependencyInEmptyList(org.eclipse.m2e.tests.ui.editing.PomHelperTest)  Time elapsed: 0.004 s
testCreatePlugin(org.eclipse.m2e.tests.ui.editing.PomHelperTest)  Time elapsed: 0.005 s
testFindDependencies(org.eclipse.m2e.tests.ui.editing.PomHelperTest)  Time elapsed: 0 s
testFindDependenciesMissing(org.eclipse.m2e.tests.ui.editing.PomHelperTest)  Time elapsed: 0 s
testCreatePluginInEmptyList(org.eclipse.m2e.tests.ui.editing.PomHelperTest)  Time elapsed: 0.003 s
testCreateDependency(org.eclipse.m2e.tests.ui.editing.PomHelperTest)  Time elapsed: 0.004 s
testFindDependency(org.eclipse.m2e.tests.ui.editing.PomHelperTest)  Time elapsed: 0.001 s
Running org.eclipse.m2e.tests.ui.editing.AddExclusionOperationTest
Tests run: 6, Failures: 0, Errors: 0, Skipped: 0, Time elapsed: 0.012 s - in org.eclipse.m2e.tests.ui.editing.AddExclusionOperationTest
testAddExclusion(org.eclipse.m2e.tests.ui.editing.AddExclusionOperationTest)  Time elapsed: 0.007 s
testAddExclusion_existingExclusion(org.eclipse.m2e.tests.ui.editing.AddExclusionOperationTest)  Time elapsed: 0.003 s
testAddExclusion_duplicateExclusion(org.eclipse.m2e.tests.ui.editing.AddExclusionOperationTest)  Time elapsed: 0.001 s
testMissingDependency_withDependencies(org.eclipse.m2e.tests.ui.editing.AddExclusionOperationTest)  Time elapsed: 0 s
testMissingDependency_emptyDependenciesElement(org.eclipse.m2e.tests.ui.editing.AddExclusionOperationTest)  Time elapsed: 0 s
testMissingDependency_noDependenciesElement(org.eclipse.m2e.tests.ui.editing.AddExclusionOperationTest)  Time elapsed: 0 s
Running org.eclipse.m2e.tests.ui.MavenPropertyTesterTest
Tests run: 1, Failures: 0, Errors: 0, Skipped: 0, Time elapsed: 0.988 s - in org.eclipse.m2e.tests.ui.MavenPropertyTesterTest
testIsBuildDirectory(org.eclipse.m2e.tests.ui.MavenPropertyTesterTest)  Time elapsed: 0.988 s
Running org.eclipse.m2e.tests.ui.OpenPomActionTest
Tests run: 1, Failures: 0, Errors: 0, Skipped: 0, Time elapsed: 1.583 s - in org.eclipse.m2e.tests.ui.OpenPomActionTest
test454759_openEditor(org.eclipse.m2e.tests.ui.OpenPomActionTest)  Time elapsed: 1.582 s
Running org.eclipse.m2e.tests.MavenProjectMutableStateTest
Tests run: 3, Failures: 0, Errors: 0, Skipped: 0, Time elapsed: 3.804 s - in org.eclipse.m2e.tests.MavenProjectMutableStateTest
testExecuteMojo(org.eclipse.m2e.tests.MavenProjectMutableStateTest)  Time elapsed: 1.491 s
testMavenBuilder(org.eclipse.m2e.tests.MavenProjectMutableStateTest)  Time elapsed: 1.193 s
testImport(org.eclipse.m2e.tests.MavenProjectMutableStateTest)  Time elapsed: 1.119 s
Running org.eclipse.m2e.tests.MutableProjectRegistryTest
Tests run: 8, Failures: 0, Errors: 0, Skipped: 0, Time elapsed: 7.421 s - in org.eclipse.m2e.tests.MutableProjectRegistryTest
testRemoveProject(org.eclipse.m2e.tests.MutableProjectRegistryTest)  Time elapsed: 0.819 s
testReplaceProject(org.eclipse.m2e.tests.MutableProjectRegistryTest)  Time elapsed: 0.868 s
testIllegalStateMerge(org.eclipse.m2e.tests.MutableProjectRegistryTest)  Time elapsed: 1.15 s
testForeignClassesInSerializedProjectRegistry(org.eclipse.m2e.tests.MutableProjectRegistryTest)  Time elapsed: 1.086 s
testDetectNoLongerExistingProjectsInWorkspaceState(org.eclipse.m2e.tests.MutableProjectRegistryTest)  Time elapsed: 0.881 s
testAddProject(org.eclipse.m2e.tests.MutableProjectRegistryTest)  Time elapsed: 0.782 s
testSaveParticipant(org.eclipse.m2e.tests.MutableProjectRegistryTest)  Time elapsed: 1.053 s
testRemoveUnknownProject(org.eclipse.m2e.tests.MutableProjectRegistryTest)  Time elapsed: 0.781 s
Running org.eclipse.m2e.tests.ClasspathProviderTest
Tests run: 20, Failures: 0, Errors: 0, Skipped: 0, Time elapsed: 15.989 s - in org.eclipse.m2e.tests.ClasspathProviderTest
testTestClassesTestScopeAndTestType(org.eclipse.m2e.tests.ClasspathProviderTest)  Time elapsed: 0.814 s
testSourcePath(org.eclipse.m2e.tests.ClasspathProviderTest)  Time elapsed: 0.778 s
testCustomClasspath(org.eclipse.m2e.tests.ClasspathProviderTest)  Time elapsed: 0.745 s
test368230_unknownClassifier(org.eclipse.m2e.tests.ClasspathProviderTest)  Time elapsed: 0.765 s
testTestClassesDefaultClassifier(org.eclipse.m2e.tests.ClasspathProviderTest)  Time elapsed: 0.859 s
testJunitClasspathOrder(org.eclipse.m2e.tests.ClasspathProviderTest)  Time elapsed: 0.789 s
testProvidedScopeTestApp(org.eclipse.m2e.tests.ClasspathProviderTest)  Time elapsed: 0.73 s
testNoFilterResources(org.eclipse.m2e.tests.ClasspathProviderTest)  Time elapsed: 0.971 s
testProvidedScopeApp(org.eclipse.m2e.tests.ClasspathProviderTest)  Time elapsed: 0.877 s
testLaunchConfigListener(org.eclipse.m2e.tests.ClasspathProviderTest)  Time elapsed: 0.767 s
testProvidedScopeAppTest(org.eclipse.m2e.tests.ClasspathProviderTest)  Time elapsed: 0.75 s
testTestClassesTestsClassifier(org.eclipse.m2e.tests.ClasspathProviderTest)  Time elapsed: 0.756 s
test(org.eclipse.m2e.tests.ClasspathProviderTest)  Time elapsed: 0.755 s
testNonDefaultTestSource(org.eclipse.m2e.tests.ClasspathProviderTest)  Time elapsed: 0.986 s
testCustomProjectEntry(org.eclipse.m2e.tests.ClasspathProviderTest)  Time elapsed: 0.751 s
testCustomBuildpath(org.eclipse.m2e.tests.ClasspathProviderTest)  Time elapsed: 0.78 s
testNotMavenProject(org.eclipse.m2e.tests.ClasspathProviderTest)  Time elapsed: 0.819 s
testTestClassesDefaultAndTestsClassifier(org.eclipse.m2e.tests.ClasspathProviderTest)  Time elapsed: 0.747 s
testSystemScope(org.eclipse.m2e.tests.ClasspathProviderTest)  Time elapsed: 0.736 s
test368230_FancyClassifier(org.eclipse.m2e.tests.ClasspathProviderTest)  Time elapsed: 0.811 s
Running org.eclipse.m2e.tests.embedder.ArtifactKeyTest
Tests run: 1, Failures: 0, Errors: 0, Skipped: 0, Time elapsed: 0 s - in org.eclipse.m2e.tests.embedder.ArtifactKeyTest
testPortableString(org.eclipse.m2e.tests.embedder.ArtifactKeyTest)  Time elapsed: 0 s
Running org.eclipse.m2e.tests.embedder.MavenExecutionContextTest
Tests run: 6, Failures: 0, Errors: 0, Skipped: 0, Time elapsed: 5.697 s - in org.eclipse.m2e.tests.embedder.MavenExecutionContextTest
testBasic(org.eclipse.m2e.tests.embedder.MavenExecutionContextTest)  Time elapsed: 0.984 s
test496492_threadContextClassloaderLeak(org.eclipse.m2e.tests.embedder.MavenExecutionContextTest)  Time elapsed: 1.694 s
testExecutionRequestContainsSystemProperties(org.eclipse.m2e.tests.embedder.MavenExecutionContextTest)  Time elapsed: 0.757 s
testReenterShortcut(org.eclipse.m2e.tests.embedder.MavenExecutionContextTest)  Time elapsed: 0.707 s
testIllegalState(org.eclipse.m2e.tests.embedder.MavenExecutionContextTest)  Time elapsed: 0.761 s
testNested(org.eclipse.m2e.tests.embedder.MavenExecutionContextTest)  Time elapsed: 0.793 s
Running org.eclipse.m2e.tests.embedder.MavenModelManagerTest
Tests run: 2, Failures: 0, Errors: 0, Skipped: 0, Time elapsed: 1.743 s - in org.eclipse.m2e.tests.embedder.MavenModelManagerTest
test416882_dependencyTree(org.eclipse.m2e.tests.embedder.MavenModelManagerTest)  Time elapsed: 0.926 s
testCreateMavenModel(org.eclipse.m2e.tests.embedder.MavenModelManagerTest)  Time elapsed: 0.816 s
Running org.eclipse.m2e.tests.embedder.MavenRuntimeManagerTest
Tests run: 4, Failures: 0, Errors: 0, Skipped: 0, Time elapsed: 0.009 s - in org.eclipse.m2e.tests.embedder.MavenRuntimeManagerTest
testDefaultRuntime(org.eclipse.m2e.tests.embedder.MavenRuntimeManagerTest)  Time elapsed: 0.004 s
testSetDefaultRuntime(org.eclipse.m2e.tests.embedder.MavenRuntimeManagerTest)  Time elapsed: 0.001 s
testExternalRuntime(org.eclipse.m2e.tests.embedder.MavenRuntimeManagerTest)  Time elapsed: 0.004 s
testGetRuntime(org.eclipse.m2e.tests.embedder.MavenRuntimeManagerTest)  Time elapsed: 0 s
Running org.eclipse.m2e.tests.embedder.MavenImplTest
Tests run: 21, Failures: 0, Errors: 0, Skipped: 1, Time elapsed: 27.786 s - in org.eclipse.m2e.tests.embedder.MavenImplTest
test438454_guiceScopedComponentInjection(org.eclipse.m2e.tests.embedder.MavenImplTest)  Time elapsed: 3.285 s
testUnreadableSettings(org.eclipse.m2e.tests.embedder.MavenImplTest)  Time elapsed: 1.692 s
testGetProxy(org.eclipse.m2e.tests.embedder.MavenImplTest)  Time elapsed: 1.376 s
testMNGECLIPSE2556_settingsSystemPropertiesSubstiution(org.eclipse.m2e.tests.embedder.MavenImplTest)  Time elapsed: 1.4 s
testGetDefaultRepositories(org.eclipse.m2e.tests.embedder.MavenImplTest)  Time elapsed: 1.614 s
testGetRepositories(org.eclipse.m2e.tests.embedder.MavenImplTest)  Time elapsed: 1.334 s
testMissingArtifact(org.eclipse.m2e.tests.embedder.MavenImplTest)  Time elapsed: 0.777 s
testIsUnavailable(org.eclipse.m2e.tests.embedder.MavenImplTest)  Time elapsed: 0.875 s
testLocalRepositoryListener(org.eclipse.m2e.tests.embedder.MavenImplTest)  Time elapsed: 0.861 s
testGlobalSettings(org.eclipse.m2e.tests.embedder.MavenImplTest)  Time elapsed: 1.314 s
testReadNoParent(org.eclipse.m2e.tests.embedder.MavenImplTest)  Time elapsed: 0.803 s
test358620_reparse_changed_user_settings(org.eclipse.m2e.tests.embedder.MavenImplTest)  Time elapsed: 1.212 s
test366839_userAgent(org.eclipse.m2e.tests.embedder.MavenImplTest)  Time elapsed: 1.27 s
testReadLocalParent(org.eclipse.m2e.tests.embedder.MavenImplTest)  Time elapsed: 0.745 s
testReadProjectWithDependenciesFromMirror(org.eclipse.m2e.tests.embedder.MavenImplTest)  Time elapsed: 1.483 s
testGetMojoParameterValue(org.eclipse.m2e.tests.embedder.MavenImplTest)  Time elapsed: 1.313 s
testGetRepositoriesWithSettingsInjection(org.eclipse.m2e.tests.embedder.MavenImplTest)  Time elapsed: 1.297 s
test386196_ParallelDownloads(org.eclipse.m2e.tests.embedder.MavenImplTest)  Time elapsed: 2.138 s
testProxySupport(org.eclipse.m2e.tests.embedder.MavenImplTest)  Time elapsed: 1.859 s
DISABLED_testSslWithMutualHandshake(org.eclipse.m2e.tests.embedder.MavenImplTest) skipped
testReadRemoteParent(org.eclipse.m2e.tests.embedder.MavenImplTest)  Time elapsed: 1.138 s
Running org.eclipse.m2e.tests.embedder.MavenModelEditTest
Tests run: 16, Failures: 0, Errors: 0, Skipped: 0, Time elapsed: 0.095 s - in org.eclipse.m2e.tests.embedder.MavenModelEditTest
testOneRemove(org.eclipse.m2e.tests.embedder.MavenModelEditTest)  Time elapsed: 0.02 s
testEncoding(org.eclipse.m2e.tests.embedder.MavenModelEditTest)  Time elapsed: 0.006 s
testAttributeChange(org.eclipse.m2e.tests.embedder.MavenModelEditTest)  Time elapsed: 0.004 s
testAttributeRoundtrip(org.eclipse.m2e.tests.embedder.MavenModelEditTest)  Time elapsed: 0.005 s
testAttributeRemove(org.eclipse.m2e.tests.embedder.MavenModelEditTest)  Time elapsed: 0.004 s
testManyRoundtrip(org.eclipse.m2e.tests.embedder.MavenModelEditTest)  Time elapsed: 0.006 s
testManybuildinRoundtrip(org.eclipse.m2e.tests.embedder.MavenModelEditTest)  Time elapsed: 0.004 s
testAttributeAdd(org.eclipse.m2e.tests.embedder.MavenModelEditTest)  Time elapsed: 0.005 s
testOneReplace(org.eclipse.m2e.tests.embedder.MavenModelEditTest)  Time elapsed: 0.003 s
testManyAdd(org.eclipse.m2e.tests.embedder.MavenModelEditTest)  Time elapsed: 0.004 s
testManybuildincommentRemove(org.eclipse.m2e.tests.embedder.MavenModelEditTest)  Time elapsed: 0.003 s
testManyChange(org.eclipse.m2e.tests.embedder.MavenModelEditTest)  Time elapsed: 0.009 s
testXpp3domRoundtrip(org.eclipse.m2e.tests.embedder.MavenModelEditTest)  Time elapsed: 0.009 s
testManyRemove(org.eclipse.m2e.tests.embedder.MavenModelEditTest)  Time elapsed: 0.004 s
testOneRoundtrip(org.eclipse.m2e.tests.embedder.MavenModelEditTest)  Time elapsed: 0.004 s
testManybuildinRemove(org.eclipse.m2e.tests.embedder.MavenModelEditTest)  Time elapsed: 0.004 s
Running org.eclipse.m2e.tests.JavaUtilTest
Tests run: 1, Failures: 0, Errors: 0, Skipped: 0, Time elapsed: 0.003 s - in org.eclipse.m2e.tests.JavaUtilTest
testGetDefaultJavaPackage(org.eclipse.m2e.tests.JavaUtilTest)  Time elapsed: 0.002 s
Running org.eclipse.m2e.tests.MarkerTest
Tests run: 10, Failures: 0, Errors: 0, Skipped: 0, Time elapsed: 16.293 s - in org.eclipse.m2e.tests.MarkerTest
testBuildContextWithTwoProjectConfigurators(org.eclipse.m2e.tests.MarkerTest)  Time elapsed: 1.483 s
test512825_missingArtifactVersion(org.eclipse.m2e.tests.MarkerTest)  Time elapsed: 1.178 s
testManagedTransitive(org.eclipse.m2e.tests.MarkerTest)  Time elapsed: 1.811 s
testBuildContextWithSameProjectConfiguratorTwice(org.eclipse.m2e.tests.MarkerTest)  Time elapsed: 1.518 s
testNoDuplicateMarker(org.eclipse.m2e.tests.MarkerTest)  Time elapsed: 1.049 s
test(org.eclipse.m2e.tests.MarkerTest)  Time elapsed: 3.39 s
testMarkerResolutions(org.eclipse.m2e.tests.MarkerTest)  Time elapsed: 1.228 s
test361445_missingArtifactMarkerAttributes(org.eclipse.m2e.tests.MarkerTest)  Time elapsed: 1.185 s
testBuildContextWithOneProjectConfigurator(org.eclipse.m2e.tests.MarkerTest)  Time elapsed: 1.587 s
testBuildCantReadPom(org.eclipse.m2e.tests.MarkerTest)  Time elapsed: 1.862 s
Running org.eclipse.m2e.tests.ProfileSupportTest
Tests run: 1, Failures: 0, Errors: 0, Skipped: 0, Time elapsed: 1.459 s - in org.eclipse.m2e.tests.ProfileSupportTest
test337353_deactivateProfile(org.eclipse.m2e.tests.ProfileSupportTest)  Time elapsed: 1.458 s
Running org.eclipse.m2e.tests.builder.MavenBuilderTest
Tests run: 14, Failures: 0, Errors: 0, Skipped: 2, Time elapsed: 17.213 s - in org.eclipse.m2e.tests.builder.MavenBuilderTest
test005_pomChanged(org.eclipse.m2e.tests.builder.MavenBuilderTest)  Time elapsed: 1.701 s
test007_refreshChangedPom(org.eclipse.m2e.tests.builder.MavenBuilderTest)  Time elapsed: 1.746 s
_test006_testPluginProperties(org.eclipse.m2e.tests.builder.MavenBuilderTest) skipped
test397251_malformedPom(org.eclipse.m2e.tests.builder.MavenBuilderTest)  Time elapsed: 0.926 s
test422106_legacyPlexusUtils(org.eclipse.m2e.tests.builder.MavenBuilderTest)  Time elapsed: 1.402 s
test004_useMavenOutputFolders(org.eclipse.m2e.tests.builder.MavenBuilderTest)  Time elapsed: 1.178 s
test002_customResourceLocation(org.eclipse.m2e.tests.builder.MavenBuilderTest)  Time elapsed: 1.135 s
test001_standardLayout(org.eclipse.m2e.tests.builder.MavenBuilderTest)  Time elapsed: 1.743 s
test_crossproject(org.eclipse.m2e.tests.builder.MavenBuilderTest)  Time elapsed: 1.487 s
test380096_cleanProjectWithLifecycleMappingProblemsAfterWorkspaceRestart(org.eclipse.m2e.tests.builder.MavenBuilderTest)  Time elapsed: 1.477 s
test010_properties(org.eclipse.m2e.tests.builder.MavenBuilderTest)  Time elapsed: 1.294 s
_test008_classpathChange(org.eclipse.m2e.tests.builder.MavenBuilderTest) skipped
test368380_buildContextDeepRefreshFromLocal(org.eclipse.m2e.tests.builder.MavenBuilderTest)  Time elapsed: 1.729 s
test013_refreshFixedPom(org.eclipse.m2e.tests.builder.MavenBuilderTest)  Time elapsed: 1.394 s
Running org.eclipse.m2e.tests.builder.EclipseIncrementalBuildContextTest
Tests run: 1, Failures: 0, Errors: 0, Skipped: 0, Time elapsed: 1.416 s - in org.eclipse.m2e.tests.builder.EclipseIncrementalBuildContextTest
testScanner(org.eclipse.m2e.tests.builder.EclipseIncrementalBuildContextTest)  Time elapsed: 1.415 s
Running org.eclipse.m2e.tests.builder.EclipseBuildContextTest
Tests run: 2, Failures: 0, Errors: 0, Skipped: 0, Time elapsed: 2.424 s - in org.eclipse.m2e.tests.builder.EclipseBuildContextTest
testScanner(org.eclipse.m2e.tests.builder.EclipseBuildContextTest)  Time elapsed: 1.22 s
test361038_buildContext_scan_nonExistingFolder(org.eclipse.m2e.tests.builder.EclipseBuildContextTest)  Time elapsed: 1.203 s
Running org.eclipse.m2e.tests.builder.BuildContextLifecycleTest
Tests run: 1, Failures: 0, Errors: 0, Skipped: 0, Time elapsed: 1.6 s - in org.eclipse.m2e.tests.builder.BuildContextLifecycleTest
testBuildContextRefreshProject(org.eclipse.m2e.tests.builder.BuildContextLifecycleTest)  Time elapsed: 1.599 s
Running org.eclipse.m2e.tests.launch.MavenLauncherConfigurationHandlerTest
Tests run: 1, Failures: 0, Errors: 0, Skipped: 0, Time elapsed: 1.209 s - in org.eclipse.m2e.tests.launch.MavenLauncherConfigurationHandlerTest
test421015_workspaceProjectLibraryClasspathEntries(org.eclipse.m2e.tests.launch.MavenLauncherConfigurationHandlerTest)  Time elapsed: 1.209 s
Running org.eclipse.m2e.tests.launch.MavenLaunchDelegateTest
Tests run: 6, Failures: 0, Errors: 0, Skipped: 0, Time elapsed: 0.022 s - in org.eclipse.m2e.tests.launch.MavenLaunchDelegateTest
testGetVMArguments332WithParent(org.eclipse.m2e.tests.launch.MavenLaunchDelegateTest)  Time elapsed: 0.004 s
testGetVMArgumentsSubstituteMultiModuleDir(org.eclipse.m2e.tests.launch.MavenLaunchDelegateTest)  Time elapsed: 0.002 s
testUserSettingsProgramArguments(org.eclipse.m2e.tests.launch.MavenLaunchDelegateTest)  Time elapsed: 0.01 s
testGlobalSettingsProgramArguments(org.eclipse.m2e.tests.launch.MavenLaunchDelegateTest)  Time elapsed: 0.004 s
testGetVMArguments325(org.eclipse.m2e.tests.launch.MavenLaunchDelegateTest)  Time elapsed: 0 s
testGetVMArguments331(org.eclipse.m2e.tests.launch.MavenLaunchDelegateTest)  Time elapsed: 0 s
Running org.eclipse.m2e.tests.launch.LaunchingUtilsTest
Tests run: 1, Failures: 0, Errors: 0, Skipped: 0, Time elapsed: 0.878 s - in org.eclipse.m2e.tests.launch.LaunchingUtilsTest
testGenerateProjectLocationVariableExpression(org.eclipse.m2e.tests.launch.LaunchingUtilsTest)  Time elapsed: 0.877 s
Running org.eclipse.m2e.tests.launch.MavenRuntimeClasspathProviderTest
Tests run: 7, Failures: 0, Errors: 0, Skipped: 0, Time elapsed: 10.896 s - in org.eclipse.m2e.tests.launch.MavenRuntimeClasspathProviderTest
testAddJUnit5DependenciesWithEngine(org.eclipse.m2e.tests.launch.MavenRuntimeClasspathProviderTest)  Time elapsed: 1.895 s
testClasspathScopeRuntime(org.eclipse.m2e.tests.launch.MavenRuntimeClasspathProviderTest)  Time elapsed: 1.77 s
testAddJUnit5DependenciesAPIOnlyDisabled(org.eclipse.m2e.tests.launch.MavenRuntimeClasspathProviderTest)  Time elapsed: 1.369 s
testAddJUnit5DependenciesWithLauncher(org.eclipse.m2e.tests.launch.MavenRuntimeClasspathProviderTest)  Time elapsed: 1.236 s
testClasspathScopeTest(org.eclipse.m2e.tests.launch.MavenRuntimeClasspathProviderTest)  Time elapsed: 2.061 s
testAddJUnit5DependenciesAggregator(org.eclipse.m2e.tests.launch.MavenRuntimeClasspathProviderTest)  Time elapsed: 1.462 s
testAddJUnit5DependenciesAPIOnly(org.eclipse.m2e.tests.launch.MavenRuntimeClasspathProviderTest)  Time elapsed: 1.103 s
Running org.eclipse.m2e.tests.archetype.ArchetypeManagerTest
Tests run: 12, Failures: 0, Errors: 0, Skipped: 0, Time elapsed: 1.406 s - in org.eclipse.m2e.tests.archetype.ArchetypeManagerTest
test371775_archetypeRepoAuthentication(org.eclipse.m2e.tests.archetype.ArchetypeManagerTest)  Time elapsed: 0.004 s
testEmbeddedLocalArchetypeCatalogFactory(org.eclipse.m2e.tests.archetype.ArchetypeManagerTest)  Time elapsed: 0.002 s
testArchetypeManagerSaveRestore(org.eclipse.m2e.tests.archetype.ArchetypeManagerTest)  Time elapsed: 0.617 s
testRepositoryUrlFromRemoteArchetypeCatalogs(org.eclipse.m2e.tests.archetype.ArchetypeManagerTest)  Time elapsed: 0.005 s
testArchetypeManager(org.eclipse.m2e.tests.archetype.ArchetypeManagerTest)  Time elapsed: 0.641 s
testAddRemoteCatalog(org.eclipse.m2e.tests.archetype.ArchetypeManagerTest)  Time elapsed: 0.004 s
testActiveArchetypeCatalogs(org.eclipse.m2e.tests.archetype.ArchetypeManagerTest)  Time elapsed: 0.011 s
testBadLocalArchetypeCatalogFactory(org.eclipse.m2e.tests.archetype.ArchetypeManagerTest)  Time elapsed: 0 s
testRemoteArchetypeCatalogFactory(org.eclipse.m2e.tests.archetype.ArchetypeManagerTest)  Time elapsed: 0 s
test359855_localArchetypeWithProperties(org.eclipse.m2e.tests.archetype.ArchetypeManagerTest)  Time elapsed: 0.023 s
testLocalArchetypeCatalogFactory(org.eclipse.m2e.tests.archetype.ArchetypeManagerTest)  Time elapsed: 0 s
test387784_remoteArchetypeWithProperties(org.eclipse.m2e.tests.archetype.ArchetypeManagerTest)  Time elapsed: 0.099 s
Running org.eclipse.m2e.tests.archetype.ArchetypeUtilTest
Tests run: 2, Failures: 0, Errors: 0, Skipped: 0, Time elapsed: 0.001 s - in org.eclipse.m2e.tests.archetype.ArchetypeUtilTest
testAreEqual(org.eclipse.m2e.tests.archetype.ArchetypeUtilTest)  Time elapsed: 0 s
testGetHashCode(org.eclipse.m2e.tests.archetype.ArchetypeUtilTest)  Time elapsed: 0 s
Running org.eclipse.m2e.tests.ProjectRegistryRefreshJobTest
Tests run: 10, Failures: 0, Errors: 0, Skipped: 0, Time elapsed: 24.678 s - in org.eclipse.m2e.tests.ProjectRegistryRefreshJobTest
test436679_NoRefreshWhenImport(org.eclipse.m2e.tests.ProjectRegistryRefreshJobTest)  Time elapsed: 2.311 s
test445675_autobuild(org.eclipse.m2e.tests.ProjectRegistryRefreshJobTest)  Time elapsed: 2.178 s
testMultiProject(org.eclipse.m2e.tests.ProjectRegistryRefreshJobTest)  Time elapsed: 2.65 s
testRefreshAfterOpen(org.eclipse.m2e.tests.ProjectRegistryRefreshJobTest)  Time elapsed: 2.03 s
testUpdateForced(org.eclipse.m2e.tests.ProjectRegistryRefreshJobTest)  Time elapsed: 2.172 s
test416050_ignoreNonMavenProjectChanges(org.eclipse.m2e.tests.ProjectRegistryRefreshJobTest)  Time elapsed: 1.289 s
testDependencyAdded_NoUpdate(org.eclipse.m2e.tests.ProjectRegistryRefreshJobTest)  Time elapsed: 2.647 s
testXXXX_projectRenameRefresh(org.eclipse.m2e.tests.ProjectRegistryRefreshJobTest)  Time elapsed: 2.842 s
test437493_NoRefreshWhenInitClasspathContainer(org.eclipse.m2e.tests.ProjectRegistryRefreshJobTest)  Time elapsed: 3.785 s
testUpdateNotForced(org.eclipse.m2e.tests.ProjectRegistryRefreshJobTest)  Time elapsed: 2.774 s
Running org.eclipse.m2e.tests.BuildPathManagerTest
[INFO] ----------------------------------------------------------------------------
[INFO] Using following parameters for creating project from Old (1.x) Archetype: maven-archetype-quickstart:1.1
[INFO] ----------------------------------------------------------------------------
[INFO] Parameter: basedir, Value: /home/jenkins/agent/workspace/m2e-gerrit/m2e-core-tests/org.eclipse.m2e.tests/target/work/data
[INFO] Parameter: package, Value: jar
[INFO] Parameter: groupId, Value: archetype-project
[INFO] Parameter: artifactId, Value: archetype-project
[INFO] Parameter: packageName, Value: jar
[INFO] Parameter: version, Value: 0.0.1-SNAPSHOT
[INFO] project created from Old (1.x) Archetype in dir: /home/jenkins/agent/workspace/m2e-gerrit/m2e-core-tests/org.eclipse.m2e.tests/target/work/data/archetype-project
[INFO] ----------------------------------------------------------------------------
[INFO] Using following parameters for creating project from Old (1.x) Archetype: maven-archetype-quickstart:1.1
[INFO] ----------------------------------------------------------------------------
[INFO] Parameter: basedir, Value: /tmp/m2eclipse9178431745829184341test/external-archetype-project-1
[INFO] Parameter: package, Value: jar
[INFO] Parameter: groupId, Value: external-archetype-project-1
[INFO] Parameter: artifactId, Value: external-archetype-project-1
[INFO] Parameter: packageName, Value: jar
[INFO] Parameter: version, Value: 0.0.1-SNAPSHOT
[INFO] project created from Old (1.x) Archetype in dir: /tmp/m2eclipse9178431745829184341test/external-archetype-project-1/external-archetype-project-1
[INFO] ----------------------------------------------------------------------------
[INFO] Using following parameters for creating project from Old (1.x) Archetype: maven-archetype-quickstart:1.1
[INFO] ----------------------------------------------------------------------------
[INFO] Parameter: basedir, Value: /tmp/m2eclipse9178431745829184341test/external-archetype-project-2
[INFO] Parameter: package, Value: jar
[INFO] Parameter: groupId, Value: external-archetype-project-2
[INFO] Parameter: artifactId, Value: external-archetype-project-2
[INFO] Parameter: packageName, Value: jar
[INFO] Parameter: version, Value: 0.0.1-SNAPSHOT
Tests run: 45, Failures: 0, Errors: 0, Skipped: 1, Time elapsed: 79.823 s - in org.eclipse.m2e.tests.BuildPathManagerTest
testDownloadSources_001_workspaceRestart(org.eclipse.m2e.tests.BuildPathManagerTest)  Time elapsed: 2.495 s
testEnableMavenNatureWithNoWorkspace(org.eclipse.m2e.tests.BuildPathManagerTest)  Time elapsed: 2.38 s
test385391_keepCustomSourceEncoding(org.eclipse.m2e.tests.BuildPathManagerTest)  Time elapsed: 2.422 s
testProjectImportWithProfile1(org.eclipse.m2e.tests.BuildPathManagerTest)  Time elapsed: 1.444 s
testProjectImportWithProfile2(org.eclipse.m2e.tests.BuildPathManagerTest)  Time elapsed: 1.596 s
testProjectNameWithNameTemplate(org.eclipse.m2e.tests.BuildPathManagerTest)  Time elapsed: 1.294 s
testProjectImport001_useMavenOutputFolders(org.eclipse.m2e.tests.BuildPathManagerTest)  Time elapsed: 1.287 s
testArchetypeProject(org.eclipse.m2e.tests.BuildPathManagerTest)  Time elapsed: 1.97 s
testClasspathOrderWorkspace001(org.eclipse.m2e.tests.BuildPathManagerTest)  Time elapsed: 2.197 s
testClasspathOrderWorkspace003(org.eclipse.m2e.tests.BuildPathManagerTest)  Time elapsed: 1.969 s
testDownloadSources_001_sourceAttachment(org.eclipse.m2e.tests.BuildPathManagerTest)  Time elapsed: 1.463 s
testMNGECLIPSE_2367_same_sources_resources(org.eclipse.m2e.tests.BuildPathManagerTest)  Time elapsed: 1.278 s
test360962_forbiddenReferencePreference(org.eclipse.m2e.tests.BuildPathManagerTest)  Time elapsed: 1.794 s
test388596_expandedSnapshotDependency(org.eclipse.m2e.tests.BuildPathManagerTest)  Time elapsed: 2.147 s
test359725_resourcesWorkspaceRoot(org.eclipse.m2e.tests.BuildPathManagerTest)  Time elapsed: 1.395 s
testClassifiers(org.eclipse.m2e.tests.BuildPathManagerTest)  Time elapsed: 2.866 s
test486721_overlappingResourceFolders(org.eclipse.m2e.tests.BuildPathManagerTest)  Time elapsed: 1.468 s
test005_dependencyAvailableFromLocalRepoAndWorkspace(org.eclipse.m2e.tests.BuildPathManagerTest)  Time elapsed: 2.889 s
testDisableMavenNature(org.eclipse.m2e.tests.BuildPathManagerTest)  Time elapsed: 1.566 s
testDownloadSources_001_basic(org.eclipse.m2e.tests.BuildPathManagerTest)  Time elapsed: 2.636 s
testDownloadSources_003_customRemoteRepository(org.eclipse.m2e.tests.BuildPathManagerTest)  Time elapsed: 1.574 s
_testProjectImport002_useMavenOutputFolders(org.eclipse.m2e.tests.BuildPathManagerTest) skipped
testMNGECLIPSE_2367_sources_encloses_resources(org.eclipse.m2e.tests.BuildPathManagerTest)  Time elapsed: 1.469 s
testDownloadSources_006_nonMavenProject(org.eclipse.m2e.tests.BuildPathManagerTest)  Time elapsed: 4.115 s
testCompilerSettings14(org.eclipse.m2e.tests.BuildPathManagerTest)  Time elapsed: 1.129 s
testSimpleProjectInExternalLocation(org.eclipse.m2e.tests.BuildPathManagerTest)  Time elapsed: 1.404 s
testDownloadSources_007_missingTestsSources(org.eclipse.m2e.tests.BuildPathManagerTest)  Time elapsed: 1.905 s
testMNGECLIPSE_696_compiler_includes_excludes(org.eclipse.m2e.tests.BuildPathManagerTest)  Time elapsed: 1.577 s
test431080_flatDirectoryLayout(org.eclipse.m2e.tests.BuildPathManagerTest)  Time elapsed: 1.404 s
testDownloadSources_005_classifier(org.eclipse.m2e.tests.BuildPathManagerTest)  Time elapsed: 1.644 s
testDownloadSources_008_fallbackToJavadocWhenMissingSources(org.eclipse.m2e.tests.BuildPathManagerTest)  Time elapsed: 1.751 s
testArchetypeProjectInExternalLocation(org.eclipse.m2e.tests.BuildPathManagerTest)  Time elapsed: 1.984 s
testMNGECLIPSE_2367_testSources_encloses_resources(org.eclipse.m2e.tests.BuildPathManagerTest)  Time elapsed: 1.386 s
testCompilerSettingsJsr14(org.eclipse.m2e.tests.BuildPathManagerTest)  Time elapsed: 1.102 s
testProjectNameTemplateWithProperties(org.eclipse.m2e.tests.BuildPathManagerTest)  Time elapsed: 1.21 s
testDownloadSources_002_javadoconly(org.eclipse.m2e.tests.BuildPathManagerTest)  Time elapsed: 1.495 s
testMavenBuilderOrder(org.eclipse.m2e.tests.BuildPathManagerTest)  Time elapsed: 2.087 s
testDownloadSources_004_testsClassifier(org.eclipse.m2e.tests.BuildPathManagerTest)  Time elapsed: 2.87 s
testEnableMavenNature(org.eclipse.m2e.tests.BuildPathManagerTest)  Time elapsed: 1.83 s
testProjectNameTemplate(org.eclipse.m2e.tests.BuildPathManagerTest)  Time elapsed: 1.586 s
testMNGECLIPSE_1047_localRepoPath(org.eclipse.m2e.tests.BuildPathManagerTest)  Time elapsed: 1.071 s
testCreateSimpleProject(org.eclipse.m2e.tests.BuildPathManagerTest)  Time elapsed: 1.586 s
testMNGECLIPSE_2433_resourcesOutsideBasdir(org.eclipse.m2e.tests.BuildPathManagerTest)  Time elapsed: 1.412 s
testUpdateProjectConfigurationWithWorkspace(org.eclipse.m2e.tests.BuildPathManagerTest)  Time elapsed: 1.995 s
test486721_sourceAndResourceUnderSameNonDefaultFolder(org.eclipse.m2e.tests.BuildPathManagerTest)  Time elapsed: 1.677 s
Running org.eclipse.m2e.tests.SourceLocationHelperTest
Tests run: 5, Failures: 0, Errors: 0, Skipped: 0, Time elapsed: 6.83 s - in org.eclipse.m2e.tests.SourceLocationHelperTest
testDependencyLocation(org.eclipse.m2e.tests.SourceLocationHelperTest)  Time elapsed: 1.485 s
testMojoExecutionLocationWithExecutions(org.eclipse.m2e.tests.SourceLocationHelperTest)  Time elapsed: 1.437 s
testPackagingLocation(org.eclipse.m2e.tests.SourceLocationHelperTest)  Time elapsed: 0.978 s
testMojoExecutionLocation(org.eclipse.m2e.tests.SourceLocationHelperTest)  Time elapsed: 1.904 s
testPluginAttributeLocation(org.eclipse.m2e.tests.SourceLocationHelperTest)  Time elapsed: 1.026 s
Running org.eclipse.m2e.tests.properties.MavenPropertiesTest
Tests run: 2, Failures: 0, Errors: 0, Skipped: 0, Time elapsed: 2.587 s - in org.eclipse.m2e.tests.properties.MavenPropertiesTest
testBuildingProjectWithProperties(org.eclipse.m2e.tests.properties.MavenPropertiesTest)  Time elapsed: 1.459 s
testReadResolverConfigurationProperties(org.eclipse.m2e.tests.properties.MavenPropertiesTest)  Time elapsed: 1.127 s
Running org.eclipse.m2e.tests.LocalProjectScannerTest
Tests run: 11, Failures: 0, Errors: 0, Skipped: 0, Time elapsed: 0.005 s - in org.eclipse.m2e.tests.LocalProjectScannerTest
testDeepNesting002(org.eclipse.m2e.tests.LocalProjectScannerTest)  Time elapsed: 0.001 s
testOutsideWorkspace(org.eclipse.m2e.tests.LocalProjectScannerTest)  Time elapsed: 0 s
testModuleCorrelationInverse(org.eclipse.m2e.tests.LocalProjectScannerTest)  Time elapsed: 0.001 s
testCircleRefs(org.eclipse.m2e.tests.LocalProjectScannerTest)  Time elapsed: 0 s
testSkipNested(org.eclipse.m2e.tests.LocalProjectScannerTest)  Time elapsed: 0.001 s
testNoMetadata(org.eclipse.m2e.tests.LocalProjectScannerTest)  Time elapsed: 0 s
testStackOverflow(org.eclipse.m2e.tests.LocalProjectScannerTest)  Time elapsed: 0.001 s
testMNGECLIPSE614_ImportModulesOutsideOfParent(org.eclipse.m2e.tests.LocalProjectScannerTest)  Time elapsed: 0 s
testDeepNesting(org.eclipse.m2e.tests.LocalProjectScannerTest)  Time elapsed: 0 s
testRenameInWorkspace(org.eclipse.m2e.tests.LocalProjectScannerTest)  Time elapsed: 0 s
testModuleReferencedByFile(org.eclipse.m2e.tests.LocalProjectScannerTest)  Time elapsed: 0.001 s
Running org.eclipse.m2e.tests.ProjectConfigurationManagerTest
[INFO] ----------------------------------------------------------------------------
[INFO] Using following parameters for creating project from Archetype: mngeclipse-2110:1.0
[INFO] ----------------------------------------------------------------------------
[INFO] Parameter: groupId, Value: mngeclipse-2110
[INFO] Parameter: artifactId, Value: mngeclipse-2110
[INFO] Parameter: version, Value: 0.0.1-SNAPSHOT
[INFO] Parameter: package, Value: jar
[INFO] Parameter: packageInPathFormat, Value: jar
[INFO] project created from Archetype in dir: /home/jenkins/agent/workspace/m2e-gerrit/m2e-core-tests/org.eclipse.m2e.tests/target/work/data/mngeclipse-2110
[INFO] ----------------------------------------------------------------------------
[INFO] Using following parameters for creating project from Old (1.x) Archetype: maven-archetype-quickstart:1.1
[INFO] ----------------------------------------------------------------------------
[INFO] Parameter: basedir, Value: /home/jenkins/agent/workspace/m2e-gerrit/m2e-core-tests/org.eclipse.m2e.tests/target/work/data/parent002
[INFO] Parameter: package, Value: jar
[INFO] Parameter: groupId, Value: archetyped
[INFO] Parameter: artifactId, Value: archetyped
[INFO] Parameter: packageName, Value: jar
[INFO] Parameter: version, Value: 0.0.1-SNAPSHOT
[INFO] project created from Old (1.x) Archetype in dir: /home/jenkins/agent/workspace/m2e-gerrit/m2e-core-tests/org.eclipse.m2e.tests/target/work/data/parent002/archetyped
Tests run: 23, Failures: 0, Errors: 0, Skipped: 0, Time elapsed: 43.803 s - in org.eclipse.m2e.tests.ProjectConfigurationManagerTest
testAddRemoveMavenBuilder(org.eclipse.m2e.tests.ProjectConfigurationManagerTest)  Time elapsed: 0.796 s
testImportJavaProjectWithUnknownPackaging(org.eclipse.m2e.tests.ProjectConfigurationManagerTest)  Time elapsed: 1.61 s
testHiddenFolderForSimpleModule(org.eclipse.m2e.tests.ProjectConfigurationManagerTest)  Time elapsed: 2.379 s
testConfigureProjectEncodingForBasicProject(org.eclipse.m2e.tests.ProjectConfigurationManagerTest)  Time elapsed: 1.956 s
testAddRemoveMavenBuilderDisabled(org.eclipse.m2e.tests.ProjectConfigurationManagerTest)  Time elapsed: 1.174 s
testExtractionOfCompilerSettingsDespiteErrorsInExecutionPlan(org.eclipse.m2e.tests.ProjectConfigurationManagerTest)  Time elapsed: 1.12 s
testRevertToContainerDefinedEncoding(org.eclipse.m2e.tests.ProjectConfigurationManagerTest)  Time elapsed: 1.128 s
testIgnoreStaleProjectConfiguration(org.eclipse.m2e.tests.ProjectConfigurationManagerTest)  Time elapsed: 1.646 s
test397251_forcePluginResolutionUpdate(org.eclipse.m2e.tests.ProjectConfigurationManagerTest)  Time elapsed: 7.014 s
testResolutionOfArchetypeFromRepository(org.eclipse.m2e.tests.ProjectConfigurationManagerTest)  Time elapsed: 2.248 s
testStaleProjectConfigurationMarkerAfterFixingMissingBuildExtension(org.eclipse.m2e.tests.ProjectConfigurationManagerTest)  Time elapsed: 2.231 s
test447460MultipleUpdateConfiguration(org.eclipse.m2e.tests.ProjectConfigurationManagerTest)  Time elapsed: 1.505 s
testHiddenFolderForArchetypeModule(org.eclipse.m2e.tests.ProjectConfigurationManagerTest)  Time elapsed: 2.702 s
testStaleProjectConfigurationMarkerAfterWorkspaceRestart(org.eclipse.m2e.tests.ProjectConfigurationManagerTest)  Time elapsed: 1.478 s
testStaleProjectConfigurationWarningMarker(org.eclipse.m2e.tests.ProjectConfigurationManagerTest)  Time elapsed: 1.603 s
testAutomaticUpdateProjectConfigurationMarker(org.eclipse.m2e.tests.ProjectConfigurationManagerTest)  Time elapsed: 1.805 s
test473953_ProjectCreationListener(org.eclipse.m2e.tests.ProjectConfigurationManagerTest)  Time elapsed: 1.903 s
testWorkspaceResolutionOfInterModuleDependenciesDuringImport(org.eclipse.m2e.tests.ProjectConfigurationManagerTest)  Time elapsed: 2.356 s
testBasedirRenameRequired(org.eclipse.m2e.tests.ProjectConfigurationManagerTest)  Time elapsed: 1.953 s
testStaleProjectConfigurationMarker(org.eclipse.m2e.tests.ProjectConfigurationManagerTest)  Time elapsed: 1.544 s
testKeepEncodingSetByUserForSubfoldersAndFiles(org.eclipse.m2e.tests.ProjectConfigurationManagerTest)  Time elapsed: 1.112 s
testBasedirRenameNo(org.eclipse.m2e.tests.ProjectConfigurationManagerTest)  Time elapsed: 1.119 s
testBasicUpdateConfiguration(org.eclipse.m2e.tests.ProjectConfigurationManagerTest)  Time elapsed: 1.421 s

Results:

Tests run: 547, Failures: 0, Errors: 0, Skipped: 5

SWT SessionManagerDBus: Failed to connect to org.gnome.SessionManager: Failed to execute child process ?dbus-launch? (No such file or directory)
SWT SessionManagerDBus: Failed to connect to org.xfce.SessionManager: Failed to execute child process ?dbus-launch? (No such file or directory)
[INFO] All tests passed!
[INFO] 
[INFO] --- tycho-p2-extras-plugin:1.7.0:compare-version-with-baselines (check-no-version-regression) @ org.eclipse.m2e.tests ---
[INFO] 
[INFO] --- maven-install-plugin:2.3.1:install (default-install) @ org.eclipse.m2e.tests ---
[INFO] Installing /home/jenkins/agent/workspace/m2e-gerrit/m2e-core-tests/org.eclipse.m2e.tests/target/org.eclipse.m2e.tests-1.16.0-SNAPSHOT.jar to /home/jenkins/agent/workspace/m2e-gerrit/.repository/org/eclipse/m2e/org.eclipse.m2e.tests/1.16.0-SNAPSHOT/org.eclipse.m2e.tests-1.16.0-SNAPSHOT.jar
[INFO] Installing /home/jenkins/agent/workspace/m2e-gerrit/m2e-core-tests/org.eclipse.m2e.tests/pom.xml to /home/jenkins/agent/workspace/m2e-gerrit/.repository/org/eclipse/m2e/org.eclipse.m2e.tests/1.16.0-SNAPSHOT/org.eclipse.m2e.tests-1.16.0-SNAPSHOT.pom
[INFO] Installing /home/jenkins/agent/workspace/m2e-gerrit/m2e-core-tests/org.eclipse.m2e.tests/target/org.eclipse.m2e.tests-1.16.0-SNAPSHOT-sources.jar to /home/jenkins/agent/workspace/m2e-gerrit/.repository/org/eclipse/m2e/org.eclipse.m2e.tests/1.16.0-SNAPSHOT/org.eclipse.m2e.tests-1.16.0-SNAPSHOT-sources.jar
[INFO] Installing /home/jenkins/agent/workspace/m2e-gerrit/m2e-core-tests/org.eclipse.m2e.tests/target/org.eclipse.m2e.tests-1.16.0-SNAPSHOT.jar.pack.gz to /home/jenkins/agent/workspace/m2e-gerrit/.repository/org/eclipse/m2e/org.eclipse.m2e.tests/1.16.0-SNAPSHOT/org.eclipse.m2e.tests-1.16.0-SNAPSHOT-pack200.jar.pack.gz
[INFO] Installing /home/jenkins/agent/workspace/m2e-gerrit/m2e-core-tests/org.eclipse.m2e.tests/target/p2content.xml to /home/jenkins/agent/workspace/m2e-gerrit/.repository/org/eclipse/m2e/org.eclipse.m2e.tests/1.16.0-SNAPSHOT/org.eclipse.m2e.tests-1.16.0-SNAPSHOT-p2metadata.xml
[INFO] Installing /home/jenkins/agent/workspace/m2e-gerrit/m2e-core-tests/org.eclipse.m2e.tests/target/p2artifacts.xml to /home/jenkins/agent/workspace/m2e-gerrit/.repository/org/eclipse/m2e/org.eclipse.m2e.tests/1.16.0-SNAPSHOT/org.eclipse.m2e.tests-1.16.0-SNAPSHOT-p2artifacts.xml
[INFO] 
[INFO] --- tycho-p2-plugin:1.7.0:update-local-index (default-update-local-index) @ org.eclipse.m2e.tests ---
[INFO] 
[INFO] ------------< org.eclipse.m2e:org.eclipse.m2e.editor.tests >------------
[INFO] Building Maven Integration for Eclipse POM Editor tests 1.16.0-SNAPSHOT [39/40]
[INFO] ------------------------[ eclipse-test-plugin ]-------------------------
[INFO] 
[INFO] --- maven-clean-plugin:2.4.1:clean (default-clean) @ org.eclipse.m2e.editor.tests ---
[INFO] 
[INFO] --- tycho-packaging-plugin:1.7.0:build-qualifier (default-build-qualifier) @ org.eclipse.m2e.editor.tests ---
[INFO] The project's OSGi version is 1.16.0.20200429-1632
[INFO] 
[INFO] --- tycho-packaging-plugin:1.7.0:validate-id (default-validate-id) @ org.eclipse.m2e.editor.tests ---
[INFO] 
[INFO] --- tycho-packaging-plugin:1.7.0:validate-version (default-validate-version) @ org.eclipse.m2e.editor.tests ---
[INFO] 
[INFO] --- jacoco-maven-plugin:0.8.5:prepare-agent (default) @ org.eclipse.m2e.editor.tests ---
[INFO] tycho.testArgLine set to -javaagent:/home/jenkins/agent/workspace/m2e-gerrit/.repository/org/jacoco/org.jacoco.agent/0.8.5/org.jacoco.agent-0.8.5-runtime.jar=destfile=/home/jenkins/agent/workspace/m2e-gerrit/m2e-core-tests/target/jacoco.exec,append=true,includes=org.eclipse.m2e*:org.apache.maven*:org.eclipse.aether* -Xmx800m
[INFO] 
[INFO] --- maven-resources-plugin:2.5:resources (default-resources) @ org.eclipse.m2e.editor.tests ---
[debug] execute contextualize
[INFO] Using 'UTF-8' encoding to copy filtered resources.
[INFO] skip non existing resourceDirectory /home/jenkins/agent/workspace/m2e-gerrit/m2e-core-tests/org.eclipse.m2e.editor.tests/src/main/resources
[INFO] 
[INFO] --- tycho-compiler-plugin:1.7.0:compile (default-compile) @ org.eclipse.m2e.editor.tests ---
[INFO] Compiling 3 source files to /home/jenkins/agent/workspace/m2e-gerrit/m2e-core-tests/org.eclipse.m2e.editor.tests/target/classes
[INFO] 
[INFO] --- maven-resources-plugin:2.5:testResources (default-testResources) @ org.eclipse.m2e.editor.tests ---
[debug] execute contextualize
[INFO] Using 'UTF-8' encoding to copy filtered resources.
[INFO] skip non existing resourceDirectory /home/jenkins/agent/workspace/m2e-gerrit/m2e-core-tests/org.eclipse.m2e.editor.tests/src/test/resources
[INFO] 
[INFO] --- tycho-source-plugin:1.7.0:plugin-source (plugin-source) @ org.eclipse.m2e.editor.tests ---
[INFO] Building jar: /home/jenkins/agent/workspace/m2e-gerrit/m2e-core-tests/org.eclipse.m2e.editor.tests/target/org.eclipse.m2e.editor.tests-1.16.0-SNAPSHOT-sources.jar
[INFO] 
[INFO] --- target-platform-configuration:1.7.0:target-platform (default-target-platform) @ org.eclipse.m2e.editor.tests ---
[INFO] 
[INFO] --- tycho-packaging-plugin:1.7.0:package-plugin (default-package-plugin) @ org.eclipse.m2e.editor.tests ---
[INFO] Building jar: /home/jenkins/agent/workspace/m2e-gerrit/m2e-core-tests/org.eclipse.m2e.editor.tests/target/org.eclipse.m2e.editor.tests-1.16.0-SNAPSHOT.jar
[INFO] 
[INFO] --- tycho-p2-plugin:1.7.0:p2-metadata-default (default-p2-metadata-default) @ org.eclipse.m2e.editor.tests ---
[INFO] 
[INFO] --- tycho-pack200a-plugin:1.7.0:normalize (pack200-normalize) @ org.eclipse.m2e.editor.tests ---
[INFO] Pack200 normalizing jar /home/jenkins/agent/workspace/m2e-gerrit/m2e-core-tests/org.eclipse.m2e.editor.tests/target/org.eclipse.m2e.editor.tests-1.16.0-SNAPSHOT.jar
[INFO] 
[INFO] --- eclipse-jarsigner-plugin:1.1.5:sign (sign) @ org.eclipse.m2e.editor.tests ---
[INFO] Signing of nested jars of '/home/jenkins/agent/workspace/m2e-gerrit/m2e-core-tests/org.eclipse.m2e.editor.tests/target/org.eclipse.m2e.editor.tests-1.16.0-SNAPSHOT.jar' is disabled.
[INFO] Signing jar: /home/jenkins/agent/workspace/m2e-gerrit/m2e-core-tests/org.eclipse.m2e.editor.tests/target/org.eclipse.m2e.editor.tests-1.16.0-SNAPSHOT.jar
[INFO] Signing of nested jars of '/home/jenkins/agent/workspace/m2e-gerrit/m2e-core-tests/org.eclipse.m2e.editor.tests/target/org.eclipse.m2e.editor.tests-1.16.0-SNAPSHOT-sources.jar' is disabled.
[INFO] Signing jar: /home/jenkins/agent/workspace/m2e-gerrit/m2e-core-tests/org.eclipse.m2e.editor.tests/target/org.eclipse.m2e.editor.tests-1.16.0-SNAPSHOT-sources.jar
[INFO] 
[INFO] --- tycho-pack200b-plugin:1.7.0:pack (pack200-pack) @ org.eclipse.m2e.editor.tests ---
[INFO] Pack200 packing jar /home/jenkins/agent/workspace/m2e-gerrit/m2e-core-tests/org.eclipse.m2e.editor.tests/target/org.eclipse.m2e.editor.tests-1.16.0-SNAPSHOT.jar
[INFO] 
[INFO] --- tycho-p2-plugin:1.7.0:p2-metadata (p2-metadata) @ org.eclipse.m2e.editor.tests ---
[WARNING] No repository found at https://download.eclipse.org/technology/m2e/snapshots/1.16.1/latest.
org.eclipse.equinox.p2.core.ProvisionException: No repository found at https://download.eclipse.org/technology/m2e/snapshots/1.16.1/latest.
    at org.eclipse.equinox.internal.p2.repository.helpers.AbstractRepositoryManager.fail (AbstractRepositoryManager.java:396)
    at org.eclipse.equinox.internal.p2.repository.helpers.AbstractRepositoryManager.loadRepository (AbstractRepositoryManager.java:661)
    at org.eclipse.equinox.internal.p2.metadata.repository.MetadataRepositoryManager.loadRepository (MetadataRepositoryManager.java:110)
    at org.eclipse.tycho.p2.remote.RemoteMetadataRepositoryManager.loadRepository (RemoteMetadataRepositoryManager.java:61)
    at org.eclipse.tycho.p2.remote.RemoteMetadataRepositoryManager.loadRepository (RemoteMetadataRepositoryManager.java:53)
    at org.eclipse.tycho.p2.tools.baseline.BaselineServiceImpl.getProjectBaseline (BaselineServiceImpl.java:95)
    at org.eclipse.tycho.plugins.p2.BaselineValidator.validateAndReplace (BaselineValidator.java:88)
    at org.eclipse.tycho.plugins.p2.P2MetadataMojo.attachP2Metadata (P2MetadataMojo.java:183)
    at org.eclipse.tycho.plugins.p2.P2MetadataMojo.execute (P2MetadataMojo.java:137)
    at org.apache.maven.plugin.DefaultBuildPluginManager.executeMojo (DefaultBuildPluginManager.java:137)
    at org.apache.maven.lifecycle.internal.MojoExecutor.execute (MojoExecutor.java:210)
    at org.apache.maven.lifecycle.internal.MojoExecutor.execute (MojoExecutor.java:156)
    at org.apache.maven.lifecycle.internal.MojoExecutor.execute (MojoExecutor.java:148)
    at org.apache.maven.lifecycle.internal.LifecycleModuleBuilder.buildProject (LifecycleModuleBuilder.java:117)
    at org.apache.maven.lifecycle.internal.LifecycleModuleBuilder.buildProject (LifecycleModuleBuilder.java:81)
    at org.apache.maven.lifecycle.internal.builder.singlethreaded.SingleThreadedBuilder.build (SingleThreadedBuilder.java:56)
    at org.apache.maven.lifecycle.internal.LifecycleStarter.execute (LifecycleStarter.java:128)
    at org.apache.maven.DefaultMaven.doExecute (DefaultMaven.java:305)
    at org.apache.maven.DefaultMaven.doExecute (DefaultMaven.java:192)
    at org.apache.maven.DefaultMaven.execute (DefaultMaven.java:105)
    at org.apache.maven.cli.MavenCli.execute (MavenCli.java:957)
    at org.apache.maven.cli.MavenCli.doMain (MavenCli.java:289)
    at org.apache.maven.cli.MavenCli.main (MavenCli.java:193)
    at sun.reflect.NativeMethodAccessorImpl.invoke0 (Native Method)
    at sun.reflect.NativeMethodAccessorImpl.invoke (NativeMethodAccessorImpl.java:62)
    at sun.reflect.DelegatingMethodAccessorImpl.invoke (DelegatingMethodAccessorImpl.java:43)
    at java.lang.reflect.Method.invoke (Method.java:498)
    at org.codehaus.plexus.classworlds.launcher.Launcher.launchEnhanced (Launcher.java:282)
    at org.codehaus.plexus.classworlds.launcher.Launcher.launch (Launcher.java:225)
    at org.codehaus.plexus.classworlds.launcher.Launcher.mainWithExitCode (Launcher.java:406)
    at org.codehaus.plexus.classworlds.launcher.Launcher.main (Launcher.java:347)
[INFO] No baseline version MavenProject: org.eclipse.m2e:org.eclipse.m2e.editor.tests:1.16.0-SNAPSHOT @ /home/jenkins/agent/workspace/m2e-gerrit/m2e-core-tests/org.eclipse.m2e.editor.tests/pom.xml
[INFO] 
[INFO] --- tycho-surefire-plugin:1.7.0:test (default-test) @ org.eclipse.m2e.editor.tests ---
[INFO] Executing Test Runtime with timeout 7200, logs (if any) will be placed at: /home/jenkins/agent/workspace/m2e-gerrit/m2e-core-tests/org.eclipse.m2e.editor.tests/target/work/data/.metadata/.log
[INFO] Command line:
	[/opt/tools/java/oracle/jdk-8/1.8.0_202/jre/bin/java, -Dosgi.noShutdown=false, -Dosgi.os=linux, -Dosgi.ws=gtk, -Dosgi.arch=x86_64, -javaagent:/home/jenkins/agent/workspace/m2e-gerrit/.repository/org/jacoco/org.jacoco.agent/0.8.5/org.jacoco.agent-0.8.5-runtime.jar=destfile=/home/jenkins/agent/workspace/m2e-gerrit/m2e-core-tests/target/jacoco.exec,append=true,includes=org.eclipse.m2e*:org.apache.maven*:org.eclipse.aether*, -Xmx800m, -Dosgi.clean=true, -jar, /home/jenkins/agent/workspace/m2e-gerrit/.repository/p2/osgi/bundle/org.eclipse.equinox.launcher/1.5.700.v20200207-2156/org.eclipse.equinox.launcher-1.5.700.v20200207-2156.jar, -data, /home/jenkins/agent/workspace/m2e-gerrit/m2e-core-tests/org.eclipse.m2e.editor.tests/target/work/data, -install, /home/jenkins/agent/workspace/m2e-gerrit/m2e-core-tests/org.eclipse.m2e.editor.tests/target/work, -configuration, /home/jenkins/agent/workspace/m2e-gerrit/m2e-core-tests/org.eclipse.m2e.editor.tests/target/work/configuration, -application, org.eclipse.tycho.surefire.osgibooter.uitest, -testproperties, /home/jenkins/agent/workspace/m2e-gerrit/m2e-core-tests/org.eclipse.m2e.editor.tests/target/surefire.properties, -pluginCustomization, /home/jenkins/agent/workspace/m2e-gerrit/m2e-core-tests/org.eclipse.m2e.editor.tests/plugin_customization.ini, -timeout, 7200000]

(process:3884): Gtk-WARNING **: 07:37:34.652: Locale not supported by C library.
	Using the fallback 'C' locale.
SWT SessionManagerDBus: Failed to connect to org.gnome.SessionManager: Failed to execute child process ?dbus-launch? (No such file or directory)
SWT SessionManagerDBus: Failed to connect to org.xfce.SessionManager: Failed to execute child process ?dbus-launch? (No such file or directory)
Running org.eclipse.m2e.editor.dialogs.MavenModuleSelectionDialogTest
SLF4J: Failed to load class "org.slf4j.impl.StaticLoggerBinder".
SLF4J: Defaulting to no-operation (NOP) logger implementation
SLF4J: See http://www.slf4j.org/codes.html#StaticLoggerBinder for further details.
Warning: NLS missing message: MavenImpl_error_lookup in: org.eclipse.m2e.editor.internal.messages
Tests run: 1, Failures: 0, Errors: 0, Skipped: 0, Time elapsed: 4.944 s - in org.eclipse.m2e.editor.dialogs.MavenModuleSelectionDialogTest
testModuleSelection(org.eclipse.m2e.editor.dialogs.MavenModuleSelectionDialogTest)  Time elapsed: 3.303 s
Running org.eclipse.m2e.editor.dialogs.ManageDependenciesDialogTest
Tests run: 9, Failures: 0, Errors: 0, Skipped: 0, Time elapsed: 10.265 s - in org.eclipse.m2e.editor.dialogs.ManageDependenciesDialogTest
testDepLabelProvider(org.eclipse.m2e.editor.dialogs.ManageDependenciesDialogTest)  Time elapsed: 2.371 s
testBrokenSource(org.eclipse.m2e.editor.dialogs.ManageDependenciesDialogTest)  Time elapsed: 0.587 s
testBrokenTarget(org.eclipse.m2e.editor.dialogs.ManageDependenciesDialogTest)  Time elapsed: 0.528 s
testDepExistsDiffVersionDiffPOMs(org.eclipse.m2e.editor.dialogs.ManageDependenciesDialogTest)  Time elapsed: 0.958 s
testDepExists(org.eclipse.m2e.editor.dialogs.ManageDependenciesDialogTest)  Time elapsed: 0.76 s
testMultipleDependencies(org.eclipse.m2e.editor.dialogs.ManageDependenciesDialogTest)  Time elapsed: 1.528 s
testDiffPOMs(org.eclipse.m2e.editor.dialogs.ManageDependenciesDialogTest)  Time elapsed: 0.952 s
testDepExistsDiffVersion(org.eclipse.m2e.editor.dialogs.ManageDependenciesDialogTest)  Time elapsed: 0.728 s
testSamePOM(org.eclipse.m2e.editor.dialogs.ManageDependenciesDialogTest)  Time elapsed: 1.852 s
Running org.eclipse.m2e.editor.MavenPomEditorDirtyTest
Tests run: 1, Failures: 0, Errors: 0, Skipped: 0, Time elapsed: 1.738 s - in org.eclipse.m2e.editor.MavenPomEditorDirtyTest
test358656_dirtyStateAfterFSModification(org.eclipse.m2e.editor.MavenPomEditorDirtyTest)  Time elapsed: 1.737 s

Results:

Tests run: 11, Failures: 0, Errors: 0, Skipped: 0

SWT SessionManagerDBus: Failed to connect to org.gnome.SessionManager: Failed to execute child process ?dbus-launch? (No such file or directory)
SWT SessionManagerDBus: Failed to connect to org.xfce.SessionManager: Failed to execute child process ?dbus-launch? (No such file or directory)
[INFO] All tests passed!
[INFO] 
[INFO] --- tycho-p2-extras-plugin:1.7.0:compare-version-with-baselines (check-no-version-regression) @ org.eclipse.m2e.editor.tests ---
[INFO] 
[INFO] --- maven-install-plugin:2.3.1:install (default-install) @ org.eclipse.m2e.editor.tests ---
[INFO] Installing /home/jenkins/agent/workspace/m2e-gerrit/m2e-core-tests/org.eclipse.m2e.editor.tests/target/org.eclipse.m2e.editor.tests-1.16.0-SNAPSHOT.jar to /home/jenkins/agent/workspace/m2e-gerrit/.repository/org/eclipse/m2e/org.eclipse.m2e.editor.tests/1.16.0-SNAPSHOT/org.eclipse.m2e.editor.tests-1.16.0-SNAPSHOT.jar
[INFO] Installing /home/jenkins/agent/workspace/m2e-gerrit/m2e-core-tests/org.eclipse.m2e.editor.tests/pom.xml to /home/jenkins/agent/workspace/m2e-gerrit/.repository/org/eclipse/m2e/org.eclipse.m2e.editor.tests/1.16.0-SNAPSHOT/org.eclipse.m2e.editor.tests-1.16.0-SNAPSHOT.pom
[INFO] Installing /home/jenkins/agent/workspace/m2e-gerrit/m2e-core-tests/org.eclipse.m2e.editor.tests/target/org.eclipse.m2e.editor.tests-1.16.0-SNAPSHOT-sources.jar to /home/jenkins/agent/workspace/m2e-gerrit/.repository/org/eclipse/m2e/org.eclipse.m2e.editor.tests/1.16.0-SNAPSHOT/org.eclipse.m2e.editor.tests-1.16.0-SNAPSHOT-sources.jar
[INFO] Installing /home/jenkins/agent/workspace/m2e-gerrit/m2e-core-tests/org.eclipse.m2e.editor.tests/target/org.eclipse.m2e.editor.tests-1.16.0-SNAPSHOT.jar.pack.gz to /home/jenkins/agent/workspace/m2e-gerrit/.repository/org/eclipse/m2e/org.eclipse.m2e.editor.tests/1.16.0-SNAPSHOT/org.eclipse.m2e.editor.tests-1.16.0-SNAPSHOT-pack200.jar.pack.gz
[INFO] Installing /home/jenkins/agent/workspace/m2e-gerrit/m2e-core-tests/org.eclipse.m2e.editor.tests/target/p2content.xml to /home/jenkins/agent/workspace/m2e-gerrit/.repository/org/eclipse/m2e/org.eclipse.m2e.editor.tests/1.16.0-SNAPSHOT/org.eclipse.m2e.editor.tests-1.16.0-SNAPSHOT-p2metadata.xml
[INFO] Installing /home/jenkins/agent/workspace/m2e-gerrit/m2e-core-tests/org.eclipse.m2e.editor.tests/target/p2artifacts.xml to /home/jenkins/agent/workspace/m2e-gerrit/.repository/org/eclipse/m2e/org.eclipse.m2e.editor.tests/1.16.0-SNAPSHOT/org.eclipse.m2e.editor.tests-1.16.0-SNAPSHOT-p2artifacts.xml
[INFO] 
[INFO] --- tycho-p2-plugin:1.7.0:update-local-index (default-update-local-index) @ org.eclipse.m2e.editor.tests ---
[INFO] 
[INFO] ----------< org.eclipse.m2e:org.eclipse.m2e.editor.xml.tests >----------
[INFO] Building Maven POM XML Editor Tests 1.16.0-SNAPSHOT              [40/40]
[INFO] ------------------------[ eclipse-test-plugin ]-------------------------
[INFO] 
[INFO] --- maven-clean-plugin:2.4.1:clean (default-clean) @ org.eclipse.m2e.editor.xml.tests ---
[INFO] 
[INFO] --- tycho-packaging-plugin:1.7.0:build-qualifier (default-build-qualifier) @ org.eclipse.m2e.editor.xml.tests ---
[INFO] The project's OSGi version is 1.16.0.20200429-1632
[INFO] 
[INFO] --- tycho-packaging-plugin:1.7.0:validate-id (default-validate-id) @ org.eclipse.m2e.editor.xml.tests ---
[INFO] 
[INFO] --- tycho-packaging-plugin:1.7.0:validate-version (default-validate-version) @ org.eclipse.m2e.editor.xml.tests ---
[INFO] 
[INFO] --- jacoco-maven-plugin:0.8.5:prepare-agent (default) @ org.eclipse.m2e.editor.xml.tests ---
[INFO] tycho.testArgLine set to -javaagent:/home/jenkins/agent/workspace/m2e-gerrit/.repository/org/jacoco/org.jacoco.agent/0.8.5/org.jacoco.agent-0.8.5-runtime.jar=destfile=/home/jenkins/agent/workspace/m2e-gerrit/m2e-core-tests/target/jacoco.exec,append=true,includes=org.eclipse.m2e*:org.apache.maven*:org.eclipse.aether* -Xmx800m
[INFO] 
[INFO] --- maven-resources-plugin:2.5:resources (default-resources) @ org.eclipse.m2e.editor.xml.tests ---
[debug] execute contextualize
[INFO] Using 'UTF-8' encoding to copy filtered resources.
[INFO] skip non existing resourceDirectory /home/jenkins/agent/workspace/m2e-gerrit/m2e-core-tests/org.eclipse.m2e.editor.xml.tests/src/main/resources
[INFO] 
[INFO] --- tycho-compiler-plugin:1.7.0:compile (default-compile) @ org.eclipse.m2e.editor.xml.tests ---
[WARNING] Parameter 'useProjectSettings' is set to true, but preferences file '/home/jenkins/agent/workspace/m2e-gerrit/m2e-core-tests/org.eclipse.m2e.editor.xml.tests/.settings/org.eclipse.jdt.core.prefs' could not be found!
[INFO] Compiling 22 source files to /home/jenkins/agent/workspace/m2e-gerrit/m2e-core-tests/org.eclipse.m2e.editor.xml.tests/target/classes
[INFO] 
[INFO] --- maven-resources-plugin:2.5:testResources (default-testResources) @ org.eclipse.m2e.editor.xml.tests ---
[debug] execute contextualize
[INFO] Using 'UTF-8' encoding to copy filtered resources.
[INFO] skip non existing resourceDirectory /home/jenkins/agent/workspace/m2e-gerrit/m2e-core-tests/org.eclipse.m2e.editor.xml.tests/src/test/resources
[INFO] 
[INFO] --- tycho-source-plugin:1.7.0:plugin-source (plugin-source) @ org.eclipse.m2e.editor.xml.tests ---
[INFO] Building jar: /home/jenkins/agent/workspace/m2e-gerrit/m2e-core-tests/org.eclipse.m2e.editor.xml.tests/target/org.eclipse.m2e.editor.xml.tests-1.16.0-SNAPSHOT-sources.jar
[INFO] 
[INFO] --- target-platform-configuration:1.7.0:target-platform (default-target-platform) @ org.eclipse.m2e.editor.xml.tests ---
[INFO] 
[INFO] --- tycho-packaging-plugin:1.7.0:package-plugin (default-package-plugin) @ org.eclipse.m2e.editor.xml.tests ---
[INFO] Building jar: /home/jenkins/agent/workspace/m2e-gerrit/m2e-core-tests/org.eclipse.m2e.editor.xml.tests/target/org.eclipse.m2e.editor.xml.tests-1.16.0-SNAPSHOT.jar
[INFO] 
[INFO] --- tycho-p2-plugin:1.7.0:p2-metadata-default (default-p2-metadata-default) @ org.eclipse.m2e.editor.xml.tests ---
[INFO] 
[INFO] --- tycho-pack200a-plugin:1.7.0:normalize (pack200-normalize) @ org.eclipse.m2e.editor.xml.tests ---
[INFO] Pack200 normalizing jar /home/jenkins/agent/workspace/m2e-gerrit/m2e-core-tests/org.eclipse.m2e.editor.xml.tests/target/org.eclipse.m2e.editor.xml.tests-1.16.0-SNAPSHOT.jar
[INFO] 
[INFO] --- eclipse-jarsigner-plugin:1.1.5:sign (sign) @ org.eclipse.m2e.editor.xml.tests ---
[INFO] Signing of nested jars of '/home/jenkins/agent/workspace/m2e-gerrit/m2e-core-tests/org.eclipse.m2e.editor.xml.tests/target/org.eclipse.m2e.editor.xml.tests-1.16.0-SNAPSHOT.jar' is disabled.
[INFO] Signing jar: /home/jenkins/agent/workspace/m2e-gerrit/m2e-core-tests/org.eclipse.m2e.editor.xml.tests/target/org.eclipse.m2e.editor.xml.tests-1.16.0-SNAPSHOT.jar
[INFO] Signing of nested jars of '/home/jenkins/agent/workspace/m2e-gerrit/m2e-core-tests/org.eclipse.m2e.editor.xml.tests/target/org.eclipse.m2e.editor.xml.tests-1.16.0-SNAPSHOT-sources.jar' is disabled.
[INFO] Signing jar: /home/jenkins/agent/workspace/m2e-gerrit/m2e-core-tests/org.eclipse.m2e.editor.xml.tests/target/org.eclipse.m2e.editor.xml.tests-1.16.0-SNAPSHOT-sources.jar
[INFO] 
[INFO] --- tycho-pack200b-plugin:1.7.0:pack (pack200-pack) @ org.eclipse.m2e.editor.xml.tests ---
[INFO] Pack200 packing jar /home/jenkins/agent/workspace/m2e-gerrit/m2e-core-tests/org.eclipse.m2e.editor.xml.tests/target/org.eclipse.m2e.editor.xml.tests-1.16.0-SNAPSHOT.jar
[INFO] 
[INFO] --- tycho-p2-plugin:1.7.0:p2-metadata (p2-metadata) @ org.eclipse.m2e.editor.xml.tests ---
[WARNING] No repository found at https://download.eclipse.org/technology/m2e/snapshots/1.16.1/latest.
org.eclipse.equinox.p2.core.ProvisionException: No repository found at https://download.eclipse.org/technology/m2e/snapshots/1.16.1/latest.
    at org.eclipse.equinox.internal.p2.repository.helpers.AbstractRepositoryManager.fail (AbstractRepositoryManager.java:396)
    at org.eclipse.equinox.internal.p2.repository.helpers.AbstractRepositoryManager.loadRepository (AbstractRepositoryManager.java:661)
    at org.eclipse.equinox.internal.p2.metadata.repository.MetadataRepositoryManager.loadRepository (MetadataRepositoryManager.java:110)
    at org.eclipse.tycho.p2.remote.RemoteMetadataRepositoryManager.loadRepository (RemoteMetadataRepositoryManager.java:61)
    at org.eclipse.tycho.p2.remote.RemoteMetadataRepositoryManager.loadRepository (RemoteMetadataRepositoryManager.java:53)
    at org.eclipse.tycho.p2.tools.baseline.BaselineServiceImpl.getProjectBaseline (BaselineServiceImpl.java:95)
    at org.eclipse.tycho.plugins.p2.BaselineValidator.validateAndReplace (BaselineValidator.java:88)
    at org.eclipse.tycho.plugins.p2.P2MetadataMojo.attachP2Metadata (P2MetadataMojo.java:183)
    at org.eclipse.tycho.plugins.p2.P2MetadataMojo.execute (P2MetadataMojo.java:137)
    at org.apache.maven.plugin.DefaultBuildPluginManager.executeMojo (DefaultBuildPluginManager.java:137)
    at org.apache.maven.lifecycle.internal.MojoExecutor.execute (MojoExecutor.java:210)
    at org.apache.maven.lifecycle.internal.MojoExecutor.execute (MojoExecutor.java:156)
    at org.apache.maven.lifecycle.internal.MojoExecutor.execute (MojoExecutor.java:148)
    at org.apache.maven.lifecycle.internal.LifecycleModuleBuilder.buildProject (LifecycleModuleBuilder.java:117)
    at org.apache.maven.lifecycle.internal.LifecycleModuleBuilder.buildProject (LifecycleModuleBuilder.java:81)
    at org.apache.maven.lifecycle.internal.builder.singlethreaded.SingleThreadedBuilder.build (SingleThreadedBuilder.java:56)
    at org.apache.maven.lifecycle.internal.LifecycleStarter.execute (LifecycleStarter.java:128)
    at org.apache.maven.DefaultMaven.doExecute (DefaultMaven.java:305)
    at org.apache.maven.DefaultMaven.doExecute (DefaultMaven.java:192)
    at org.apache.maven.DefaultMaven.execute (DefaultMaven.java:105)
    at org.apache.maven.cli.MavenCli.execute (MavenCli.java:957)
    at org.apache.maven.cli.MavenCli.doMain (MavenCli.java:289)
    at org.apache.maven.cli.MavenCli.main (MavenCli.java:193)
    at sun.reflect.NativeMethodAccessorImpl.invoke0 (Native Method)
    at sun.reflect.NativeMethodAccessorImpl.invoke (NativeMethodAccessorImpl.java:62)
    at sun.reflect.DelegatingMethodAccessorImpl.invoke (DelegatingMethodAccessorImpl.java:43)
    at java.lang.reflect.Method.invoke (Method.java:498)
    at org.codehaus.plexus.classworlds.launcher.Launcher.launchEnhanced (Launcher.java:282)
    at org.codehaus.plexus.classworlds.launcher.Launcher.launch (Launcher.java:225)
    at org.codehaus.plexus.classworlds.launcher.Launcher.mainWithExitCode (Launcher.java:406)
    at org.codehaus.plexus.classworlds.launcher.Launcher.main (Launcher.java:347)
[INFO] No baseline version MavenProject: org.eclipse.m2e:org.eclipse.m2e.editor.xml.tests:1.16.0-SNAPSHOT @ /home/jenkins/agent/workspace/m2e-gerrit/m2e-core-tests/org.eclipse.m2e.editor.xml.tests/pom.xml
[INFO] 
[INFO] --- tycho-surefire-plugin:1.7.0:test (default-test) @ org.eclipse.m2e.editor.xml.tests ---
[INFO] Executing Test Runtime with timeout 7200, logs (if any) will be placed at: /home/jenkins/agent/workspace/m2e-gerrit/m2e-core-tests/org.eclipse.m2e.editor.xml.tests/target/work/data/.metadata/.log
[INFO] Command line:
	[/opt/tools/java/oracle/jdk-8/1.8.0_202/jre/bin/java, -Dosgi.noShutdown=false, -Dosgi.os=linux, -Dosgi.ws=gtk, -Dosgi.arch=x86_64, -javaagent:/home/jenkins/agent/workspace/m2e-gerrit/.repository/org/jacoco/org.jacoco.agent/0.8.5/org.jacoco.agent-0.8.5-runtime.jar=destfile=/home/jenkins/agent/workspace/m2e-gerrit/m2e-core-tests/target/jacoco.exec,append=true,includes=org.eclipse.m2e*:org.apache.maven*:org.eclipse.aether*, -Xmx800m, -Dosgi.clean=true, -jar, /home/jenkins/agent/workspace/m2e-gerrit/.repository/p2/osgi/bundle/org.eclipse.equinox.launcher/1.5.700.v20200207-2156/org.eclipse.equinox.launcher-1.5.700.v20200207-2156.jar, -data, /home/jenkins/agent/workspace/m2e-gerrit/m2e-core-tests/org.eclipse.m2e.editor.xml.tests/target/work/data, -install, /home/jenkins/agent/workspace/m2e-gerrit/m2e-core-tests/org.eclipse.m2e.editor.xml.tests/target/work, -configuration, /home/jenkins/agent/workspace/m2e-gerrit/m2e-core-tests/org.eclipse.m2e.editor.xml.tests/target/work/configuration, -application, org.eclipse.tycho.surefire.osgibooter.uitest, -testproperties, /home/jenkins/agent/workspace/m2e-gerrit/m2e-core-tests/org.eclipse.m2e.editor.xml.tests/target/surefire.properties, -pluginCustomization, /home/jenkins/agent/workspace/m2e-gerrit/m2e-core-tests/org.eclipse.m2e.editor.xml.tests/plugin_customization.ini, -timeout, 7200000]

(process:4010): Gtk-WARNING **: 07:38:01.078: Locale not supported by C library.
	Using the fallback 'C' locale.
SWT SessionManagerDBus: Failed to connect to org.gnome.SessionManager: Failed to execute child process ?dbus-launch? (No such file or directory)
SWT SessionManagerDBus: Failed to connect to org.xfce.SessionManager: Failed to execute child process ?dbus-launch? (No such file or directory)
SLF4J: Failed to load class "org.slf4j.impl.StaticLoggerBinder".
SLF4J: Defaulting to no-operation (NOP) logger implementation
SLF4J: See http://www.slf4j.org/codes.html#StaticLoggerBinder for further details.
Running org.eclipse.m2e.editor.xml.FileCompletionTest
Warning: NLS missing message: MavenImpl_error_lookup in: org.eclipse.m2e.editor.internal.messages
Tests run: 2, Failures: 2, Errors: 0, Skipped: 0, Time elapsed: 4.561 s <<< FAILURE! - in org.eclipse.m2e.editor.xml.FileCompletionTest
testFilesAndDirsCompletion(org.eclipse.m2e.editor.xml.FileCompletionTest)  Time elapsed: 3.261 s  <<< FAILURE!
java.lang.AssertionError: expected:<2> but was:<6>
	at org.eclipse.m2e.editor.xml.FileCompletionTest.testFilesAndDirsCompletion(FileCompletionTest.java:104)

testModuleCompletion(org.eclipse.m2e.editor.xml.FileCompletionTest)  Time elapsed: 1.069 s  <<< FAILURE!
java.lang.AssertionError: expected:<2> but was:<3>
	at org.eclipse.m2e.editor.xml.FileCompletionTest.testModuleCompletion(FileCompletionTest.java:73)

Running org.eclipse.m2e.editor.xml.HyperlinkTest
true
Tests run: 1, Failures: 0, Errors: 0, Skipped: 0, Time elapsed: 1.972 s - in org.eclipse.m2e.editor.xml.HyperlinkTest
testHasLink(org.eclipse.m2e.editor.xml.HyperlinkTest)  Time elapsed: 1.971 s
Running org.eclipse.m2e.editor.xml.RelativePath2Test
Tests run: 1, Failures: 0, Errors: 0, Skipped: 0, Time elapsed: 0.98 s - in org.eclipse.m2e.editor.xml.RelativePath2Test
testRelativePath(org.eclipse.m2e.editor.xml.RelativePath2Test)  Time elapsed: 0.979 s
Running org.eclipse.m2e.editor.xml.PluginConfigCompletionTest
Unable to set nested messages property.
Tests run: 12, Failures: 0, Errors: 0, Skipped: 0, Time elapsed: 23.793 s - in org.eclipse.m2e.editor.xml.PluginConfigCompletionTest
testMetadataExtension(org.eclipse.m2e.editor.xml.PluginConfigCompletionTest)  Time elapsed: 10.14 s
testAllMojosCompletion(org.eclipse.m2e.editor.xml.PluginConfigCompletionTest)  Time elapsed: 2.205 s
testListItemNameCompletion(org.eclipse.m2e.editor.xml.PluginConfigCompletionTest)  Time elapsed: 1.145 s
testImplementationListItemNameCompletion(org.eclipse.m2e.editor.xml.PluginConfigCompletionTest)  Time elapsed: 1.052 s
testListItemParameterCompletion(org.eclipse.m2e.editor.xml.PluginConfigCompletionTest)  Time elapsed: 1.019 s
testM2ELifecycleMappingConfiguration(org.eclipse.m2e.editor.xml.PluginConfigCompletionTest)  Time elapsed: 0.978 s
testImplementationContentCompletion(org.eclipse.m2e.editor.xml.PluginConfigCompletionTest)  Time elapsed: 1.129 s
testSubclassListItems(org.eclipse.m2e.editor.xml.PluginConfigCompletionTest)  Time elapsed: 1.52 s
testNestedParameterCompletion(org.eclipse.m2e.editor.xml.PluginConfigCompletionTest)  Time elapsed: 1.061 s
testSingleMojoCompletion(org.eclipse.m2e.editor.xml.PluginConfigCompletionTest)  Time elapsed: 1.444 s
testAnyListItemNameParameterCompletion(org.eclipse.m2e.editor.xml.PluginConfigCompletionTest)  Time elapsed: 0.886 s
testUnknownContentCompletion(org.eclipse.m2e.editor.xml.PluginConfigCompletionTest)  Time elapsed: 1.213 s
Running org.eclipse.m2e.editor.xml.WarnIfGroupSameThanParentTest
Tests run: 1, Failures: 0, Errors: 0, Skipped: 0, Time elapsed: 2.435 s - in org.eclipse.m2e.editor.xml.WarnIfGroupSameThanParentTest
testMNGEclipse2552(org.eclipse.m2e.editor.xml.WarnIfGroupSameThanParentTest)  Time elapsed: 2.434 s
Running org.eclipse.m2e.editor.xml.PomContentAssistProcessorTest
Tests run: 1, Failures: 0, Errors: 0, Skipped: 0, Time elapsed: 0.002 s - in org.eclipse.m2e.editor.xml.PomContentAssistProcessorTest
testExtractPrefix(org.eclipse.m2e.editor.xml.PomContentAssistProcessorTest)  Time elapsed: 0.001 s
Running org.eclipse.m2e.editor.xml.ExtractProjectTest
Tests run: 1, Failures: 0, Errors: 0, Skipped: 0, Time elapsed: 1.154 s - in org.eclipse.m2e.editor.xml.ExtractProjectTest
testExtractProject(org.eclipse.m2e.editor.xml.ExtractProjectTest)  Time elapsed: 1.153 s
Running org.eclipse.m2e.editor.xml.ManagedArtifactMarkerTest
Tests run: 7, Failures: 0, Errors: 0, Skipped: 0, Time elapsed: 9.69 s - in org.eclipse.m2e.editor.xml.ManagedArtifactMarkerTest
test439309_errorOnManagedVersionOverride(org.eclipse.m2e.editor.xml.ManagedArtifactMarkerTest)  Time elapsed: 2.52 s
test439309_ignoreManagedVersionOverride(org.eclipse.m2e.editor.xml.ManagedArtifactMarkerTest)  Time elapsed: 1.303 s
test355882_noMarkerOnDifferentClassifier(org.eclipse.m2e.editor.xml.ManagedArtifactMarkerTest)  Time elapsed: 1.146 s
test553839_noErrorCausedByPluginVersionFromSuperPom(org.eclipse.m2e.editor.xml.ManagedArtifactMarkerTest)  Time elapsed: 1.069 s
testMNGEclipse2559Second(org.eclipse.m2e.editor.xml.ManagedArtifactMarkerTest)  Time elapsed: 1.269 s
test355882_MarkerOnClassifierVersionOverride(org.eclipse.m2e.editor.xml.ManagedArtifactMarkerTest)  Time elapsed: 1.12 s
testMNGEclipse2559(org.eclipse.m2e.editor.xml.ManagedArtifactMarkerTest)  Time elapsed: 1.262 s
Running org.eclipse.m2e.editor.xml.HoverTest
Tests run: 1, Failures: 0, Errors: 0, Skipped: 0, Time elapsed: 1.101 s - in org.eclipse.m2e.editor.xml.HoverTest
testHasHover(org.eclipse.m2e.editor.xml.HoverTest)  Time elapsed: 1.101 s
Running org.eclipse.m2e.editor.xml.RelativePath3Test
Tests run: 1, Failures: 0, Errors: 0, Skipped: 0, Time elapsed: 1.426 s - in org.eclipse.m2e.editor.xml.RelativePath3Test
testRelativePath(org.eclipse.m2e.editor.xml.RelativePath3Test)  Time elapsed: 1.425 s
Running org.eclipse.m2e.editor.xml.PropertyCompletionTest
Tests run: 1, Failures: 0, Errors: 0, Skipped: 0, Time elapsed: 1 s - in org.eclipse.m2e.editor.xml.PropertyCompletionTest
testCompletion(org.eclipse.m2e.editor.xml.PropertyCompletionTest)  Time elapsed: 1 s
Running org.eclipse.m2e.editor.xml.RelativePath1Test
Tests run: 1, Failures: 0, Errors: 0, Skipped: 0, Time elapsed: 0.975 s - in org.eclipse.m2e.editor.xml.RelativePath1Test
testRelativePath(org.eclipse.m2e.editor.xml.RelativePath1Test)  Time elapsed: 0.974 s
Running org.eclipse.m2e.editor.xml.ExtractProject2Test
Tests run: 1, Failures: 0, Errors: 0, Skipped: 0, Time elapsed: 1.157 s - in org.eclipse.m2e.editor.xml.ExtractProject2Test
testExtractProject(org.eclipse.m2e.editor.xml.ExtractProject2Test)  Time elapsed: 1.157 s
Running org.eclipse.m2e.editor.xml.PomEditsTest
Tests run: 2, Failures: 0, Errors: 0, Skipped: 0, Time elapsed: 1.752 s - in org.eclipse.m2e.editor.xml.PomEditsTest
test371438_insertAt_insideEmptyElement(org.eclipse.m2e.editor.xml.PomEditsTest)  Time elapsed: 0.799 s
test467590_emptyPom(org.eclipse.m2e.editor.xml.PomEditsTest)  Time elapsed: 0.952 s
Running org.eclipse.m2e.editor.xml.PomTemplateContextTest
Tests run: 11, Failures: 0, Errors: 0, Skipped: 0, Time elapsed: 7.254 s - in org.eclipse.m2e.editor.xml.PomTemplateContextTest
testGetTemplatesArtifactId_WithGroupId(org.eclipse.m2e.editor.xml.PomTemplateContextTest)  Time elapsed: 0.673 s
testGetTemplatesDependencyScope(org.eclipse.m2e.editor.xml.PomTemplateContextTest)  Time elapsed: 0.785 s
test439251_GetTemplatesConfigurationFromMojoWithEmptyParameters(org.eclipse.m2e.editor.xml.PomTemplateContextTest)  Time elapsed: 0.768 s
testGetTemplatesPackaging(org.eclipse.m2e.editor.xml.PomTemplateContextTest)  Time elapsed: 0.535 s
testGetTemplatesVersion_WithoutGroupId(org.eclipse.m2e.editor.xml.PomTemplateContextTest)  Time elapsed: 0.551 s
testGetTemplatesArtifactId_WithoutGroupId(org.eclipse.m2e.editor.xml.PomTemplateContextTest)  Time elapsed: 0.576 s
testGetTemplatesConfiguration(org.eclipse.m2e.editor.xml.PomTemplateContextTest)  Time elapsed: 0.793 s
testGetTemplatesDependencyManagementScope(org.eclipse.m2e.editor.xml.PomTemplateContextTest)  Time elapsed: 0.592 s
testGetTemplatesVersion_WithGroupId(org.eclipse.m2e.editor.xml.PomTemplateContextTest)  Time elapsed: 0.686 s
testGetTemplatesPhase(org.eclipse.m2e.editor.xml.PomTemplateContextTest)  Time elapsed: 0.718 s
testGetTemplatesGoal(org.eclipse.m2e.editor.xml.PomTemplateContextTest)  Time elapsed: 0.576 s
Running org.eclipse.m2e.editor.xml.HoverDependencyManagedTest
Tests run: 1, Failures: 0, Errors: 0, Skipped: 0, Time elapsed: 0.974 s - in org.eclipse.m2e.editor.xml.HoverDependencyManagedTest
testHasHover(org.eclipse.m2e.editor.xml.HoverDependencyManagedTest)  Time elapsed: 0.974 s
Running org.eclipse.m2e.editor.xml.MissingSchemaMarkerTest
Tests run: 1, Failures: 0, Errors: 0, Skipped: 0, Time elapsed: 1.143 s - in org.eclipse.m2e.editor.xml.MissingSchemaMarkerTest
testMissingSchemaMarker(org.eclipse.m2e.editor.xml.MissingSchemaMarkerTest)  Time elapsed: 1.141 s

Results:

Failures: 
  FileCompletionTest.testFilesAndDirsCompletion:104 expected:<2> but was:<6>
  FileCompletionTest.testModuleCompletion:73 expected:<2> but was:<3>

Tests run: 46, Failures: 2, Errors: 0, Skipped: 0

[ERROR] There are test failures.

Please refer to /home/jenkins/agent/workspace/m2e-gerrit/m2e-core-tests/org.eclipse.m2e.editor.xml.tests/target/surefire-reports for the individual test results.
[INFO] 
[INFO] --- tycho-p2-extras-plugin:1.7.0:compare-version-with-baselines (check-no-version-regression) @ org.eclipse.m2e.editor.xml.tests ---
[INFO] 
[INFO] --- maven-install-plugin:2.3.1:install (default-install) @ org.eclipse.m2e.editor.xml.tests ---
[INFO] Installing /home/jenkins/agent/workspace/m2e-gerrit/m2e-core-tests/org.eclipse.m2e.editor.xml.tests/target/org.eclipse.m2e.editor.xml.tests-1.16.0-SNAPSHOT.jar to /home/jenkins/agent/workspace/m2e-gerrit/.repository/org/eclipse/m2e/org.eclipse.m2e.editor.xml.tests/1.16.0-SNAPSHOT/org.eclipse.m2e.editor.xml.tests-1.16.0-SNAPSHOT.jar
[INFO] Installing /home/jenkins/agent/workspace/m2e-gerrit/m2e-core-tests/org.eclipse.m2e.editor.xml.tests/pom.xml to /home/jenkins/agent/workspace/m2e-gerrit/.repository/org/eclipse/m2e/org.eclipse.m2e.editor.xml.tests/1.16.0-SNAPSHOT/org.eclipse.m2e.editor.xml.tests-1.16.0-SNAPSHOT.pom
[INFO] Installing /home/jenkins/agent/workspace/m2e-gerrit/m2e-core-tests/org.eclipse.m2e.editor.xml.tests/target/org.eclipse.m2e.editor.xml.tests-1.16.0-SNAPSHOT-sources.jar to /home/jenkins/agent/workspace/m2e-gerrit/.repository/org/eclipse/m2e/org.eclipse.m2e.editor.xml.tests/1.16.0-SNAPSHOT/org.eclipse.m2e.editor.xml.tests-1.16.0-SNAPSHOT-sources.jar
[INFO] Installing /home/jenkins/agent/workspace/m2e-gerrit/m2e-core-tests/org.eclipse.m2e.editor.xml.tests/target/org.eclipse.m2e.editor.xml.tests-1.16.0-SNAPSHOT.jar.pack.gz to /home/jenkins/agent/workspace/m2e-gerrit/.repository/org/eclipse/m2e/org.eclipse.m2e.editor.xml.tests/1.16.0-SNAPSHOT/org.eclipse.m2e.editor.xml.tests-1.16.0-SNAPSHOT-pack200.jar.pack.gz
[INFO] Installing /home/jenkins/agent/workspace/m2e-gerrit/m2e-core-tests/org.eclipse.m2e.editor.xml.tests/target/p2content.xml to /home/jenkins/agent/workspace/m2e-gerrit/.repository/org/eclipse/m2e/org.eclipse.m2e.editor.xml.tests/1.16.0-SNAPSHOT/org.eclipse.m2e.editor.xml.tests-1.16.0-SNAPSHOT-p2metadata.xml
[INFO] Installing /home/jenkins/agent/workspace/m2e-gerrit/m2e-core-tests/org.eclipse.m2e.editor.xml.tests/target/p2artifacts.xml to /home/jenkins/agent/workspace/m2e-gerrit/.repository/org/eclipse/m2e/org.eclipse.m2e.editor.xml.tests/1.16.0-SNAPSHOT/org.eclipse.m2e.editor.xml.tests-1.16.0-SNAPSHOT-p2artifacts.xml
[INFO] 
[INFO] --- tycho-p2-plugin:1.7.0:update-local-index (default-update-local-index) @ org.eclipse.m2e.editor.xml.tests ---
[INFO] ------------------------------------------------------------------------
[INFO] Reactor Summary:
[INFO] 
[INFO] Maven Integration for Eclipse (parent) 1.16.0-SNAPSHOT SUCCESS [  3.323 s]
[INFO] Maven Project Model Edit Bundle 1.16.0-SNAPSHOT .... SUCCESS [  9.779 s]
[INFO] Maven Integration for Eclipse Core Plug-in 1.16.0-SNAPSHOT SUCCESS [ 10.219 s]
[INFO] Maven Integration for Eclipse UI Plug-in 1.16.0-SNAPSHOT SUCCESS [  6.856 s]
[INFO] Maven Integration for Eclipse Launching 1.16.0-SNAPSHOT SUCCESS [  3.709 s]
[INFO] Maven Integration for Eclipse JDT 1.16.0-SNAPSHOT .. SUCCESS [  3.722 s]
[INFO] Maven Integration for Eclipse JDT UI 1.16.0-SNAPSHOT SUCCESS [  3.550 s]
[INFO] Maven POM Refactoring 1.16.0-SNAPSHOT .............. SUCCESS [  3.534 s]
[INFO] m2e Marketplace 1.16.0-SNAPSHOT .................... SUCCESS [  3.618 s]
[INFO] Maven POM Editor 1.16.0-SNAPSHOT ................... SUCCESS [  4.348 s]
[INFO] Maven POM XML Editor 1.16.0-SNAPSHOT ............... SUCCESS [  3.849 s]
[INFO] org.eclipse.m2e.lifecyclemapping.defaults 1.16.0-SNAPSHOT SUCCESS [  3.706 s]
[INFO] org.eclipse.m2e.scm 1.16.0-SNAPSHOT ................ SUCCESS [  3.535 s]
[INFO] Maven Profile Manager Core 1.16.0-SNAPSHOT ......... SUCCESS [  3.047 s]
[INFO] Maven Profile Manager UI 1.16.0-SNAPSHOT ........... SUCCESS [  3.282 s]
[INFO] Maven Integration for Eclipse Importer framework 1.16.0-SNAPSHOT SUCCESS [  3.005 s]
[INFO] org.eclipse.m2e.sourcelookup 1.16.0-SNAPSHOT ....... SUCCESS [  3.199 s]
[INFO] org.eclipse.m2e.binaryproject 1.16.0-SNAPSHOT ...... SUCCESS [  3.516 s]
[INFO] org.eclipse.m2e.binaryproject.ui 1.16.0-SNAPSHOT ... SUCCESS [  3.090 s]
[INFO] org.eclipse.m2e.sourcelookup.ui 1.16.0-SNAPSHOT .... SUCCESS [  3.214 s]
[INFO] org.eclipse.m2e.editor.lemminx 1.16.1-SNAPSHOT ..... SUCCESS [ 14.608 s]
[INFO] M2E Testing Helpers 1.16.0-SNAPSHOT ................ SUCCESS [  3.389 s]
[INFO] org.eclipse.m2e.logback.appender 1.16.0-SNAPSHOT ... SUCCESS [  3.228 s]
[INFO] org.eclipse.m2e.logback.configuration 1.16.0-SNAPSHOT SUCCESS [  3.155 s]
[INFO] org.eclipse.m2e.sse.ui.feature 1.16.0-SNAPSHOT ..... SUCCESS [  1.468 s]
[INFO] Maven Integration for Eclipse 1.16.0-SNAPSHOT ...... SUCCESS [  2.249 s]
[INFO] org.eclipse.m2e.lemminx.feature 1.16.1-SNAPSHOT .... SUCCESS [  1.300 s]
[INFO] m2e extensions development support (Optional) 1.16.0-SNAPSHOT SUCCESS [  1.652 s]
[INFO] Maven Integration for Eclipse slf4j over logback logging (Optional) 1.16.0-SNAPSHOT SUCCESS [  1.586 s]
[INFO] Maven Integration for Eclipse Update Site 1.16.0-SNAPSHOT SUCCESS [  3.037 s]
[INFO] org.eclipse.m2e.core.tests 1.16.0-SNAPSHOT ......... SUCCESS [ 31.443 s]
[INFO] Tests for Maven Integration for Eclipse Importer framework 1.16.0-SNAPSHOT SUCCESS [ 16.987 s]
[INFO] org.eclipse.m2e.binaryproject.tests 1.16.0-SNAPSHOT  SUCCESS [ 21.443 s]
[INFO] org.eclipse.m2e.editor.lemminx.tests 1.16.0-SNAPSHOT SUCCESS [ 16.690 s]
[INFO] org.eclipse.m2e.jdt.tests 1.16.0-SNAPSHOT .......... SUCCESS [ 18.800 s]
[INFO] org.eclipse.m2e.editor.xml.sse.tests 1.16.0-SNAPSHOT SUCCESS [ 11.863 s]
[INFO] m2e-core-tests 1.16.0-SNAPSHOT ..................... SUCCESS [  0.009 s]
[INFO] Maven Integration for Eclipse tests 1.16.0-SNAPSHOT  SUCCESS [10:39 min]
[INFO] Maven Integration for Eclipse POM Editor tests 1.16.0-SNAPSHOT SUCCESS [ 26.646 s]
[INFO] Maven POM XML Editor Tests 1.16.0-SNAPSHOT ......... SUCCESS [01:11 min]
[INFO] ------------------------------------------------------------------------
[INFO] BUILD SUCCESS
[INFO] ------------------------------------------------------------------------
[INFO] Total time:  17:27 min
[INFO] Finished at: 2020-07-02T07:39:07Z
[INFO] ------------------------------------------------------------------------
Terminating xvnc.

Thu Jul  2 07:39:09 2020
 ComparingUpdateTracker: 0 pixels in / 0 pixels out
 ComparingUpdateTracker: (1:-nan ratio)
$ ssh-agent -k
unset SSH_AUTH_SOCK;
unset SSH_AGENT_PID;
echo Agent pid 73 killed;
[ssh-agent] Stopped.
Recording test results
Build step 'Publish JUnit test result report' changed build result to UNSTABLE
Archiving artifacts
Finished: UNSTABLE