FailedConsole Output

Skipping 1,090 KB.. Full Log
.4/2.6 MB | 54 kB | 85 kB | 106/291 kB
Progress (4): 1.4/2.6 MB | 54 kB | 85 kB | 106/291 kB
Progress (4): 1.4/2.6 MB | 54 kB | 85 kB | 110/291 kB
Progress (4): 1.4/2.6 MB | 54 kB | 85 kB | 110/291 kB
Progress (4): 1.4/2.6 MB | 54 kB | 85 kB | 114/291 kB
Progress (4): 1.4/2.6 MB | 54 kB | 85 kB | 114/291 kB
Progress (4): 1.4/2.6 MB | 54 kB | 85 kB | 118/291 kB
Progress (4): 1.4/2.6 MB | 54 kB | 85 kB | 118/291 kB
Progress (4): 1.4/2.6 MB | 54 kB | 85 kB | 122/291 kB
Progress (4): 1.5/2.6 MB | 54 kB | 85 kB | 122/291 kB
Progress (4): 1.5/2.6 MB | 54 kB | 85 kB | 126/291 kB
Progress (4): 1.5/2.6 MB | 54 kB | 85 kB | 126/291 kB
Progress (4): 1.5/2.6 MB | 54 kB | 85 kB | 130/291 kB
Progress (4): 1.5/2.6 MB | 54 kB | 85 kB | 130/291 kB
Progress (4): 1.5/2.6 MB | 54 kB | 85 kB | 131/291 kB
Progress (4): 1.5/2.6 MB | 54 kB | 85 kB | 131/291 kB
Progress (4): 1.5/2.6 MB | 54 kB | 85 kB | 135/291 kB
Progress (4): 1.5/2.6 MB | 54 kB | 85 kB | 135/291 kB
Progress (4): 1.5/2.6 MB | 54 kB | 85 kB | 139/291 kB
Progress (4): 1.5/2.6 MB | 54 kB | 85 kB | 139/291 kB
Progress (4): 1.5/2.6 MB | 54 kB | 85 kB | 143/291 kB
Progress (4): 1.5/2.6 MB | 54 kB | 85 kB | 143/291 kB
Progress (4): 1.5/2.6 MB | 54 kB | 85 kB | 147/291 kB
Progress (4): 1.5/2.6 MB | 54 kB | 85 kB | 147/291 kB
Progress (4): 1.5/2.6 MB | 54 kB | 85 kB | 151/291 kB
Progress (4): 1.5/2.6 MB | 54 kB | 85 kB | 151/291 kB
Progress (4): 1.5/2.6 MB | 54 kB | 85 kB | 155/291 kB
Progress (4): 1.5/2.6 MB | 54 kB | 85 kB | 155/291 kB
Progress (4): 1.5/2.6 MB | 54 kB | 85 kB | 159/291 kB
Progress (4): 1.5/2.6 MB | 54 kB | 85 kB | 159/291 kB
Progress (4): 1.5/2.6 MB | 54 kB | 85 kB | 163/291 kB
Progress (4): 1.5/2.6 MB | 54 kB | 85 kB | 163/291 kB
Progress (4): 1.5/2.6 MB | 54 kB | 85 kB | 167/291 kB
Progress (4): 1.5/2.6 MB | 54 kB | 85 kB | 167/291 kB
Progress (4): 1.5/2.6 MB | 54 kB | 85 kB | 171/291 kB
Progress (4): 1.5/2.6 MB | 54 kB | 85 kB | 171/291 kB
Progress (4): 1.5/2.6 MB | 54 kB | 85 kB | 175/291 kB
Progress (4): 1.5/2.6 MB | 54 kB | 85 kB | 175/291 kB
Progress (4): 1.5/2.6 MB | 54 kB | 85 kB | 179/291 kB
Progress (4): 1.5/2.6 MB | 54 kB | 85 kB | 179/291 kB
Progress (4): 1.5/2.6 MB | 54 kB | 85 kB | 183/291 kB
Progress (4): 1.5/2.6 MB | 54 kB | 85 kB | 183/291 kB
Progress (4): 1.5/2.6 MB | 54 kB | 85 kB | 187/291 kB
Progress (4): 1.5/2.6 MB | 54 kB | 85 kB | 187/291 kB
Progress (4): 1.5/2.6 MB | 54 kB | 85 kB | 191/291 kB
Progress (4): 1.5/2.6 MB | 54 kB | 85 kB | 191/291 kB
Progress (4): 1.5/2.6 MB | 54 kB | 85 kB | 195/291 kB
Progress (4): 1.5/2.6 MB | 54 kB | 85 kB | 195/291 kB
Progress (4): 1.5/2.6 MB | 54 kB | 85 kB | 199/291 kB
Progress (4): 1.5/2.6 MB | 54 kB | 85 kB | 199/291 kB
Progress (4): 1.5/2.6 MB | 54 kB | 85 kB | 203/291 kB
                                                     
Downloaded from eclipse.maven.central.mirror: https://repo.eclipse.org/content/repositories/maven_central/org/codehaus/plexus/plexus-interpolation/1.25/plexus-interpolation-1.25.jar (85 kB at 184 kB/s)
Progress (3): 1.5/2.6 MB | 54 kB | 207/291 kB
Progress (3): 1.5/2.6 MB | 54 kB | 207/291 kB
Progress (3): 1.5/2.6 MB | 54 kB | 211/291 kB
                                             
Downloading from eclipse.maven.central.mirror: https://repo.eclipse.org/content/repositories/maven_central/org/eclipse/sisu/org.eclipse.sisu.plexus/0.3.3/org.eclipse.sisu.plexus-0.3.3.jar
Downloaded from eclipse.maven.central.mirror: https://repo.eclipse.org/content/repositories/maven_central/commons-cli/commons-cli/1.4/commons-cli-1.4.jar (54 kB at 116 kB/s)
Progress (2): 1.5/2.6 MB | 215/291 kB
Progress (2): 1.5/2.6 MB | 215/291 kB
Progress (2): 1.5/2.6 MB | 219/291 kB
                                     
Downloading from eclipse.maven.central.mirror: https://repo.eclipse.org/content/repositories/maven_central/io/takari/aether/aether-connector-okhttp/0.17.6/aether-connector-okhttp-0.17.6.jar
Progress (2): 1.5/2.6 MB | 223/291 kB
Progress (2): 1.5/2.6 MB | 223/291 kB
Progress (2): 1.5/2.6 MB | 227/291 kB
Progress (2): 1.5/2.6 MB | 227/291 kB
Progress (2): 1.5/2.6 MB | 231/291 kB
Progress (2): 1.6/2.6 MB | 231/291 kB
Progress (2): 1.6/2.6 MB | 235/291 kB
Progress (2): 1.6/2.6 MB | 235/291 kB
Progress (2): 1.6/2.6 MB | 239/291 kB
Progress (2): 1.6/2.6 MB | 239/291 kB
Progress (2): 1.6/2.6 MB | 243/291 kB
Progress (2): 1.6/2.6 MB | 243/291 kB
Progress (2): 1.6/2.6 MB | 247/291 kB
Progress (2): 1.6/2.6 MB | 247/291 kB
Progress (2): 1.6/2.6 MB | 251/291 kB
Progress (2): 1.6/2.6 MB | 251/291 kB
Progress (2): 1.6/2.6 MB | 255/291 kB
Progress (2): 1.6/2.6 MB | 255/291 kB
Progress (2): 1.6/2.6 MB | 259/291 kB
Progress (2): 1.6/2.6 MB | 259/291 kB
Progress (2): 1.6/2.6 MB | 263/291 kB
Progress (2): 1.6/2.6 MB | 263/291 kB
Progress (2): 1.6/2.6 MB | 267/291 kB
Progress (2): 1.6/2.6 MB | 267/291 kB
Progress (2): 1.6/2.6 MB | 271/291 kB
Progress (2): 1.6/2.6 MB | 271/291 kB
Progress (2): 1.6/2.6 MB | 275/291 kB
Progress (2): 1.6/2.6 MB | 275/291 kB
Progress (2): 1.6/2.6 MB | 279/291 kB
Progress (2): 1.6/2.6 MB | 279/291 kB
Progress (2): 1.6/2.6 MB | 283/291 kB
Progress (2): 1.6/2.6 MB | 283/291 kB
Progress (2): 1.6/2.6 MB | 287/291 kB
Progress (2): 1.6/2.6 MB | 287/291 kB
Progress (2): 1.6/2.6 MB | 291 kB    
Progress (2): 1.6/2.6 MB | 291 kB
Progress (2): 1.6/2.6 MB | 291 kB
Progress (2): 1.6/2.6 MB | 291 kB
Progress (2): 1.6/2.6 MB | 291 kB
Progress (2): 1.6/2.6 MB | 291 kB
Progress (2): 1.6/2.6 MB | 291 kB
Progress (2): 1.6/2.6 MB | 291 kB
Progress (2): 1.6/2.6 MB | 291 kB
Progress (2): 1.6/2.6 MB | 291 kB
Progress (2): 1.6/2.6 MB | 291 kB
Progress (2): 1.7/2.6 MB | 291 kB
Progress (2): 1.7/2.6 MB | 291 kB
Progress (2): 1.7/2.6 MB | 291 kB
Progress (2): 1.7/2.6 MB | 291 kB
Progress (2): 1.7/2.6 MB | 291 kB
Progress (2): 1.7/2.6 MB | 291 kB
Progress (2): 1.7/2.6 MB | 291 kB
Progress (2): 1.7/2.6 MB | 291 kB
Progress (2): 1.7/2.6 MB | 291 kB
Progress (2): 1.7/2.6 MB | 291 kB
Progress (2): 1.7/2.6 MB | 291 kB
Progress (2): 1.7/2.6 MB | 291 kB
Progress (2): 1.7/2.6 MB | 291 kB
Progress (2): 1.7/2.6 MB | 291 kB
Progress (2): 1.7/2.6 MB | 291 kB
Progress (2): 1.7/2.6 MB | 291 kB
Progress (2): 1.7/2.6 MB | 291 kB
Progress (2): 1.7/2.6 MB | 291 kB
Progress (2): 1.7/2.6 MB | 291 kB
Progress (2): 1.7/2.6 MB | 291 kB
Progress (2): 1.7/2.6 MB | 291 kB
Progress (2): 1.7/2.6 MB | 291 kB
Progress (2): 1.7/2.6 MB | 291 kB
Progress (2): 1.7/2.6 MB | 291 kB
Progress (2): 1.7/2.6 MB | 291 kB
Progress (2): 1.8/2.6 MB | 291 kB
Progress (2): 1.8/2.6 MB | 291 kB
Progress (2): 1.8/2.6 MB | 291 kB
Progress (2): 1.8/2.6 MB | 291 kB
Progress (2): 1.8/2.6 MB | 291 kB
Progress (2): 1.8/2.6 MB | 291 kB
Progress (2): 1.8/2.6 MB | 291 kB
Progress (2): 1.8/2.6 MB | 291 kB
Progress (2): 1.8/2.6 MB | 291 kB
Progress (2): 1.8/2.6 MB | 291 kB
Progress (2): 1.8/2.6 MB | 291 kB
Progress (2): 1.8/2.6 MB | 291 kB
Progress (2): 1.8/2.6 MB | 291 kB
Progress (2): 1.8/2.6 MB | 291 kB
Progress (2): 1.8/2.6 MB | 291 kB
Progress (2): 1.8/2.6 MB | 291 kB
Progress (2): 1.8/2.6 MB | 291 kB
Progress (2): 1.8/2.6 MB | 291 kB
Progress (2): 1.8/2.6 MB | 291 kB
Progress (2): 1.8/2.6 MB | 291 kB
Progress (2): 1.8/2.6 MB | 291 kB
Progress (2): 1.8/2.6 MB | 291 kB
Progress (3): 1.8/2.6 MB | 291 kB | 4.1/205 kB
Progress (3): 1.8/2.6 MB | 291 kB | 4.1/205 kB
Progress (3): 1.8/2.6 MB | 291 kB | 4.1/205 kB
Progress (4): 1.8/2.6 MB | 291 kB | 4.1/205 kB | 4.1/51 kB
Progress (4): 1.8/2.6 MB | 291 kB | 7.7/205 kB | 4.1/51 kB
Progress (4): 1.8/2.6 MB | 291 kB | 7.7/205 kB | 7.7/51 kB
Progress (4): 1.8/2.6 MB | 291 kB | 7.7/205 kB | 7.7/51 kB
Progress (4): 1.8/2.6 MB | 291 kB | 12/205 kB | 7.7/51 kB 
                                                         
Downloaded from eclipse.maven.central.mirror: https://repo.eclipse.org/content/repositories/maven_central/org/apache/maven/maven-compat/3.6.2/maven-compat-3.6.2.jar (291 kB at 609 kB/s)
Progress (3): 1.9/2.6 MB | 12/205 kB | 7.7/51 kB
Progress (3): 1.9/2.6 MB | 12/205 kB | 12/51 kB 
                                               
Downloading from eclipse.maven.central.mirror: https://repo.eclipse.org/content/repositories/maven_central/com/squareup/okhttp3/okhttp/3.14.1/okhttp-3.14.1.jar
Progress (3): 1.9/2.6 MB | 16/205 kB | 12/51 kB
Progress (3): 1.9/2.6 MB | 16/205 kB | 16/51 kB
Progress (3): 1.9/2.6 MB | 16/205 kB | 16/51 kB
Progress (3): 1.9/2.6 MB | 20/205 kB | 16/51 kB
Progress (3): 1.9/2.6 MB | 20/205 kB | 20/51 kB
Progress (3): 1.9/2.6 MB | 20/205 kB | 20/51 kB
Progress (3): 1.9/2.6 MB | 20/205 kB | 24/51 kB
Progress (3): 1.9/2.6 MB | 24/205 kB | 24/51 kB
Progress (3): 1.9/2.6 MB | 24/205 kB | 28/51 kB
Progress (3): 1.9/2.6 MB | 24/205 kB | 28/51 kB
Progress (4): 1.9/2.6 MB | 24/205 kB | 28/51 kB | 4.1/56 kB
Progress (4): 1.9/2.6 MB | 24/205 kB | 28/51 kB | 4.1/56 kB
Progress (4): 1.9/2.6 MB | 28/205 kB | 28/51 kB | 4.1/56 kB
Progress (4): 1.9/2.6 MB | 28/205 kB | 32/51 kB | 4.1/56 kB
Progress (4): 1.9/2.6 MB | 32/205 kB | 32/51 kB | 4.1/56 kB
Progress (4): 1.9/2.6 MB | 32/205 kB | 32/51 kB | 4.1/56 kB
Progress (4): 1.9/2.6 MB | 32/205 kB | 32/51 kB | 7.7/56 kB
Progress (4): 1.9/2.6 MB | 32/205 kB | 32/51 kB | 7.7/56 kB
Progress (4): 1.9/2.6 MB | 33/205 kB | 32/51 kB | 7.7/56 kB
Progress (4): 1.9/2.6 MB | 33/205 kB | 36/51 kB | 7.7/56 kB
Progress (4): 1.9/2.6 MB | 33/205 kB | 36/51 kB | 7.7/56 kB
Progress (4): 1.9/2.6 MB | 33/205 kB | 36/51 kB | 12/56 kB 
Progress (4): 1.9/2.6 MB | 33/205 kB | 36/51 kB | 12/56 kB
Progress (4): 1.9/2.6 MB | 33/205 kB | 40/51 kB | 12/56 kB
Progress (4): 1.9/2.6 MB | 37/205 kB | 40/51 kB | 12/56 kB
Progress (4): 1.9/2.6 MB | 37/205 kB | 44/51 kB | 12/56 kB
Progress (4): 1.9/2.6 MB | 37/205 kB | 44/51 kB | 12/56 kB
Progress (4): 1.9/2.6 MB | 37/205 kB | 44/51 kB | 16/56 kB
Progress (4): 1.9/2.6 MB | 37/205 kB | 44/51 kB | 16/56 kB
Progress (4): 1.9/2.6 MB | 37/205 kB | 48/51 kB | 16/56 kB
Progress (4): 1.9/2.6 MB | 37/205 kB | 48/51 kB | 16/56 kB
Progress (4): 1.9/2.6 MB | 41/205 kB | 48/51 kB | 16/56 kB
Progress (4): 1.9/2.6 MB | 41/205 kB | 48/51 kB | 16/56 kB
Progress (4): 1.9/2.6 MB | 41/205 kB | 51 kB | 16/56 kB   
Progress (4): 1.9/2.6 MB | 41/205 kB | 51 kB | 20/56 kB
Progress (4): 1.9/2.6 MB | 41/205 kB | 51 kB | 20/56 kB
Progress (4): 1.9/2.6 MB | 45/205 kB | 51 kB | 20/56 kB
Progress (4): 1.9/2.6 MB | 45/205 kB | 51 kB | 20/56 kB
Progress (4): 1.9/2.6 MB | 45/205 kB | 51 kB | 24/56 kB
Progress (4): 1.9/2.6 MB | 45/205 kB | 51 kB | 24/56 kB
Progress (4): 1.9/2.6 MB | 49/205 kB | 51 kB | 24/56 kB
Progress (4): 1.9/2.6 MB | 49/205 kB | 51 kB | 24/56 kB
Progress (4): 1.9/2.6 MB | 49/205 kB | 51 kB | 28/56 kB
Progress (4): 1.9/2.6 MB | 53/205 kB | 51 kB | 28/56 kB
Progress (4): 1.9/2.6 MB | 53/205 kB | 51 kB | 32/56 kB
Progress (4): 1.9/2.6 MB | 53/205 kB | 51 kB | 32/56 kB
Progress (4): 1.9/2.6 MB | 53/205 kB | 51 kB | 33/56 kB
Progress (4): 1.9/2.6 MB | 57/205 kB | 51 kB | 33/56 kB
Progress (4): 1.9/2.6 MB | 57/205 kB | 51 kB | 37/56 kB
Progress (4): 1.9/2.6 MB | 57/205 kB | 51 kB | 37/56 kB
Progress (4): 1.9/2.6 MB | 57/205 kB | 51 kB | 41/56 kB
Progress (4): 1.9/2.6 MB | 61/205 kB | 51 kB | 41/56 kB
Progress (4): 1.9/2.6 MB | 61/205 kB | 51 kB | 45/56 kB
Progress (4): 1.9/2.6 MB | 61/205 kB | 51 kB | 45/56 kB
Progress (4): 1.9/2.6 MB | 61/205 kB | 51 kB | 49/56 kB
Progress (4): 1.9/2.6 MB | 65/205 kB | 51 kB | 49/56 kB
Progress (4): 1.9/2.6 MB | 65/205 kB | 51 kB | 49/56 kB
Progress (4): 1.9/2.6 MB | 66/205 kB | 51 kB | 49/56 kB
Progress (4): 1.9/2.6 MB | 66/205 kB | 51 kB | 49/56 kB
Progress (4): 1.9/2.6 MB | 66/205 kB | 51 kB | 49/56 kB
                                                       
Downloaded from eclipse.maven.central.mirror: https://repo.eclipse.org/content/repositories/maven_central/io/takari/aether/aether-connector-okhttp/0.17.6/aether-connector-okhttp-0.17.6.jar (51 kB at 104 kB/s)
Downloading from eclipse.maven.central.mirror: https://repo.eclipse.org/content/repositories/maven_central/com/squareup/okio/okio/1.17.3/okio-1.17.3.jar
Progress (3): 1.9/2.6 MB | 66/205 kB | 53/56 kB
Progress (3): 1.9/2.6 MB | 70/205 kB | 53/56 kB
Progress (3): 1.9/2.6 MB | 70/205 kB | 56 kB   
Progress (3): 1.9/2.6 MB | 70/205 kB | 56 kB
Progress (3): 1.9/2.6 MB | 74/205 kB | 56 kB
Progress (4): 1.9/2.6 MB | 74/205 kB | 56 kB | 4.1/426 kB
Progress (4): 1.9/2.6 MB | 74/205 kB | 56 kB | 4.1/426 kB
Progress (4): 1.9/2.6 MB | 74/205 kB | 56 kB | 7.7/426 kB
Progress (4): 1.9/2.6 MB | 78/205 kB | 56 kB | 7.7/426 kB
Progress (4): 1.9/2.6 MB | 78/205 kB | 56 kB | 12/426 kB 
Progress (4): 2.0/2.6 MB | 78/205 kB | 56 kB | 12/426 kB
Progress (4): 2.0/2.6 MB | 78/205 kB | 56 kB | 16/426 kB
Progress (4): 2.0/2.6 MB | 82/205 kB | 56 kB | 16/426 kB
Progress (4): 2.0/2.6 MB | 82/205 kB | 56 kB | 20/426 kB
Progress (4): 2.0/2.6 MB | 82/205 kB | 56 kB | 20/426 kB
Progress (4): 2.0/2.6 MB | 86/205 kB | 56 kB | 20/426 kB
Progress (4): 2.0/2.6 MB | 86/205 kB | 56 kB | 24/426 kB
Progress (4): 2.0/2.6 MB | 90/205 kB | 56 kB | 24/426 kB
Progress (4): 2.0/2.6 MB | 90/205 kB | 56 kB | 24/426 kB
Progress (4): 2.0/2.6 MB | 90/205 kB | 56 kB | 28/426 kB
Progress (4): 2.0/2.6 MB | 90/205 kB | 56 kB | 28/426 kB
Progress (4): 2.0/2.6 MB | 94/205 kB | 56 kB | 28/426 kB
Progress (4): 2.0/2.6 MB | 94/205 kB | 56 kB | 28/426 kB
Progress (4): 2.0/2.6 MB | 94/205 kB | 56 kB | 32/426 kB
Progress (4): 2.0/2.6 MB | 94/205 kB | 56 kB | 32/426 kB
Progress (4): 2.0/2.6 MB | 98/205 kB | 56 kB | 32/426 kB
Progress (4): 2.0/2.6 MB | 98/205 kB | 56 kB | 32/426 kB
Progress (4): 2.0/2.6 MB | 98/205 kB | 56 kB | 33/426 kB
Progress (4): 2.0/2.6 MB | 98/205 kB | 56 kB | 33/426 kB
Progress (4): 2.0/2.6 MB | 98/205 kB | 56 kB | 33/426 kB
Progress (4): 2.0/2.6 MB | 98/205 kB | 56 kB | 33/426 kB
Progress (4): 2.0/2.6 MB | 98/205 kB | 56 kB | 37/426 kB
Progress (4): 2.0/2.6 MB | 102/205 kB | 56 kB | 37/426 kB
Progress (4): 2.0/2.6 MB | 102/205 kB | 56 kB | 37/426 kB
Progress (4): 2.0/2.6 MB | 106/205 kB | 56 kB | 37/426 kB
Progress (4): 2.0/2.6 MB | 106/205 kB | 56 kB | 41/426 kB
Progress (4): 2.0/2.6 MB | 106/205 kB | 56 kB | 41/426 kB
Progress (4): 2.0/2.6 MB | 110/205 kB | 56 kB | 41/426 kB
Progress (4): 2.0/2.6 MB | 110/205 kB | 56 kB | 41/426 kB
Progress (4): 2.0/2.6 MB | 110/205 kB | 56 kB | 45/426 kB
Progress (4): 2.0/2.6 MB | 110/205 kB | 56 kB | 45/426 kB
Progress (4): 2.0/2.6 MB | 114/205 kB | 56 kB | 45/426 kB
Progress (4): 2.0/2.6 MB | 114/205 kB | 56 kB | 45/426 kB
Progress (4): 2.0/2.6 MB | 114/205 kB | 56 kB | 49/426 kB
Progress (4): 2.0/2.6 MB | 118/205 kB | 56 kB | 49/426 kB
Progress (4): 2.0/2.6 MB | 118/205 kB | 56 kB | 53/426 kB
Progress (4): 2.0/2.6 MB | 118/205 kB | 56 kB | 53/426 kB
Progress (4): 2.0/2.6 MB | 118/205 kB | 56 kB | 57/426 kB
Progress (4): 2.0/2.6 MB | 122/205 kB | 56 kB | 57/426 kB
Progress (4): 2.0/2.6 MB | 122/205 kB | 56 kB | 61/426 kB
Progress (4): 2.0/2.6 MB | 122/205 kB | 56 kB | 61/426 kB
Progress (4): 2.0/2.6 MB | 122/205 kB | 56 kB | 65/426 kB
Progress (4): 2.0/2.6 MB | 126/205 kB | 56 kB | 65/426 kB
Progress (4): 2.0/2.6 MB | 126/205 kB | 56 kB | 66/426 kB
Progress (4): 2.0/2.6 MB | 126/205 kB | 56 kB | 66/426 kB
Progress (4): 2.0/2.6 MB | 130/205 kB | 56 kB | 66/426 kB
Progress (4): 2.0/2.6 MB | 130/205 kB | 56 kB | 66/426 kB
Progress (4): 2.0/2.6 MB | 130/205 kB | 56 kB | 70/426 kB
Progress (4): 2.0/2.6 MB | 131/205 kB | 56 kB | 70/426 kB
Progress (4): 2.0/2.6 MB | 131/205 kB | 56 kB | 74/426 kB
Progress (4): 2.0/2.6 MB | 131/205 kB | 56 kB | 74/426 kB
Progress (4): 2.0/2.6 MB | 135/205 kB | 56 kB | 74/426 kB
Progress (4): 2.0/2.6 MB | 135/205 kB | 56 kB | 74/426 kB
Progress (4): 2.0/2.6 MB | 135/205 kB | 56 kB | 78/426 kB
Progress (4): 2.0/2.6 MB | 135/205 kB | 56 kB | 78/426 kB
Progress (4): 2.0/2.6 MB | 139/205 kB | 56 kB | 78/426 kB
Progress (4): 2.0/2.6 MB | 139/205 kB | 56 kB | 78/426 kB
Progress (4): 2.0/2.6 MB | 139/205 kB | 56 kB | 82/426 kB
Progress (4): 2.0/2.6 MB | 143/205 kB | 56 kB | 82/426 kB
Progress (4): 2.0/2.6 MB | 143/205 kB | 56 kB | 86/426 kB
Progress (4): 2.0/2.6 MB | 143/205 kB | 56 kB | 86/426 kB
Progress (4): 2.0/2.6 MB | 143/205 kB | 56 kB | 90/426 kB
Progress (4): 2.0/2.6 MB | 147/205 kB | 56 kB | 90/426 kB
Progress (4): 2.0/2.6 MB | 147/205 kB | 56 kB | 94/426 kB
Progress (4): 2.0/2.6 MB | 147/205 kB | 56 kB | 94/426 kB
Progress (4): 2.0/2.6 MB | 147/205 kB | 56 kB | 98/426 kB
Progress (4): 2.0/2.6 MB | 151/205 kB | 56 kB | 98/426 kB
Progress (4): 2.0/2.6 MB | 151/205 kB | 56 kB | 98/426 kB
Progress (4): 2.0/2.6 MB | 151/205 kB | 56 kB | 98/426 kB
Progress (4): 2.0/2.6 MB | 155/205 kB | 56 kB | 98/426 kB
                                                         
Downloaded from eclipse.maven.central.mirror: https://repo.eclipse.org/content/repositories/maven_central/org/apache/maven/wagon/wagon-provider-api/3.3.3/wagon-provider-api-3.3.3.jar (56 kB at 101 kB/s)
Progress (3): 2.1/2.6 MB | 155/205 kB | 98/426 kB
Progress (3): 2.1/2.6 MB | 155/205 kB | 102/426 kB
                                                  
Downloading from eclipse.maven.central.mirror: https://repo.eclipse.org/content/repositories/maven_central/org/apache/maven/resolver/maven-resolver-impl/1.4.1/maven-resolver-impl-1.4.1.jar
Progress (3): 2.1/2.6 MB | 159/205 kB | 102/426 kB
Progress (3): 2.1/2.6 MB | 159/205 kB | 106/426 kB
Progress (3): 2.1/2.6 MB | 159/205 kB | 106/426 kB
Progress (3): 2.1/2.6 MB | 163/205 kB | 106/426 kB
Progress (3): 2.1/2.6 MB | 163/205 kB | 106/426 kB
Progress (3): 2.1/2.6 MB | 163/205 kB | 110/426 kB
Progress (3): 2.1/2.6 MB | 164/205 kB | 110/426 kB
Progress (3): 2.1/2.6 MB | 164/205 kB | 114/426 kB
Progress (3): 2.1/2.6 MB | 164/205 kB | 114/426 kB
Progress (3): 2.1/2.6 MB | 168/205 kB | 114/426 kB
Progress (3): 2.1/2.6 MB | 168/205 kB | 114/426 kB
Progress (3): 2.1/2.6 MB | 168/205 kB | 118/426 kB
Progress (3): 2.1/2.6 MB | 172/205 kB | 118/426 kB
Progress (3): 2.1/2.6 MB | 172/205 kB | 122/426 kB
Progress (3): 2.1/2.6 MB | 172/205 kB | 122/426 kB
Progress (3): 2.1/2.6 MB | 176/205 kB | 122/426 kB
Progress (3): 2.1/2.6 MB | 176/205 kB | 122/426 kB
Progress (3): 2.1/2.6 MB | 176/205 kB | 126/426 kB
Progress (3): 2.1/2.6 MB | 180/205 kB | 126/426 kB
Progress (3): 2.1/2.6 MB | 180/205 kB | 130/426 kB
Progress (3): 2.1/2.6 MB | 180/205 kB | 130/426 kB
Progress (3): 2.1/2.6 MB | 184/205 kB | 130/426 kB
Progress (3): 2.1/2.6 MB | 184/205 kB | 131/426 kB
Progress (3): 2.1/2.6 MB | 188/205 kB | 131/426 kB
Progress (3): 2.1/2.6 MB | 188/205 kB | 131/426 kB
Progress (3): 2.1/2.6 MB | 188/205 kB | 135/426 kB
Progress (3): 2.1/2.6 MB | 192/205 kB | 135/426 kB
Progress (3): 2.1/2.6 MB | 192/205 kB | 139/426 kB
Progress (3): 2.1/2.6 MB | 192/205 kB | 139/426 kB
Progress (3): 2.1/2.6 MB | 196/205 kB | 139/426 kB
Progress (3): 2.1/2.6 MB | 196/205 kB | 139/426 kB
Progress (3): 2.1/2.6 MB | 196/205 kB | 143/426 kB
Progress (3): 2.1/2.6 MB | 200/205 kB | 143/426 kB
Progress (3): 2.1/2.6 MB | 200/205 kB | 143/426 kB
Progress (3): 2.1/2.6 MB | 200/205 kB | 147/426 kB
Progress (3): 2.1/2.6 MB | 200/205 kB | 147/426 kB
Progress (3): 2.1/2.6 MB | 204/205 kB | 147/426 kB
Progress (3): 2.1/2.6 MB | 204/205 kB | 147/426 kB
Progress (3): 2.1/2.6 MB | 204/205 kB | 151/426 kB
Progress (3): 2.1/2.6 MB | 204/205 kB | 151/426 kB
Progress (3): 2.1/2.6 MB | 205 kB | 151/426 kB    
Progress (3): 2.1/2.6 MB | 205 kB | 151/426 kB
Progress (3): 2.1/2.6 MB | 205 kB | 155/426 kB
Progress (3): 2.1/2.6 MB | 205 kB | 155/426 kB
Progress (3): 2.1/2.6 MB | 205 kB | 159/426 kB
Progress (3): 2.1/2.6 MB | 205 kB | 159/426 kB
Progress (3): 2.1/2.6 MB | 205 kB | 163/426 kB
Progress (3): 2.1/2.6 MB | 205 kB | 163/426 kB
Progress (3): 2.1/2.6 MB | 205 kB | 164/426 kB
Progress (3): 2.1/2.6 MB | 205 kB | 164/426 kB
Progress (3): 2.1/2.6 MB | 205 kB | 168/426 kB
Progress (3): 2.1/2.6 MB | 205 kB | 168/426 kB
Progress (3): 2.1/2.6 MB | 205 kB | 172/426 kB
Progress (3): 2.1/2.6 MB | 205 kB | 172/426 kB
Progress (3): 2.1/2.6 MB | 205 kB | 176/426 kB
Progress (3): 2.1/2.6 MB | 205 kB | 176/426 kB
Progress (3): 2.1/2.6 MB | 205 kB | 180/426 kB
Progress (3): 2.1/2.6 MB | 205 kB | 180/426 kB
Progress (3): 2.1/2.6 MB | 205 kB | 184/426 kB
Progress (3): 2.1/2.6 MB | 205 kB | 184/426 kB
Progress (3): 2.1/2.6 MB | 205 kB | 188/426 kB
Progress (3): 2.2/2.6 MB | 205 kB | 188/426 kB
Progress (3): 2.2/2.6 MB | 205 kB | 192/426 kB
Progress (3): 2.2/2.6 MB | 205 kB | 192/426 kB
Progress (3): 2.2/2.6 MB | 205 kB | 196/426 kB
Progress (3): 2.2/2.6 MB | 205 kB | 196/426 kB
Progress (3): 2.2/2.6 MB | 205 kB | 197/426 kB
Progress (3): 2.2/2.6 MB | 205 kB | 197/426 kB
Progress (3): 2.2/2.6 MB | 205 kB | 201/426 kB
Progress (3): 2.2/2.6 MB | 205 kB | 201/426 kB
Progress (3): 2.2/2.6 MB | 205 kB | 205/426 kB
Progress (3): 2.2/2.6 MB | 205 kB | 205/426 kB
Progress (3): 2.2/2.6 MB | 205 kB | 209/426 kB
Progress (3): 2.2/2.6 MB | 205 kB | 209/426 kB
Progress (3): 2.2/2.6 MB | 205 kB | 213/426 kB
Progress (3): 2.2/2.6 MB | 205 kB | 213/426 kB
Progress (3): 2.2/2.6 MB | 205 kB | 217/426 kB
Progress (3): 2.2/2.6 MB | 205 kB | 217/426 kB
Progress (3): 2.2/2.6 MB | 205 kB | 221/426 kB
Progress (3): 2.2/2.6 MB | 205 kB | 221/426 kB
Progress (3): 2.2/2.6 MB | 205 kB | 225/426 kB
Progress (3): 2.2/2.6 MB | 205 kB | 225/426 kB
Progress (3): 2.2/2.6 MB | 205 kB | 229/426 kB
Progress (3): 2.2/2.6 MB | 205 kB | 229/426 kB
Progress (3): 2.2/2.6 MB | 205 kB | 229/426 kB
Progress (3): 2.2/2.6 MB | 205 kB | 229/426 kB
Progress (3): 2.2/2.6 MB | 205 kB | 229/426 kB
Progress (3): 2.2/2.6 MB | 205 kB | 233/426 kB
Progress (3): 2.2/2.6 MB | 205 kB | 233/426 kB
Progress (3): 2.2/2.6 MB | 205 kB | 237/426 kB
Progress (3): 2.2/2.6 MB | 205 kB | 237/426 kB
Progress (3): 2.2/2.6 MB | 205 kB | 241/426 kB
Progress (3): 2.2/2.6 MB | 205 kB | 241/426 kB
Progress (3): 2.2/2.6 MB | 205 kB | 245/426 kB
Progress (3): 2.2/2.6 MB | 205 kB | 245/426 kB
Progress (4): 2.2/2.6 MB | 205 kB | 245/426 kB | 4.1/181 kB
Progress (4): 2.2/2.6 MB | 205 kB | 245/426 kB | 4.1/181 kB
Progress (4): 2.2/2.6 MB | 205 kB | 249/426 kB | 4.1/181 kB
Progress (4): 2.2/2.6 MB | 205 kB | 249/426 kB | 4.1/181 kB
Progress (4): 2.2/2.6 MB | 205 kB | 249/426 kB | 7.7/181 kB
Progress (4): 2.2/2.6 MB | 205 kB | 249/426 kB | 7.7/181 kB
Progress (4): 2.2/2.6 MB | 205 kB | 253/426 kB | 7.7/181 kB
Progress (4): 2.2/2.6 MB | 205 kB | 253/426 kB | 7.7/181 kB
Progress (4): 2.2/2.6 MB | 205 kB | 253/426 kB | 12/181 kB 
Progress (4): 2.2/2.6 MB | 205 kB | 253/426 kB | 12/181 kB
Progress (4): 2.2/2.6 MB | 205 kB | 257/426 kB | 12/181 kB
Progress (4): 2.2/2.6 MB | 205 kB | 257/426 kB | 12/181 kB
Progress (4): 2.2/2.6 MB | 205 kB | 257/426 kB | 16/181 kB
Progress (4): 2.2/2.6 MB | 205 kB | 261/426 kB | 16/181 kB
                                                          
Downloaded from eclipse.maven.central.mirror: https://repo.eclipse.org/content/repositories/maven_central/org/eclipse/sisu/org.eclipse.sisu.plexus/0.3.3/org.eclipse.sisu.plexus-0.3.3.jar (205 kB at 361 kB/s)
Progress (3): 2.2/2.6 MB | 261/426 kB | 16/181 kB
                                                 
Downloading from eclipse.maven.central.mirror: https://repo.eclipse.org/content/repositories/maven_central/org/apache/maven/resolver/maven-resolver-connector-basic/1.4.1/maven-resolver-connector-basic-1.4.1.jar
Progress (3): 2.2/2.6 MB | 262/426 kB | 16/181 kB
Progress (3): 2.2/2.6 MB | 262/426 kB | 20/181 kB
Progress (3): 2.3/2.6 MB | 262/426 kB | 20/181 kB
Progress (3): 2.3/2.6 MB | 262/426 kB | 24/181 kB
Progress (3): 2.3/2.6 MB | 266/426 kB | 24/181 kB
Progress (3): 2.3/2.6 MB | 266/426 kB | 24/181 kB
Progress (3): 2.3/2.6 MB | 270/426 kB | 24/181 kB
Progress (3): 2.3/2.6 MB | 270/426 kB | 28/181 kB
Progress (3): 2.3/2.6 MB | 270/426 kB | 28/181 kB
Progress (3): 2.3/2.6 MB | 270/426 kB | 32/181 kB
Progress (3): 2.3/2.6 MB | 274/426 kB | 32/181 kB
Progress (3): 2.3/2.6 MB | 274/426 kB | 33/181 kB
Progress (3): 2.3/2.6 MB | 274/426 kB | 33/181 kB
Progress (3): 2.3/2.6 MB | 278/426 kB | 33/181 kB
Progress (3): 2.3/2.6 MB | 278/426 kB | 33/181 kB
Progress (3): 2.3/2.6 MB | 278/426 kB | 37/181 kB
Progress (3): 2.3/2.6 MB | 282/426 kB | 37/181 kB
Progress (3): 2.3/2.6 MB | 282/426 kB | 41/181 kB
Progress (3): 2.3/2.6 MB | 282/426 kB | 41/181 kB
Progress (3): 2.3/2.6 MB | 286/426 kB | 41/181 kB
Progress (3): 2.3/2.6 MB | 286/426 kB | 41/181 kB
Progress (3): 2.3/2.6 MB | 286/426 kB | 45/181 kB
Progress (3): 2.3/2.6 MB | 290/426 kB | 45/181 kB
Progress (3): 2.3/2.6 MB | 290/426 kB | 49/181 kB
Progress (3): 2.3/2.6 MB | 290/426 kB | 49/181 kB
Progress (3): 2.3/2.6 MB | 294/426 kB | 49/181 kB
Progress (3): 2.3/2.6 MB | 294/426 kB | 49/181 kB
Progress (3): 2.3/2.6 MB | 294/426 kB | 53/181 kB
Progress (3): 2.3/2.6 MB | 295/426 kB | 53/181 kB
Progress (3): 2.3/2.6 MB | 295/426 kB | 57/181 kB
Progress (3): 2.3/2.6 MB | 295/426 kB | 57/181 kB
Progress (3): 2.3/2.6 MB | 299/426 kB | 57/181 kB
Progress (3): 2.3/2.6 MB | 299/426 kB | 57/181 kB
Progress (3): 2.3/2.6 MB | 299/426 kB | 61/181 kB
Progress (3): 2.3/2.6 MB | 303/426 kB | 61/181 kB
Progress (3): 2.3/2.6 MB | 303/426 kB | 65/181 kB
Progress (3): 2.3/2.6 MB | 303/426 kB | 65/181 kB
Progress (3): 2.3/2.6 MB | 307/426 kB | 65/181 kB
Progress (3): 2.3/2.6 MB | 307/426 kB | 65/181 kB
Progress (3): 2.3/2.6 MB | 307/426 kB | 69/181 kB
Progress (3): 2.3/2.6 MB | 311/426 kB | 69/181 kB
Progress (3): 2.3/2.6 MB | 311/426 kB | 73/181 kB
Progress (3): 2.3/2.6 MB | 311/426 kB | 73/181 kB
Progress (3): 2.3/2.6 MB | 311/426 kB | 77/181 kB
Progress (3): 2.3/2.6 MB | 315/426 kB | 77/181 kB
Progress (3): 2.3/2.6 MB | 315/426 kB | 81/181 kB
Progress (3): 2.3/2.6 MB | 315/426 kB | 81/181 kB
Progress (3): 2.3/2.6 MB | 319/426 kB | 81/181 kB
Progress (3): 2.3/2.6 MB | 319/426 kB | 85/181 kB
Progress (3): 2.3/2.6 MB | 319/426 kB | 85/181 kB
Progress (3): 2.3/2.6 MB | 319/426 kB | 89/181 kB
Progress (3): 2.3/2.6 MB | 323/426 kB | 89/181 kB
Progress (3): 2.3/2.6 MB | 323/426 kB | 89/181 kB
Progress (3): 2.3/2.6 MB | 327/426 kB | 89/181 kB
Progress (3): 2.3/2.6 MB | 327/426 kB | 89/181 kB
Progress (3): 2.3/2.6 MB | 327/426 kB | 93/181 kB
Progress (3): 2.3/2.6 MB | 327/426 kB | 93/181 kB
Progress (3): 2.3/2.6 MB | 328/426 kB | 93/181 kB
Progress (3): 2.3/2.6 MB | 328/426 kB | 97/181 kB
Progress (3): 2.3/2.6 MB | 328/426 kB | 97/181 kB
Progress (3): 2.3/2.6 MB | 332/426 kB | 97/181 kB
Progress (3): 2.3/2.6 MB | 332/426 kB | 97/181 kB
Progress (3): 2.3/2.6 MB | 332/426 kB | 101/181 kB
Progress (3): 2.3/2.6 MB | 336/426 kB | 101/181 kB
Progress (3): 2.3/2.6 MB | 336/426 kB | 105/181 kB
Progress (3): 2.3/2.6 MB | 336/426 kB | 105/181 kB
Progress (3): 2.3/2.6 MB | 340/426 kB | 105/181 kB
Progress (3): 2.3/2.6 MB | 340/426 kB | 105/181 kB
Progress (3): 2.3/2.6 MB | 340/426 kB | 109/181 kB
Progress (3): 2.3/2.6 MB | 344/426 kB | 109/181 kB
Progress (3): 2.3/2.6 MB | 344/426 kB | 113/181 kB
Progress (3): 2.3/2.6 MB | 344/426 kB | 113/181 kB
Progress (3): 2.3/2.6 MB | 348/426 kB | 113/181 kB
Progress (3): 2.3/2.6 MB | 348/426 kB | 113/181 kB
Progress (3): 2.3/2.6 MB | 348/426 kB | 117/181 kB
Progress (3): 2.3/2.6 MB | 352/426 kB | 117/181 kB
Progress (3): 2.3/2.6 MB | 352/426 kB | 121/181 kB
Progress (3): 2.4/2.6 MB | 352/426 kB | 121/181 kB
Progress (3): 2.4/2.6 MB | 356/426 kB | 121/181 kB
Progress (3): 2.4/2.6 MB | 356/426 kB | 125/181 kB
Progress (3): 2.4/2.6 MB | 356/426 kB | 125/181 kB
Progress (3): 2.4/2.6 MB | 356/426 kB | 129/181 kB
Progress (3): 2.4/2.6 MB | 360/426 kB | 129/181 kB
Progress (3): 2.4/2.6 MB | 360/426 kB | 129/181 kB
Progress (3): 2.4/2.6 MB | 360/426 kB | 133/181 kB
Progress (3): 2.4/2.6 MB | 360/426 kB | 133/181 kB
Progress (3): 2.4/2.6 MB | 364/426 kB | 133/181 kB
Progress (3): 2.4/2.6 MB | 364/426 kB | 137/181 kB
Progress (3): 2.4/2.6 MB | 368/426 kB | 137/181 kB
Progress (3): 2.4/2.6 MB | 368/426 kB | 141/181 kB
Progress (3): 2.4/2.6 MB | 368/426 kB | 141/181 kB
Progress (3): 2.4/2.6 MB | 372/426 kB | 141/181 kB
Progress (3): 2.4/2.6 MB | 372/426 kB | 145/181 kB
Progress (3): 2.4/2.6 MB | 376/426 kB | 145/181 kB
Progress (3): 2.4/2.6 MB | 376/426 kB | 145/181 kB
Progress (4): 2.4/2.6 MB | 376/426 kB | 145/181 kB | 4.1/92 kB
Progress (4): 2.4/2.6 MB | 376/426 kB | 149/181 kB | 4.1/92 kB
Progress (4): 2.4/2.6 MB | 376/426 kB | 149/181 kB | 7.7/92 kB
Progress (4): 2.4/2.6 MB | 376/426 kB | 149/181 kB | 7.7/92 kB
Progress (4): 2.4/2.6 MB | 380/426 kB | 149/181 kB | 7.7/92 kB
Progress (4): 2.4/2.6 MB | 380/426 kB | 149/181 kB | 7.7/92 kB
Progress (4): 2.4/2.6 MB | 380/426 kB | 149/181 kB | 12/92 kB 
Progress (4): 2.4/2.6 MB | 380/426 kB | 149/181 kB | 12/92 kB
Progress (4): 2.4/2.6 MB | 380/426 kB | 153/181 kB | 12/92 kB
Progress (4): 2.4/2.6 MB | 380/426 kB | 153/181 kB | 12/92 kB
Progress (4): 2.4/2.6 MB | 380/426 kB | 153/181 kB | 16/92 kB
Progress (4): 2.4/2.6 MB | 384/426 kB | 153/181 kB | 16/92 kB
Progress (4): 2.4/2.6 MB | 384/426 kB | 153/181 kB | 16/92 kB
Progress (4): 2.4/2.6 MB | 384/426 kB | 157/181 kB | 16/92 kB
Progress (4): 2.4/2.6 MB | 384/426 kB | 157/181 kB | 16/92 kB
Progress (4): 2.4/2.6 MB | 388/426 kB | 157/181 kB | 16/92 kB
Progress (4): 2.4/2.6 MB | 388/426 kB | 157/181 kB | 20/92 kB
Progress (4): 2.4/2.6 MB | 392/426 kB | 157/181 kB | 20/92 kB
Progress (4): 2.4/2.6 MB | 392/426 kB | 157/181 kB | 20/92 kB
Progress (4): 2.4/2.6 MB | 392/426 kB | 161/181 kB | 20/92 kB
Progress (4): 2.4/2.6 MB | 396/426 kB | 161/181 kB | 20/92 kB
Progress (4): 2.4/2.6 MB | 396/426 kB | 161/181 kB | 20/92 kB
Progress (5): 2.4/2.6 MB | 396/426 kB | 161/181 kB | 20/92 kB | 4.1/44 kB
Progress (5): 2.4/2.6 MB | 396/426 kB | 161/181 kB | 24/92 kB | 4.1/44 kB
Progress (5): 2.4/2.6 MB | 396/426 kB | 161/181 kB | 24/92 kB | 7.7/44 kB
Progress (5): 2.4/2.6 MB | 396/426 kB | 161/181 kB | 24/92 kB | 7.7/44 kB
Progress (5): 2.4/2.6 MB | 400/426 kB | 161/181 kB | 24/92 kB | 7.7/44 kB
Progress (5): 2.4/2.6 MB | 400/426 kB | 165/181 kB | 24/92 kB | 7.7/44 kB
Progress (5): 2.4/2.6 MB | 404/426 kB | 165/181 kB | 24/92 kB | 7.7/44 kB
Progress (5): 2.4/2.6 MB | 408/426 kB | 165/181 kB | 24/92 kB | 7.7/44 kB
Progress (5): 2.4/2.6 MB | 412/426 kB | 165/181 kB | 24/92 kB | 7.7/44 kB
Progress (5): 2.4/2.6 MB | 416/426 kB | 165/181 kB | 24/92 kB | 7.7/44 kB
Progress (5): 2.4/2.6 MB | 416/426 kB | 165/181 kB | 24/92 kB | 7.7/44 kB
Progress (5): 2.4/2.6 MB | 416/426 kB | 165/181 kB | 24/92 kB | 12/44 kB 
Progress (5): 2.4/2.6 MB | 416/426 kB | 165/181 kB | 28/92 kB | 12/44 kB
Progress (5): 2.4/2.6 MB | 416/426 kB | 165/181 kB | 28/92 kB | 16/44 kB
Progress (5): 2.4/2.6 MB | 416/426 kB | 165/181 kB | 28/92 kB | 16/44 kB
Progress (5): 2.4/2.6 MB | 416/426 kB | 165/181 kB | 28/92 kB | 20/44 kB
Progress (5): 2.4/2.6 MB | 420/426 kB | 165/181 kB | 28/92 kB | 20/44 kB
Progress (5): 2.4/2.6 MB | 420/426 kB | 169/181 kB | 28/92 kB | 20/44 kB
Progress (5): 2.4/2.6 MB | 424/426 kB | 169/181 kB | 28/92 kB | 20/44 kB
Progress (5): 2.4/2.6 MB | 424/426 kB | 169/181 kB | 28/92 kB | 24/44 kB
Progress (5): 2.4/2.6 MB | 424/426 kB | 169/181 kB | 28/92 kB | 24/44 kB
Progress (5): 2.4/2.6 MB | 424/426 kB | 169/181 kB | 32/92 kB | 24/44 kB
Progress (5): 2.4/2.6 MB | 424/426 kB | 169/181 kB | 32/92 kB | 28/44 kB
Progress (5): 2.4/2.6 MB | 426 kB | 169/181 kB | 32/92 kB | 28/44 kB    
Progress (5): 2.4/2.6 MB | 426 kB | 173/181 kB | 32/92 kB | 28/44 kB
Progress (5): 2.4/2.6 MB | 426 kB | 173/181 kB | 32/92 kB | 32/44 kB
Progress (5): 2.4/2.6 MB | 426 kB | 173/181 kB | 33/92 kB | 32/44 kB
Progress (5): 2.4/2.6 MB | 426 kB | 173/181 kB | 33/92 kB | 36/44 kB
Progress (5): 2.4/2.6 MB | 426 kB | 173/181 kB | 33/92 kB | 36/44 kB
Progress (5): 2.4/2.6 MB | 426 kB | 173/181 kB | 33/92 kB | 40/44 kB
Progress (5): 2.4/2.6 MB | 426 kB | 173/181 kB | 37/92 kB | 40/44 kB
Progress (5): 2.4/2.6 MB | 426 kB | 177/181 kB | 37/92 kB | 40/44 kB
Progress (5): 2.4/2.6 MB | 426 kB | 177/181 kB | 41/92 kB | 40/44 kB
Progress (5): 2.4/2.6 MB | 426 kB | 177/181 kB | 41/92 kB | 44/44 kB
Progress (5): 2.4/2.6 MB | 426 kB | 177/181 kB | 41/92 kB | 44/44 kB
Progress (5): 2.4/2.6 MB | 426 kB | 177/181 kB | 41/92 kB | 44 kB   
Progress (5): 2.4/2.6 MB | 426 kB | 177/181 kB | 45/92 kB | 44 kB
Progress (5): 2.4/2.6 MB | 426 kB | 181 kB | 45/92 kB | 44 kB    
Progress (5): 2.4/2.6 MB | 426 kB | 181 kB | 49/92 kB | 44 kB
Progress (5): 2.4/2.6 MB | 426 kB | 181 kB | 49/92 kB | 44 kB
Progress (5): 2.4/2.6 MB | 426 kB | 181 kB | 53/92 kB | 44 kB
Progress (5): 2.4/2.6 MB | 426 kB | 181 kB | 53/92 kB | 44 kB
Progress (5): 2.4/2.6 MB | 426 kB | 181 kB | 57/92 kB | 44 kB
Progress (5): 2.4/2.6 MB | 426 kB | 181 kB | 57/92 kB | 44 kB
Progress (5): 2.4/2.6 MB | 426 kB | 181 kB | 61/92 kB | 44 kB
Progress (5): 2.4/2.6 MB | 426 kB | 181 kB | 61/92 kB | 44 kB
Progress (5): 2.4/2.6 MB | 426 kB | 181 kB | 65/92 kB | 44 kB
Progress (5): 2.4/2.6 MB | 426 kB | 181 kB | 65/92 kB | 44 kB
Progress (5): 2.4/2.6 MB | 426 kB | 181 kB | 69/92 kB | 44 kB
Progress (5): 2.5/2.6 MB | 426 kB | 181 kB | 69/92 kB | 44 kB
Progress (5): 2.5/2.6 MB | 426 kB | 181 kB | 73/92 kB | 44 kB
Progress (5): 2.5/2.6 MB | 426 kB | 181 kB | 73/92 kB | 44 kB
Progress (5): 2.5/2.6 MB | 426 kB | 181 kB | 77/92 kB | 44 kB
Progress (5): 2.5/2.6 MB | 426 kB | 181 kB | 77/92 kB | 44 kB
Progress (5): 2.5/2.6 MB | 426 kB | 181 kB | 81/92 kB | 44 kB
Progress (5): 2.5/2.6 MB | 426 kB | 181 kB | 81/92 kB | 44 kB
Progress (5): 2.5/2.6 MB | 426 kB | 181 kB | 85/92 kB | 44 kB
Progress (5): 2.5/2.6 MB | 426 kB | 181 kB | 85/92 kB | 44 kB
Progress (5): 2.5/2.6 MB | 426 kB | 181 kB | 89/92 kB | 44 kB
Progress (5): 2.5/2.6 MB | 426 kB | 181 kB | 89/92 kB | 44 kB
Progress (5): 2.5/2.6 MB | 426 kB | 181 kB | 92 kB | 44 kB   
Progress (5): 2.5/2.6 MB | 426 kB | 181 kB | 92 kB | 44 kB
Progress (5): 2.5/2.6 MB | 426 kB | 181 kB | 92 kB | 44 kB
Progress (5): 2.5/2.6 MB | 426 kB | 181 kB | 92 kB | 44 kB
Progress (5): 2.5/2.6 MB | 426 kB | 181 kB | 92 kB | 44 kB
Progress (5): 2.5/2.6 MB | 426 kB | 181 kB | 92 kB | 44 kB
Progress (5): 2.5/2.6 MB | 426 kB | 181 kB | 92 kB | 44 kB
Progress (5): 2.5/2.6 MB | 426 kB | 181 kB | 92 kB | 44 kB
Progress (5): 2.5/2.6 MB | 426 kB | 181 kB | 92 kB | 44 kB
Progress (5): 2.5/2.6 MB | 426 kB | 181 kB | 92 kB | 44 kB
Progress (5): 2.5/2.6 MB | 426 kB | 181 kB | 92 kB | 44 kB
Progress (5): 2.5/2.6 MB | 426 kB | 181 kB | 92 kB | 44 kB
Progress (5): 2.5/2.6 MB | 426 kB | 181 kB | 92 kB | 44 kB
Progress (5): 2.5/2.6 MB | 426 kB | 181 kB | 92 kB | 44 kB
Progress (5): 2.5/2.6 MB | 426 kB | 181 kB | 92 kB | 44 kB
Progress (5): 2.5/2.6 MB | 426 kB | 181 kB | 92 kB | 44 kB
Progress (5): 2.5/2.6 MB | 426 kB | 181 kB | 92 kB | 44 kB
Progress (5): 2.5/2.6 MB | 426 kB | 181 kB | 92 kB | 44 kB
Progress (5): 2.5/2.6 MB | 426 kB | 181 kB | 92 kB | 44 kB
Progress (5): 2.5/2.6 MB | 426 kB | 181 kB | 92 kB | 44 kB
Progress (5): 2.6/2.6 MB | 426 kB | 181 kB | 92 kB | 44 kB
Progress (5): 2.6/2.6 MB | 426 kB | 181 kB | 92 kB | 44 kB
Progress (5): 2.6/2.6 MB | 426 kB | 181 kB | 92 kB | 44 kB
Progress (5): 2.6/2.6 MB | 426 kB | 181 kB | 92 kB | 44 kB
Progress (5): 2.6/2.6 MB | 426 kB | 181 kB | 92 kB | 44 kB
Progress (5): 2.6/2.6 MB | 426 kB | 181 kB | 92 kB | 44 kB
Progress (5): 2.6/2.6 MB | 426 kB | 181 kB | 92 kB | 44 kB
Progress (5): 2.6/2.6 MB | 426 kB | 181 kB | 92 kB | 44 kB
Progress (5): 2.6/2.6 MB | 426 kB | 181 kB | 92 kB | 44 kB
Progress (5): 2.6/2.6 MB | 426 kB | 181 kB | 92 kB | 44 kB
Progress (5): 2.6 MB | 426 kB | 181 kB | 92 kB | 44 kB    
                                                      
Downloaded from eclipse.maven.central.mirror: https://repo.eclipse.org/content/repositories/maven_central/com/squareup/okhttp3/okhttp/3.14.1/okhttp-3.14.1.jar (426 kB at 646 kB/s)
Downloading from eclipse.maven.central.mirror: https://repo.eclipse.org/content/repositories/maven_central/org/apache/maven/resolver/maven-resolver-transport-wagon/1.4.1/maven-resolver-transport-wagon-1.4.1.jar
Downloaded from eclipse.maven.central.mirror: https://repo.eclipse.org/content/repositories/maven_central/org/apache/maven/resolver/maven-resolver-impl/1.4.1/maven-resolver-impl-1.4.1.jar (181 kB at 273 kB/s)
Downloading from eclipse.maven.central.mirror: https://repo.eclipse.org/content/repositories/maven_central/org/apache/maven/wagon/wagon-file/3.3.3/wagon-file-3.3.3.jar
Downloaded from eclipse.maven.central.mirror: https://repo.eclipse.org/content/repositories/maven_central/org/apache/maven/resolver/maven-resolver-connector-basic/1.4.1/maven-resolver-connector-basic-1.4.1.jar (44 kB at 66 kB/s)
Downloading from eclipse.maven.central.mirror: https://repo.eclipse.org/content/repositories/maven_central/org/fusesource/jansi/jansi/1.17.1/jansi-1.17.1.jar
Downloaded from eclipse.maven.central.mirror: https://repo.eclipse.org/content/repositories/maven_central/com/squareup/okio/okio/1.17.3/okio-1.17.3.jar (92 kB at 138 kB/s)
Downloaded from eclipse.maven.central.mirror: https://repo.eclipse.org/content/repositories/maven_central/com/google/guava/guava/25.1-android/guava-25.1-android.jar (2.6 MB at 3.9 MB/s)
Progress (1): 4.1/31 kB
Progress (1): 7.7/31 kB
Progress (1): 12/31 kB 
Progress (2): 12/31 kB | 4.1/12 kB
Progress (2): 16/31 kB | 4.1/12 kB
Progress (2): 16/31 kB | 7.7/12 kB
Progress (2): 20/31 kB | 7.7/12 kB
Progress (2): 20/31 kB | 12 kB    
Progress (2): 24/31 kB | 12 kB
Progress (2): 28/31 kB | 12 kB
Progress (2): 31 kB | 12 kB   
Progress (3): 31 kB | 12 kB | 4.1/284 kB
Progress (3): 31 kB | 12 kB | 7.7/284 kB
Progress (3): 31 kB | 12 kB | 12/284 kB 
Progress (3): 31 kB | 12 kB | 16/284 kB
Progress (3): 31 kB | 12 kB | 20/284 kB
Progress (3): 31 kB | 12 kB | 24/284 kB
Progress (3): 31 kB | 12 kB | 28/284 kB
Progress (3): 31 kB | 12 kB | 32/284 kB
Progress (3): 31 kB | 12 kB | 33/284 kB
Progress (3): 31 kB | 12 kB | 37/284 kB
Progress (3): 31 kB | 12 kB | 41/284 kB
Progress (3): 31 kB | 12 kB | 45/284 kB
Progress (3): 31 kB | 12 kB | 49/284 kB
Progress (3): 31 kB | 12 kB | 53/284 kB
Progress (3): 31 kB | 12 kB | 57/284 kB
Progress (3): 31 kB | 12 kB | 61/284 kB
                                       
Downloaded from eclipse.maven.central.mirror: https://repo.eclipse.org/content/repositories/maven_central/org/apache/maven/wagon/wagon-file/3.3.3/wagon-file-3.3.3.jar (12 kB at 17 kB/s)
Progress (2): 31 kB | 65/284 kB
                               
Downloaded from eclipse.maven.central.mirror: https://repo.eclipse.org/content/repositories/maven_central/org/apache/maven/resolver/maven-resolver-transport-wagon/1.4.1/maven-resolver-transport-wagon-1.4.1.jar (31 kB at 46 kB/s)
Progress (1): 69/284 kB
Progress (1): 73/284 kB
Progress (1): 77/284 kB
Progress (1): 81/284 kB
Progress (1): 85/284 kB
Progress (1): 89/284 kB
Progress (1): 93/284 kB
Progress (1): 97/284 kB
Progress (1): 98/284 kB
Progress (1): 102/284 kB
Progress (1): 106/284 kB
Progress (1): 110/284 kB
Progress (1): 114/284 kB
Progress (1): 118/284 kB
Progress (1): 122/284 kB
Progress (1): 126/284 kB
Progress (1): 130/284 kB
Progress (1): 131/284 kB
Progress (1): 135/284 kB
Progress (1): 139/284 kB
Progress (1): 143/284 kB
Progress (1): 147/284 kB
Progress (1): 151/284 kB
Progress (1): 155/284 kB
Progress (1): 159/284 kB
Progress (1): 163/284 kB
Progress (1): 167/284 kB
Progress (1): 171/284 kB
Progress (1): 175/284 kB
Progress (1): 179/284 kB
Progress (1): 183/284 kB
Progress (1): 187/284 kB
Progress (1): 191/284 kB
Progress (1): 195/284 kB
Progress (1): 199/284 kB
Progress (1): 203/284 kB
Progress (1): 207/284 kB
Progress (1): 211/284 kB
Progress (1): 215/284 kB
Progress (1): 219/284 kB
Progress (1): 223/284 kB
Progress (1): 227/284 kB
Progress (1): 231/284 kB
Progress (1): 235/284 kB
Progress (1): 239/284 kB
Progress (1): 243/284 kB
Progress (1): 247/284 kB
Progress (1): 251/284 kB
Progress (1): 255/284 kB
Progress (1): 259/284 kB
Progress (1): 263/284 kB
Progress (1): 267/284 kB
Progress (1): 271/284 kB
Progress (1): 275/284 kB
Progress (1): 279/284 kB
Progress (1): 283/284 kB
Progress (1): 284 kB    
                    
Downloaded from eclipse.maven.central.mirror: https://repo.eclipse.org/content/repositories/maven_central/org/fusesource/jansi/jansi/1.17.1/jansi-1.17.1.jar (284 kB at 410 kB/s)
[INFO] 
[INFO] --- maven-clean-plugin:2.4.1:clean (default-clean) @ org.eclipse.m2e.maven.runtime ---
[INFO] 
[INFO] --- maven-resources-plugin:2.5:resources (default-resources) @ org.eclipse.m2e.maven.runtime ---
[debug] execute contextualize
[INFO] Using 'UTF-8' encoding to copy filtered resources.
[INFO] Copying 3 resources
[INFO] 
[INFO] --- maven-compiler-plugin:3.8.1:compile (default-compile) @ org.eclipse.m2e.maven.runtime ---
[INFO] No sources to compile
[INFO] 
[INFO] --- maven-resources-plugin:2.5:testResources (default-testResources) @ org.eclipse.m2e.maven.runtime ---
[debug] execute contextualize
[INFO] Using 'UTF-8' encoding to copy filtered resources.
[INFO] skip non existing resourceDirectory /home/jenkins/agent/workspace/m2e-gerrit/m2e-maven-runtime/org.eclipse.m2e.maven.runtime/src/test/resources
[INFO] 
[INFO] --- maven-compiler-plugin:3.8.1:testCompile (default-testCompile) @ org.eclipse.m2e.maven.runtime ---
[INFO] No sources to compile
[INFO] 
[INFO] --- maven-surefire-plugin:2.8:test (default-test) @ org.eclipse.m2e.maven.runtime ---
[INFO] No tests to run.
[INFO] Surefire report directory: /home/jenkins/agent/workspace/m2e-gerrit/m2e-maven-runtime/org.eclipse.m2e.maven.runtime/target/surefire-reports

-------------------------------------------------------
 T E S T S
-------------------------------------------------------
There are no tests to run.

Results :

Tests run: 0, Failures: 0, Errors: 0, Skipped: 0

[INFO] 
[INFO] --- maven-bundle-plugin:4.2.0:bundle (default-bundle) @ org.eclipse.m2e.maven.runtime ---
[WARNING] Bundle org.eclipse.m2e:org.eclipse.m2e.maven.runtime:bundle:1.14.0-SNAPSHOT : Version for package org.eclipse.aether is set to different values in the source (1.1.1) and in the manifest (1.4.1). The version in the manifest is not picked up by an other sibling bundles in this project or projects that directly depend on this project
[WARNING] Bundle org.eclipse.m2e:org.eclipse.m2e.maven.runtime:bundle:1.14.0-SNAPSHOT : Version for package org.eclipse.aether.artifact is set to different values in the source (1.1.1) and in the manifest (1.4.1). The version in the manifest is not picked up by an other sibling bundles in this project or projects that directly depend on this project
[WARNING] Bundle org.eclipse.m2e:org.eclipse.m2e.maven.runtime:bundle:1.14.0-SNAPSHOT : Version for package org.eclipse.aether.collection is set to different values in the source (1.1.1) and in the manifest (1.4.1). The version in the manifest is not picked up by an other sibling bundles in this project or projects that directly depend on this project
[WARNING] Bundle org.eclipse.m2e:org.eclipse.m2e.maven.runtime:bundle:1.14.0-SNAPSHOT : Version for package org.eclipse.aether.connector.basic is set to different values in the source (1.1.1) and in the manifest (1.4.1). The version in the manifest is not picked up by an other sibling bundles in this project or projects that directly depend on this project
[WARNING] Bundle org.eclipse.m2e:org.eclipse.m2e.maven.runtime:bundle:1.14.0-SNAPSHOT : Version for package org.eclipse.aether.deployment is set to different values in the source (1.1.1) and in the manifest (1.4.1). The version in the manifest is not picked up by an other sibling bundles in this project or projects that directly depend on this project
[WARNING] Bundle org.eclipse.m2e:org.eclipse.m2e.maven.runtime:bundle:1.14.0-SNAPSHOT : Version for package org.eclipse.aether.graph is set to different values in the source (1.1.1) and in the manifest (1.4.1). The version in the manifest is not picked up by an other sibling bundles in this project or projects that directly depend on this project
[WARNING] Bundle org.eclipse.m2e:org.eclipse.m2e.maven.runtime:bundle:1.14.0-SNAPSHOT : Version for package org.eclipse.aether.impl is set to different values in the source (1.1.1) and in the manifest (1.4.1). The version in the manifest is not picked up by an other sibling bundles in this project or projects that directly depend on this project
[WARNING] Bundle org.eclipse.m2e:org.eclipse.m2e.maven.runtime:bundle:1.14.0-SNAPSHOT : Version for package org.eclipse.aether.impl.guice is set to different values in the source (1.1.1) and in the manifest (1.4.1). The version in the manifest is not picked up by an other sibling bundles in this project or projects that directly depend on this project
[WARNING] Bundle org.eclipse.m2e:org.eclipse.m2e.maven.runtime:bundle:1.14.0-SNAPSHOT : Version for package org.eclipse.aether.installation is set to different values in the source (1.1.1) and in the manifest (1.4.1). The version in the manifest is not picked up by an other sibling bundles in this project or projects that directly depend on this project
[WARNING] Bundle org.eclipse.m2e:org.eclipse.m2e.maven.runtime:bundle:1.14.0-SNAPSHOT : Version for package org.eclipse.aether.metadata is set to different values in the source (1.1.1) and in the manifest (1.4.1). The version in the manifest is not picked up by an other sibling bundles in this project or projects that directly depend on this project
[WARNING] Bundle org.eclipse.m2e:org.eclipse.m2e.maven.runtime:bundle:1.14.0-SNAPSHOT : Version for package org.eclipse.aether.repository is set to different values in the source (1.1.1) and in the manifest (1.4.1). The version in the manifest is not picked up by an other sibling bundles in this project or projects that directly depend on this project
[WARNING] Bundle org.eclipse.m2e:org.eclipse.m2e.maven.runtime:bundle:1.14.0-SNAPSHOT : Version for package org.eclipse.aether.resolution is set to different values in the source (1.1.1) and in the manifest (1.4.1). The version in the manifest is not picked up by an other sibling bundles in this project or projects that directly depend on this project
[WARNING] Bundle org.eclipse.m2e:org.eclipse.m2e.maven.runtime:bundle:1.14.0-SNAPSHOT : Version for package org.eclipse.aether.spi.connector is set to different values in the source (1.1.1) and in the manifest (1.4.1). The version in the manifest is not picked up by an other sibling bundles in this project or projects that directly depend on this project
[WARNING] Bundle org.eclipse.m2e:org.eclipse.m2e.maven.runtime:bundle:1.14.0-SNAPSHOT : Version for package org.eclipse.aether.spi.connector.checksum is set to different values in the source (1.1.1) and in the manifest (1.4.1). The version in the manifest is not picked up by an other sibling bundles in this project or projects that directly depend on this project
[WARNING] Bundle org.eclipse.m2e:org.eclipse.m2e.maven.runtime:bundle:1.14.0-SNAPSHOT : Version for package org.eclipse.aether.spi.connector.layout is set to different values in the source (1.1.1) and in the manifest (1.4.1). The version in the manifest is not picked up by an other sibling bundles in this project or projects that directly depend on this project
[WARNING] Bundle org.eclipse.m2e:org.eclipse.m2e.maven.runtime:bundle:1.14.0-SNAPSHOT : Version for package org.eclipse.aether.spi.connector.transport is set to different values in the source (1.1.1) and in the manifest (1.4.1). The version in the manifest is not picked up by an other sibling bundles in this project or projects that directly depend on this project
[WARNING] Bundle org.eclipse.m2e:org.eclipse.m2e.maven.runtime:bundle:1.14.0-SNAPSHOT : Version for package org.eclipse.aether.spi.io is set to different values in the source (1.1.1) and in the manifest (1.4.1). The version in the manifest is not picked up by an other sibling bundles in this project or projects that directly depend on this project
[WARNING] Bundle org.eclipse.m2e:org.eclipse.m2e.maven.runtime:bundle:1.14.0-SNAPSHOT : Version for package org.eclipse.aether.spi.localrepo is set to different values in the source (1.1.1) and in the manifest (1.4.1). The version in the manifest is not picked up by an other sibling bundles in this project or projects that directly depend on this project
[WARNING] Bundle org.eclipse.m2e:org.eclipse.m2e.maven.runtime:bundle:1.14.0-SNAPSHOT : Version for package org.eclipse.aether.spi.locator is set to different values in the source (1.1.1) and in the manifest (1.4.1). The version in the manifest is not picked up by an other sibling bundles in this project or projects that directly depend on this project
[WARNING] Bundle org.eclipse.m2e:org.eclipse.m2e.maven.runtime:bundle:1.14.0-SNAPSHOT : Version for package org.eclipse.aether.spi.log is set to different values in the source (1.1.1) and in the manifest (1.4.1). The version in the manifest is not picked up by an other sibling bundles in this project or projects that directly depend on this project
[WARNING] Bundle org.eclipse.m2e:org.eclipse.m2e.maven.runtime:bundle:1.14.0-SNAPSHOT : Version for package org.eclipse.aether.transfer is set to different values in the source (1.1.1) and in the manifest (1.4.1). The version in the manifest is not picked up by an other sibling bundles in this project or projects that directly depend on this project
[WARNING] Bundle org.eclipse.m2e:org.eclipse.m2e.maven.runtime:bundle:1.14.0-SNAPSHOT : Version for package org.eclipse.aether.transform is set to different values in the source (1.1.1) and in the manifest (1.4.1). The version in the manifest is not picked up by an other sibling bundles in this project or projects that directly depend on this project
[WARNING] Bundle org.eclipse.m2e:org.eclipse.m2e.maven.runtime:bundle:1.14.0-SNAPSHOT : Version for package org.eclipse.aether.transport.wagon is set to different values in the source (1.1.1) and in the manifest (1.4.1). The version in the manifest is not picked up by an other sibling bundles in this project or projects that directly depend on this project
[WARNING] Bundle org.eclipse.m2e:org.eclipse.m2e.maven.runtime:bundle:1.14.0-SNAPSHOT : Version for package org.eclipse.aether.util is set to different values in the source (1.1.1) and in the manifest (1.4.1). The version in the manifest is not picked up by an other sibling bundles in this project or projects that directly depend on this project
[WARNING] Bundle org.eclipse.m2e:org.eclipse.m2e.maven.runtime:bundle:1.14.0-SNAPSHOT : Version for package org.eclipse.aether.util.artifact is set to different values in the source (1.1.1) and in the manifest (1.4.1). The version in the manifest is not picked up by an other sibling bundles in this project or projects that directly depend on this project
[WARNING] Bundle org.eclipse.m2e:org.eclipse.m2e.maven.runtime:bundle:1.14.0-SNAPSHOT : Version for package org.eclipse.aether.util.concurrency is set to different values in the source (1.1.1) and in the manifest (1.4.1). The version in the manifest is not picked up by an other sibling bundles in this project or projects that directly depend on this project
[WARNING] Bundle org.eclipse.m2e:org.eclipse.m2e.maven.runtime:bundle:1.14.0-SNAPSHOT : Version for package org.eclipse.aether.util.filter is set to different values in the source (1.1.1) and in the manifest (1.4.1). The version in the manifest is not picked up by an other sibling bundles in this project or projects that directly depend on this project
[WARNING] Bundle org.eclipse.m2e:org.eclipse.m2e.maven.runtime:bundle:1.14.0-SNAPSHOT : Version for package org.eclipse.aether.util.graph.manager is set to different values in the source (1.1.1) and in the manifest (1.4.1). The version in the manifest is not picked up by an other sibling bundles in this project or projects that directly depend on this project
[WARNING] Bundle org.eclipse.m2e:org.eclipse.m2e.maven.runtime:bundle:1.14.0-SNAPSHOT : Version for package org.eclipse.aether.util.graph.selector is set to different values in the source (1.1.1) and in the manifest (1.4.1). The version in the manifest is not picked up by an other sibling bundles in this project or projects that directly depend on this project
[WARNING] Bundle org.eclipse.m2e:org.eclipse.m2e.maven.runtime:bundle:1.14.0-SNAPSHOT : Version for package org.eclipse.aether.util.graph.transformer is set to different values in the source (1.1.1) and in the manifest (1.4.1). The version in the manifest is not picked up by an other sibling bundles in this project or projects that directly depend on this project
[WARNING] Bundle org.eclipse.m2e:org.eclipse.m2e.maven.runtime:bundle:1.14.0-SNAPSHOT : Version for package org.eclipse.aether.util.graph.traverser is set to different values in the source (1.1.1) and in the manifest (1.4.1). The version in the manifest is not picked up by an other sibling bundles in this project or projects that directly depend on this project
[WARNING] Bundle org.eclipse.m2e:org.eclipse.m2e.maven.runtime:bundle:1.14.0-SNAPSHOT : Version for package org.eclipse.aether.util.graph.version is set to different values in the source (1.1.1) and in the manifest (1.4.1). The version in the manifest is not picked up by an other sibling bundles in this project or projects that directly depend on this project
[WARNING] Bundle org.eclipse.m2e:org.eclipse.m2e.maven.runtime:bundle:1.14.0-SNAPSHOT : Version for package org.eclipse.aether.util.graph.visitor is set to different values in the source (1.1.1) and in the manifest (1.4.1). The version in the manifest is not picked up by an other sibling bundles in this project or projects that directly depend on this project
[WARNING] Bundle org.eclipse.m2e:org.eclipse.m2e.maven.runtime:bundle:1.14.0-SNAPSHOT : Version for package org.eclipse.aether.util.listener is set to different values in the source (1.1.1) and in the manifest (1.4.1). The version in the manifest is not picked up by an other sibling bundles in this project or projects that directly depend on this project
[WARNING] Bundle org.eclipse.m2e:org.eclipse.m2e.maven.runtime:bundle:1.14.0-SNAPSHOT : Version for package org.eclipse.aether.util.repository is set to different values in the source (1.1.1) and in the manifest (1.4.1). The version in the manifest is not picked up by an other sibling bundles in this project or projects that directly depend on this project
[WARNING] Bundle org.eclipse.m2e:org.eclipse.m2e.maven.runtime:bundle:1.14.0-SNAPSHOT : Version for package org.eclipse.aether.util.version is set to different values in the source (1.1.1) and in the manifest (1.4.1). The version in the manifest is not picked up by an other sibling bundles in this project or projects that directly depend on this project
[WARNING] Bundle org.eclipse.m2e:org.eclipse.m2e.maven.runtime:bundle:1.14.0-SNAPSHOT : Version for package org.eclipse.aether.version is set to different values in the source (1.1.1) and in the manifest (1.4.1). The version in the manifest is not picked up by an other sibling bundles in this project or projects that directly depend on this project
[WARNING] Bundle org.eclipse.m2e:org.eclipse.m2e.maven.runtime:bundle:1.14.0-SNAPSHOT : Host org.eclipse.m2e.maven.runtime.slf4j.simple=bundle-version="[1.14.0,1.15.0)" for this fragment/require bundle cannot be found on the classpath
[WARNING] Bundle org.eclipse.m2e:org.eclipse.m2e.maven.runtime:bundle:1.14.0-SNAPSHOT : Host javax.inject=bundle-version="1.0.0";visibility:=reexport for this fragment/require bundle cannot be found on the classpath
[WARNING] Bundle org.eclipse.m2e:org.eclipse.m2e.maven.runtime:bundle:1.14.0-SNAPSHOT : Export org.apache.maven.cli,  has 1,  private references [org.apache.commons.cli]
[WARNING] Bundle org.eclipse.m2e:org.eclipse.m2e.maven.runtime:bundle:1.14.0-SNAPSHOT : Export org.apache.maven.extension.internal,  has 1,  private references [org.eclipse.sisu]
[WARNING] Bundle org.eclipse.m2e:org.eclipse.m2e.maven.runtime:bundle:1.14.0-SNAPSHOT : Export org.apache.maven.model.building,  has 1,  private references [org.eclipse.sisu]
[WARNING] Bundle org.eclipse.m2e:org.eclipse.m2e.maven.runtime:bundle:1.14.0-SNAPSHOT : Export org.apache.maven.shared.utils,  has 1,  private references [javax.annotation]
[WARNING] Bundle org.eclipse.m2e:org.eclipse.m2e.maven.runtime:bundle:1.14.0-SNAPSHOT : Export org.apache.maven.shared.utils.cli,  has 1,  private references [javax.annotation]
[WARNING] Bundle org.eclipse.m2e:org.eclipse.m2e.maven.runtime:bundle:1.14.0-SNAPSHOT : Export org.apache.maven.shared.utils.introspection,  has 1,  private references [javax.annotation]
[WARNING] Bundle org.eclipse.m2e:org.eclipse.m2e.maven.runtime:bundle:1.14.0-SNAPSHOT : Export org.apache.maven.shared.utils.io,  has 1,  private references [javax.annotation]
[WARNING] Bundle org.eclipse.m2e:org.eclipse.m2e.maven.runtime:bundle:1.14.0-SNAPSHOT : Export org.apache.maven.shared.utils.xml,  has 2,  private references [javax.annotation, org.apache.commons.io.output]
[WARNING] Bundle org.eclipse.m2e:org.eclipse.m2e.maven.runtime:bundle:1.14.0-SNAPSHOT : Export org.codehaus.plexus,  has 1,  private references [org.eclipse.sisu.plexus]
[WARNING] Bundle org.eclipse.m2e:org.eclipse.m2e.maven.runtime:bundle:1.14.0-SNAPSHOT : Export org.codehaus.plexus.component.configurator.converters.special,  has 1,  private references [org.codehaus.classworlds]
[WARNING] Bundle org.eclipse.m2e:org.eclipse.m2e.maven.runtime:bundle:1.14.0-SNAPSHOT : Export org.codehaus.plexus.component.factory,  has 1,  private references [org.codehaus.classworlds]
[WARNING] Bundle org.eclipse.m2e:org.eclipse.m2e.maven.runtime:bundle:1.14.0-SNAPSHOT : Export org.codehaus.plexus.logging,  has 1,  private references [org.eclipse.sisu.bean]
[WARNING] Bundle org.eclipse.m2e:org.eclipse.m2e.maven.runtime:bundle:1.14.0-SNAPSHOT : Export org.sonatype.plexus.components.cipher,  has 1,  private references [javax.enterprise.inject]
[WARNING] Bundle org.eclipse.m2e:org.eclipse.m2e.maven.runtime:bundle:1.14.0-SNAPSHOT : Export io.takari.aether.connector,  has 1,  private references [org.eclipse.sisu]
[WARNING] Bundle org.eclipse.m2e:org.eclipse.m2e.maven.runtime:bundle:1.14.0-SNAPSHOT : Invalid package name: 'META-INF.plexus' in Export-Package
[WARNING] Bundle org.eclipse.m2e:org.eclipse.m2e.maven.runtime:bundle:1.14.0-SNAPSHOT : Invalid package name: 'META-INF.sisu' in Export-Package
[INFO] 
[INFO] --- tycho-p2-plugin:1.4.0:p2-metadata (p2-metadata) @ org.eclipse.m2e.maven.runtime ---
[INFO] 
[INFO] --- tycho-p2-plugin:1.4.0:update-local-index (p2-metadata) @ org.eclipse.m2e.maven.runtime ---
[INFO] 
[INFO] --- tycho-pack200a-plugin:1.4.0:normalize (pack200-normalize) @ org.eclipse.m2e.maven.runtime ---
[INFO] Pack200 normalizing jar /home/jenkins/agent/workspace/m2e-gerrit/m2e-maven-runtime/org.eclipse.m2e.maven.runtime/target/org.eclipse.m2e.maven.runtime-1.14.0-SNAPSHOT.jar
[INFO] 
[INFO] --- eclipse-jarsigner-plugin:1.1.5:sign (sign) @ org.eclipse.m2e.maven.runtime ---
[INFO] Signing of nested jars of '/home/jenkins/agent/workspace/m2e-gerrit/m2e-maven-runtime/org.eclipse.m2e.maven.runtime/target/org.eclipse.m2e.maven.runtime-1.14.0-SNAPSHOT.jar' is disabled.
[INFO] Signing jar: /home/jenkins/agent/workspace/m2e-gerrit/m2e-maven-runtime/org.eclipse.m2e.maven.runtime/target/org.eclipse.m2e.maven.runtime-1.14.0-SNAPSHOT.jar
[INFO] 
[INFO] --- tycho-pack200b-plugin:1.4.0:pack (pack200-pack) @ org.eclipse.m2e.maven.runtime ---
[INFO] Pack200 packing jar /home/jenkins/agent/workspace/m2e-gerrit/m2e-maven-runtime/org.eclipse.m2e.maven.runtime/target/org.eclipse.m2e.maven.runtime-1.14.0-SNAPSHOT.jar
[INFO] 
[INFO] --- maven-install-plugin:2.3.1:install (default-install) @ org.eclipse.m2e.maven.runtime ---
[INFO] Installing /home/jenkins/agent/workspace/m2e-gerrit/m2e-maven-runtime/org.eclipse.m2e.maven.runtime/target/org.eclipse.m2e.maven.runtime-1.14.0-SNAPSHOT.jar to /home/jenkins/agent/workspace/m2e-gerrit/.repository/org/eclipse/m2e/org.eclipse.m2e.maven.runtime/1.14.0-SNAPSHOT/org.eclipse.m2e.maven.runtime-1.14.0-SNAPSHOT.jar
[INFO] Installing /home/jenkins/agent/workspace/m2e-gerrit/m2e-maven-runtime/org.eclipse.m2e.maven.runtime/pom.xml to /home/jenkins/agent/workspace/m2e-gerrit/.repository/org/eclipse/m2e/org.eclipse.m2e.maven.runtime/1.14.0-SNAPSHOT/org.eclipse.m2e.maven.runtime-1.14.0-SNAPSHOT.pom
[INFO] Installing /home/jenkins/agent/workspace/m2e-gerrit/m2e-maven-runtime/org.eclipse.m2e.maven.runtime/target/org.eclipse.m2e.maven.runtime-1.14.0-SNAPSHOT.jar.pack.gz to /home/jenkins/agent/workspace/m2e-gerrit/.repository/org/eclipse/m2e/org.eclipse.m2e.maven.runtime/1.14.0-SNAPSHOT/org.eclipse.m2e.maven.runtime-1.14.0-SNAPSHOT-pack200.jar.pack.gz
[INFO] 
[INFO] --- maven-bundle-plugin:4.2.0:install (default-install) @ org.eclipse.m2e.maven.runtime ---
[INFO] Installing org/eclipse/m2e/org.eclipse.m2e.maven.runtime/1.14.0-SNAPSHOT/org.eclipse.m2e.maven.runtime-1.14.0-SNAPSHOT.jar
[INFO] Writing OBR metadata
[INFO] 
[INFO] -----< org.eclipse.m2e:org.eclipse.m2e.maven.runtime.slf4j.simple >-----
[INFO] Building org.eclipse.m2e.maven.runtime.slf4j.simple 1.14.0-SNAPSHOT [5/5]
[INFO] -------------------------------[ bundle ]-------------------------------
Downloading from maven-3.6.2-staging: https://repository.apache.org/content/repositories/maven-1529/org/slf4j/slf4j-simple/1.7.5/slf4j-simple-1.7.5.pom
Downloading from eclipse.maven.central.mirror: https://repo.eclipse.org/content/repositories/maven_central/org/slf4j/slf4j-simple/1.7.5/slf4j-simple-1.7.5.pom
Progress (1): 1.5 kB
                    
Downloaded from eclipse.maven.central.mirror: https://repo.eclipse.org/content/repositories/maven_central/org/slf4j/slf4j-simple/1.7.5/slf4j-simple-1.7.5.pom (1.5 kB at 46 kB/s)
Downloading from maven-3.6.2-staging: https://repository.apache.org/content/repositories/maven-1529/org/slf4j/slf4j-parent/1.7.5/slf4j-parent-1.7.5.pom
Downloading from eclipse.maven.central.mirror: https://repo.eclipse.org/content/repositories/maven_central/org/slf4j/slf4j-parent/1.7.5/slf4j-parent-1.7.5.pom
Progress (1): 4.1/12 kB
Progress (1): 7.7/12 kB
Progress (1): 12/12 kB 
Progress (1): 12 kB   
                   
Downloaded from eclipse.maven.central.mirror: https://repo.eclipse.org/content/repositories/maven_central/org/slf4j/slf4j-parent/1.7.5/slf4j-parent-1.7.5.pom (12 kB at 738 kB/s)
Downloading from maven-3.6.2-staging: https://repository.apache.org/content/repositories/maven-1529/org/slf4j/slf4j-api/1.7.5/slf4j-api-1.7.5.pom
Downloading from eclipse.maven.central.mirror: https://repo.eclipse.org/content/repositories/maven_central/org/slf4j/slf4j-api/1.7.5/slf4j-api-1.7.5.pom
Progress (1): 2.7 kB
                    
Downloaded from eclipse.maven.central.mirror: https://repo.eclipse.org/content/repositories/maven_central/org/slf4j/slf4j-api/1.7.5/slf4j-api-1.7.5.pom (2.7 kB at 142 kB/s)
Downloading from maven-3.6.2-staging: https://repository.apache.org/content/repositories/maven-1529/org/slf4j/slf4j-simple/1.7.5/slf4j-simple-1.7.5.jar
Downloading from maven-3.6.2-staging: https://repository.apache.org/content/repositories/maven-1529/org/slf4j/slf4j-api/1.7.5/slf4j-api-1.7.5.jar
Downloading from eclipse.maven.central.mirror: https://repo.eclipse.org/content/repositories/maven_central/org/slf4j/slf4j-simple/1.7.5/slf4j-simple-1.7.5.jar
Downloading from eclipse.maven.central.mirror: https://repo.eclipse.org/content/repositories/maven_central/org/slf4j/slf4j-api/1.7.5/slf4j-api-1.7.5.jar
Progress (1): 4.1/26 kB
Progress (1): 7.7/26 kB
Progress (1): 12/26 kB 
Progress (1): 16/26 kB
Progress (2): 16/26 kB | 4.1/11 kB
Progress (2): 20/26 kB | 4.1/11 kB
Progress (2): 20/26 kB | 7.7/11 kB
Progress (2): 24/26 kB | 7.7/11 kB
Progress (2): 24/26 kB | 11 kB    
Progress (2): 26 kB | 11 kB   
                           
Downloaded from eclipse.maven.central.mirror: https://repo.eclipse.org/content/repositories/maven_central/org/slf4j/slf4j-simple/1.7.5/slf4j-simple-1.7.5.jar (11 kB at 381 kB/s)
Downloaded from eclipse.maven.central.mirror: https://repo.eclipse.org/content/repositories/maven_central/org/slf4j/slf4j-api/1.7.5/slf4j-api-1.7.5.jar (26 kB at 869 kB/s)
[INFO] 
[INFO] --- maven-clean-plugin:2.4.1:clean (default-clean) @ org.eclipse.m2e.maven.runtime.slf4j.simple ---
[INFO] 
[INFO] --- maven-resources-plugin:2.5:resources (default-resources) @ org.eclipse.m2e.maven.runtime.slf4j.simple ---
[debug] execute contextualize
[INFO] Using 'UTF-8' encoding to copy filtered resources.
[INFO] Copying 4 resources
[INFO] 
[INFO] --- maven-compiler-plugin:3.8.1:compile (default-compile) @ org.eclipse.m2e.maven.runtime.slf4j.simple ---
[INFO] No sources to compile
[INFO] 
[INFO] --- maven-resources-plugin:2.5:testResources (default-testResources) @ org.eclipse.m2e.maven.runtime.slf4j.simple ---
[debug] execute contextualize
[INFO] Using 'UTF-8' encoding to copy filtered resources.
[INFO] skip non existing resourceDirectory /home/jenkins/agent/workspace/m2e-gerrit/m2e-maven-runtime/org.eclipse.m2e.maven.runtime.slf4j.simple/src/test/resources
[INFO] 
[INFO] --- maven-compiler-plugin:3.8.1:testCompile (default-testCompile) @ org.eclipse.m2e.maven.runtime.slf4j.simple ---
[INFO] No sources to compile
[INFO] 
[INFO] --- maven-surefire-plugin:2.8:test (default-test) @ org.eclipse.m2e.maven.runtime.slf4j.simple ---
[INFO] No tests to run.
[INFO] Surefire report directory: /home/jenkins/agent/workspace/m2e-gerrit/m2e-maven-runtime/org.eclipse.m2e.maven.runtime.slf4j.simple/target/surefire-reports

-------------------------------------------------------
 T E S T S
-------------------------------------------------------
There are no tests to run.

Results :

Tests run: 0, Failures: 0, Errors: 0, Skipped: 0

[INFO] 
[INFO] --- maven-bundle-plugin:4.2.0:bundle (default-bundle) @ org.eclipse.m2e.maven.runtime.slf4j.simple ---
[INFO] 
[INFO] --- tycho-p2-plugin:1.4.0:p2-metadata (p2-metadata) @ org.eclipse.m2e.maven.runtime.slf4j.simple ---
[INFO] 
[INFO] --- tycho-p2-plugin:1.4.0:update-local-index (p2-metadata) @ org.eclipse.m2e.maven.runtime.slf4j.simple ---
[INFO] 
[INFO] --- tycho-pack200a-plugin:1.4.0:normalize (pack200-normalize) @ org.eclipse.m2e.maven.runtime.slf4j.simple ---
[INFO] Pack200 normalizing jar /home/jenkins/agent/workspace/m2e-gerrit/m2e-maven-runtime/org.eclipse.m2e.maven.runtime.slf4j.simple/target/org.eclipse.m2e.maven.runtime.slf4j.simple-1.14.0-SNAPSHOT.jar
[INFO] 
[INFO] --- eclipse-jarsigner-plugin:1.1.5:sign (sign) @ org.eclipse.m2e.maven.runtime.slf4j.simple ---
[INFO] Signing of nested jars of '/home/jenkins/agent/workspace/m2e-gerrit/m2e-maven-runtime/org.eclipse.m2e.maven.runtime.slf4j.simple/target/org.eclipse.m2e.maven.runtime.slf4j.simple-1.14.0-SNAPSHOT.jar' is disabled.
[INFO] Signing jar: /home/jenkins/agent/workspace/m2e-gerrit/m2e-maven-runtime/org.eclipse.m2e.maven.runtime.slf4j.simple/target/org.eclipse.m2e.maven.runtime.slf4j.simple-1.14.0-SNAPSHOT.jar
[INFO] 
[INFO] --- tycho-pack200b-plugin:1.4.0:pack (pack200-pack) @ org.eclipse.m2e.maven.runtime.slf4j.simple ---
[INFO] Pack200 packing jar /home/jenkins/agent/workspace/m2e-gerrit/m2e-maven-runtime/org.eclipse.m2e.maven.runtime.slf4j.simple/target/org.eclipse.m2e.maven.runtime.slf4j.simple-1.14.0-SNAPSHOT.jar
[INFO] 
[INFO] --- maven-install-plugin:2.3.1:install (default-install) @ org.eclipse.m2e.maven.runtime.slf4j.simple ---
[INFO] Installing /home/jenkins/agent/workspace/m2e-gerrit/m2e-maven-runtime/org.eclipse.m2e.maven.runtime.slf4j.simple/target/org.eclipse.m2e.maven.runtime.slf4j.simple-1.14.0-SNAPSHOT.jar to /home/jenkins/agent/workspace/m2e-gerrit/.repository/org/eclipse/m2e/org.eclipse.m2e.maven.runtime.slf4j.simple/1.14.0-SNAPSHOT/org.eclipse.m2e.maven.runtime.slf4j.simple-1.14.0-SNAPSHOT.jar
[INFO] Installing /home/jenkins/agent/workspace/m2e-gerrit/m2e-maven-runtime/org.eclipse.m2e.maven.runtime.slf4j.simple/pom.xml to /home/jenkins/agent/workspace/m2e-gerrit/.repository/org/eclipse/m2e/org.eclipse.m2e.maven.runtime.slf4j.simple/1.14.0-SNAPSHOT/org.eclipse.m2e.maven.runtime.slf4j.simple-1.14.0-SNAPSHOT.pom
[INFO] Installing /home/jenkins/agent/workspace/m2e-gerrit/m2e-maven-runtime/org.eclipse.m2e.maven.runtime.slf4j.simple/target/org.eclipse.m2e.maven.runtime.slf4j.simple-1.14.0-SNAPSHOT.jar.pack.gz to /home/jenkins/agent/workspace/m2e-gerrit/.repository/org/eclipse/m2e/org.eclipse.m2e.maven.runtime.slf4j.simple/1.14.0-SNAPSHOT/org.eclipse.m2e.maven.runtime.slf4j.simple-1.14.0-SNAPSHOT-pack200.jar.pack.gz
[INFO] 
[INFO] --- maven-bundle-plugin:4.2.0:install (default-install) @ org.eclipse.m2e.maven.runtime.slf4j.simple ---
[INFO] Installing org/eclipse/m2e/org.eclipse.m2e.maven.runtime.slf4j.simple/1.14.0-SNAPSHOT/org.eclipse.m2e.maven.runtime.slf4j.simple-1.14.0-SNAPSHOT.jar
[INFO] Writing OBR metadata
[INFO] ------------------------------------------------------------------------
[INFO] Reactor Summary for m2e-maven-runtime 1.14.0-SNAPSHOT:
[INFO] 
[INFO] m2e-maven-runtime .................................. SUCCESS [  5.438 s]
[INFO] Maven Archetype Common Bundle ...................... SUCCESS [ 27.900 s]
[INFO] Nexus Indexer Bundle ............................... SUCCESS [  6.054 s]
[INFO] Embedded Maven Runtime Bundle ...................... SUCCESS [ 20.508 s]
[INFO] org.eclipse.m2e.maven.runtime.slf4j.simple ......... SUCCESS [  2.251 s]
[INFO] ------------------------------------------------------------------------
[INFO] BUILD SUCCESS
[INFO] ------------------------------------------------------------------------
[INFO] Total time:  01:25 min
[INFO] Finished at: 2019-10-25T18:52:52Z
[INFO] ------------------------------------------------------------------------
[m2e-gerrit] $ /opt/tools/apache-maven/3.5.4/bin/mvn -f pom.xml -DGERRIT_BRANCH=master -DGERRIT_PATCHSET_REVISION=78fdd784c59bd9c6a3c81036c15b250364e6dec1 -DGERRIT_HOST=gerrit-local -DGERRIT_CHANGE_OWNER_EMAIL=akurtako@redhat.com "-DGERRIT_EVENT_ACCOUNT_NAME=Alexander Kurtakov" -DGERRIT_CHANGE_URL=https://git.eclipse.org/r/151636 -DGERRIT_PATCHSET_UPLOADER_EMAIL=akurtako@redhat.com -DGERRIT_EVENT_TYPE=patchset-created -DGERRIT_PROJECT=m2e/m2e-core -DGERRIT_CHANGE_NUMBER=151636 -DGERRIT_SCHEME=ssh '-DGERRIT_PATCHSET_UPLOADER=\"Alexander Kurtakov\" <akurtako@redhat.com>' -DGERRIT_PORT=29418 -DGERRIT_CHANGE_PRIVATE_STATE=false -DGERRIT_REFSPEC=refs/changes/36/151636/2 "-DGERRIT_PATCHSET_UPLOADER_NAME=Alexander Kurtakov" '-DGERRIT_CHANGE_OWNER=\"Alexander Kurtakov\" <akurtako@redhat.com>' -DGERRIT_CHANGE_COMMIT_MESSAGE=TW92ZSBhd2F5IG9mIGRlcHJlY2F0ZWQgU3RyaW5nVXRpbHMuZXF1YWxzLgoKcGxleHVzLXV0aWxzIGl0c2VsZiBqdXN0IGNhbGxzIE9iamVjdHMuZXF1YWxzIG5vdy4KCkNoYW5nZS1JZDogSTIyNmNlZDBlYWQ0ZDkzYWQ1MTQ1YzJhMWQyYzZiZTQyNDA3MDk2ZTIKU2lnbmVkLW9mZi1ieTogQWxleGFuZGVyIEt1cnRha292IDxha3VydGFrb0ByZWRoYXQuY29tPg== "-DGERRIT_NAME=Eclipse Gerrit" -DGERRIT_TOPIC= "-DGERRIT_CHANGE_SUBJECT=Move away of deprecated StringUtils.equals." '-DGERRIT_EVENT_ACCOUNT=\"Alexander Kurtakov\" <akurtako@redhat.com>' -DGERRIT_CHANGE_WIP_STATE=false -DGERRIT_CHANGE_ID=I226ced0ead4d93ad5145c2a1d2c6be42407096e2 -DGERRIT_EVENT_HASH=-1516942638 -DGERRIT_VERSION=2.14.6 -DGERRIT_EVENT_ACCOUNT_EMAIL=akurtako@redhat.com -DGERRIT_PATCHSET_NUMBER=2 "-DGERRIT_CHANGE_OWNER_NAME=Alexander Kurtakov" -Dmaven.test.failure.ignore=true -Dmaven.test.error.ignore=true -Dtycho.disableP2Mirrors=true -Dtycho.surefire.timeout=7200 -Dmaven.repo.local=/home/jenkins/agent/workspace/m2e-gerrit/.repository clean install -Peclipse-sign,uts,its
Picked up JAVA_TOOL_OPTIONS: -XX:+IgnoreUnrecognizedVMOptions -XX:+UseContainerSupport -XX:+UnlockExperimentalVMOptions -XX:+UseCGroupMemoryLimitForHeap
Picked up _JAVA_OPTIONS: -XX:MaxRAMPercentage=64.0
[INFO] Scanning for projects...
Downloading from cbi-releases: https://repo.eclipse.org/content/repositories/cbi-releases/org/eclipse/tycho/tycho-maven-plugin/1.5.0/tycho-maven-plugin-1.5.0.pom
Downloading from tycho-snapshots: https://oss.sonatype.org/content/groups/staging/org/eclipse/tycho/tycho-maven-plugin/1.5.0/tycho-maven-plugin-1.5.0.pom
Downloading from eclipse.maven.central.mirror: https://repo.eclipse.org/content/repositories/maven_central/org/eclipse/tycho/tycho-maven-plugin/1.5.0/tycho-maven-plugin-1.5.0.pom
Progress (1): 2.1 kB
                    
Downloaded from eclipse.maven.central.mirror: https://repo.eclipse.org/content/repositories/maven_central/org/eclipse/tycho/tycho-maven-plugin/1.5.0/tycho-maven-plugin-1.5.0.pom (2.1 kB at 42 kB/s)
Downloading from cbi-releases: https://repo.eclipse.org/content/repositories/cbi-releases/org/eclipse/tycho/tycho/1.5.0/tycho-1.5.0.pom
Downloading from tycho-snapshots: https://oss.sonatype.org/content/groups/staging/org/eclipse/tycho/tycho/1.5.0/tycho-1.5.0.pom
Downloading from eclipse.maven.central.mirror: https://repo.eclipse.org/content/repositories/maven_central/org/eclipse/tycho/tycho/1.5.0/tycho-1.5.0.pom
Progress (1): 4.1/19 kB
Progress (1): 7.7/19 kB
Progress (1): 12/19 kB 
Progress (1): 16/19 kB
Progress (1): 19 kB   
                   
Downloaded from eclipse.maven.central.mirror: https://repo.eclipse.org/content/repositories/maven_central/org/eclipse/tycho/tycho/1.5.0/tycho-1.5.0.pom (19 kB at 436 kB/s)
Downloading from cbi-releases: https://repo.eclipse.org/content/repositories/cbi-releases/org/eclipse/tycho/tycho-core/1.5.0/tycho-core-1.5.0.pom
Downloading from tycho-snapshots: https://oss.sonatype.org/content/groups/staging/org/eclipse/tycho/tycho-core/1.5.0/tycho-core-1.5.0.pom
Downloading from eclipse.maven.central.mirror: https://repo.eclipse.org/content/repositories/maven_central/org/eclipse/tycho/tycho-core/1.5.0/tycho-core-1.5.0.pom
Progress (1): 4.1/4.8 kB
Progress (1): 4.8 kB    
                    
Downloaded from eclipse.maven.central.mirror: https://repo.eclipse.org/content/repositories/maven_central/org/eclipse/tycho/tycho-core/1.5.0/tycho-core-1.5.0.pom (4.8 kB at 142 kB/s)
Downloading from cbi-releases: https://repo.eclipse.org/content/repositories/cbi-releases/org/eclipse/tycho/org.eclipse.tycho.p2.tools.shared/1.5.0/org.eclipse.tycho.p2.tools.shared-1.5.0.pom
Downloading from tycho-snapshots: https://oss.sonatype.org/content/groups/staging/org/eclipse/tycho/org.eclipse.tycho.p2.tools.shared/1.5.0/org.eclipse.tycho.p2.tools.shared-1.5.0.pom
Downloading from eclipse.maven.central.mirror: https://repo.eclipse.org/content/repositories/maven_central/org/eclipse/tycho/org.eclipse.tycho.p2.tools.shared/1.5.0/org.eclipse.tycho.p2.tools.shared-1.5.0.pom
Progress (1): 1.1 kB
                    
Downloaded from eclipse.maven.central.mirror: https://repo.eclipse.org/content/repositories/maven_central/org/eclipse/tycho/org.eclipse.tycho.p2.tools.shared/1.5.0/org.eclipse.tycho.p2.tools.shared-1.5.0.pom (1.1 kB at 30 kB/s)
Downloading from cbi-releases: https://repo.eclipse.org/content/repositories/cbi-releases/org/eclipse/tycho/tycho-bundles/1.5.0/tycho-bundles-1.5.0.pom
Downloading from tycho-snapshots: https://oss.sonatype.org/content/groups/staging/org/eclipse/tycho/tycho-bundles/1.5.0/tycho-bundles-1.5.0.pom
Downloading from eclipse.maven.central.mirror: https://repo.eclipse.org/content/repositories/maven_central/org/eclipse/tycho/tycho-bundles/1.5.0/tycho-bundles-1.5.0.pom
Progress (1): 3.0 kB
                    
Downloaded from eclipse.maven.central.mirror: https://repo.eclipse.org/content/repositories/maven_central/org/eclipse/tycho/tycho-bundles/1.5.0/tycho-bundles-1.5.0.pom (3.0 kB at 91 kB/s)
Downloading from cbi-releases: https://repo.eclipse.org/content/repositories/cbi-releases/org/apache/commons/commons-compress/1.18/commons-compress-1.18.pom
Downloading from tycho-snapshots: https://oss.sonatype.org/content/groups/staging/org/apache/commons/commons-compress/1.18/commons-compress-1.18.pom
Downloading from eclipse.maven.central.mirror: https://repo.eclipse.org/content/repositories/maven_central/org/apache/commons/commons-compress/1.18/commons-compress-1.18.pom
Progress (1): 4.1/18 kB
Progress (1): 7.7/18 kB
Progress (1): 12/18 kB 
Progress (1): 16/18 kB
Progress (1): 18 kB   
                   
Downloaded from eclipse.maven.central.mirror: https://repo.eclipse.org/content/repositories/maven_central/org/apache/commons/commons-compress/1.18/commons-compress-1.18.pom (18 kB at 493 kB/s)
Downloading from cbi-releases: https://repo.eclipse.org/content/repositories/cbi-releases/org/eclipse/platform/org.eclipse.osgi.compatibility.state/1.1.600/org.eclipse.osgi.compatibility.state-1.1.600.pom
Downloading from tycho-snapshots: https://oss.sonatype.org/content/groups/staging/org/eclipse/platform/org.eclipse.osgi.compatibility.state/1.1.600/org.eclipse.osgi.compatibility.state-1.1.600.pom
Downloading from eclipse.maven.central.mirror: https://repo.eclipse.org/content/repositories/maven_central/org/eclipse/platform/org.eclipse.osgi.compatibility.state/1.1.600/org.eclipse.osgi.compatibility.state-1.1.600.pom
Progress (1): 2.0 kB
                    
Downloaded from eclipse.maven.central.mirror: https://repo.eclipse.org/content/repositories/maven_central/org/eclipse/platform/org.eclipse.osgi.compatibility.state/1.1.600/org.eclipse.osgi.compatibility.state-1.1.600.pom (2.0 kB at 15 kB/s)
Downloading from cbi-releases: https://repo.eclipse.org/content/repositories/cbi-releases/org/eclipse/platform/org.eclipse.osgi/3.15.0/org.eclipse.osgi-3.15.0.pom
Downloading from tycho-snapshots: https://oss.sonatype.org/content/groups/staging/org/eclipse/platform/org.eclipse.osgi/3.15.0/org.eclipse.osgi-3.15.0.pom
Downloading from eclipse.maven.central.mirror: https://repo.eclipse.org/content/repositories/maven_central/org/eclipse/platform/org.eclipse.osgi/3.15.0/org.eclipse.osgi-3.15.0.pom
Progress (1): 1.7 kB
                    
Downloaded from eclipse.maven.central.mirror: https://repo.eclipse.org/content/repositories/maven_central/org/eclipse/platform/org.eclipse.osgi/3.15.0/org.eclipse.osgi-3.15.0.pom (1.7 kB at 6.9 kB/s)
Downloading from cbi-releases: https://repo.eclipse.org/content/repositories/cbi-releases/org/eclipse/tycho/sisu-equinox-embedder/1.5.0/sisu-equinox-embedder-1.5.0.pom
Downloading from tycho-snapshots: https://oss.sonatype.org/content/groups/staging/org/eclipse/tycho/sisu-equinox-embedder/1.5.0/sisu-equinox-embedder-1.5.0.pom
Downloading from eclipse.maven.central.mirror: https://repo.eclipse.org/content/repositories/maven_central/org/eclipse/tycho/sisu-equinox-embedder/1.5.0/sisu-equinox-embedder-1.5.0.pom
Progress (1): 1.8 kB
                    
Downloaded from eclipse.maven.central.mirror: https://repo.eclipse.org/content/repositories/maven_central/org/eclipse/tycho/sisu-equinox-embedder/1.5.0/sisu-equinox-embedder-1.5.0.pom (1.8 kB at 7.8 kB/s)
Downloading from cbi-releases: https://repo.eclipse.org/content/repositories/cbi-releases/org/eclipse/tycho/sisu-equinox/1.5.0/sisu-equinox-1.5.0.pom
Downloading from tycho-snapshots: https://oss.sonatype.org/content/groups/staging/org/eclipse/tycho/sisu-equinox/1.5.0/sisu-equinox-1.5.0.pom
Downloading from eclipse.maven.central.mirror: https://repo.eclipse.org/content/repositories/maven_central/org/eclipse/tycho/sisu-equinox/1.5.0/sisu-equinox-1.5.0.pom
Progress (1): 1.0 kB
                    
Downloaded from eclipse.maven.central.mirror: https://repo.eclipse.org/content/repositories/maven_central/org/eclipse/tycho/sisu-equinox/1.5.0/sisu-equinox-1.5.0.pom (1.0 kB at 30 kB/s)
Downloading from cbi-releases: https://repo.eclipse.org/content/repositories/cbi-releases/org/eclipse/tycho/sisu-equinox-api/1.5.0/sisu-equinox-api-1.5.0.pom
Downloading from tycho-snapshots: https://oss.sonatype.org/content/groups/staging/org/eclipse/tycho/sisu-equinox-api/1.5.0/sisu-equinox-api-1.5.0.pom
Downloading from eclipse.maven.central.mirror: https://repo.eclipse.org/content/repositories/maven_central/org/eclipse/tycho/sisu-equinox-api/1.5.0/sisu-equinox-api-1.5.0.pom
Progress (1): 1.7 kB
                    
Downloaded from eclipse.maven.central.mirror: https://repo.eclipse.org/content/repositories/maven_central/org/eclipse/tycho/sisu-equinox-api/1.5.0/sisu-equinox-api-1.5.0.pom (1.7 kB at 52 kB/s)
Downloading from cbi-releases: https://repo.eclipse.org/content/repositories/cbi-releases/org/eclipse/tycho/tycho-metadata-model/1.5.0/tycho-metadata-model-1.5.0.pom
Downloading from tycho-snapshots: https://oss.sonatype.org/content/groups/staging/org/eclipse/tycho/tycho-metadata-model/1.5.0/tycho-metadata-model-1.5.0.pom
Downloading from eclipse.maven.central.mirror: https://repo.eclipse.org/content/repositories/maven_central/org/eclipse/tycho/tycho-metadata-model/1.5.0/tycho-metadata-model-1.5.0.pom
Progress (1): 1.3 kB
                    
Downloaded from eclipse.maven.central.mirror: https://repo.eclipse.org/content/repositories/maven_central/org/eclipse/tycho/tycho-metadata-model/1.5.0/tycho-metadata-model-1.5.0.pom (1.3 kB at 39 kB/s)
Downloading from cbi-releases: https://repo.eclipse.org/content/repositories/cbi-releases/org/eclipse/tycho/tycho-embedder-api/1.5.0/tycho-embedder-api-1.5.0.pom
Downloading from tycho-snapshots: https://oss.sonatype.org/content/groups/staging/org/eclipse/tycho/tycho-embedder-api/1.5.0/tycho-embedder-api-1.5.0.pom
Downloading from eclipse.maven.central.mirror: https://repo.eclipse.org/content/repositories/maven_central/org/eclipse/tycho/tycho-embedder-api/1.5.0/tycho-embedder-api-1.5.0.pom
Progress (1): 2.1 kB
                    
Downloaded from eclipse.maven.central.mirror: https://repo.eclipse.org/content/repositories/maven_central/org/eclipse/tycho/tycho-embedder-api/1.5.0/tycho-embedder-api-1.5.0.pom (2.1 kB at 50 kB/s)
Downloading from cbi-releases: https://repo.eclipse.org/content/repositories/cbi-releases/org/eclipse/tycho/org.eclipse.tycho.embedder.shared/1.5.0/org.eclipse.tycho.embedder.shared-1.5.0.pom
Downloading from tycho-snapshots: https://oss.sonatype.org/content/groups/staging/org/eclipse/tycho/org.eclipse.tycho.embedder.shared/1.5.0/org.eclipse.tycho.embedder.shared-1.5.0.pom
Downloading from eclipse.maven.central.mirror: https://repo.eclipse.org/content/repositories/maven_central/org/eclipse/tycho/org.eclipse.tycho.embedder.shared/1.5.0/org.eclipse.tycho.embedder.shared-1.5.0.pom
Progress (1): 1.1 kB
                    
Downloaded from eclipse.maven.central.mirror: https://repo.eclipse.org/content/repositories/maven_central/org/eclipse/tycho/org.eclipse.tycho.embedder.shared/1.5.0/org.eclipse.tycho.embedder.shared-1.5.0.pom (1.1 kB at 31 kB/s)
Downloading from cbi-releases: https://repo.eclipse.org/content/repositories/cbi-releases/org/eclipse/tycho/org.eclipse.tycho.core.shared/1.5.0/org.eclipse.tycho.core.shared-1.5.0.pom
Downloading from tycho-snapshots: https://oss.sonatype.org/content/groups/staging/org/eclipse/tycho/org.eclipse.tycho.core.shared/1.5.0/org.eclipse.tycho.core.shared-1.5.0.pom
Downloading from eclipse.maven.central.mirror: https://repo.eclipse.org/content/repositories/maven_central/org/eclipse/tycho/org.eclipse.tycho.core.shared/1.5.0/org.eclipse.tycho.core.shared-1.5.0.pom
Progress (1): 1.0 kB
                    
Downloaded from eclipse.maven.central.mirror: https://repo.eclipse.org/content/repositories/maven_central/org/eclipse/tycho/org.eclipse.tycho.core.shared/1.5.0/org.eclipse.tycho.core.shared-1.5.0.pom (1.0 kB at 32 kB/s)
Downloading from cbi-releases: https://repo.eclipse.org/content/repositories/cbi-releases/org/eclipse/tycho/tycho-p2-facade/1.5.0/tycho-p2-facade-1.5.0.pom
Downloading from tycho-snapshots: https://oss.sonatype.org/content/groups/staging/org/eclipse/tycho/tycho-p2-facade/1.5.0/tycho-p2-facade-1.5.0.pom
Downloading from eclipse.maven.central.mirror: https://repo.eclipse.org/content/repositories/maven_central/org/eclipse/tycho/tycho-p2-facade/1.5.0/tycho-p2-facade-1.5.0.pom
Progress (1): 2.1 kB
                    
Downloaded from eclipse.maven.central.mirror: https://repo.eclipse.org/content/repositories/maven_central/org/eclipse/tycho/tycho-p2-facade/1.5.0/tycho-p2-facade-1.5.0.pom (2.1 kB at 63 kB/s)
Downloading from cbi-releases: https://repo.eclipse.org/content/repositories/cbi-releases/org/eclipse/tycho/tycho-p2/1.5.0/tycho-p2-1.5.0.pom
Downloading from tycho-snapshots: https://oss.sonatype.org/content/groups/staging/org/eclipse/tycho/tycho-p2/1.5.0/tycho-p2-1.5.0.pom
Downloading from eclipse.maven.central.mirror: https://repo.eclipse.org/content/repositories/maven_central/org/eclipse/tycho/tycho-p2/1.5.0/tycho-p2-1.5.0.pom
Progress (1): 1.1 kB
                    
Downloaded from eclipse.maven.central.mirror: https://repo.eclipse.org/content/repositories/maven_central/org/eclipse/tycho/tycho-p2/1.5.0/tycho-p2-1.5.0.pom (1.1 kB at 36 kB/s)
Downloading from cbi-releases: https://repo.eclipse.org/content/repositories/cbi-releases/org/eclipse/tycho/org.eclipse.tycho.p2.resolver.shared/1.5.0/org.eclipse.tycho.p2.resolver.shared-1.5.0.pom
Downloading from tycho-snapshots: https://oss.sonatype.org/content/groups/staging/org/eclipse/tycho/org.eclipse.tycho.p2.resolver.shared/1.5.0/org.eclipse.tycho.p2.resolver.shared-1.5.0.pom
Downloading from eclipse.maven.central.mirror: https://repo.eclipse.org/content/repositories/maven_central/org/eclipse/tycho/org.eclipse.tycho.p2.resolver.shared/1.5.0/org.eclipse.tycho.p2.resolver.shared-1.5.0.pom
Progress (1): 1.1 kB
                    
Downloaded from eclipse.maven.central.mirror: https://repo.eclipse.org/content/repositories/maven_central/org/eclipse/tycho/org.eclipse.tycho.p2.resolver.shared/1.5.0/org.eclipse.tycho.p2.resolver.shared-1.5.0.pom (1.1 kB at 33 kB/s)
Downloading from cbi-releases: https://repo.eclipse.org/content/repositories/cbi-releases/org/eclipse/tycho/tycho-maven-plugin/1.5.0/tycho-maven-plugin-1.5.0.jar
Downloading from cbi-releases: https://repo.eclipse.org/content/repositories/cbi-releases/org/eclipse/tycho/tycho-core/1.5.0/tycho-core-1.5.0.jar
Downloading from cbi-releases: https://repo.eclipse.org/content/repositories/cbi-releases/org/apache/commons/commons-compress/1.18/commons-compress-1.18.jar
Downloading from cbi-releases: https://repo.eclipse.org/content/repositories/cbi-releases/org/eclipse/tycho/org.eclipse.tycho.p2.tools.shared/1.5.0/org.eclipse.tycho.p2.tools.shared-1.5.0.jar
Downloading from cbi-releases: https://repo.eclipse.org/content/repositories/cbi-releases/org/eclipse/platform/org.eclipse.osgi.compatibility.state/1.1.600/org.eclipse.osgi.compatibility.state-1.1.600.jar
Downloading from cbi-releases: https://repo.eclipse.org/content/repositories/cbi-releases/org/eclipse/platform/org.eclipse.osgi/3.15.0/org.eclipse.osgi-3.15.0.jar
Downloading from cbi-releases: https://repo.eclipse.org/content/repositories/cbi-releases/org/eclipse/tycho/sisu-equinox-embedder/1.5.0/sisu-equinox-embedder-1.5.0.jar
Downloading from cbi-releases: https://repo.eclipse.org/content/repositories/cbi-releases/org/eclipse/tycho/sisu-equinox-api/1.5.0/sisu-equinox-api-1.5.0.jar
Downloading from cbi-releases: https://repo.eclipse.org/content/repositories/cbi-releases/org/eclipse/tycho/tycho-metadata-model/1.5.0/tycho-metadata-model-1.5.0.jar
Downloading from cbi-releases: https://repo.eclipse.org/content/repositories/cbi-releases/org/eclipse/tycho/tycho-embedder-api/1.5.0/tycho-embedder-api-1.5.0.jar
Downloading from cbi-releases: https://repo.eclipse.org/content/repositories/cbi-releases/org/eclipse/tycho/org.eclipse.tycho.embedder.shared/1.5.0/org.eclipse.tycho.embedder.shared-1.5.0.jar
Downloading from cbi-releases: https://repo.eclipse.org/content/repositories/cbi-releases/org/eclipse/tycho/org.eclipse.tycho.core.shared/1.5.0/org.eclipse.tycho.core.shared-1.5.0.jar
Downloading from cbi-releases: https://repo.eclipse.org/content/repositories/cbi-releases/org/eclipse/tycho/tycho-p2-facade/1.5.0/tycho-p2-facade-1.5.0.jar
Downloading from cbi-releases: https://repo.eclipse.org/content/repositories/cbi-releases/org/eclipse/tycho/org.eclipse.tycho.p2.resolver.shared/1.5.0/org.eclipse.tycho.p2.resolver.shared-1.5.0.jar
Downloading from tycho-snapshots: https://oss.sonatype.org/content/groups/staging/org/eclipse/tycho/tycho-maven-plugin/1.5.0/tycho-maven-plugin-1.5.0.jar
Downloading from tycho-snapshots: https://oss.sonatype.org/content/groups/staging/org/eclipse/tycho/tycho-core/1.5.0/tycho-core-1.5.0.jar
Downloading from tycho-snapshots: https://oss.sonatype.org/content/groups/staging/org/apache/commons/commons-compress/1.18/commons-compress-1.18.jar
Downloading from tycho-snapshots: https://oss.sonatype.org/content/groups/staging/org/eclipse/tycho/org.eclipse.tycho.p2.tools.shared/1.5.0/org.eclipse.tycho.p2.tools.shared-1.5.0.jar
Downloading from tycho-snapshots: https://oss.sonatype.org/content/groups/staging/org/eclipse/platform/org.eclipse.osgi.compatibility.state/1.1.600/org.eclipse.osgi.compatibility.state-1.1.600.jar
Downloading from tycho-snapshots: https://oss.sonatype.org/content/groups/staging/org/eclipse/platform/org.eclipse.osgi/3.15.0/org.eclipse.osgi-3.15.0.jar
Downloading from tycho-snapshots: https://oss.sonatype.org/content/groups/staging/org/eclipse/tycho/sisu-equinox-embedder/1.5.0/sisu-equinox-embedder-1.5.0.jar
Downloading from tycho-snapshots: https://oss.sonatype.org/content/groups/staging/org/eclipse/tycho/sisu-equinox-api/1.5.0/sisu-equinox-api-1.5.0.jar
Downloading from tycho-snapshots: https://oss.sonatype.org/content/groups/staging/org/eclipse/tycho/tycho-metadata-model/1.5.0/tycho-metadata-model-1.5.0.jar
Downloading from tycho-snapshots: https://oss.sonatype.org/content/groups/staging/org/eclipse/tycho/tycho-embedder-api/1.5.0/tycho-embedder-api-1.5.0.jar
Downloading from tycho-snapshots: https://oss.sonatype.org/content/groups/staging/org/eclipse/tycho/org.eclipse.tycho.embedder.shared/1.5.0/org.eclipse.tycho.embedder.shared-1.5.0.jar
Downloading from tycho-snapshots: https://oss.sonatype.org/content/groups/staging/org/eclipse/tycho/org.eclipse.tycho.core.shared/1.5.0/org.eclipse.tycho.core.shared-1.5.0.jar
Downloading from tycho-snapshots: https://oss.sonatype.org/content/groups/staging/org/eclipse/tycho/tycho-p2-facade/1.5.0/tycho-p2-facade-1.5.0.jar
Downloading from tycho-snapshots: https://oss.sonatype.org/content/groups/staging/org/eclipse/tycho/org.eclipse.tycho.p2.resolver.shared/1.5.0/org.eclipse.tycho.p2.resolver.shared-1.5.0.jar
Downloading from eclipse.maven.central.mirror: https://repo.eclipse.org/content/repositories/maven_central/org/eclipse/tycho/tycho-maven-plugin/1.5.0/tycho-maven-plugin-1.5.0.jar
Downloading from eclipse.maven.central.mirror: https://repo.eclipse.org/content/repositories/maven_central/org/eclipse/tycho/org.eclipse.tycho.p2.tools.shared/1.5.0/org.eclipse.tycho.p2.tools.shared-1.5.0.jar
Downloading from eclipse.maven.central.mirror: https://repo.eclipse.org/content/repositories/maven_central/org/eclipse/platform/org.eclipse.osgi.compatibility.state/1.1.600/org.eclipse.osgi.compatibility.state-1.1.600.jar
Downloading from eclipse.maven.central.mirror: https://repo.eclipse.org/content/repositories/maven_central/org/apache/commons/commons-compress/1.18/commons-compress-1.18.jar
Downloading from eclipse.maven.central.mirror: https://repo.eclipse.org/content/repositories/maven_central/org/eclipse/tycho/tycho-core/1.5.0/tycho-core-1.5.0.jar
Progress (1): 4.1/22 kB
Progress (1): 7.7/22 kB
Progress (2): 7.7/22 kB | 4.1/592 kB
Progress (2): 12/22 kB | 4.1/592 kB 
Progress (2): 12/22 kB | 7.7/592 kB
Progress (2): 16/22 kB | 7.7/592 kB
Progress (2): 16/22 kB | 12/592 kB 
Progress (2): 20/22 kB | 12/592 kB
Progress (2): 20/22 kB | 16/592 kB
Progress (2): 22 kB | 16/592 kB   
Progress (2): 22 kB | 20/592 kB
Progress (2): 22 kB | 24/592 kB
Progress (2): 22 kB | 28/592 kB
Progress (2): 22 kB | 32/592 kB
Progress (2): 22 kB | 36/592 kB
Progress (2): 22 kB | 40/592 kB
Progress (2): 22 kB | 44/592 kB
Progress (2): 22 kB | 48/592 kB
Progress (3): 22 kB | 48/592 kB | 4.1/206 kB
Progress (3): 22 kB | 52/592 kB | 4.1/206 kB
Progress (3): 22 kB | 52/592 kB | 7.7/206 kB
Progress (3): 22 kB | 56/592 kB | 7.7/206 kB
                                            
Downloaded from eclipse.maven.central.mirror: https://repo.eclipse.org/content/repositories/maven_central/org/eclipse/tycho/org.eclipse.tycho.p2.tools.shared/1.5.0/org.eclipse.tycho.p2.tools.shared-1.5.0.jar (22 kB at 504 kB/s)
Progress (2): 60/592 kB | 7.7/206 kB
Progress (3): 60/592 kB | 7.7/206 kB | 4.1/5.4 kB
Progress (3): 60/592 kB | 12/206 kB | 4.1/5.4 kB 
Progress (3): 60/592 kB | 12/206 kB | 5.4 kB    
Progress (3): 64/592 kB | 12/206 kB | 5.4 kB
                                            
Downloading from eclipse.maven.central.mirror: https://repo.eclipse.org/content/repositories/maven_central/org/eclipse/platform/org.eclipse.osgi/3.15.0/org.eclipse.osgi-3.15.0.jar
Progress (3): 64/592 kB | 16/206 kB | 5.4 kB
Progress (3): 68/592 kB | 16/206 kB | 5.4 kB
Progress (3): 68/592 kB | 20/206 kB | 5.4 kB
Progress (3): 72/592 kB | 20/206 kB | 5.4 kB
Progress (3): 72/592 kB | 24/206 kB | 5.4 kB
Progress (3): 76/592 kB | 24/206 kB | 5.4 kB
Progress (3): 80/592 kB | 24/206 kB | 5.4 kB
Progress (3): 80/592 kB | 28/206 kB | 5.4 kB
Progress (3): 80/592 kB | 32/206 kB | 5.4 kB
Progress (3): 84/592 kB | 32/206 kB | 5.4 kB
Progress (3): 88/592 kB | 32/206 kB | 5.4 kB
Progress (3): 88/592 kB | 36/206 kB | 5.4 kB
Progress (3): 88/592 kB | 40/206 kB | 5.4 kB
Progress (3): 92/592 kB | 40/206 kB | 5.4 kB
Progress (3): 96/592 kB | 40/206 kB | 5.4 kB
Progress (3): 96/592 kB | 44/206 kB | 5.4 kB
Progress (3): 96/592 kB | 48/206 kB | 5.4 kB
Progress (3): 100/592 kB | 48/206 kB | 5.4 kB
                                             
Downloaded from eclipse.maven.central.mirror: https://repo.eclipse.org/content/repositories/maven_central/org/eclipse/tycho/tycho-maven-plugin/1.5.0/tycho-maven-plugin-1.5.0.jar (5.4 kB at 102 kB/s)
Progress (2): 100/592 kB | 52/206 kB
Progress (2): 104/592 kB | 52/206 kB
Progress (2): 104/592 kB | 56/206 kB
                                    
Downloading from eclipse.maven.central.mirror: https://repo.eclipse.org/content/repositories/maven_central/org/eclipse/tycho/sisu-equinox-embedder/1.5.0/sisu-equinox-embedder-1.5.0.jar
Progress (2): 108/592 kB | 56/206 kB
Progress (3): 108/592 kB | 56/206 kB | 0/1.5 MB
Progress (3): 112/592 kB | 56/206 kB | 0/1.5 MB
Progress (3): 112/592 kB | 60/206 kB | 0/1.5 MB
Progress (3): 112/592 kB | 60/206 kB | 0/1.5 MB
Progress (3): 116/592 kB | 60/206 kB | 0/1.5 MB
Progress (3): 116/592 kB | 64/206 kB | 0/1.5 MB
Progress (3): 116/592 kB | 64/206 kB | 0/1.5 MB
Progress (3): 120/592 kB | 64/206 kB | 0/1.5 MB
Progress (3): 120/592 kB | 68/206 kB | 0/1.5 MB
Progress (3): 120/592 kB | 68/206 kB | 0/1.5 MB
Progress (3): 124/592 kB | 68/206 kB | 0/1.5 MB
Progress (3): 124/592 kB | 72/206 kB | 0/1.5 MB
Progress (3): 124/592 kB | 72/206 kB | 0/1.5 MB
Progress (3): 128/592 kB | 72/206 kB | 0/1.5 MB
Progress (3): 128/592 kB | 76/206 kB | 0/1.5 MB
Progress (3): 128/592 kB | 76/206 kB | 0/1.5 MB
Progress (3): 128/592 kB | 80/206 kB | 0/1.5 MB
Progress (3): 132/592 kB | 80/206 kB | 0/1.5 MB
Progress (3): 132/592 kB | 80/206 kB | 0/1.5 MB
Progress (4): 132/592 kB | 80/206 kB | 0/1.5 MB | 4.1/13 kB
Progress (4): 136/592 kB | 80/206 kB | 0/1.5 MB | 4.1/13 kB
Progress (4): 136/592 kB | 80/206 kB | 0/1.5 MB | 7.7/13 kB
Progress (4): 136/592 kB | 80/206 kB | 0/1.5 MB | 7.7/13 kB
Progress (4): 136/592 kB | 84/206 kB | 0/1.5 MB | 7.7/13 kB
Progress (4): 136/592 kB | 84/206 kB | 0/1.5 MB | 7.7/13 kB
Progress (4): 136/592 kB | 84/206 kB | 0/1.5 MB | 12/13 kB 
Progress (4): 140/592 kB | 84/206 kB | 0/1.5 MB | 12/13 kB
Progress (4): 140/592 kB | 84/206 kB | 0/1.5 MB | 13 kB   
Progress (4): 140/592 kB | 84/206 kB | 0/1.5 MB | 13 kB
Progress (4): 140/592 kB | 88/206 kB | 0/1.5 MB | 13 kB
Progress (4): 140/592 kB | 88/206 kB | 0/1.5 MB | 13 kB
Progress (4): 144/592 kB | 88/206 kB | 0/1.5 MB | 13 kB
Progress (4): 144/592 kB | 92/206 kB | 0/1.5 MB | 13 kB
Progress (4): 144/592 kB | 92/206 kB | 0/1.5 MB | 13 kB
Progress (4): 148/592 kB | 92/206 kB | 0/1.5 MB | 13 kB
Progress (4): 148/592 kB | 96/206 kB | 0/1.5 MB | 13 kB
Progress (4): 152/592 kB | 96/206 kB | 0/1.5 MB | 13 kB
Progress (4): 152/592 kB | 96/206 kB | 0/1.5 MB | 13 kB
Progress (4): 152/592 kB | 100/206 kB | 0/1.5 MB | 13 kB
Progress (4): 156/592 kB | 100/206 kB | 0/1.5 MB | 13 kB
Progress (4): 156/592 kB | 100/206 kB | 0.1/1.5 MB | 13 kB
Progress (4): 156/592 kB | 104/206 kB | 0.1/1.5 MB | 13 kB
Progress (4): 156/592 kB | 104/206 kB | 0.1/1.5 MB | 13 kB
Progress (4): 160/592 kB | 104/206 kB | 0.1/1.5 MB | 13 kB
Progress (4): 160/592 kB | 108/206 kB | 0.1/1.5 MB | 13 kB
Progress (4): 160/592 kB | 108/206 kB | 0.1/1.5 MB | 13 kB
Progress (4): 164/592 kB | 108/206 kB | 0.1/1.5 MB | 13 kB
Progress (4): 164/592 kB | 112/206 kB | 0.1/1.5 MB | 13 kB
Progress (4): 168/592 kB | 112/206 kB | 0.1/1.5 MB | 13 kB
Progress (4): 168/592 kB | 112/206 kB | 0.1/1.5 MB | 13 kB
Progress (4): 168/592 kB | 116/206 kB | 0.1/1.5 MB | 13 kB
Progress (4): 172/592 kB | 116/206 kB | 0.1/1.5 MB | 13 kB
Progress (4): 172/592 kB | 116/206 kB | 0.1/1.5 MB | 13 kB
Progress (4): 172/592 kB | 120/206 kB | 0.1/1.5 MB | 13 kB
Progress (4): 172/592 kB | 120/206 kB | 0.1/1.5 MB | 13 kB
Progress (4): 176/592 kB | 120/206 kB | 0.1/1.5 MB | 13 kB
Progress (4): 176/592 kB | 124/206 kB | 0.1/1.5 MB | 13 kB
Progress (4): 176/592 kB | 124/206 kB | 0.1/1.5 MB | 13 kB
Progress (4): 180/592 kB | 124/206 kB | 0.1/1.5 MB | 13 kB
Progress (4): 180/592 kB | 128/206 kB | 0.1/1.5 MB | 13 kB
Progress (4): 184/592 kB | 128/206 kB | 0.1/1.5 MB | 13 kB
Progress (4): 184/592 kB | 128/206 kB | 0.1/1.5 MB | 13 kB
Progress (4): 184/592 kB | 132/206 kB | 0.1/1.5 MB | 13 kB
Progress (4): 188/592 kB | 132/206 kB | 0.1/1.5 MB | 13 kB
Progress (4): 188/592 kB | 132/206 kB | 0.1/1.5 MB | 13 kB
Progress (4): 188/592 kB | 136/206 kB | 0.1/1.5 MB | 13 kB
Progress (4): 188/592 kB | 136/206 kB | 0.1/1.5 MB | 13 kB
Progress (4): 192/592 kB | 136/206 kB | 0.1/1.5 MB | 13 kB
Progress (4): 192/592 kB | 140/206 kB | 0.1/1.5 MB | 13 kB
Progress (4): 192/592 kB | 140/206 kB | 0.1/1.5 MB | 13 kB
Progress (4): 196/592 kB | 140/206 kB | 0.1/1.5 MB | 13 kB
Progress (4): 196/592 kB | 144/206 kB | 0.1/1.5 MB | 13 kB
Progress (5): 196/592 kB | 144/206 kB | 0.1/1.5 MB | 13 kB | 4.1/248 kB
Progress (5): 200/592 kB | 144/206 kB | 0.1/1.5 MB | 13 kB | 4.1/248 kB
Progress (5): 200/592 kB | 144/206 kB | 0.1/1.5 MB | 13 kB | 4.1/248 kB
Progress (5): 200/592 kB | 144/206 kB | 0.1/1.5 MB | 13 kB | 7.7/248 kB
Progress (5): 200/592 kB | 148/206 kB | 0.1/1.5 MB | 13 kB | 7.7/248 kB
Progress (5): 200/592 kB | 148/206 kB | 0.1/1.5 MB | 13 kB | 7.7/248 kB
Progress (5): 204/592 kB | 148/206 kB | 0.1/1.5 MB | 13 kB | 7.7/248 kB
Progress (5): 204/592 kB | 148/206 kB | 0.1/1.5 MB | 13 kB | 7.7/248 kB
Progress (5): 204/592 kB | 152/206 kB | 0.1/1.5 MB | 13 kB | 7.7/248 kB
Progress (5): 204/592 kB | 152/206 kB | 0.1/1.5 MB | 13 kB | 12/248 kB 
Progress (5): 204/592 kB | 152/206 kB | 0.1/1.5 MB | 13 kB | 16/248 kB
Progress (5): 204/592 kB | 152/206 kB | 0.1/1.5 MB | 13 kB | 20/248 kB
Progress (5): 204/592 kB | 152/206 kB | 0.1/1.5 MB | 13 kB | 24/248 kB
Progress (5): 204/592 kB | 156/206 kB | 0.1/1.5 MB | 13 kB | 24/248 kB
Progress (5): 204/592 kB | 156/206 kB | 0.1/1.5 MB | 13 kB | 24/248 kB
Progress (5): 208/592 kB | 156/206 kB | 0.1/1.5 MB | 13 kB | 24/248 kB
Progress (5): 208/592 kB | 156/206 kB | 0.1/1.5 MB | 13 kB | 24/248 kB
Progress (5): 208/592 kB | 160/206 kB | 0.1/1.5 MB | 13 kB | 24/248 kB
Progress (5): 208/592 kB | 160/206 kB | 0.1/1.5 MB | 13 kB | 28/248 kB
Progress (5): 208/592 kB | 164/206 kB | 0.1/1.5 MB | 13 kB | 28/248 kB
Progress (5): 208/592 kB | 164/206 kB | 0.1/1.5 MB | 13 kB | 28/248 kB
Progress (5): 212/592 kB | 164/206 kB | 0.1/1.5 MB | 13 kB | 28/248 kB
Progress (5): 212/592 kB | 164/206 kB | 0.1/1.5 MB | 13 kB | 28/248 kB
Progress (5): 212/592 kB | 168/206 kB | 0.1/1.5 MB | 13 kB | 28/248 kB
Progress (5): 212/592 kB | 168/206 kB | 0.1/1.5 MB | 13 kB | 32/248 kB
Progress (5): 212/592 kB | 172/206 kB | 0.1/1.5 MB | 13 kB | 32/248 kB
Progress (5): 212/592 kB | 172/206 kB | 0.1/1.5 MB | 13 kB | 32/248 kB
Progress (5): 216/592 kB | 172/206 kB | 0.1/1.5 MB | 13 kB | 32/248 kB
Progress (5): 216/592 kB | 172/206 kB | 0.1/1.5 MB | 13 kB | 32/248 kB
Progress (5): 216/592 kB | 176/206 kB | 0.1/1.5 MB | 13 kB | 32/248 kB
Progress (5): 216/592 kB | 176/206 kB | 0.1/1.5 MB | 13 kB | 36/248 kB
Progress (5): 216/592 kB | 176/206 kB | 0.1/1.5 MB | 13 kB | 36/248 kB
Progress (5): 220/592 kB | 176/206 kB | 0.1/1.5 MB | 13 kB | 36/248 kB
Progress (5): 220/592 kB | 176/206 kB | 0.1/1.5 MB | 13 kB | 36/248 kB
Progress (5): 220/592 kB | 176/206 kB | 0.1/1.5 MB | 13 kB | 40/248 kB
Progress (5): 220/592 kB | 180/206 kB | 0.1/1.5 MB | 13 kB | 40/248 kB
Progress (5): 220/592 kB | 180/206 kB | 0.1/1.5 MB | 13 kB | 44/248 kB
Progress (5): 220/592 kB | 180/206 kB | 0.1/1.5 MB | 13 kB | 44/248 kB
Progress (5): 224/592 kB | 180/206 kB | 0.1/1.5 MB | 13 kB | 44/248 kB
Progress (5): 224/592 kB | 180/206 kB | 0.1/1.5 MB | 13 kB | 44/248 kB
Progress (5): 224/592 kB | 180/206 kB | 0.1/1.5 MB | 13 kB | 48/248 kB
Progress (5): 224/592 kB | 184/206 kB | 0.1/1.5 MB | 13 kB | 48/248 kB
Progress (5): 224/592 kB | 184/206 kB | 0.1/1.5 MB | 13 kB | 52/248 kB
Progress (5): 224/592 kB | 184/206 kB | 0.1/1.5 MB | 13 kB | 52/248 kB
Progress (5): 228/592 kB | 184/206 kB | 0.1/1.5 MB | 13 kB | 52/248 kB
Progress (5): 228/592 kB | 184/206 kB | 0.2/1.5 MB | 13 kB | 52/248 kB
Progress (5): 228/592 kB | 184/206 kB | 0.2/1.5 MB | 13 kB | 56/248 kB
Progress (5): 228/592 kB | 188/206 kB | 0.2/1.5 MB | 13 kB | 56/248 kB
Progress (5): 228/592 kB | 188/206 kB | 0.2/1.5 MB | 13 kB | 60/248 kB
Progress (5): 228/592 kB | 188/206 kB | 0.2/1.5 MB | 13 kB | 60/248 kB
Progress (5): 232/592 kB | 188/206 kB | 0.2/1.5 MB | 13 kB | 60/248 kB
Progress (5): 232/592 kB | 188/206 kB | 0.2/1.5 MB | 13 kB | 60/248 kB
Progress (5): 232/592 kB | 188/206 kB | 0.2/1.5 MB | 13 kB | 64/248 kB
Progress (5): 232/592 kB | 192/206 kB | 0.2/1.5 MB | 13 kB | 64/248 kB
Progress (5): 236/592 kB | 192/206 kB | 0.2/1.5 MB | 13 kB | 64/248 kB
Progress (5): 236/592 kB | 192/206 kB | 0.2/1.5 MB | 13 kB | 64/248 kB
Progress (5): 240/592 kB | 192/206 kB | 0.2/1.5 MB | 13 kB | 64/248 kB
Progress (5): 240/592 kB | 196/206 kB | 0.2/1.5 MB | 13 kB | 64/248 kB
Progress (5): 240/592 kB | 196/206 kB | 0.2/1.5 MB | 13 kB | 68/248 kB
Progress (5): 244/592 kB | 196/206 kB | 0.2/1.5 MB | 13 kB | 68/248 kB
Progress (5): 244/592 kB | 200/206 kB | 0.2/1.5 MB | 13 kB | 68/248 kB
Progress (5): 244/592 kB | 200/206 kB | 0.2/1.5 MB | 13 kB | 68/248 kB
Progress (5): 244/592 kB | 204/206 kB | 0.2/1.5 MB | 13 kB | 68/248 kB
Progress (5): 248/592 kB | 204/206 kB | 0.2/1.5 MB | 13 kB | 68/248 kB
Progress (5): 248/592 kB | 204/206 kB | 0.2/1.5 MB | 13 kB | 72/248 kB
Progress (5): 248/592 kB | 206 kB | 0.2/1.5 MB | 13 kB | 72/248 kB    
Progress (5): 248/592 kB | 206 kB | 0.2/1.5 MB | 13 kB | 72/248 kB
Progress (5): 248/592 kB | 206 kB | 0.2/1.5 MB | 13 kB | 76/248 kB
Progress (5): 248/592 kB | 206 kB | 0.2/1.5 MB | 13 kB | 76/248 kB
Progress (5): 248/592 kB | 206 kB | 0.2/1.5 MB | 13 kB | 80/248 kB
Progress (5): 248/592 kB | 206 kB | 0.2/1.5 MB | 13 kB | 80/248 kB
Progress (5): 248/592 kB | 206 kB | 0.2/1.5 MB | 13 kB | 84/248 kB
Progress (5): 248/592 kB | 206 kB | 0.2/1.5 MB | 13 kB | 84/248 kB
Progress (5): 248/592 kB | 206 kB | 0.2/1.5 MB | 13 kB | 88/248 kB
Progress (5): 248/592 kB | 206 kB | 0.2/1.5 MB | 13 kB | 88/248 kB
Progress (5): 248/592 kB | 206 kB | 0.2/1.5 MB | 13 kB | 92/248 kB
Progress (5): 248/592 kB | 206 kB | 0.2/1.5 MB | 13 kB | 92/248 kB
Progress (5): 248/592 kB | 206 kB | 0.2/1.5 MB | 13 kB | 96/248 kB
Progress (5): 248/592 kB | 206 kB | 0.2/1.5 MB | 13 kB | 96/248 kB
Progress (5): 248/592 kB | 206 kB | 0.2/1.5 MB | 13 kB | 100/248 kB
Progress (5): 248/592 kB | 206 kB | 0.2/1.5 MB | 13 kB | 100/248 kB
Progress (5): 248/592 kB | 206 kB | 0.2/1.5 MB | 13 kB | 104/248 kB
Progress (5): 248/592 kB | 206 kB | 0.2/1.5 MB | 13 kB | 104/248 kB
Progress (5): 248/592 kB | 206 kB | 0.2/1.5 MB | 13 kB | 108/248 kB
Progress (5): 248/592 kB | 206 kB | 0.2/1.5 MB | 13 kB | 108/248 kB
Progress (5): 248/592 kB | 206 kB | 0.2/1.5 MB | 13 kB | 112/248 kB
Progress (5): 248/592 kB | 206 kB | 0.2/1.5 MB | 13 kB | 112/248 kB
Progress (5): 248/592 kB | 206 kB | 0.2/1.5 MB | 13 kB | 116/248 kB
Progress (5): 248/592 kB | 206 kB | 0.2/1.5 MB | 13 kB | 116/248 kB
Progress (5): 248/592 kB | 206 kB | 0.2/1.5 MB | 13 kB | 120/248 kB
Progress (5): 248/592 kB | 206 kB | 0.2/1.5 MB | 13 kB | 120/248 kB
Progress (5): 248/592 kB | 206 kB | 0.2/1.5 MB | 13 kB | 124/248 kB
Progress (5): 248/592 kB | 206 kB | 0.2/1.5 MB | 13 kB | 124/248 kB
Progress (5): 248/592 kB | 206 kB | 0.2/1.5 MB | 13 kB | 128/248 kB
Progress (5): 248/592 kB | 206 kB | 0.2/1.5 MB | 13 kB | 128/248 kB
Progress (5): 248/592 kB | 206 kB | 0.2/1.5 MB | 13 kB | 132/248 kB
Progress (5): 248/592 kB | 206 kB | 0.2/1.5 MB | 13 kB | 132/248 kB
Progress (5): 248/592 kB | 206 kB | 0.2/1.5 MB | 13 kB | 136/248 kB
Progress (5): 248/592 kB | 206 kB | 0.2/1.5 MB | 13 kB | 136/248 kB
Progress (5): 248/592 kB | 206 kB | 0.2/1.5 MB | 13 kB | 140/248 kB
Progress (5): 248/592 kB | 206 kB | 0.2/1.5 MB | 13 kB | 140/248 kB
Progress (5): 248/592 kB | 206 kB | 0.2/1.5 MB | 13 kB | 144/248 kB
Progress (5): 248/592 kB | 206 kB | 0.2/1.5 MB | 13 kB | 144/248 kB
Progress (5): 248/592 kB | 206 kB | 0.2/1.5 MB | 13 kB | 148/248 kB
                                                                   
Downloaded from eclipse.maven.central.mirror: https://repo.eclipse.org/content/repositories/maven_central/org/eclipse/tycho/tycho-core/1.5.0/tycho-core-1.5.0.jar (206 kB at 1.2 MB/s)
Progress (4): 248/592 kB | 0.2/1.5 MB | 13 kB | 152/248 kB
Progress (4): 248/592 kB | 0.2/1.5 MB | 13 kB | 152/248 kB
                                                          
Downloading from eclipse.maven.central.mirror: https://repo.eclipse.org/content/repositories/maven_central/org/eclipse/tycho/sisu-equinox-api/1.5.0/sisu-equinox-api-1.5.0.jar
Progress (4): 248/592 kB | 0.2/1.5 MB | 13 kB | 152/248 kB
Progress (4): 248/592 kB | 0.2/1.5 MB | 13 kB | 156/248 kB
Progress (4): 248/592 kB | 0.2/1.5 MB | 13 kB | 156/248 kB
Progress (4): 248/592 kB | 0.2/1.5 MB | 13 kB | 160/248 kB
Progress (4): 248/592 kB | 0.2/1.5 MB | 13 kB | 160/248 kB
Progress (4): 248/592 kB | 0.3/1.5 MB | 13 kB | 160/248 kB
Progress (4): 248/592 kB | 0.3/1.5 MB | 13 kB | 164/248 kB
Progress (4): 248/592 kB | 0.3/1.5 MB | 13 kB | 164/248 kB
Progress (4): 248/592 kB | 0.3/1.5 MB | 13 kB | 168/248 kB
Progress (4): 248/592 kB | 0.3/1.5 MB | 13 kB | 168/248 kB
Progress (4): 248/592 kB | 0.3/1.5 MB | 13 kB | 172/248 kB
Progress (4): 248/592 kB | 0.3/1.5 MB | 13 kB | 172/248 kB
Progress (4): 248/592 kB | 0.3/1.5 MB | 13 kB | 176/248 kB
Progress (4): 248/592 kB | 0.3/1.5 MB | 13 kB | 176/248 kB
Progress (4): 248/592 kB | 0.3/1.5 MB | 13 kB | 176/248 kB
Progress (4): 248/592 kB | 0.3/1.5 MB | 13 kB | 180/248 kB
Progress (4): 248/592 kB | 0.3/1.5 MB | 13 kB | 180/248 kB
Progress (4): 248/592 kB | 0.3/1.5 MB | 13 kB | 184/248 kB
Progress (4): 248/592 kB | 0.3/1.5 MB | 13 kB | 184/248 kB
Progress (4): 248/592 kB | 0.3/1.5 MB | 13 kB | 188/248 kB
Progress (4): 248/592 kB | 0.3/1.5 MB | 13 kB | 188/248 kB
Progress (4): 248/592 kB | 0.3/1.5 MB | 13 kB | 192/248 kB
Progress (4): 248/592 kB | 0.3/1.5 MB | 13 kB | 192/248 kB
Progress (4): 248/592 kB | 0.3/1.5 MB | 13 kB | 196/248 kB
Progress (4): 248/592 kB | 0.3/1.5 MB | 13 kB | 196/248 kB
Progress (4): 248/592 kB | 0.3/1.5 MB | 13 kB | 200/248 kB
Progress (4): 248/592 kB | 0.3/1.5 MB | 13 kB | 200/248 kB
Progress (4): 248/592 kB | 0.3/1.5 MB | 13 kB | 204/248 kB
Progress (4): 248/592 kB | 0.3/1.5 MB | 13 kB | 204/248 kB
Progress (4): 248/592 kB | 0.3/1.5 MB | 13 kB | 208/248 kB
Progress (4): 248/592 kB | 0.3/1.5 MB | 13 kB | 208/248 kB
Progress (4): 248/592 kB | 0.3/1.5 MB | 13 kB | 212/248 kB
Progress (4): 248/592 kB | 0.3/1.5 MB | 13 kB | 212/248 kB
Progress (4): 248/592 kB | 0.3/1.5 MB | 13 kB | 216/248 kB
Progress (4): 248/592 kB | 0.3/1.5 MB | 13 kB | 216/248 kB
Progress (4): 248/592 kB | 0.3/1.5 MB | 13 kB | 220/248 kB
Progress (4): 248/592 kB | 0.3/1.5 MB | 13 kB | 220/248 kB
Progress (4): 248/592 kB | 0.3/1.5 MB | 13 kB | 224/248 kB
Progress (4): 248/592 kB | 0.3/1.5 MB | 13 kB | 224/248 kB
Progress (4): 248/592 kB | 0.3/1.5 MB | 13 kB | 228/248 kB
Progress (4): 248/592 kB | 0.3/1.5 MB | 13 kB | 228/248 kB
Progress (4): 248/592 kB | 0.3/1.5 MB | 13 kB | 232/248 kB
Progress (4): 248/592 kB | 0.3/1.5 MB | 13 kB | 232/248 kB
Progress (4): 248/592 kB | 0.3/1.5 MB | 13 kB | 236/248 kB
Progress (4): 248/592 kB | 0.3/1.5 MB | 13 kB | 236/248 kB
Progress (4): 248/592 kB | 0.3/1.5 MB | 13 kB | 240/248 kB
Progress (4): 248/592 kB | 0.3/1.5 MB | 13 kB | 240/248 kB
Progress (4): 248/592 kB | 0.3/1.5 MB | 13 kB | 244/248 kB
Progress (4): 248/592 kB | 0.3/1.5 MB | 13 kB | 244/248 kB
Progress (4): 248/592 kB | 0.3/1.5 MB | 13 kB | 248 kB    
Progress (5): 248/592 kB | 0.3/1.5 MB | 13 kB | 248 kB | 3.1 kB
Progress (5): 248/592 kB | 0.3/1.5 MB | 13 kB | 248 kB | 3.1 kB
Progress (5): 248/592 kB | 0.3/1.5 MB | 13 kB | 248 kB | 3.1 kB
Progress (5): 248/592 kB | 0.4/1.5 MB | 13 kB | 248 kB | 3.1 kB
Progress (5): 248/592 kB | 0.4/1.5 MB | 13 kB | 248 kB | 3.1 kB
                                                               
Downloaded from eclipse.maven.central.mirror: https://repo.eclipse.org/content/repositories/maven_central/org/eclipse/platform/org.eclipse.osgi.compatibility.state/1.1.600/org.eclipse.osgi.compatibility.state-1.1.600.jar (248 kB at 991 kB/s)
Downloaded from eclipse.maven.central.mirror: https://repo.eclipse.org/content/repositories/maven_central/org/eclipse/tycho/sisu-equinox-api/1.5.0/sisu-equinox-api-1.5.0.jar (3.1 kB at 12 kB/s)
Progress (3): 248/592 kB | 0.4/1.5 MB | 13 kB
                                             
Downloading from eclipse.maven.central.mirror: https://repo.eclipse.org/content/repositories/maven_central/org/eclipse/tycho/tycho-embedder-api/1.5.0/tycho-embedder-api-1.5.0.jar
Downloading from eclipse.maven.central.mirror: https://repo.eclipse.org/content/repositories/maven_central/org/eclipse/tycho/tycho-metadata-model/1.5.0/tycho-metadata-model-1.5.0.jar
Progress (3): 248/592 kB | 0.4/1.5 MB | 13 kB
Progress (3): 248/592 kB | 0.4/1.5 MB | 13 kB
Progress (3): 248/592 kB | 0.4/1.5 MB | 13 kB
Progress (3): 248/592 kB | 0.4/1.5 MB | 13 kB
Progress (3): 248/592 kB | 0.4/1.5 MB | 13 kB
Progress (3): 248/592 kB | 0.4/1.5 MB | 13 kB
Progress (3): 248/592 kB | 0.4/1.5 MB | 13 kB
Progress (3): 248/592 kB | 0.4/1.5 MB | 13 kB
Progress (3): 248/592 kB | 0.4/1.5 MB | 13 kB
Progress (3): 248/592 kB | 0.4/1.5 MB | 13 kB
Progress (3): 248/592 kB | 0.4/1.5 MB | 13 kB
Progress (3): 248/592 kB | 0.4/1.5 MB | 13 kB
Progress (3): 248/592 kB | 0.4/1.5 MB | 13 kB
Progress (3): 248/592 kB | 0.4/1.5 MB | 13 kB
Progress (3): 248/592 kB | 0.4/1.5 MB | 13 kB
Progress (3): 248/592 kB | 0.4/1.5 MB | 13 kB
Progress (3): 248/592 kB | 0.4/1.5 MB | 13 kB
Progress (3): 248/592 kB | 0.4/1.5 MB | 13 kB
Progress (3): 248/592 kB | 0.4/1.5 MB | 13 kB
Progress (3): 248/592 kB | 0.4/1.5 MB | 13 kB
Progress (3): 248/592 kB | 0.4/1.5 MB | 13 kB
Progress (3): 248/592 kB | 0.4/1.5 MB | 13 kB
Progress (3): 248/592 kB | 0.5/1.5 MB | 13 kB
Progress (3): 248/592 kB | 0.5/1.5 MB | 13 kB
Progress (3): 248/592 kB | 0.5/1.5 MB | 13 kB
Progress (3): 248/592 kB | 0.5/1.5 MB | 13 kB
Progress (3): 248/592 kB | 0.5/1.5 MB | 13 kB
Progress (3): 248/592 kB | 0.5/1.5 MB | 13 kB
Progress (3): 248/592 kB | 0.5/1.5 MB | 13 kB
Progress (3): 248/592 kB | 0.5/1.5 MB | 13 kB
Progress (3): 248/592 kB | 0.5/1.5 MB | 13 kB
Progress (3): 248/592 kB | 0.5/1.5 MB | 13 kB
Progress (3): 248/592 kB | 0.5/1.5 MB | 13 kB
Progress (3): 248/592 kB | 0.5/1.5 MB | 13 kB
Progress (3): 248/592 kB | 0.5/1.5 MB | 13 kB
Progress (3): 248/592 kB | 0.5/1.5 MB | 13 kB
Progress (3): 248/592 kB | 0.5/1.5 MB | 13 kB
Progress (3): 248/592 kB | 0.5/1.5 MB | 13 kB
Progress (3): 248/592 kB | 0.5/1.5 MB | 13 kB
Progress (3): 248/592 kB | 0.5/1.5 MB | 13 kB
Progress (3): 248/592 kB | 0.5/1.5 MB | 13 kB
Progress (3): 248/592 kB | 0.5/1.5 MB | 13 kB
Progress (3): 248/592 kB | 0.5/1.5 MB | 13 kB
Progress (3): 248/592 kB | 0.5/1.5 MB | 13 kB
Progress (3): 248/592 kB | 0.5/1.5 MB | 13 kB
Progress (3): 248/592 kB | 0.5/1.5 MB | 13 kB
Progress (3): 248/592 kB | 0.5/1.5 MB | 13 kB
Progress (3): 248/592 kB | 0.6/1.5 MB | 13 kB
Progress (3): 248/592 kB | 0.6/1.5 MB | 13 kB
Progress (3): 248/592 kB | 0.6/1.5 MB | 13 kB
Progress (3): 248/592 kB | 0.6/1.5 MB | 13 kB
Progress (3): 248/592 kB | 0.6/1.5 MB | 13 kB
Progress (3): 248/592 kB | 0.6/1.5 MB | 13 kB
Progress (3): 248/592 kB | 0.6/1.5 MB | 13 kB
Progress (3): 248/592 kB | 0.6/1.5 MB | 13 kB
Progress (4): 248/592 kB | 0.6/1.5 MB | 13 kB | 4.1/38 kB
Progress (4): 248/592 kB | 0.6/1.5 MB | 13 kB | 4.1/38 kB
Progress (4): 248/592 kB | 0.6/1.5 MB | 13 kB | 7.7/38 kB
Progress (4): 248/592 kB | 0.6/1.5 MB | 13 kB | 7.7/38 kB
Progress (4): 248/592 kB | 0.6/1.5 MB | 13 kB | 7.7/38 kB
Progress (4): 248/592 kB | 0.6/1.5 MB | 13 kB | 12/38 kB 
Progress (4): 248/592 kB | 0.6/1.5 MB | 13 kB | 12/38 kB
Progress (4): 248/592 kB | 0.6/1.5 MB | 13 kB | 16/38 kB
Progress (4): 248/592 kB | 0.6/1.5 MB | 13 kB | 16/38 kB
Progress (5): 248/592 kB | 0.6/1.5 MB | 13 kB | 16/38 kB | 4.1/7.0 kB
Progress (5): 248/592 kB | 0.6/1.5 MB | 13 kB | 16/38 kB | 4.1/7.0 kB
Progress (5): 248/592 kB | 0.6/1.5 MB | 13 kB | 20/38 kB | 4.1/7.0 kB
Progress (5): 248/592 kB | 0.6/1.5 MB | 13 kB | 20/38 kB | 4.1/7.0 kB
Progress (5): 248/592 kB | 0.6/1.5 MB | 13 kB | 20/38 kB | 7.0 kB    
Progress (5): 248/592 kB | 0.6/1.5 MB | 13 kB | 20/38 kB | 7.0 kB
Progress (5): 248/592 kB | 0.6/1.5 MB | 13 kB | 24/38 kB | 7.0 kB
Progress (5): 248/592 kB | 0.6/1.5 MB | 13 kB | 24/38 kB | 7.0 kB
Progress (5): 248/592 kB | 0.6/1.5 MB | 13 kB | 28/38 kB | 7.0 kB
Progress (5): 248/592 kB | 0.6/1.5 MB | 13 kB | 28/38 kB | 7.0 kB
Progress (5): 248/592 kB | 0.6/1.5 MB | 13 kB | 32/38 kB | 7.0 kB
Progress (5): 248/592 kB | 0.6/1.5 MB | 13 kB | 32/38 kB | 7.0 kB
Progress (5): 248/592 kB | 0.6/1.5 MB | 13 kB | 36/38 kB | 7.0 kB
Progress (5): 248/592 kB | 0.6/1.5 MB | 13 kB | 36/38 kB | 7.0 kB
Progress (5): 248/592 kB | 0.6/1.5 MB | 13 kB | 38 kB | 7.0 kB   
Progress (5): 248/592 kB | 0.6/1.5 MB | 13 kB | 38 kB | 7.0 kB
Progress (5): 248/592 kB | 0.6/1.5 MB | 13 kB | 38 kB | 7.0 kB
Progress (5): 248/592 kB | 0.6/1.5 MB | 13 kB | 38 kB | 7.0 kB
Progress (5): 248/592 kB | 0.6/1.5 MB | 13 kB | 38 kB | 7.0 kB
Progress (5): 248/592 kB | 0.6/1.5 MB | 13 kB | 38 kB | 7.0 kB
Progress (5): 248/592 kB | 0.7/1.5 MB | 13 kB | 38 kB | 7.0 kB
Progress (5): 248/592 kB | 0.7/1.5 MB | 13 kB | 38 kB | 7.0 kB
Progress (5): 248/592 kB | 0.7/1.5 MB | 13 kB | 38 kB | 7.0 kB
Progress (5): 248/592 kB | 0.7/1.5 MB | 13 kB | 38 kB | 7.0 kB
Progress (5): 248/592 kB | 0.7/1.5 MB | 13 kB | 38 kB | 7.0 kB
Progress (5): 248/592 kB | 0.7/1.5 MB | 13 kB | 38 kB | 7.0 kB
Progress (5): 248/592 kB | 0.7/1.5 MB | 13 kB | 38 kB | 7.0 kB
Progress (5): 248/592 kB | 0.7/1.5 MB | 13 kB | 38 kB | 7.0 kB
Progress (5): 248/592 kB | 0.7/1.5 MB | 13 kB | 38 kB | 7.0 kB
Progress (5): 248/592 kB | 0.7/1.5 MB | 13 kB | 38 kB | 7.0 kB
Progress (5): 248/592 kB | 0.7/1.5 MB | 13 kB | 38 kB | 7.0 kB
Progress (5): 248/592 kB | 0.7/1.5 MB | 13 kB | 38 kB | 7.0 kB
                                                              
Downloaded from eclipse.maven.central.mirror: https://repo.eclipse.org/content/repositories/maven_central/org/eclipse/tycho/sisu-equinox-embedder/1.5.0/sisu-equinox-embedder-1.5.0.jar (13 kB at 48 kB/s)
Progress (4): 248/592 kB | 0.7/1.5 MB | 38 kB | 7.0 kB
                                                      
Downloading from eclipse.maven.central.mirror: https://repo.eclipse.org/content/repositories/maven_central/org/eclipse/tycho/org.eclipse.tycho.embedder.shared/1.5.0/org.eclipse.tycho.embedder.shared-1.5.0.jar
Progress (4): 248/592 kB | 0.7/1.5 MB | 38 kB | 7.0 kB
Progress (4): 248/592 kB | 0.7/1.5 MB | 38 kB | 7.0 kB
Progress (4): 248/592 kB | 0.7/1.5 MB | 38 kB | 7.0 kB
Progress (4): 248/592 kB | 0.7/1.5 MB | 38 kB | 7.0 kB
Progress (4): 248/592 kB | 0.7/1.5 MB | 38 kB | 7.0 kB
Progress (4): 248/592 kB | 0.7/1.5 MB | 38 kB | 7.0 kB
Progress (4): 248/592 kB | 0.7/1.5 MB | 38 kB | 7.0 kB
                                                      
Downloaded from eclipse.maven.central.mirror: https://repo.eclipse.org/content/repositories/maven_central/org/eclipse/tycho/tycho-embedder-api/1.5.0/tycho-embedder-api-1.5.0.jar (7.0 kB at 25 kB/s)
Progress (3): 248/592 kB | 0.7/1.5 MB | 38 kB
                                             
Downloading from eclipse.maven.central.mirror: https://repo.eclipse.org/content/repositories/maven_central/org/eclipse/tycho/org.eclipse.tycho.core.shared/1.5.0/org.eclipse.tycho.core.shared-1.5.0.jar
Progress (3): 248/592 kB | 0.7/1.5 MB | 38 kB
Progress (3): 248/592 kB | 0.7/1.5 MB | 38 kB
Progress (3): 248/592 kB | 0.7/1.5 MB | 38 kB
                                             
Downloaded from eclipse.maven.central.mirror: https://repo.eclipse.org/content/repositories/maven_central/org/eclipse/tycho/tycho-metadata-model/1.5.0/tycho-metadata-model-1.5.0.jar (38 kB at 137 kB/s)
Progress (2): 248/592 kB | 0.7/1.5 MB
                                     
Downloading from eclipse.maven.central.mirror: https://repo.eclipse.org/content/repositories/maven_central/org/eclipse/tycho/tycho-p2-facade/1.5.0/tycho-p2-facade-1.5.0.jar
Progress (2): 248/592 kB | 0.8/1.5 MB
Progress (2): 248/592 kB | 0.8/1.5 MB
Progress (2): 248/592 kB | 0.8/1.5 MB
Progress (2): 248/592 kB | 0.8/1.5 MB
Progress (2): 248/592 kB | 0.8/1.5 MB
Progress (2): 248/592 kB | 0.8/1.5 MB
Progress (2): 248/592 kB | 0.8/1.5 MB
Progress (2): 248/592 kB | 0.8/1.5 MB
Progress (2): 248/592 kB | 0.8/1.5 MB
Progress (2): 248/592 kB | 0.8/1.5 MB
Progress (2): 248/592 kB | 0.8/1.5 MB
Progress (3): 248/592 kB | 0.8/1.5 MB | 4.1/9.4 kB
Progress (3): 248/592 kB | 0.8/1.5 MB | 4.1/9.4 kB
Progress (3): 248/592 kB | 0.8/1.5 MB | 7.7/9.4 kB
Progress (3): 248/592 kB | 0.8/1.5 MB | 7.7/9.4 kB
Progress (3): 248/592 kB | 0.8/1.5 MB | 9.4 kB    
Progress (3): 248/592 kB | 0.8/1.5 MB | 9.4 kB
Progress (3): 248/592 kB | 0.8/1.5 MB | 9.4 kB
Progress (3): 248/592 kB | 0.8/1.5 MB | 9.4 kB
Progress (3): 248/592 kB | 0.8/1.5 MB | 9.4 kB
Progress (4): 248/592 kB | 0.8/1.5 MB | 9.4 kB | 4.1/37 kB
Progress (4): 248/592 kB | 0.8/1.5 MB | 9.4 kB | 4.1/37 kB
Progress (4): 248/592 kB | 0.8/1.5 MB | 9.4 kB | 7.7/37 kB
Progress (4): 252/592 kB | 0.8/1.5 MB | 9.4 kB | 7.7/37 kB
Progress (4): 252/592 kB | 0.8/1.5 MB | 9.4 kB | 7.7/37 kB
Progress (4): 256/592 kB | 0.8/1.5 MB | 9.4 kB | 7.7/37 kB
Progress (4): 256/592 kB | 0.8/1.5 MB | 9.4 kB | 12/37 kB 
Progress (4): 256/592 kB | 0.8/1.5 MB | 9.4 kB | 12/37 kB
Progress (4): 256/592 kB | 0.8/1.5 MB | 9.4 kB | 16/37 kB
Progress (4): 256/592 kB | 0.8/1.5 MB | 9.4 kB | 16/37 kB
Progress (4): 256/592 kB | 0.8/1.5 MB | 9.4 kB | 16/37 kB
Progress (4): 256/592 kB | 0.8/1.5 MB | 9.4 kB | 16/37 kB
Progress (4): 256/592 kB | 0.8/1.5 MB | 9.4 kB | 16/37 kB
Progress (4): 256/592 kB | 0.8/1.5 MB | 9.4 kB | 16/37 kB
                                                         
Downloaded from eclipse.maven.central.mirror: https://repo.eclipse.org/content/repositories/maven_central/org/eclipse/tycho/org.eclipse.tycho.embedder.shared/1.5.0/org.eclipse.tycho.embedder.shared-1.5.0.jar (9.4 kB at 33 kB/s)
Downloading from eclipse.maven.central.mirror: https://repo.eclipse.org/content/repositories/maven_central/org/eclipse/tycho/org.eclipse.tycho.p2.resolver.shared/1.5.0/org.eclipse.tycho.p2.resolver.shared-1.5.0.jar
Progress (3): 256/592 kB | 0.8/1.5 MB | 20/37 kB
Progress (3): 260/592 kB | 0.8/1.5 MB | 20/37 kB
Progress (3): 260/592 kB | 0.9/1.5 MB | 20/37 kB
Progress (3): 264/592 kB | 0.9/1.5 MB | 20/37 kB
Progress (3): 264/592 kB | 0.9/1.5 MB | 24/37 kB
Progress (3): 268/592 kB | 0.9/1.5 MB | 24/37 kB
Progress (3): 268/592 kB | 0.9/1.5 MB | 24/37 kB
Progress (3): 268/592 kB | 0.9/1.5 MB | 28/37 kB
Progress (3): 272/592 kB | 0.9/1.5 MB | 28/37 kB
Progress (3): 272/592 kB | 0.9/1.5 MB | 32/37 kB
Progress (4): 272/592 kB | 0.9/1.5 MB | 32/37 kB | 4.1/37 kB
Progress (4): 272/592 kB | 0.9/1.5 MB | 32/37 kB | 4.1/37 kB
Progress (4): 272/592 kB | 0.9/1.5 MB | 32/37 kB | 7.7/37 kB
Progress (4): 272/592 kB | 0.9/1.5 MB | 36/37 kB | 7.7/37 kB
Progress (4): 276/592 kB | 0.9/1.5 MB | 36/37 kB | 7.7/37 kB
Progress (4): 276/592 kB | 0.9/1.5 MB | 36/37 kB | 12/37 kB 
Progress (4): 276/592 kB | 0.9/1.5 MB | 37 kB | 12/37 kB   
Progress (4): 276/592 kB | 0.9/1.5 MB | 37 kB | 12/37 kB
Progress (4): 276/592 kB | 0.9/1.5 MB | 37 kB | 16/37 kB
Progress (4): 280/592 kB | 0.9/1.5 MB | 37 kB | 16/37 kB
Progress (4): 280/592 kB | 0.9/1.5 MB | 37 kB | 20/37 kB
Progress (4): 280/592 kB | 0.9/1.5 MB | 37 kB | 20/37 kB
Progress (4): 284/592 kB | 0.9/1.5 MB | 37 kB | 20/37 kB
Progress (4): 284/592 kB | 0.9/1.5 MB | 37 kB | 24/37 kB
Progress (4): 288/592 kB | 0.9/1.5 MB | 37 kB | 24/37 kB
Progress (4): 288/592 kB | 0.9/1.5 MB | 37 kB | 24/37 kB
Progress (4): 288/592 kB | 0.9/1.5 MB | 37 kB | 28/37 kB
Progress (4): 288/592 kB | 0.9/1.5 MB | 37 kB | 28/37 kB
Progress (4): 292/592 kB | 0.9/1.5 MB | 37 kB | 28/37 kB
Progress (4): 292/592 kB | 0.9/1.5 MB | 37 kB | 28/37 kB
Progress (4): 292/592 kB | 0.9/1.5 MB | 37 kB | 32/37 kB
Progress (4): 292/592 kB | 0.9/1.5 MB | 37 kB | 32/37 kB
Progress (4): 296/592 kB | 0.9/1.5 MB | 37 kB | 32/37 kB
Progress (4): 296/592 kB | 0.9/1.5 MB | 37 kB | 32/37 kB
Progress (4): 296/592 kB | 0.9/1.5 MB | 37 kB | 36/37 kB
Progress (4): 300/592 kB | 0.9/1.5 MB | 37 kB | 36/37 kB
Progress (4): 300/592 kB | 0.9/1.5 MB | 37 kB | 36/37 kB
Progress (4): 300/592 kB | 0.9/1.5 MB | 37 kB | 37 kB   
Progress (4): 300/592 kB | 0.9/1.5 MB | 37 kB | 37 kB
Progress (4): 304/592 kB | 0.9/1.5 MB | 37 kB | 37 kB
Progress (4): 304/592 kB | 0.9/1.5 MB | 37 kB | 37 kB
Progress (4): 304/592 kB | 0.9/1.5 MB | 37 kB | 37 kB
Progress (4): 308/592 kB | 0.9/1.5 MB | 37 kB | 37 kB
Progress (4): 308/592 kB | 0.9/1.5 MB | 37 kB | 37 kB
Progress (4): 312/592 kB | 0.9/1.5 MB | 37 kB | 37 kB
Progress (4): 312/592 kB | 0.9/1.5 MB | 37 kB | 37 kB
Progress (4): 316/592 kB | 0.9/1.5 MB | 37 kB | 37 kB
Progress (4): 316/592 kB | 0.9/1.5 MB | 37 kB | 37 kB
Progress (4): 320/592 kB | 0.9/1.5 MB | 37 kB | 37 kB
Progress (4): 320/592 kB | 0.9/1.5 MB | 37 kB | 37 kB
Progress (4): 324/592 kB | 0.9/1.5 MB | 37 kB | 37 kB
Progress (4): 324/592 kB | 0.9/1.5 MB | 37 kB | 37 kB
Progress (4): 328/592 kB | 0.9/1.5 MB | 37 kB | 37 kB
Progress (4): 328/592 kB | 0.9/1.5 MB | 37 kB | 37 kB
Progress (4): 332/592 kB | 0.9/1.5 MB | 37 kB | 37 kB
Progress (4): 332/592 kB | 0.9/1.5 MB | 37 kB | 37 kB
Progress (4): 336/592 kB | 0.9/1.5 MB | 37 kB | 37 kB
Progress (4): 336/592 kB | 0.9/1.5 MB | 37 kB | 37 kB
Progress (4): 340/592 kB | 0.9/1.5 MB | 37 kB | 37 kB
Progress (4): 340/592 kB | 0.9/1.5 MB | 37 kB | 37 kB
Progress (4): 344/592 kB | 0.9/1.5 MB | 37 kB | 37 kB
Progress (4): 344/592 kB | 0.9/1.5 MB | 37 kB | 37 kB
Progress (4): 348/592 kB | 0.9/1.5 MB | 37 kB | 37 kB
Progress (4): 348/592 kB | 0.9/1.5 MB | 37 kB | 37 kB
Progress (4): 352/592 kB | 0.9/1.5 MB | 37 kB | 37 kB
Progress (4): 352/592 kB | 1.0/1.5 MB | 37 kB | 37 kB
Progress (4): 356/592 kB | 1.0/1.5 MB | 37 kB | 37 kB
Progress (4): 356/592 kB | 1.0/1.5 MB | 37 kB | 37 kB
Progress (4): 360/592 kB | 1.0/1.5 MB | 37 kB | 37 kB
Progress (4): 360/592 kB | 1.0/1.5 MB | 37 kB | 37 kB
Progress (4): 364/592 kB | 1.0/1.5 MB | 37 kB | 37 kB
Progress (4): 364/592 kB | 1.0/1.5 MB | 37 kB | 37 kB
Progress (4): 368/592 kB | 1.0/1.5 MB | 37 kB | 37 kB
Progress (4): 368/592 kB | 1.0/1.5 MB | 37 kB | 37 kB
Progress (4): 372/592 kB | 1.0/1.5 MB | 37 kB | 37 kB
Progress (4): 372/592 kB | 1.0/1.5 MB | 37 kB | 37 kB
Progress (4): 376/592 kB | 1.0/1.5 MB | 37 kB | 37 kB
Progress (4): 376/592 kB | 1.0/1.5 MB | 37 kB | 37 kB
Progress (4): 380/592 kB | 1.0/1.5 MB | 37 kB | 37 kB
Progress (4): 380/592 kB | 1.0/1.5 MB | 37 kB | 37 kB
Progress (4): 384/592 kB | 1.0/1.5 MB | 37 kB | 37 kB
Progress (4): 384/592 kB | 1.0/1.5 MB | 37 kB | 37 kB
Progress (4): 388/592 kB | 1.0/1.5 MB | 37 kB | 37 kB
Progress (4): 388/592 kB | 1.0/1.5 MB | 37 kB | 37 kB
Progress (4): 392/592 kB | 1.0/1.5 MB | 37 kB | 37 kB
Progress (4): 392/592 kB | 1.0/1.5 MB | 37 kB | 37 kB
Progress (4): 396/592 kB | 1.0/1.5 MB | 37 kB | 37 kB
Progress (4): 396/592 kB | 1.0/1.5 MB | 37 kB | 37 kB
Progress (4): 400/592 kB | 1.0/1.5 MB | 37 kB | 37 kB
Progress (4): 400/592 kB | 1.0/1.5 MB | 37 kB | 37 kB
                                                     
Downloaded from eclipse.maven.central.mirror: https://repo.eclipse.org/content/repositories/maven_central/org/eclipse/tycho/org.eclipse.tycho.core.shared/1.5.0/org.eclipse.tycho.core.shared-1.5.0.jar (37 kB at 103 kB/s)
Downloaded from eclipse.maven.central.mirror: https://repo.eclipse.org/content/repositories/maven_central/org/eclipse/tycho/tycho-p2-facade/1.5.0/tycho-p2-facade-1.5.0.jar (37 kB at 103 kB/s)
Progress (2): 400/592 kB | 1.0/1.5 MB
Progress (2): 404/592 kB | 1.0/1.5 MB
Progress (2): 404/592 kB | 1.0/1.5 MB
Progress (2): 408/592 kB | 1.0/1.5 MB
Progress (2): 408/592 kB | 1.0/1.5 MB
Progress (2): 412/592 kB | 1.0/1.5 MB
Progress (2): 412/592 kB | 1.0/1.5 MB
Progress (2): 416/592 kB | 1.0/1.5 MB
Progress (2): 416/592 kB | 1.0/1.5 MB
Progress (2): 420/592 kB | 1.0/1.5 MB
Progress (2): 420/592 kB | 1.0/1.5 MB
Progress (2): 424/592 kB | 1.0/1.5 MB
Progress (2): 424/592 kB | 1.0/1.5 MB
Progress (2): 428/592 kB | 1.0/1.5 MB
Progress (2): 428/592 kB | 1.0/1.5 MB
Progress (2): 432/592 kB | 1.0/1.5 MB
Progress (2): 432/592 kB | 1.0/1.5 MB
Progress (2): 436/592 kB | 1.0/1.5 MB
Progress (2): 436/592 kB | 1.0/1.5 MB
Progress (2): 440/592 kB | 1.0/1.5 MB
Progress (2): 440/592 kB | 1.0/1.5 MB
Progress (2): 444/592 kB | 1.0/1.5 MB
Progress (2): 444/592 kB | 1.0/1.5 MB
Progress (3): 444/592 kB | 1.0/1.5 MB | 4.1/29 kB
Progress (3): 448/592 kB | 1.0/1.5 MB | 4.1/29 kB
Progress (3): 448/592 kB | 1.0/1.5 MB | 7.7/29 kB
Progress (3): 448/592 kB | 1.1/1.5 MB | 7.7/29 kB
Progress (3): 452/592 kB | 1.1/1.5 MB | 7.7/29 kB
Progress (3): 452/592 kB | 1.1/1.5 MB | 7.7/29 kB
Progress (3): 452/592 kB | 1.1/1.5 MB | 12/29 kB 
Progress (3): 456/592 kB | 1.1/1.5 MB | 12/29 kB
Progress (3): 456/592 kB | 1.1/1.5 MB | 16/29 kB
Progress (3): 456/592 kB | 1.1/1.5 MB | 16/29 kB
Progress (3): 460/592 kB | 1.1/1.5 MB | 16/29 kB
Progress (3): 460/592 kB | 1.1/1.5 MB | 20/29 kB
Progress (3): 460/592 kB | 1.1/1.5 MB | 20/29 kB
Progress (3): 460/592 kB | 1.1/1.5 MB | 24/29 kB
Progress (3): 464/592 kB | 1.1/1.5 MB | 24/29 kB
Progress (3): 464/592 kB | 1.1/1.5 MB | 24/29 kB
Progress (3): 464/592 kB | 1.1/1.5 MB | 28/29 kB
Progress (3): 464/592 kB | 1.1/1.5 MB | 28/29 kB
Progress (3): 468/592 kB | 1.1/1.5 MB | 28/29 kB
Progress (3): 468/592 kB | 1.1/1.5 MB | 29 kB   
Progress (3): 472/592 kB | 1.1/1.5 MB | 29 kB
Progress (3): 472/592 kB | 1.1/1.5 MB | 29 kB
Progress (3): 472/592 kB | 1.1/1.5 MB | 29 kB
Progress (3): 476/592 kB | 1.1/1.5 MB | 29 kB
Progress (3): 476/592 kB | 1.1/1.5 MB | 29 kB
Progress (3): 480/592 kB | 1.1/1.5 MB | 29 kB
Progress (3): 480/592 kB | 1.1/1.5 MB | 29 kB
Progress (3): 484/592 kB | 1.1/1.5 MB | 29 kB
Progress (3): 484/592 kB | 1.1/1.5 MB | 29 kB
Progress (3): 488/592 kB | 1.1/1.5 MB | 29 kB
Progress (3): 488/592 kB | 1.1/1.5 MB | 29 kB
Progress (3): 492/592 kB | 1.1/1.5 MB | 29 kB
Progress (3): 492/592 kB | 1.1/1.5 MB | 29 kB
Progress (3): 496/592 kB | 1.1/1.5 MB | 29 kB
Progress (3): 496/592 kB | 1.1/1.5 MB | 29 kB
Progress (3): 500/592 kB | 1.1/1.5 MB | 29 kB
Progress (3): 500/592 kB | 1.1/1.5 MB | 29 kB
Progress (3): 504/592 kB | 1.1/1.5 MB | 29 kB
Progress (3): 504/592 kB | 1.1/1.5 MB | 29 kB
Progress (3): 508/592 kB | 1.1/1.5 MB | 29 kB
Progress (3): 508/592 kB | 1.1/1.5 MB | 29 kB
Progress (3): 512/592 kB | 1.1/1.5 MB | 29 kB
Progress (3): 512/592 kB | 1.1/1.5 MB | 29 kB
Progress (3): 516/592 kB | 1.1/1.5 MB | 29 kB
Progress (3): 516/592 kB | 1.1/1.5 MB | 29 kB
Progress (3): 520/592 kB | 1.1/1.5 MB | 29 kB
Progress (3): 520/592 kB | 1.1/1.5 MB | 29 kB
Progress (3): 524/592 kB | 1.1/1.5 MB | 29 kB
Progress (3): 524/592 kB | 1.1/1.5 MB | 29 kB
Progress (3): 528/592 kB | 1.1/1.5 MB | 29 kB
Progress (3): 528/592 kB | 1.1/1.5 MB | 29 kB
Progress (3): 532/592 kB | 1.1/1.5 MB | 29 kB
Progress (3): 532/592 kB | 1.1/1.5 MB | 29 kB
Progress (3): 536/592 kB | 1.1/1.5 MB | 29 kB
Progress (3): 536/592 kB | 1.1/1.5 MB | 29 kB
Progress (3): 540/592 kB | 1.1/1.5 MB | 29 kB
Progress (3): 540/592 kB | 1.1/1.5 MB | 29 kB
Progress (3): 544/592 kB | 1.1/1.5 MB | 29 kB
Progress (3): 544/592 kB | 1.2/1.5 MB | 29 kB
Progress (3): 548/592 kB | 1.2/1.5 MB | 29 kB
Progress (3): 548/592 kB | 1.2/1.5 MB | 29 kB
Progress (3): 552/592 kB | 1.2/1.5 MB | 29 kB
Progress (3): 552/592 kB | 1.2/1.5 MB | 29 kB
Progress (3): 556/592 kB | 1.2/1.5 MB | 29 kB
Progress (3): 556/592 kB | 1.2/1.5 MB | 29 kB
Progress (3): 560/592 kB | 1.2/1.5 MB | 29 kB
Progress (3): 560/592 kB | 1.2/1.5 MB | 29 kB
Progress (3): 564/592 kB | 1.2/1.5 MB | 29 kB
Progress (3): 564/592 kB | 1.2/1.5 MB | 29 kB
Progress (3): 568/592 kB | 1.2/1.5 MB | 29 kB
Progress (3): 568/592 kB | 1.2/1.5 MB | 29 kB
Progress (3): 572/592 kB | 1.2/1.5 MB | 29 kB
Progress (3): 572/592 kB | 1.2/1.5 MB | 29 kB
Progress (3): 576/592 kB | 1.2/1.5 MB | 29 kB
Progress (3): 576/592 kB | 1.2/1.5 MB | 29 kB
                                             
Downloaded from eclipse.maven.central.mirror: https://repo.eclipse.org/content/repositories/maven_central/org/eclipse/tycho/org.eclipse.tycho.p2.resolver.shared/1.5.0/org.eclipse.tycho.p2.resolver.shared-1.5.0.jar (29 kB at 77 kB/s)
Progress (2): 576/592 kB | 1.2/1.5 MB
Progress (2): 580/592 kB | 1.2/1.5 MB
Progress (2): 580/592 kB | 1.2/1.5 MB
Progress (2): 584/592 kB | 1.2/1.5 MB
Progress (2): 584/592 kB | 1.2/1.5 MB
Progress (2): 588/592 kB | 1.2/1.5 MB
Progress (2): 588/592 kB | 1.2/1.5 MB
Progress (2): 592/592 kB | 1.2/1.5 MB
Progress (2): 592 kB | 1.2/1.5 MB    
Progress (2): 592 kB | 1.2/1.5 MB
Progress (2): 592 kB | 1.2/1.5 MB
Progress (2): 592 kB | 1.2/1.5 MB
Progress (2): 592 kB | 1.2/1.5 MB
Progress (2): 592 kB | 1.2/1.5 MB
Progress (2): 592 kB | 1.2/1.5 MB
Progress (2): 592 kB | 1.2/1.5 MB
Progress (2): 592 kB | 1.2/1.5 MB
Progress (2): 592 kB | 1.2/1.5 MB
Progress (2): 592 kB | 1.2/1.5 MB
Progress (2): 592 kB | 1.2/1.5 MB
Progress (2): 592 kB | 1.2/1.5 MB
Progress (2): 592 kB | 1.3/1.5 MB
Progress (2): 592 kB | 1.3/1.5 MB
Progress (2): 592 kB | 1.3/1.5 MB
Progress (2): 592 kB | 1.3/1.5 MB
Progress (2): 592 kB | 1.3/1.5 MB
Progress (2): 592 kB | 1.3/1.5 MB
Progress (2): 592 kB | 1.3/1.5 MB
Progress (2): 592 kB | 1.3/1.5 MB
Progress (2): 592 kB | 1.3/1.5 MB
Progress (2): 592 kB | 1.3/1.5 MB
Progress (2): 592 kB | 1.3/1.5 MB
Progress (2): 592 kB | 1.3/1.5 MB
Progress (2): 592 kB | 1.3/1.5 MB
Progress (2): 592 kB | 1.3/1.5 MB
Progress (2): 592 kB | 1.3/1.5 MB
Progress (2): 592 kB | 1.3/1.5 MB
Progress (2): 592 kB | 1.3/1.5 MB
Progress (2): 592 kB | 1.3/1.5 MB
Progress (2): 592 kB | 1.3/1.5 MB
Progress (2): 592 kB | 1.3/1.5 MB
Progress (2): 592 kB | 1.3/1.5 MB
Progress (2): 592 kB | 1.3/1.5 MB
Progress (2): 592 kB | 1.3/1.5 MB
Progress (2): 592 kB | 1.3/1.5 MB
Progress (2): 592 kB | 1.3/1.5 MB
Progress (2): 592 kB | 1.4/1.5 MB
                                 
Downloaded from eclipse.maven.central.mirror: https://repo.eclipse.org/content/repositories/maven_central/org/apache/commons/commons-compress/1.18/commons-compress-1.18.jar (592 kB at 1.5 MB/s)
Progress (1): 1.4/1.5 MB
Progress (1): 1.4/1.5 MB
Progress (1): 1.4/1.5 MB
Progress (1): 1.4/1.5 MB
Progress (1): 1.4/1.5 MB
Progress (1): 1.4/1.5 MB
Progress (1): 1.4/1.5 MB
Progress (1): 1.4/1.5 MB
Progress (1): 1.4/1.5 MB
Progress (1): 1.4/1.5 MB
Progress (1): 1.4/1.5 MB
Progress (1): 1.4/1.5 MB
Progress (1): 1.4/1.5 MB
Progress (1): 1.4/1.5 MB
Progress (1): 1.4/1.5 MB
Progress (1): 1.4/1.5 MB
Progress (1): 1.4/1.5 MB
Progress (1): 1.4/1.5 MB
Progress (1): 1.4/1.5 MB
Progress (1): 1.4/1.5 MB
Progress (1): 1.4/1.5 MB
Progress (1): 1.4/1.5 MB
Progress (1): 1.4/1.5 MB
Progress (1): 1.4/1.5 MB
Progress (1): 1.5/1.5 MB
Progress (1): 1.5/1.5 MB
Progress (1): 1.5/1.5 MB
Progress (1): 1.5 MB    
                    
Downloaded from eclipse.maven.central.mirror: https://repo.eclipse.org/content/repositories/maven_central/org/eclipse/platform/org.eclipse.osgi/3.15.0/org.eclipse.osgi-3.15.0.jar (1.5 MB at 3.2 MB/s)
[ERROR] [ERROR] Some problems were encountered while processing the POMs:
[FATAL] Non-resolvable parent POM for org.eclipse.m2e:org.eclipse.m2e.editor.tests:[unknown-version]: Could not find artifact org.eclipse.m2e:m2e-core-tests:pom:1.13.0-SNAPSHOT and 'parent.relativePath' points at wrong local POM @ line 12, column 11
[FATAL] Non-resolvable parent POM for org.eclipse.m2e:org.eclipse.m2e.editor.xml.tests:[unknown-version]: Could not find artifact org.eclipse.m2e:m2e-core-tests:pom:1.13.0-SNAPSHOT and 'parent.relativePath' points at wrong local POM @ line 12, column 11
 @ 
[ERROR] The build could not read 2 projects -> [Help 1]
[ERROR]   
[ERROR]   The project org.eclipse.m2e:org.eclipse.m2e.editor.tests:[unknown-version] (/home/jenkins/agent/workspace/m2e-gerrit/m2e-core-tests/org.eclipse.m2e.editor.tests/pom.xml) has 1 error
[ERROR]     Non-resolvable parent POM for org.eclipse.m2e:org.eclipse.m2e.editor.tests:[unknown-version]: Could not find artifact org.eclipse.m2e:m2e-core-tests:pom:1.13.0-SNAPSHOT and 'parent.relativePath' points at wrong local POM @ line 12, column 11 -> [Help 2]
[ERROR]   
[ERROR]   The project org.eclipse.m2e:org.eclipse.m2e.editor.xml.tests:[unknown-version] (/home/jenkins/agent/workspace/m2e-gerrit/m2e-core-tests/org.eclipse.m2e.editor.xml.tests/pom.xml) has 1 error
[ERROR]     Non-resolvable parent POM for org.eclipse.m2e:org.eclipse.m2e.editor.xml.tests:[unknown-version]: Could not find artifact org.eclipse.m2e:m2e-core-tests:pom:1.13.0-SNAPSHOT and 'parent.relativePath' points at wrong local POM @ line 12, column 11 -> [Help 2]
[ERROR] 
[ERROR] To see the full stack trace of the errors, re-run Maven with the -e switch.
[ERROR] Re-run Maven using the -X switch to enable full debug logging.
[ERROR] 
[ERROR] For more information about the errors and possible solutions, please read the following articles:
[ERROR] [Help 1] http://cwiki.apache.org/confluence/display/MAVEN/ProjectBuildingException
[ERROR] [Help 2] http://cwiki.apache.org/confluence/display/MAVEN/UnresolvableModelException
Build step 'Invoke top-level Maven targets' marked build as failure
Terminating xvnc.
Recording test results
ERROR: Step ‘Publish JUnit test result report’ failed: No test report files were found. Configuration error?
Archiving artifacts
Finished: FAILURE