FailedConsole Output

Skipping 1,100 KB.. Full Log
| 61/85 kB | 32/291 kB | 28/56 kB
Progress (5): 1.2/2.6 MB | 502 kB | 61/85 kB | 33/291 kB | 28/56 kB
Progress (5): 1.2/2.6 MB | 502 kB | 61/85 kB | 33/291 kB | 32/56 kB
Progress (5): 1.2/2.6 MB | 502 kB | 65/85 kB | 33/291 kB | 32/56 kB
Progress (5): 1.2/2.6 MB | 502 kB | 65/85 kB | 37/291 kB | 32/56 kB
Progress (5): 1.2/2.6 MB | 502 kB | 65/85 kB | 37/291 kB | 36/56 kB
Progress (5): 1.2/2.6 MB | 502 kB | 65/85 kB | 41/291 kB | 36/56 kB
Progress (5): 1.2/2.6 MB | 502 kB | 69/85 kB | 41/291 kB | 36/56 kB
Progress (5): 1.2/2.6 MB | 502 kB | 69/85 kB | 41/291 kB | 40/56 kB
Progress (5): 1.2/2.6 MB | 502 kB | 73/85 kB | 41/291 kB | 40/56 kB
Progress (5): 1.2/2.6 MB | 502 kB | 73/85 kB | 45/291 kB | 40/56 kB
Progress (5): 1.2/2.6 MB | 502 kB | 77/85 kB | 45/291 kB | 40/56 kB
Progress (5): 1.2/2.6 MB | 502 kB | 77/85 kB | 45/291 kB | 44/56 kB
Progress (5): 1.2/2.6 MB | 502 kB | 77/85 kB | 45/291 kB | 44/56 kB
                                                                   
Downloaded from eclipse.maven.central.mirror: https://repo.eclipse.org/content/repositories/maven_central/org/apache/commons/commons-lang3/3.8.1/commons-lang3-3.8.1.jar (502 kB at 876 kB/s)
Downloading from eclipse.maven.central.mirror: https://repo.eclipse.org/content/repositories/maven_central/org/eclipse/sisu/org.eclipse.sisu.plexus/0.3.3/org.eclipse.sisu.plexus-0.3.3.jar
Progress (4): 1.2/2.6 MB | 81/85 kB | 45/291 kB | 44/56 kB
Progress (4): 1.2/2.6 MB | 81/85 kB | 49/291 kB | 44/56 kB
Progress (4): 1.2/2.6 MB | 85/85 kB | 49/291 kB | 44/56 kB
Progress (4): 1.2/2.6 MB | 85/85 kB | 49/291 kB | 44/56 kB
Progress (4): 1.2/2.6 MB | 85/85 kB | 49/291 kB | 48/56 kB
Progress (4): 1.2/2.6 MB | 85/85 kB | 49/291 kB | 48/56 kB
Progress (4): 1.2/2.6 MB | 85/85 kB | 49/291 kB | 52/56 kB
Progress (4): 1.2/2.6 MB | 85/85 kB | 53/291 kB | 52/56 kB
Progress (4): 1.2/2.6 MB | 85 kB | 53/291 kB | 52/56 kB   
Progress (4): 1.2/2.6 MB | 85 kB | 57/291 kB | 52/56 kB
Progress (4): 1.2/2.6 MB | 85 kB | 57/291 kB | 56/56 kB
Progress (4): 1.2/2.6 MB | 85 kB | 57/291 kB | 56/56 kB
Progress (4): 1.2/2.6 MB | 85 kB | 57/291 kB | 56 kB   
Progress (4): 1.2/2.6 MB | 85 kB | 57/291 kB | 56 kB
Progress (4): 1.2/2.6 MB | 85 kB | 61/291 kB | 56 kB
Progress (4): 1.2/2.6 MB | 85 kB | 61/291 kB | 56 kB
Progress (4): 1.2/2.6 MB | 85 kB | 65/291 kB | 56 kB
Progress (4): 1.2/2.6 MB | 85 kB | 65/291 kB | 56 kB
Progress (4): 1.2/2.6 MB | 85 kB | 66/291 kB | 56 kB
Progress (4): 1.2/2.6 MB | 85 kB | 66/291 kB | 56 kB
Progress (4): 1.2/2.6 MB | 85 kB | 70/291 kB | 56 kB
Progress (4): 1.2/2.6 MB | 85 kB | 70/291 kB | 56 kB
Progress (4): 1.2/2.6 MB | 85 kB | 74/291 kB | 56 kB
Progress (4): 1.2/2.6 MB | 85 kB | 74/291 kB | 56 kB
Progress (4): 1.2/2.6 MB | 85 kB | 78/291 kB | 56 kB
Progress (4): 1.2/2.6 MB | 85 kB | 78/291 kB | 56 kB
Progress (4): 1.2/2.6 MB | 85 kB | 82/291 kB | 56 kB
Progress (4): 1.2/2.6 MB | 85 kB | 82/291 kB | 56 kB
Progress (4): 1.2/2.6 MB | 85 kB | 86/291 kB | 56 kB
Progress (4): 1.2/2.6 MB | 85 kB | 86/291 kB | 56 kB
Progress (4): 1.2/2.6 MB | 85 kB | 90/291 kB | 56 kB
Progress (4): 1.2/2.6 MB | 85 kB | 90/291 kB | 56 kB
Progress (4): 1.2/2.6 MB | 85 kB | 94/291 kB | 56 kB
Progress (4): 1.2/2.6 MB | 85 kB | 98/291 kB | 56 kB
Progress (4): 1.2/2.6 MB | 85 kB | 98/291 kB | 56 kB
Progress (4): 1.2/2.6 MB | 85 kB | 98/291 kB | 56 kB
Progress (4): 1.2/2.6 MB | 85 kB | 98/291 kB | 56 kB
Progress (4): 1.2/2.6 MB | 85 kB | 102/291 kB | 56 kB
Progress (4): 1.2/2.6 MB | 85 kB | 106/291 kB | 56 kB
Progress (4): 1.2/2.6 MB | 85 kB | 106/291 kB | 56 kB
Progress (4): 1.2/2.6 MB | 85 kB | 110/291 kB | 56 kB
Progress (4): 1.2/2.6 MB | 85 kB | 110/291 kB | 56 kB
Progress (4): 1.2/2.6 MB | 85 kB | 114/291 kB | 56 kB
Progress (4): 1.3/2.6 MB | 85 kB | 114/291 kB | 56 kB
Progress (4): 1.3/2.6 MB | 85 kB | 118/291 kB | 56 kB
Progress (4): 1.3/2.6 MB | 85 kB | 118/291 kB | 56 kB
Progress (4): 1.3/2.6 MB | 85 kB | 122/291 kB | 56 kB
Progress (4): 1.3/2.6 MB | 85 kB | 122/291 kB | 56 kB
Progress (4): 1.3/2.6 MB | 85 kB | 126/291 kB | 56 kB
Progress (4): 1.3/2.6 MB | 85 kB | 126/291 kB | 56 kB
Progress (4): 1.3/2.6 MB | 85 kB | 130/291 kB | 56 kB
Progress (4): 1.3/2.6 MB | 85 kB | 131/291 kB | 56 kB
Progress (4): 1.3/2.6 MB | 85 kB | 131/291 kB | 56 kB
Progress (4): 1.3/2.6 MB | 85 kB | 135/291 kB | 56 kB
Progress (4): 1.3/2.6 MB | 85 kB | 135/291 kB | 56 kB
Progress (4): 1.3/2.6 MB | 85 kB | 139/291 kB | 56 kB
Progress (4): 1.3/2.6 MB | 85 kB | 139/291 kB | 56 kB
Progress (4): 1.3/2.6 MB | 85 kB | 143/291 kB | 56 kB
                                                     
Downloaded from eclipse.maven.central.mirror: https://repo.eclipse.org/content/repositories/maven_central/org/apache/maven/wagon/wagon-provider-api/3.3.3/wagon-provider-api-3.3.3.jar (56 kB at 96 kB/s)
Progress (3): 1.3/2.6 MB | 85 kB | 147/291 kB
Progress (3): 1.3/2.6 MB | 85 kB | 147/291 kB
Progress (3): 1.3/2.6 MB | 85 kB | 151/291 kB
                                             
Downloading from eclipse.maven.central.mirror: https://repo.eclipse.org/content/repositories/maven_central/io/takari/aether/aether-connector-okhttp/0.17.6/aether-connector-okhttp-0.17.6.jar
Progress (3): 1.3/2.6 MB | 85 kB | 151/291 kB
Progress (3): 1.3/2.6 MB | 85 kB | 155/291 kB
Progress (3): 1.3/2.6 MB | 85 kB | 155/291 kB
Progress (3): 1.3/2.6 MB | 85 kB | 159/291 kB
Progress (3): 1.3/2.6 MB | 85 kB | 163/291 kB
Progress (3): 1.3/2.6 MB | 85 kB | 163/291 kB
                                             
Downloaded from eclipse.maven.central.mirror: https://repo.eclipse.org/content/repositories/maven_central/org/codehaus/plexus/plexus-interpolation/1.25/plexus-interpolation-1.25.jar (85 kB at 146 kB/s)
Downloading from eclipse.maven.central.mirror: https://repo.eclipse.org/content/repositories/maven_central/com/squareup/okhttp3/okhttp/3.14.1/okhttp-3.14.1.jar
Progress (2): 1.3/2.6 MB | 164/291 kB
Progress (3): 1.3/2.6 MB | 164/291 kB | 4.1/205 kB
Progress (3): 1.3/2.6 MB | 164/291 kB | 4.1/205 kB
Progress (3): 1.3/2.6 MB | 164/291 kB | 7.7/205 kB
Progress (3): 1.3/2.6 MB | 168/291 kB | 7.7/205 kB
Progress (3): 1.3/2.6 MB | 168/291 kB | 12/205 kB 
Progress (3): 1.3/2.6 MB | 168/291 kB | 12/205 kB
Progress (3): 1.3/2.6 MB | 168/291 kB | 16/205 kB
Progress (3): 1.3/2.6 MB | 172/291 kB | 16/205 kB
Progress (3): 1.3/2.6 MB | 172/291 kB | 20/205 kB
Progress (3): 1.3/2.6 MB | 172/291 kB | 20/205 kB
Progress (3): 1.3/2.6 MB | 172/291 kB | 24/205 kB
Progress (3): 1.3/2.6 MB | 176/291 kB | 24/205 kB
Progress (3): 1.3/2.6 MB | 176/291 kB | 24/205 kB
Progress (3): 1.3/2.6 MB | 176/291 kB | 28/205 kB
Progress (3): 1.3/2.6 MB | 180/291 kB | 28/205 kB
Progress (3): 1.3/2.6 MB | 180/291 kB | 32/205 kB
Progress (3): 1.3/2.6 MB | 180/291 kB | 32/205 kB
Progress (3): 1.3/2.6 MB | 180/291 kB | 33/205 kB
Progress (3): 1.3/2.6 MB | 184/291 kB | 33/205 kB
Progress (3): 1.3/2.6 MB | 184/291 kB | 33/205 kB
Progress (3): 1.3/2.6 MB | 188/291 kB | 33/205 kB
Progress (3): 1.3/2.6 MB | 188/291 kB | 37/205 kB
Progress (3): 1.3/2.6 MB | 192/291 kB | 37/205 kB
Progress (3): 1.3/2.6 MB | 192/291 kB | 37/205 kB
Progress (3): 1.3/2.6 MB | 196/291 kB | 37/205 kB
Progress (3): 1.3/2.6 MB | 196/291 kB | 41/205 kB
Progress (3): 1.3/2.6 MB | 196/291 kB | 41/205 kB
Progress (3): 1.3/2.6 MB | 197/291 kB | 41/205 kB
Progress (3): 1.3/2.6 MB | 197/291 kB | 41/205 kB
Progress (3): 1.3/2.6 MB | 197/291 kB | 45/205 kB
Progress (3): 1.3/2.6 MB | 201/291 kB | 45/205 kB
Progress (3): 1.3/2.6 MB | 201/291 kB | 49/205 kB
Progress (3): 1.3/2.6 MB | 201/291 kB | 49/205 kB
Progress (3): 1.3/2.6 MB | 205/291 kB | 49/205 kB
Progress (3): 1.3/2.6 MB | 205/291 kB | 49/205 kB
Progress (3): 1.3/2.6 MB | 205/291 kB | 53/205 kB
Progress (3): 1.3/2.6 MB | 209/291 kB | 53/205 kB
Progress (3): 1.3/2.6 MB | 209/291 kB | 57/205 kB
Progress (3): 1.3/2.6 MB | 209/291 kB | 57/205 kB
Progress (3): 1.3/2.6 MB | 209/291 kB | 61/205 kB
Progress (3): 1.3/2.6 MB | 213/291 kB | 61/205 kB
Progress (3): 1.3/2.6 MB | 213/291 kB | 65/205 kB
Progress (3): 1.3/2.6 MB | 217/291 kB | 65/205 kB
Progress (3): 1.3/2.6 MB | 217/291 kB | 65/205 kB
Progress (3): 1.3/2.6 MB | 221/291 kB | 65/205 kB
Progress (3): 1.3/2.6 MB | 221/291 kB | 66/205 kB
Progress (3): 1.3/2.6 MB | 225/291 kB | 66/205 kB
Progress (3): 1.3/2.6 MB | 225/291 kB | 70/205 kB
Progress (3): 1.3/2.6 MB | 225/291 kB | 70/205 kB
Progress (3): 1.3/2.6 MB | 225/291 kB | 74/205 kB
Progress (3): 1.3/2.6 MB | 229/291 kB | 74/205 kB
Progress (3): 1.3/2.6 MB | 229/291 kB | 78/205 kB
Progress (3): 1.4/2.6 MB | 229/291 kB | 78/205 kB
Progress (3): 1.4/2.6 MB | 229/291 kB | 82/205 kB
Progress (3): 1.4/2.6 MB | 229/291 kB | 82/205 kB
Progress (3): 1.4/2.6 MB | 229/291 kB | 82/205 kB
Progress (3): 1.4/2.6 MB | 233/291 kB | 82/205 kB
Progress (3): 1.4/2.6 MB | 233/291 kB | 86/205 kB
Progress (3): 1.4/2.6 MB | 237/291 kB | 86/205 kB
Progress (3): 1.4/2.6 MB | 237/291 kB | 86/205 kB
Progress (3): 1.4/2.6 MB | 241/291 kB | 86/205 kB
Progress (3): 1.4/2.6 MB | 241/291 kB | 90/205 kB
Progress (3): 1.4/2.6 MB | 241/291 kB | 90/205 kB
Progress (3): 1.4/2.6 MB | 245/291 kB | 90/205 kB
Progress (3): 1.4/2.6 MB | 245/291 kB | 90/205 kB
Progress (3): 1.4/2.6 MB | 245/291 kB | 94/205 kB
Progress (3): 1.4/2.6 MB | 249/291 kB | 94/205 kB
Progress (3): 1.4/2.6 MB | 249/291 kB | 94/205 kB
Progress (3): 1.4/2.6 MB | 249/291 kB | 98/205 kB
Progress (3): 1.4/2.6 MB | 249/291 kB | 98/205 kB
Progress (3): 1.4/2.6 MB | 253/291 kB | 98/205 kB
Progress (3): 1.4/2.6 MB | 253/291 kB | 98/205 kB
Progress (3): 1.4/2.6 MB | 257/291 kB | 98/205 kB
Progress (3): 1.4/2.6 MB | 257/291 kB | 98/205 kB
Progress (3): 1.4/2.6 MB | 261/291 kB | 98/205 kB
Progress (3): 1.4/2.6 MB | 261/291 kB | 102/205 kB
Progress (3): 1.4/2.6 MB | 265/291 kB | 102/205 kB
Progress (3): 1.4/2.6 MB | 265/291 kB | 102/205 kB
Progress (3): 1.4/2.6 MB | 269/291 kB | 102/205 kB
Progress (3): 1.4/2.6 MB | 269/291 kB | 106/205 kB
Progress (3): 1.4/2.6 MB | 273/291 kB | 106/205 kB
Progress (3): 1.4/2.6 MB | 273/291 kB | 106/205 kB
Progress (3): 1.4/2.6 MB | 277/291 kB | 106/205 kB
Progress (3): 1.4/2.6 MB | 277/291 kB | 110/205 kB
Progress (3): 1.4/2.6 MB | 281/291 kB | 110/205 kB
Progress (3): 1.4/2.6 MB | 281/291 kB | 110/205 kB
Progress (3): 1.4/2.6 MB | 285/291 kB | 110/205 kB
Progress (3): 1.4/2.6 MB | 285/291 kB | 114/205 kB
Progress (3): 1.4/2.6 MB | 289/291 kB | 114/205 kB
Progress (3): 1.4/2.6 MB | 289/291 kB | 118/205 kB
Progress (3): 1.4/2.6 MB | 289/291 kB | 118/205 kB
Progress (3): 1.4/2.6 MB | 289/291 kB | 122/205 kB
Progress (3): 1.4/2.6 MB | 291 kB | 122/205 kB    
Progress (3): 1.4/2.6 MB | 291 kB | 126/205 kB
Progress (3): 1.4/2.6 MB | 291 kB | 126/205 kB
Progress (3): 1.4/2.6 MB | 291 kB | 130/205 kB
Progress (3): 1.4/2.6 MB | 291 kB | 131/205 kB
Progress (3): 1.4/2.6 MB | 291 kB | 131/205 kB
Progress (3): 1.4/2.6 MB | 291 kB | 135/205 kB
Progress (3): 1.4/2.6 MB | 291 kB | 135/205 kB
Progress (3): 1.4/2.6 MB | 291 kB | 139/205 kB
Progress (3): 1.4/2.6 MB | 291 kB | 139/205 kB
Progress (3): 1.4/2.6 MB | 291 kB | 143/205 kB
Progress (3): 1.4/2.6 MB | 291 kB | 143/205 kB
Progress (4): 1.4/2.6 MB | 291 kB | 143/205 kB | 4.1/51 kB
Progress (4): 1.4/2.6 MB | 291 kB | 147/205 kB | 4.1/51 kB
Progress (4): 1.4/2.6 MB | 291 kB | 147/205 kB | 7.7/51 kB
Progress (4): 1.4/2.6 MB | 291 kB | 147/205 kB | 7.7/51 kB
Progress (4): 1.4/2.6 MB | 291 kB | 151/205 kB | 7.7/51 kB
Progress (4): 1.4/2.6 MB | 291 kB | 151/205 kB | 7.7/51 kB
Progress (4): 1.4/2.6 MB | 291 kB | 151/205 kB | 12/51 kB 
Progress (4): 1.4/2.6 MB | 291 kB | 151/205 kB | 12/51 kB
Progress (4): 1.4/2.6 MB | 291 kB | 155/205 kB | 12/51 kB
Progress (4): 1.4/2.6 MB | 291 kB | 155/205 kB | 12/51 kB
Progress (4): 1.4/2.6 MB | 291 kB | 155/205 kB | 16/51 kB
Progress (4): 1.4/2.6 MB | 291 kB | 159/205 kB | 16/51 kB
Progress (5): 1.4/2.6 MB | 291 kB | 159/205 kB | 16/51 kB | 4.1/426 kB
Progress (5): 1.4/2.6 MB | 291 kB | 159/205 kB | 16/51 kB | 4.1/426 kB
Progress (5): 1.4/2.6 MB | 291 kB | 159/205 kB | 16/51 kB | 7.7/426 kB
Progress (5): 1.4/2.6 MB | 291 kB | 159/205 kB | 20/51 kB | 7.7/426 kB
Progress (5): 1.4/2.6 MB | 291 kB | 163/205 kB | 20/51 kB | 7.7/426 kB
Progress (5): 1.4/2.6 MB | 291 kB | 163/205 kB | 24/51 kB | 7.7/426 kB
Progress (5): 1.4/2.6 MB | 291 kB | 163/205 kB | 24/51 kB | 12/426 kB 
Progress (5): 1.4/2.6 MB | 291 kB | 163/205 kB | 24/51 kB | 12/426 kB
Progress (5): 1.4/2.6 MB | 291 kB | 163/205 kB | 24/51 kB | 16/426 kB
Progress (5): 1.4/2.6 MB | 291 kB | 163/205 kB | 28/51 kB | 16/426 kB
Progress (5): 1.4/2.6 MB | 291 kB | 164/205 kB | 28/51 kB | 16/426 kB
Progress (5): 1.4/2.6 MB | 291 kB | 164/205 kB | 32/51 kB | 16/426 kB
Progress (5): 1.4/2.6 MB | 291 kB | 164/205 kB | 32/51 kB | 20/426 kB
Progress (5): 1.4/2.6 MB | 291 kB | 164/205 kB | 32/51 kB | 20/426 kB
Progress (5): 1.4/2.6 MB | 291 kB | 164/205 kB | 32/51 kB | 24/426 kB
Progress (5): 1.4/2.6 MB | 291 kB | 164/205 kB | 36/51 kB | 24/426 kB
Progress (5): 1.4/2.6 MB | 291 kB | 168/205 kB | 36/51 kB | 24/426 kB
Progress (5): 1.4/2.6 MB | 291 kB | 168/205 kB | 40/51 kB | 24/426 kB
Progress (5): 1.4/2.6 MB | 291 kB | 168/205 kB | 40/51 kB | 28/426 kB
Progress (5): 1.4/2.6 MB | 291 kB | 168/205 kB | 40/51 kB | 28/426 kB
Progress (5): 1.4/2.6 MB | 291 kB | 168/205 kB | 40/51 kB | 32/426 kB
Progress (5): 1.4/2.6 MB | 291 kB | 168/205 kB | 44/51 kB | 32/426 kB
                                                                     
Downloaded from eclipse.maven.central.mirror: https://repo.eclipse.org/content/repositories/maven_central/org/apache/maven/maven-compat/3.6.2/maven-compat-3.6.2.jar (291 kB at 480 kB/s)
Progress (4): 1.4/2.6 MB | 172/205 kB | 44/51 kB | 32/426 kB
                                                            
Downloading from eclipse.maven.central.mirror: https://repo.eclipse.org/content/repositories/maven_central/com/squareup/okio/okio/1.17.3/okio-1.17.3.jar
Progress (4): 1.4/2.6 MB | 172/205 kB | 48/51 kB | 32/426 kB
Progress (4): 1.4/2.6 MB | 172/205 kB | 48/51 kB | 33/426 kB
Progress (4): 1.5/2.6 MB | 172/205 kB | 48/51 kB | 33/426 kB
Progress (4): 1.5/2.6 MB | 172/205 kB | 48/51 kB | 37/426 kB
Progress (4): 1.5/2.6 MB | 172/205 kB | 51 kB | 37/426 kB   
Progress (4): 1.5/2.6 MB | 176/205 kB | 51 kB | 37/426 kB
Progress (4): 1.5/2.6 MB | 176/205 kB | 51 kB | 41/426 kB
Progress (4): 1.5/2.6 MB | 176/205 kB | 51 kB | 41/426 kB
Progress (4): 1.5/2.6 MB | 176/205 kB | 51 kB | 45/426 kB
Progress (4): 1.5/2.6 MB | 180/205 kB | 51 kB | 45/426 kB
Progress (4): 1.5/2.6 MB | 180/205 kB | 51 kB | 45/426 kB
Progress (4): 1.5/2.6 MB | 180/205 kB | 51 kB | 49/426 kB
Progress (4): 1.5/2.6 MB | 180/205 kB | 51 kB | 49/426 kB
Progress (4): 1.5/2.6 MB | 184/205 kB | 51 kB | 49/426 kB
Progress (4): 1.5/2.6 MB | 184/205 kB | 51 kB | 53/426 kB
Progress (4): 1.5/2.6 MB | 188/205 kB | 51 kB | 53/426 kB
Progress (4): 1.5/2.6 MB | 188/205 kB | 51 kB | 53/426 kB
Progress (4): 1.5/2.6 MB | 192/205 kB | 51 kB | 53/426 kB
Progress (4): 1.5/2.6 MB | 192/205 kB | 51 kB | 57/426 kB
Progress (4): 1.5/2.6 MB | 196/205 kB | 51 kB | 57/426 kB
Progress (4): 1.5/2.6 MB | 196/205 kB | 51 kB | 57/426 kB
Progress (4): 1.5/2.6 MB | 200/205 kB | 51 kB | 57/426 kB
Progress (4): 1.5/2.6 MB | 200/205 kB | 51 kB | 61/426 kB
Progress (4): 1.5/2.6 MB | 200/205 kB | 51 kB | 61/426 kB
Progress (4): 1.5/2.6 MB | 204/205 kB | 51 kB | 61/426 kB
Progress (4): 1.5/2.6 MB | 204/205 kB | 51 kB | 61/426 kB
Progress (4): 1.5/2.6 MB | 204/205 kB | 51 kB | 65/426 kB
Progress (4): 1.5/2.6 MB | 205 kB | 51 kB | 65/426 kB    
Progress (4): 1.5/2.6 MB | 205 kB | 51 kB | 65/426 kB
Progress (4): 1.5/2.6 MB | 205 kB | 51 kB | 66/426 kB
Progress (4): 1.5/2.6 MB | 205 kB | 51 kB | 66/426 kB
Progress (4): 1.5/2.6 MB | 205 kB | 51 kB | 70/426 kB
Progress (4): 1.5/2.6 MB | 205 kB | 51 kB | 74/426 kB
Progress (4): 1.5/2.6 MB | 205 kB | 51 kB | 74/426 kB
Progress (4): 1.5/2.6 MB | 205 kB | 51 kB | 78/426 kB
Progress (4): 1.5/2.6 MB | 205 kB | 51 kB | 78/426 kB
Progress (4): 1.5/2.6 MB | 205 kB | 51 kB | 82/426 kB
Progress (4): 1.5/2.6 MB | 205 kB | 51 kB | 82/426 kB
Progress (4): 1.5/2.6 MB | 205 kB | 51 kB | 86/426 kB
Progress (4): 1.5/2.6 MB | 205 kB | 51 kB | 86/426 kB
Progress (4): 1.5/2.6 MB | 205 kB | 51 kB | 86/426 kB
Progress (4): 1.5/2.6 MB | 205 kB | 51 kB | 86/426 kB
Progress (5): 1.5/2.6 MB | 205 kB | 51 kB | 86/426 kB | 4.1/92 kB
Progress (5): 1.5/2.6 MB | 205 kB | 51 kB | 86/426 kB | 7.7/92 kB
Progress (5): 1.5/2.6 MB | 205 kB | 51 kB | 90/426 kB | 7.7/92 kB
Progress (5): 1.5/2.6 MB | 205 kB | 51 kB | 90/426 kB | 12/92 kB 
                                                                
Downloaded from eclipse.maven.central.mirror: https://repo.eclipse.org/content/repositories/maven_central/org/eclipse/sisu/org.eclipse.sisu.plexus/0.3.3/org.eclipse.sisu.plexus-0.3.3.jar (205 kB at 305 kB/s)
Progress (4): 1.5/2.6 MB | 51 kB | 90/426 kB | 12/92 kB
                                                       
Downloaded from eclipse.maven.central.mirror: https://repo.eclipse.org/content/repositories/maven_central/io/takari/aether/aether-connector-okhttp/0.17.6/aether-connector-okhttp-0.17.6.jar (51 kB at 76 kB/s)
Progress (3): 1.5/2.6 MB | 90/426 kB | 12/92 kB
                                               
Downloading from eclipse.maven.central.mirror: https://repo.eclipse.org/content/repositories/maven_central/org/apache/maven/resolver/maven-resolver-impl/1.4.1/maven-resolver-impl-1.4.1.jar
Progress (3): 1.5/2.6 MB | 90/426 kB | 16/92 kB
Progress (3): 1.5/2.6 MB | 94/426 kB | 16/92 kB
Progress (3): 1.5/2.6 MB | 94/426 kB | 16/92 kB
                                               
Downloading from eclipse.maven.central.mirror: https://repo.eclipse.org/content/repositories/maven_central/org/apache/maven/resolver/maven-resolver-connector-basic/1.4.1/maven-resolver-connector-basic-1.4.1.jar
Progress (3): 1.5/2.6 MB | 94/426 kB | 16/92 kB
Progress (3): 1.5/2.6 MB | 98/426 kB | 16/92 kB
Progress (3): 1.5/2.6 MB | 98/426 kB | 20/92 kB
Progress (3): 1.5/2.6 MB | 102/426 kB | 20/92 kB
Progress (3): 1.5/2.6 MB | 102/426 kB | 20/92 kB
Progress (3): 1.5/2.6 MB | 106/426 kB | 20/92 kB
Progress (3): 1.5/2.6 MB | 106/426 kB | 24/92 kB
Progress (3): 1.5/2.6 MB | 106/426 kB | 24/92 kB
Progress (3): 1.5/2.6 MB | 110/426 kB | 24/92 kB
Progress (3): 1.5/2.6 MB | 110/426 kB | 28/92 kB
Progress (3): 1.5/2.6 MB | 110/426 kB | 28/92 kB
Progress (3): 1.5/2.6 MB | 114/426 kB | 28/92 kB
Progress (3): 1.5/2.6 MB | 114/426 kB | 28/92 kB
Progress (3): 1.5/2.6 MB | 118/426 kB | 28/92 kB
Progress (3): 1.5/2.6 MB | 118/426 kB | 32/92 kB
Progress (3): 1.5/2.6 MB | 118/426 kB | 32/92 kB
Progress (3): 1.5/2.6 MB | 122/426 kB | 32/92 kB
Progress (3): 1.6/2.6 MB | 122/426 kB | 32/92 kB
Progress (3): 1.6/2.6 MB | 122/426 kB | 33/92 kB
Progress (3): 1.6/2.6 MB | 126/426 kB | 33/92 kB
Progress (3): 1.6/2.6 MB | 126/426 kB | 33/92 kB
Progress (3): 1.6/2.6 MB | 130/426 kB | 33/92 kB
Progress (3): 1.6/2.6 MB | 130/426 kB | 37/92 kB
Progress (3): 1.6/2.6 MB | 131/426 kB | 37/92 kB
Progress (3): 1.6/2.6 MB | 131/426 kB | 37/92 kB
Progress (3): 1.6/2.6 MB | 131/426 kB | 41/92 kB
Progress (3): 1.6/2.6 MB | 135/426 kB | 41/92 kB
Progress (3): 1.6/2.6 MB | 135/426 kB | 41/92 kB
Progress (3): 1.6/2.6 MB | 139/426 kB | 41/92 kB
Progress (3): 1.6/2.6 MB | 139/426 kB | 45/92 kB
Progress (3): 1.6/2.6 MB | 139/426 kB | 45/92 kB
Progress (3): 1.6/2.6 MB | 139/426 kB | 49/92 kB
Progress (3): 1.6/2.6 MB | 143/426 kB | 49/92 kB
Progress (3): 1.6/2.6 MB | 143/426 kB | 49/92 kB
Progress (3): 1.6/2.6 MB | 147/426 kB | 49/92 kB
Progress (3): 1.6/2.6 MB | 147/426 kB | 53/92 kB
Progress (3): 1.6/2.6 MB | 147/426 kB | 53/92 kB
Progress (3): 1.6/2.6 MB | 147/426 kB | 57/92 kB
Progress (3): 1.6/2.6 MB | 151/426 kB | 57/92 kB
Progress (3): 1.6/2.6 MB | 151/426 kB | 57/92 kB
Progress (3): 1.6/2.6 MB | 155/426 kB | 57/92 kB
Progress (3): 1.6/2.6 MB | 155/426 kB | 61/92 kB
Progress (3): 1.6/2.6 MB | 155/426 kB | 61/92 kB
Progress (3): 1.6/2.6 MB | 155/426 kB | 65/92 kB
Progress (3): 1.6/2.6 MB | 159/426 kB | 65/92 kB
Progress (3): 1.6/2.6 MB | 159/426 kB | 65/92 kB
Progress (3): 1.6/2.6 MB | 163/426 kB | 65/92 kB
Progress (3): 1.6/2.6 MB | 163/426 kB | 69/92 kB
Progress (3): 1.6/2.6 MB | 167/426 kB | 69/92 kB
Progress (3): 1.6/2.6 MB | 167/426 kB | 69/92 kB
Progress (3): 1.6/2.6 MB | 171/426 kB | 69/92 kB
Progress (3): 1.6/2.6 MB | 171/426 kB | 73/92 kB
Progress (3): 1.6/2.6 MB | 171/426 kB | 73/92 kB
Progress (3): 1.6/2.6 MB | 171/426 kB | 77/92 kB
Progress (3): 1.6/2.6 MB | 175/426 kB | 77/92 kB
Progress (3): 1.6/2.6 MB | 175/426 kB | 81/92 kB
Progress (3): 1.6/2.6 MB | 175/426 kB | 81/92 kB
Progress (3): 1.6/2.6 MB | 175/426 kB | 85/92 kB
Progress (3): 1.6/2.6 MB | 179/426 kB | 85/92 kB
Progress (3): 1.6/2.6 MB | 179/426 kB | 85/92 kB
Progress (3): 1.6/2.6 MB | 179/426 kB | 89/92 kB
Progress (3): 1.6/2.6 MB | 179/426 kB | 89/92 kB
Progress (3): 1.6/2.6 MB | 183/426 kB | 89/92 kB
Progress (3): 1.6/2.6 MB | 183/426 kB | 92 kB   
Progress (3): 1.6/2.6 MB | 183/426 kB | 92 kB
Progress (3): 1.6/2.6 MB | 187/426 kB | 92 kB
Progress (3): 1.6/2.6 MB | 187/426 kB | 92 kB
Progress (3): 1.6/2.6 MB | 191/426 kB | 92 kB
Progress (3): 1.6/2.6 MB | 195/426 kB | 92 kB
Progress (3): 1.6/2.6 MB | 195/426 kB | 92 kB
Progress (3): 1.6/2.6 MB | 199/426 kB | 92 kB
Progress (3): 1.6/2.6 MB | 199/426 kB | 92 kB
Progress (3): 1.6/2.6 MB | 203/426 kB | 92 kB
Progress (3): 1.6/2.6 MB | 203/426 kB | 92 kB
Progress (3): 1.6/2.6 MB | 207/426 kB | 92 kB
Progress (3): 1.6/2.6 MB | 207/426 kB | 92 kB
Progress (3): 1.6/2.6 MB | 211/426 kB | 92 kB
Progress (3): 1.6/2.6 MB | 211/426 kB | 92 kB
Progress (3): 1.6/2.6 MB | 215/426 kB | 92 kB
Progress (3): 1.6/2.6 MB | 215/426 kB | 92 kB
Progress (3): 1.6/2.6 MB | 219/426 kB | 92 kB
Progress (3): 1.6/2.6 MB | 219/426 kB | 92 kB
Progress (3): 1.6/2.6 MB | 223/426 kB | 92 kB
Progress (3): 1.6/2.6 MB | 223/426 kB | 92 kB
Progress (3): 1.6/2.6 MB | 227/426 kB | 92 kB
Progress (4): 1.6/2.6 MB | 227/426 kB | 92 kB | 4.1/181 kB
Progress (4): 1.6/2.6 MB | 231/426 kB | 92 kB | 4.1/181 kB
Progress (4): 1.7/2.6 MB | 231/426 kB | 92 kB | 4.1/181 kB
Progress (4): 1.7/2.6 MB | 235/426 kB | 92 kB | 4.1/181 kB
Progress (4): 1.7/2.6 MB | 235/426 kB | 92 kB | 7.7/181 kB
Progress (4): 1.7/2.6 MB | 239/426 kB | 92 kB | 7.7/181 kB
Progress (4): 1.7/2.6 MB | 239/426 kB | 92 kB | 7.7/181 kB
Progress (4): 1.7/2.6 MB | 239/426 kB | 92 kB | 12/181 kB 
Progress (4): 1.7/2.6 MB | 243/426 kB | 92 kB | 12/181 kB
Progress (4): 1.7/2.6 MB | 243/426 kB | 92 kB | 16/181 kB
Progress (4): 1.7/2.6 MB | 243/426 kB | 92 kB | 16/181 kB
Progress (4): 1.7/2.6 MB | 247/426 kB | 92 kB | 16/181 kB
Progress (4): 1.7/2.6 MB | 247/426 kB | 92 kB | 16/181 kB
Progress (4): 1.7/2.6 MB | 247/426 kB | 92 kB | 20/181 kB
Progress (4): 1.7/2.6 MB | 251/426 kB | 92 kB | 20/181 kB
Progress (4): 1.7/2.6 MB | 251/426 kB | 92 kB | 24/181 kB
Progress (4): 1.7/2.6 MB | 251/426 kB | 92 kB | 24/181 kB
Progress (4): 1.7/2.6 MB | 255/426 kB | 92 kB | 24/181 kB
Progress (4): 1.7/2.6 MB | 255/426 kB | 92 kB | 24/181 kB
Progress (4): 1.7/2.6 MB | 255/426 kB | 92 kB | 28/181 kB
Progress (4): 1.7/2.6 MB | 259/426 kB | 92 kB | 28/181 kB
Progress (4): 1.7/2.6 MB | 259/426 kB | 92 kB | 28/181 kB
Progress (4): 1.7/2.6 MB | 259/426 kB | 92 kB | 32/181 kB
Progress (4): 1.7/2.6 MB | 259/426 kB | 92 kB | 32/181 kB
Progress (4): 1.7/2.6 MB | 263/426 kB | 92 kB | 32/181 kB
Progress (4): 1.7/2.6 MB | 263/426 kB | 92 kB | 36/181 kB
Progress (4): 1.7/2.6 MB | 267/426 kB | 92 kB | 36/181 kB
Progress (4): 1.7/2.6 MB | 267/426 kB | 92 kB | 36/181 kB
Progress (4): 1.7/2.6 MB | 271/426 kB | 92 kB | 36/181 kB
Progress (4): 1.7/2.6 MB | 271/426 kB | 92 kB | 40/181 kB
Progress (4): 1.7/2.6 MB | 275/426 kB | 92 kB | 40/181 kB
Progress (4): 1.7/2.6 MB | 275/426 kB | 92 kB | 40/181 kB
Progress (4): 1.7/2.6 MB | 279/426 kB | 92 kB | 40/181 kB
Progress (4): 1.7/2.6 MB | 279/426 kB | 92 kB | 44/181 kB
Progress (4): 1.7/2.6 MB | 279/426 kB | 92 kB | 44/181 kB
Progress (4): 1.7/2.6 MB | 283/426 kB | 92 kB | 44/181 kB
Progress (4): 1.7/2.6 MB | 283/426 kB | 92 kB | 44/181 kB
Progress (4): 1.7/2.6 MB | 283/426 kB | 92 kB | 48/181 kB
Progress (4): 1.7/2.6 MB | 287/426 kB | 92 kB | 48/181 kB
Progress (4): 1.7/2.6 MB | 287/426 kB | 92 kB | 48/181 kB
Progress (4): 1.7/2.6 MB | 291/426 kB | 92 kB | 48/181 kB
Progress (4): 1.7/2.6 MB | 291/426 kB | 92 kB | 52/181 kB
Progress (4): 1.7/2.6 MB | 295/426 kB | 92 kB | 52/181 kB
Progress (4): 1.7/2.6 MB | 295/426 kB | 92 kB | 52/181 kB
Progress (4): 1.7/2.6 MB | 299/426 kB | 92 kB | 52/181 kB
Progress (4): 1.7/2.6 MB | 299/426 kB | 92 kB | 56/181 kB
Progress (4): 1.7/2.6 MB | 303/426 kB | 92 kB | 56/181 kB
Progress (4): 1.7/2.6 MB | 303/426 kB | 92 kB | 56/181 kB
Progress (4): 1.7/2.6 MB | 307/426 kB | 92 kB | 56/181 kB
Progress (5): 1.7/2.6 MB | 307/426 kB | 92 kB | 56/181 kB | 4.1/44 kB
Progress (5): 1.7/2.6 MB | 307/426 kB | 92 kB | 60/181 kB | 4.1/44 kB
Progress (5): 1.7/2.6 MB | 307/426 kB | 92 kB | 60/181 kB | 7.7/44 kB
Progress (5): 1.7/2.6 MB | 311/426 kB | 92 kB | 60/181 kB | 7.7/44 kB
Progress (5): 1.7/2.6 MB | 311/426 kB | 92 kB | 60/181 kB | 7.7/44 kB
Progress (5): 1.7/2.6 MB | 311/426 kB | 92 kB | 60/181 kB | 12/44 kB 
Progress (5): 1.7/2.6 MB | 315/426 kB | 92 kB | 60/181 kB | 12/44 kB
Progress (5): 1.7/2.6 MB | 315/426 kB | 92 kB | 64/181 kB | 12/44 kB
                                                                    
Downloaded from eclipse.maven.central.mirror: https://repo.eclipse.org/content/repositories/maven_central/com/squareup/okio/okio/1.17.3/okio-1.17.3.jar (92 kB at 132 kB/s)
Progress (4): 1.7/2.6 MB | 315/426 kB | 68/181 kB | 12/44 kB
Progress (4): 1.7/2.6 MB | 319/426 kB | 68/181 kB | 12/44 kB
Progress (4): 1.7/2.6 MB | 319/426 kB | 68/181 kB | 16/44 kB
Progress (4): 1.7/2.6 MB | 319/426 kB | 68/181 kB | 16/44 kB
Progress (4): 1.7/2.6 MB | 319/426 kB | 68/181 kB | 20/44 kB
Progress (4): 1.7/2.6 MB | 323/426 kB | 68/181 kB | 20/44 kB
Progress (4): 1.7/2.6 MB | 323/426 kB | 72/181 kB | 20/44 kB
                                                            
Downloading from eclipse.maven.central.mirror: https://repo.eclipse.org/content/repositories/maven_central/org/apache/maven/resolver/maven-resolver-transport-wagon/1.4.1/maven-resolver-transport-wagon-1.4.1.jar
Progress (4): 1.7/2.6 MB | 323/426 kB | 76/181 kB | 20/44 kB
Progress (4): 1.7/2.6 MB | 327/426 kB | 76/181 kB | 20/44 kB
Progress (4): 1.7/2.6 MB | 327/426 kB | 76/181 kB | 24/44 kB
Progress (4): 1.7/2.6 MB | 327/426 kB | 76/181 kB | 24/44 kB
Progress (4): 1.7/2.6 MB | 327/426 kB | 76/181 kB | 28/44 kB
Progress (4): 1.7/2.6 MB | 331/426 kB | 76/181 kB | 28/44 kB
Progress (4): 1.7/2.6 MB | 331/426 kB | 80/181 kB | 28/44 kB
Progress (4): 1.7/2.6 MB | 335/426 kB | 80/181 kB | 28/44 kB
Progress (4): 1.7/2.6 MB | 335/426 kB | 84/181 kB | 28/44 kB
Progress (4): 1.7/2.6 MB | 335/426 kB | 84/181 kB | 32/44 kB
Progress (4): 1.7/2.6 MB | 335/426 kB | 84/181 kB | 32/44 kB
Progress (4): 1.7/2.6 MB | 335/426 kB | 84/181 kB | 36/44 kB
Progress (4): 1.7/2.6 MB | 335/426 kB | 88/181 kB | 36/44 kB
Progress (4): 1.7/2.6 MB | 339/426 kB | 88/181 kB | 36/44 kB
Progress (4): 1.7/2.6 MB | 339/426 kB | 92/181 kB | 36/44 kB
Progress (4): 1.7/2.6 MB | 339/426 kB | 92/181 kB | 40/44 kB
Progress (4): 1.7/2.6 MB | 339/426 kB | 92/181 kB | 40/44 kB
Progress (4): 1.7/2.6 MB | 339/426 kB | 92/181 kB | 44/44 kB
Progress (4): 1.7/2.6 MB | 339/426 kB | 96/181 kB | 44/44 kB
Progress (4): 1.7/2.6 MB | 343/426 kB | 96/181 kB | 44/44 kB
Progress (4): 1.7/2.6 MB | 343/426 kB | 96/181 kB | 44/44 kB
Progress (4): 1.7/2.6 MB | 343/426 kB | 96/181 kB | 44 kB   
Progress (4): 1.7/2.6 MB | 343/426 kB | 96/181 kB | 44 kB
Progress (4): 1.7/2.6 MB | 347/426 kB | 96/181 kB | 44 kB
Progress (4): 1.7/2.6 MB | 347/426 kB | 100/181 kB | 44 kB
Progress (4): 1.7/2.6 MB | 347/426 kB | 100/181 kB | 44 kB
Progress (4): 1.7/2.6 MB | 347/426 kB | 104/181 kB | 44 kB
Progress (4): 1.7/2.6 MB | 351/426 kB | 104/181 kB | 44 kB
Progress (4): 1.7/2.6 MB | 351/426 kB | 108/181 kB | 44 kB
Progress (4): 1.7/2.6 MB | 351/426 kB | 108/181 kB | 44 kB
Progress (4): 1.7/2.6 MB | 351/426 kB | 112/181 kB | 44 kB
Progress (4): 1.7/2.6 MB | 355/426 kB | 112/181 kB | 44 kB
Progress (4): 1.7/2.6 MB | 355/426 kB | 116/181 kB | 44 kB
Progress (4): 1.7/2.6 MB | 359/426 kB | 116/181 kB | 44 kB
Progress (4): 1.7/2.6 MB | 359/426 kB | 116/181 kB | 44 kB
Progress (4): 1.7/2.6 MB | 363/426 kB | 116/181 kB | 44 kB
Progress (4): 1.7/2.6 MB | 363/426 kB | 120/181 kB | 44 kB
Progress (4): 1.7/2.6 MB | 367/426 kB | 120/181 kB | 44 kB
Progress (4): 1.8/2.6 MB | 367/426 kB | 120/181 kB | 44 kB
Progress (4): 1.8/2.6 MB | 371/426 kB | 120/181 kB | 44 kB
Progress (4): 1.8/2.6 MB | 371/426 kB | 124/181 kB | 44 kB
Progress (4): 1.8/2.6 MB | 375/426 kB | 124/181 kB | 44 kB
Progress (4): 1.8/2.6 MB | 375/426 kB | 124/181 kB | 44 kB
Progress (4): 1.8/2.6 MB | 379/426 kB | 124/181 kB | 44 kB
Progress (4): 1.8/2.6 MB | 379/426 kB | 128/181 kB | 44 kB
Progress (4): 1.8/2.6 MB | 383/426 kB | 128/181 kB | 44 kB
Progress (4): 1.8/2.6 MB | 383/426 kB | 128/181 kB | 44 kB
Progress (4): 1.8/2.6 MB | 387/426 kB | 128/181 kB | 44 kB
Progress (4): 1.8/2.6 MB | 387/426 kB | 132/181 kB | 44 kB
Progress (4): 1.8/2.6 MB | 391/426 kB | 132/181 kB | 44 kB
Progress (4): 1.8/2.6 MB | 391/426 kB | 132/181 kB | 44 kB
Progress (4): 1.8/2.6 MB | 395/426 kB | 132/181 kB | 44 kB
Progress (4): 1.8/2.6 MB | 395/426 kB | 136/181 kB | 44 kB
Progress (4): 1.8/2.6 MB | 395/426 kB | 136/181 kB | 44 kB
Progress (4): 1.8/2.6 MB | 395/426 kB | 140/181 kB | 44 kB
Progress (4): 1.8/2.6 MB | 399/426 kB | 140/181 kB | 44 kB
Progress (4): 1.8/2.6 MB | 399/426 kB | 140/181 kB | 44 kB
Progress (4): 1.8/2.6 MB | 399/426 kB | 144/181 kB | 44 kB
Progress (4): 1.8/2.6 MB | 399/426 kB | 144/181 kB | 44 kB
Progress (4): 1.8/2.6 MB | 403/426 kB | 144/181 kB | 44 kB
Progress (4): 1.8/2.6 MB | 403/426 kB | 148/181 kB | 44 kB
Progress (4): 1.8/2.6 MB | 407/426 kB | 148/181 kB | 44 kB
Progress (4): 1.8/2.6 MB | 407/426 kB | 148/181 kB | 44 kB
Progress (4): 1.8/2.6 MB | 411/426 kB | 148/181 kB | 44 kB
Progress (4): 1.8/2.6 MB | 411/426 kB | 152/181 kB | 44 kB
Progress (4): 1.8/2.6 MB | 415/426 kB | 152/181 kB | 44 kB
Progress (4): 1.8/2.6 MB | 415/426 kB | 152/181 kB | 44 kB
Progress (5): 1.8/2.6 MB | 415/426 kB | 152/181 kB | 44 kB | 4.1/31 kB
                                                                      
Downloaded from eclipse.maven.central.mirror: https://repo.eclipse.org/content/repositories/maven_central/org/apache/maven/resolver/maven-resolver-connector-basic/1.4.1/maven-resolver-connector-basic-1.4.1.jar (44 kB at 57 kB/s)
Downloading from eclipse.maven.central.mirror: https://repo.eclipse.org/content/repositories/maven_central/org/apache/maven/wagon/wagon-file/3.3.3/wagon-file-3.3.3.jar
Progress (4): 1.8/2.6 MB | 419/426 kB | 152/181 kB | 4.1/31 kB
Progress (4): 1.8/2.6 MB | 419/426 kB | 156/181 kB | 4.1/31 kB
Progress (4): 1.8/2.6 MB | 423/426 kB | 156/181 kB | 4.1/31 kB
Progress (4): 1.8/2.6 MB | 423/426 kB | 156/181 kB | 7.7/31 kB
Progress (4): 1.8/2.6 MB | 423/426 kB | 156/181 kB | 7.7/31 kB
Progress (4): 1.8/2.6 MB | 423/426 kB | 156/181 kB | 12/31 kB 
Progress (4): 1.8/2.6 MB | 426 kB | 156/181 kB | 12/31 kB    
Progress (4): 1.8/2.6 MB | 426 kB | 160/181 kB | 12/31 kB
Progress (4): 1.8/2.6 MB | 426 kB | 160/181 kB | 16/31 kB
Progress (4): 1.8/2.6 MB | 426 kB | 160/181 kB | 16/31 kB
Progress (4): 1.8/2.6 MB | 426 kB | 160/181 kB | 20/31 kB
Progress (4): 1.8/2.6 MB | 426 kB | 164/181 kB | 20/31 kB
Progress (4): 1.8/2.6 MB | 426 kB | 164/181 kB | 24/31 kB
Progress (4): 1.8/2.6 MB | 426 kB | 164/181 kB | 24/31 kB
Progress (4): 1.8/2.6 MB | 426 kB | 164/181 kB | 28/31 kB
Progress (4): 1.8/2.6 MB | 426 kB | 168/181 kB | 28/31 kB
Progress (4): 1.8/2.6 MB | 426 kB | 168/181 kB | 31 kB   
Progress (4): 1.8/2.6 MB | 426 kB | 168/181 kB | 31 kB
Progress (4): 1.8/2.6 MB | 426 kB | 172/181 kB | 31 kB
Progress (4): 1.8/2.6 MB | 426 kB | 176/181 kB | 31 kB
Progress (4): 1.8/2.6 MB | 426 kB | 176/181 kB | 31 kB
Progress (4): 1.8/2.6 MB | 426 kB | 180/181 kB | 31 kB
Progress (4): 1.8/2.6 MB | 426 kB | 180/181 kB | 31 kB
Progress (4): 1.8/2.6 MB | 426 kB | 181 kB | 31 kB    
Progress (4): 1.8/2.6 MB | 426 kB | 181 kB | 31 kB
Progress (4): 1.8/2.6 MB | 426 kB | 181 kB | 31 kB
Progress (4): 1.8/2.6 MB | 426 kB | 181 kB | 31 kB
Progress (4): 1.8/2.6 MB | 426 kB | 181 kB | 31 kB
Progress (4): 1.8/2.6 MB | 426 kB | 181 kB | 31 kB
Progress (4): 1.8/2.6 MB | 426 kB | 181 kB | 31 kB
Progress (4): 1.8/2.6 MB | 426 kB | 181 kB | 31 kB
Progress (4): 1.8/2.6 MB | 426 kB | 181 kB | 31 kB
Progress (4): 1.8/2.6 MB | 426 kB | 181 kB | 31 kB
Progress (4): 1.8/2.6 MB | 426 kB | 181 kB | 31 kB
Progress (4): 1.9/2.6 MB | 426 kB | 181 kB | 31 kB
Progress (4): 1.9/2.6 MB | 426 kB | 181 kB | 31 kB
Progress (4): 1.9/2.6 MB | 426 kB | 181 kB | 31 kB
Progress (4): 1.9/2.6 MB | 426 kB | 181 kB | 31 kB
Progress (4): 1.9/2.6 MB | 426 kB | 181 kB | 31 kB
Progress (4): 1.9/2.6 MB | 426 kB | 181 kB | 31 kB
Progress (4): 1.9/2.6 MB | 426 kB | 181 kB | 31 kB
Progress (4): 1.9/2.6 MB | 426 kB | 181 kB | 31 kB
Progress (4): 1.9/2.6 MB | 426 kB | 181 kB | 31 kB
Progress (4): 1.9/2.6 MB | 426 kB | 181 kB | 31 kB
Progress (4): 1.9/2.6 MB | 426 kB | 181 kB | 31 kB
Progress (4): 1.9/2.6 MB | 426 kB | 181 kB | 31 kB
Progress (4): 1.9/2.6 MB | 426 kB | 181 kB | 31 kB
Progress (4): 1.9/2.6 MB | 426 kB | 181 kB | 31 kB
Progress (4): 1.9/2.6 MB | 426 kB | 181 kB | 31 kB
Progress (4): 1.9/2.6 MB | 426 kB | 181 kB | 31 kB
Progress (4): 1.9/2.6 MB | 426 kB | 181 kB | 31 kB
Progress (4): 1.9/2.6 MB | 426 kB | 181 kB | 31 kB
Progress (4): 1.9/2.6 MB | 426 kB | 181 kB | 31 kB
Progress (4): 1.9/2.6 MB | 426 kB | 181 kB | 31 kB
Progress (4): 1.9/2.6 MB | 426 kB | 181 kB | 31 kB
Progress (4): 1.9/2.6 MB | 426 kB | 181 kB | 31 kB
                                                  
Downloaded from eclipse.maven.central.mirror: https://repo.eclipse.org/content/repositories/maven_central/org/apache/maven/resolver/maven-resolver-impl/1.4.1/maven-resolver-impl-1.4.1.jar (181 kB at 230 kB/s)
Progress (3): 1.9/2.6 MB | 426 kB | 31 kB
                                         
Downloading from eclipse.maven.central.mirror: https://repo.eclipse.org/content/repositories/maven_central/org/fusesource/jansi/jansi/1.17.1/jansi-1.17.1.jar
Progress (3): 1.9/2.6 MB | 426 kB | 31 kB
                                         
Downloaded from eclipse.maven.central.mirror: https://repo.eclipse.org/content/repositories/maven_central/com/squareup/okhttp3/okhttp/3.14.1/okhttp-3.14.1.jar (426 kB at 542 kB/s)
Progress (2): 1.9/2.6 MB | 31 kB
Progress (2): 2.0/2.6 MB | 31 kB
                                
Downloaded from eclipse.maven.central.mirror: https://repo.eclipse.org/content/repositories/maven_central/org/apache/maven/resolver/maven-resolver-transport-wagon/1.4.1/maven-resolver-transport-wagon-1.4.1.jar (31 kB at 39 kB/s)
Progress (1): 2.0/2.6 MB
Progress (1): 2.0/2.6 MB
Progress (1): 2.0/2.6 MB
Progress (1): 2.0/2.6 MB
Progress (1): 2.0/2.6 MB
Progress (1): 2.0/2.6 MB
Progress (1): 2.0/2.6 MB
Progress (1): 2.0/2.6 MB
Progress (1): 2.0/2.6 MB
Progress (1): 2.0/2.6 MB
Progress (1): 2.0/2.6 MB
Progress (1): 2.0/2.6 MB
Progress (1): 2.0/2.6 MB
Progress (1): 2.0/2.6 MB
Progress (1): 2.0/2.6 MB
Progress (1): 2.0/2.6 MB
Progress (1): 2.0/2.6 MB
Progress (1): 2.0/2.6 MB
Progress (1): 2.0/2.6 MB
Progress (2): 2.0/2.6 MB | 4.1/12 kB
Progress (2): 2.0/2.6 MB | 4.1/12 kB
Progress (2): 2.0/2.6 MB | 7.7/12 kB
Progress (2): 2.0/2.6 MB | 7.7/12 kB
Progress (2): 2.0/2.6 MB | 12 kB    
Progress (2): 2.0/2.6 MB | 12 kB
Progress (2): 2.0/2.6 MB | 12 kB
Progress (2): 2.0/2.6 MB | 12 kB
Progress (2): 2.1/2.6 MB | 12 kB
Progress (2): 2.1/2.6 MB | 12 kB
Progress (2): 2.1/2.6 MB | 12 kB
Progress (2): 2.1/2.6 MB | 12 kB
Progress (2): 2.1/2.6 MB | 12 kB
Progress (2): 2.1/2.6 MB | 12 kB
Progress (2): 2.1/2.6 MB | 12 kB
Progress (2): 2.1/2.6 MB | 12 kB
Progress (2): 2.1/2.6 MB | 12 kB
Progress (2): 2.1/2.6 MB | 12 kB
Progress (2): 2.1/2.6 MB | 12 kB
Progress (2): 2.1/2.6 MB | 12 kB
Progress (2): 2.1/2.6 MB | 12 kB
Progress (2): 2.1/2.6 MB | 12 kB
Progress (2): 2.1/2.6 MB | 12 kB
Progress (2): 2.1/2.6 MB | 12 kB
Progress (2): 2.1/2.6 MB | 12 kB
Progress (2): 2.1/2.6 MB | 12 kB
Progress (2): 2.1/2.6 MB | 12 kB
Progress (2): 2.1/2.6 MB | 12 kB
Progress (2): 2.1/2.6 MB | 12 kB
Progress (3): 2.1/2.6 MB | 12 kB | 4.1/284 kB
Progress (3): 2.1/2.6 MB | 12 kB | 4.1/284 kB
Progress (3): 2.1/2.6 MB | 12 kB | 7.7/284 kB
Progress (3): 2.1/2.6 MB | 12 kB | 7.7/284 kB
Progress (3): 2.1/2.6 MB | 12 kB | 12/284 kB 
Progress (3): 2.1/2.6 MB | 12 kB | 12/284 kB
Progress (3): 2.1/2.6 MB | 12 kB | 16/284 kB
Progress (3): 2.1/2.6 MB | 12 kB | 16/284 kB
Progress (3): 2.1/2.6 MB | 12 kB | 20/284 kB
Progress (3): 2.2/2.6 MB | 12 kB | 20/284 kB
                                            
Downloaded from eclipse.maven.central.mirror: https://repo.eclipse.org/content/repositories/maven_central/org/apache/maven/wagon/wagon-file/3.3.3/wagon-file-3.3.3.jar (12 kB at 14 kB/s)
Progress (2): 2.2/2.6 MB | 24/284 kB
Progress (2): 2.2/2.6 MB | 24/284 kB
Progress (2): 2.2/2.6 MB | 28/284 kB
Progress (2): 2.2/2.6 MB | 28/284 kB
Progress (2): 2.2/2.6 MB | 32/284 kB
Progress (2): 2.2/2.6 MB | 33/284 kB
Progress (2): 2.2/2.6 MB | 33/284 kB
Progress (2): 2.2/2.6 MB | 37/284 kB
Progress (2): 2.2/2.6 MB | 37/284 kB
Progress (2): 2.2/2.6 MB | 41/284 kB
Progress (2): 2.2/2.6 MB | 41/284 kB
Progress (2): 2.2/2.6 MB | 45/284 kB
Progress (2): 2.2/2.6 MB | 45/284 kB
Progress (2): 2.2/2.6 MB | 49/284 kB
Progress (2): 2.2/2.6 MB | 49/284 kB
Progress (2): 2.2/2.6 MB | 53/284 kB
Progress (2): 2.2/2.6 MB | 53/284 kB
Progress (2): 2.2/2.6 MB | 57/284 kB
Progress (2): 2.2/2.6 MB | 57/284 kB
Progress (2): 2.2/2.6 MB | 61/284 kB
Progress (2): 2.2/2.6 MB | 61/284 kB
Progress (2): 2.2/2.6 MB | 65/284 kB
Progress (2): 2.2/2.6 MB | 66/284 kB
Progress (2): 2.2/2.6 MB | 66/284 kB
Progress (2): 2.2/2.6 MB | 70/284 kB
Progress (2): 2.2/2.6 MB | 70/284 kB
Progress (2): 2.2/2.6 MB | 74/284 kB
Progress (2): 2.2/2.6 MB | 74/284 kB
Progress (2): 2.2/2.6 MB | 78/284 kB
Progress (2): 2.2/2.6 MB | 78/284 kB
Progress (2): 2.2/2.6 MB | 82/284 kB
Progress (2): 2.2/2.6 MB | 82/284 kB
Progress (2): 2.2/2.6 MB | 86/284 kB
Progress (2): 2.2/2.6 MB | 86/284 kB
Progress (2): 2.2/2.6 MB | 90/284 kB
Progress (2): 2.2/2.6 MB | 90/284 kB
Progress (2): 2.2/2.6 MB | 94/284 kB
Progress (2): 2.2/2.6 MB | 94/284 kB
Progress (2): 2.2/2.6 MB | 98/284 kB
Progress (2): 2.2/2.6 MB | 98/284 kB
Progress (2): 2.2/2.6 MB | 98/284 kB
Progress (2): 2.2/2.6 MB | 102/284 kB
Progress (2): 2.2/2.6 MB | 102/284 kB
Progress (2): 2.2/2.6 MB | 106/284 kB
Progress (2): 2.2/2.6 MB | 106/284 kB
Progress (2): 2.2/2.6 MB | 110/284 kB
Progress (2): 2.2/2.6 MB | 110/284 kB
Progress (2): 2.2/2.6 MB | 114/284 kB
Progress (2): 2.2/2.6 MB | 114/284 kB
Progress (2): 2.2/2.6 MB | 118/284 kB
Progress (2): 2.2/2.6 MB | 118/284 kB
Progress (2): 2.2/2.6 MB | 122/284 kB
Progress (2): 2.3/2.6 MB | 122/284 kB
Progress (2): 2.3/2.6 MB | 126/284 kB
Progress (2): 2.3/2.6 MB | 126/284 kB
Progress (2): 2.3/2.6 MB | 130/284 kB
Progress (2): 2.3/2.6 MB | 131/284 kB
Progress (2): 2.3/2.6 MB | 131/284 kB
Progress (2): 2.3/2.6 MB | 135/284 kB
Progress (2): 2.3/2.6 MB | 135/284 kB
Progress (2): 2.3/2.6 MB | 139/284 kB
Progress (2): 2.3/2.6 MB | 139/284 kB
Progress (2): 2.3/2.6 MB | 143/284 kB
Progress (2): 2.3/2.6 MB | 143/284 kB
Progress (2): 2.3/2.6 MB | 147/284 kB
Progress (2): 2.3/2.6 MB | 147/284 kB
Progress (2): 2.3/2.6 MB | 151/284 kB
Progress (2): 2.3/2.6 MB | 151/284 kB
Progress (2): 2.3/2.6 MB | 155/284 kB
Progress (2): 2.3/2.6 MB | 155/284 kB
Progress (2): 2.3/2.6 MB | 159/284 kB
Progress (2): 2.3/2.6 MB | 159/284 kB
Progress (2): 2.3/2.6 MB | 163/284 kB
Progress (2): 2.3/2.6 MB | 164/284 kB
Progress (2): 2.3/2.6 MB | 164/284 kB
Progress (2): 2.3/2.6 MB | 168/284 kB
Progress (2): 2.3/2.6 MB | 168/284 kB
Progress (2): 2.3/2.6 MB | 172/284 kB
Progress (2): 2.3/2.6 MB | 172/284 kB
Progress (2): 2.3/2.6 MB | 176/284 kB
Progress (2): 2.3/2.6 MB | 176/284 kB
Progress (2): 2.3/2.6 MB | 180/284 kB
Progress (2): 2.3/2.6 MB | 180/284 kB
Progress (2): 2.3/2.6 MB | 184/284 kB
Progress (2): 2.3/2.6 MB | 184/284 kB
Progress (2): 2.3/2.6 MB | 188/284 kB
Progress (2): 2.3/2.6 MB | 188/284 kB
Progress (2): 2.3/2.6 MB | 192/284 kB
Progress (2): 2.3/2.6 MB | 192/284 kB
Progress (2): 2.3/2.6 MB | 196/284 kB
Progress (2): 2.3/2.6 MB | 197/284 kB
Progress (2): 2.3/2.6 MB | 197/284 kB
Progress (2): 2.3/2.6 MB | 201/284 kB
Progress (2): 2.3/2.6 MB | 201/284 kB
Progress (2): 2.3/2.6 MB | 205/284 kB
Progress (2): 2.3/2.6 MB | 205/284 kB
Progress (2): 2.3/2.6 MB | 209/284 kB
Progress (2): 2.3/2.6 MB | 209/284 kB
Progress (2): 2.3/2.6 MB | 213/284 kB
Progress (2): 2.3/2.6 MB | 213/284 kB
Progress (2): 2.3/2.6 MB | 217/284 kB
Progress (2): 2.3/2.6 MB | 217/284 kB
Progress (2): 2.3/2.6 MB | 221/284 kB
Progress (2): 2.3/2.6 MB | 221/284 kB
Progress (2): 2.3/2.6 MB | 225/284 kB
Progress (2): 2.4/2.6 MB | 225/284 kB
Progress (2): 2.4/2.6 MB | 229/284 kB
Progress (2): 2.4/2.6 MB | 229/284 kB
Progress (2): 2.4/2.6 MB | 229/284 kB
Progress (2): 2.4/2.6 MB | 233/284 kB
Progress (2): 2.4/2.6 MB | 233/284 kB
Progress (2): 2.4/2.6 MB | 237/284 kB
Progress (2): 2.4/2.6 MB | 237/284 kB
Progress (2): 2.4/2.6 MB | 241/284 kB
Progress (2): 2.4/2.6 MB | 241/284 kB
Progress (2): 2.4/2.6 MB | 245/284 kB
Progress (2): 2.4/2.6 MB | 245/284 kB
Progress (2): 2.4/2.6 MB | 249/284 kB
Progress (2): 2.4/2.6 MB | 249/284 kB
Progress (2): 2.4/2.6 MB | 253/284 kB
Progress (2): 2.4/2.6 MB | 253/284 kB
Progress (2): 2.4/2.6 MB | 257/284 kB
Progress (2): 2.4/2.6 MB | 257/284 kB
Progress (2): 2.4/2.6 MB | 261/284 kB
Progress (2): 2.4/2.6 MB | 261/284 kB
Progress (2): 2.4/2.6 MB | 265/284 kB
Progress (2): 2.4/2.6 MB | 265/284 kB
Progress (2): 2.4/2.6 MB | 269/284 kB
Progress (2): 2.4/2.6 MB | 269/284 kB
Progress (2): 2.4/2.6 MB | 273/284 kB
Progress (2): 2.4/2.6 MB | 273/284 kB
Progress (2): 2.4/2.6 MB | 277/284 kB
Progress (2): 2.4/2.6 MB | 277/284 kB
Progress (2): 2.4/2.6 MB | 281/284 kB
Progress (2): 2.4/2.6 MB | 284 kB    
                                 
Downloaded from eclipse.maven.central.mirror: https://repo.eclipse.org/content/repositories/maven_central/org/fusesource/jansi/jansi/1.17.1/jansi-1.17.1.jar (284 kB at 346 kB/s)
Progress (1): 2.4/2.6 MB
Progress (1): 2.4/2.6 MB
Progress (1): 2.4/2.6 MB
Progress (1): 2.4/2.6 MB
Progress (1): 2.4/2.6 MB
Progress (1): 2.4/2.6 MB
Progress (1): 2.4/2.6 MB
Progress (1): 2.4/2.6 MB
Progress (1): 2.4/2.6 MB
Progress (1): 2.4/2.6 MB
Progress (1): 2.4/2.6 MB
Progress (1): 2.5/2.6 MB
Progress (1): 2.5/2.6 MB
Progress (1): 2.5/2.6 MB
Progress (1): 2.5/2.6 MB
Progress (1): 2.5/2.6 MB
Progress (1): 2.5/2.6 MB
Progress (1): 2.5/2.6 MB
Progress (1): 2.5/2.6 MB
Progress (1): 2.5/2.6 MB
Progress (1): 2.5/2.6 MB
Progress (1): 2.5/2.6 MB
Progress (1): 2.5/2.6 MB
Progress (1): 2.5/2.6 MB
Progress (1): 2.5/2.6 MB
Progress (1): 2.5/2.6 MB
Progress (1): 2.5/2.6 MB
Progress (1): 2.5/2.6 MB
Progress (1): 2.5/2.6 MB
Progress (1): 2.5/2.6 MB
Progress (1): 2.5/2.6 MB
Progress (1): 2.5/2.6 MB
Progress (1): 2.5/2.6 MB
Progress (1): 2.5/2.6 MB
Progress (1): 2.5/2.6 MB
Progress (1): 2.5/2.6 MB
Progress (1): 2.6/2.6 MB
Progress (1): 2.6/2.6 MB
Progress (1): 2.6/2.6 MB
Progress (1): 2.6/2.6 MB
Progress (1): 2.6/2.6 MB
Progress (1): 2.6/2.6 MB
Progress (1): 2.6/2.6 MB
Progress (1): 2.6/2.6 MB
Progress (1): 2.6/2.6 MB
Progress (1): 2.6/2.6 MB
Progress (1): 2.6 MB    
                    
Downloaded from eclipse.maven.central.mirror: https://repo.eclipse.org/content/repositories/maven_central/com/google/guava/guava/25.1-android/guava-25.1-android.jar (2.6 MB at 2.9 MB/s)
[INFO] 
[INFO] --- maven-clean-plugin:2.4.1:clean (default-clean) @ org.eclipse.m2e.maven.runtime ---
[INFO] 
[INFO] --- maven-resources-plugin:2.5:resources (default-resources) @ org.eclipse.m2e.maven.runtime ---
[debug] execute contextualize
[INFO] Using 'UTF-8' encoding to copy filtered resources.
[INFO] Copying 3 resources
[INFO] 
[INFO] --- maven-compiler-plugin:3.8.1:compile (default-compile) @ org.eclipse.m2e.maven.runtime ---
[INFO] No sources to compile
[INFO] 
[INFO] --- maven-resources-plugin:2.5:testResources (default-testResources) @ org.eclipse.m2e.maven.runtime ---
[debug] execute contextualize
[INFO] Using 'UTF-8' encoding to copy filtered resources.
[INFO] skip non existing resourceDirectory /home/jenkins/agent/workspace/m2e-gerrit/m2e-maven-runtime/org.eclipse.m2e.maven.runtime/src/test/resources
[INFO] 
[INFO] --- maven-compiler-plugin:3.8.1:testCompile (default-testCompile) @ org.eclipse.m2e.maven.runtime ---
[INFO] No sources to compile
[INFO] 
[INFO] --- maven-surefire-plugin:2.8:test (default-test) @ org.eclipse.m2e.maven.runtime ---
[INFO] No tests to run.
[INFO] Surefire report directory: /home/jenkins/agent/workspace/m2e-gerrit/m2e-maven-runtime/org.eclipse.m2e.maven.runtime/target/surefire-reports

-------------------------------------------------------
 T E S T S
-------------------------------------------------------
There are no tests to run.

Results :

Tests run: 0, Failures: 0, Errors: 0, Skipped: 0

[INFO] 
[INFO] --- maven-bundle-plugin:4.2.0:bundle (default-bundle) @ org.eclipse.m2e.maven.runtime ---
[WARNING] Bundle org.eclipse.m2e:org.eclipse.m2e.maven.runtime:bundle:1.14.0-SNAPSHOT : Version for package org.eclipse.aether is set to different values in the source (1.1.1) and in the manifest (1.4.1). The version in the manifest is not picked up by an other sibling bundles in this project or projects that directly depend on this project
[WARNING] Bundle org.eclipse.m2e:org.eclipse.m2e.maven.runtime:bundle:1.14.0-SNAPSHOT : Version for package org.eclipse.aether.artifact is set to different values in the source (1.1.1) and in the manifest (1.4.1). The version in the manifest is not picked up by an other sibling bundles in this project or projects that directly depend on this project
[WARNING] Bundle org.eclipse.m2e:org.eclipse.m2e.maven.runtime:bundle:1.14.0-SNAPSHOT : Version for package org.eclipse.aether.collection is set to different values in the source (1.1.1) and in the manifest (1.4.1). The version in the manifest is not picked up by an other sibling bundles in this project or projects that directly depend on this project
[WARNING] Bundle org.eclipse.m2e:org.eclipse.m2e.maven.runtime:bundle:1.14.0-SNAPSHOT : Version for package org.eclipse.aether.connector.basic is set to different values in the source (1.1.1) and in the manifest (1.4.1). The version in the manifest is not picked up by an other sibling bundles in this project or projects that directly depend on this project
[WARNING] Bundle org.eclipse.m2e:org.eclipse.m2e.maven.runtime:bundle:1.14.0-SNAPSHOT : Version for package org.eclipse.aether.deployment is set to different values in the source (1.1.1) and in the manifest (1.4.1). The version in the manifest is not picked up by an other sibling bundles in this project or projects that directly depend on this project
[WARNING] Bundle org.eclipse.m2e:org.eclipse.m2e.maven.runtime:bundle:1.14.0-SNAPSHOT : Version for package org.eclipse.aether.graph is set to different values in the source (1.1.1) and in the manifest (1.4.1). The version in the manifest is not picked up by an other sibling bundles in this project or projects that directly depend on this project
[WARNING] Bundle org.eclipse.m2e:org.eclipse.m2e.maven.runtime:bundle:1.14.0-SNAPSHOT : Version for package org.eclipse.aether.impl is set to different values in the source (1.1.1) and in the manifest (1.4.1). The version in the manifest is not picked up by an other sibling bundles in this project or projects that directly depend on this project
[WARNING] Bundle org.eclipse.m2e:org.eclipse.m2e.maven.runtime:bundle:1.14.0-SNAPSHOT : Version for package org.eclipse.aether.impl.guice is set to different values in the source (1.1.1) and in the manifest (1.4.1). The version in the manifest is not picked up by an other sibling bundles in this project or projects that directly depend on this project
[WARNING] Bundle org.eclipse.m2e:org.eclipse.m2e.maven.runtime:bundle:1.14.0-SNAPSHOT : Version for package org.eclipse.aether.installation is set to different values in the source (1.1.1) and in the manifest (1.4.1). The version in the manifest is not picked up by an other sibling bundles in this project or projects that directly depend on this project
[WARNING] Bundle org.eclipse.m2e:org.eclipse.m2e.maven.runtime:bundle:1.14.0-SNAPSHOT : Version for package org.eclipse.aether.metadata is set to different values in the source (1.1.1) and in the manifest (1.4.1). The version in the manifest is not picked up by an other sibling bundles in this project or projects that directly depend on this project
[WARNING] Bundle org.eclipse.m2e:org.eclipse.m2e.maven.runtime:bundle:1.14.0-SNAPSHOT : Version for package org.eclipse.aether.repository is set to different values in the source (1.1.1) and in the manifest (1.4.1). The version in the manifest is not picked up by an other sibling bundles in this project or projects that directly depend on this project
[WARNING] Bundle org.eclipse.m2e:org.eclipse.m2e.maven.runtime:bundle:1.14.0-SNAPSHOT : Version for package org.eclipse.aether.resolution is set to different values in the source (1.1.1) and in the manifest (1.4.1). The version in the manifest is not picked up by an other sibling bundles in this project or projects that directly depend on this project
[WARNING] Bundle org.eclipse.m2e:org.eclipse.m2e.maven.runtime:bundle:1.14.0-SNAPSHOT : Version for package org.eclipse.aether.spi.connector is set to different values in the source (1.1.1) and in the manifest (1.4.1). The version in the manifest is not picked up by an other sibling bundles in this project or projects that directly depend on this project
[WARNING] Bundle org.eclipse.m2e:org.eclipse.m2e.maven.runtime:bundle:1.14.0-SNAPSHOT : Version for package org.eclipse.aether.spi.connector.checksum is set to different values in the source (1.1.1) and in the manifest (1.4.1). The version in the manifest is not picked up by an other sibling bundles in this project or projects that directly depend on this project
[WARNING] Bundle org.eclipse.m2e:org.eclipse.m2e.maven.runtime:bundle:1.14.0-SNAPSHOT : Version for package org.eclipse.aether.spi.connector.layout is set to different values in the source (1.1.1) and in the manifest (1.4.1). The version in the manifest is not picked up by an other sibling bundles in this project or projects that directly depend on this project
[WARNING] Bundle org.eclipse.m2e:org.eclipse.m2e.maven.runtime:bundle:1.14.0-SNAPSHOT : Version for package org.eclipse.aether.spi.connector.transport is set to different values in the source (1.1.1) and in the manifest (1.4.1). The version in the manifest is not picked up by an other sibling bundles in this project or projects that directly depend on this project
[WARNING] Bundle org.eclipse.m2e:org.eclipse.m2e.maven.runtime:bundle:1.14.0-SNAPSHOT : Version for package org.eclipse.aether.spi.io is set to different values in the source (1.1.1) and in the manifest (1.4.1). The version in the manifest is not picked up by an other sibling bundles in this project or projects that directly depend on this project
[WARNING] Bundle org.eclipse.m2e:org.eclipse.m2e.maven.runtime:bundle:1.14.0-SNAPSHOT : Version for package org.eclipse.aether.spi.localrepo is set to different values in the source (1.1.1) and in the manifest (1.4.1). The version in the manifest is not picked up by an other sibling bundles in this project or projects that directly depend on this project
[WARNING] Bundle org.eclipse.m2e:org.eclipse.m2e.maven.runtime:bundle:1.14.0-SNAPSHOT : Version for package org.eclipse.aether.spi.locator is set to different values in the source (1.1.1) and in the manifest (1.4.1). The version in the manifest is not picked up by an other sibling bundles in this project or projects that directly depend on this project
[WARNING] Bundle org.eclipse.m2e:org.eclipse.m2e.maven.runtime:bundle:1.14.0-SNAPSHOT : Version for package org.eclipse.aether.spi.log is set to different values in the source (1.1.1) and in the manifest (1.4.1). The version in the manifest is not picked up by an other sibling bundles in this project or projects that directly depend on this project
[WARNING] Bundle org.eclipse.m2e:org.eclipse.m2e.maven.runtime:bundle:1.14.0-SNAPSHOT : Version for package org.eclipse.aether.transfer is set to different values in the source (1.1.1) and in the manifest (1.4.1). The version in the manifest is not picked up by an other sibling bundles in this project or projects that directly depend on this project
[WARNING] Bundle org.eclipse.m2e:org.eclipse.m2e.maven.runtime:bundle:1.14.0-SNAPSHOT : Version for package org.eclipse.aether.transform is set to different values in the source (1.1.1) and in the manifest (1.4.1). The version in the manifest is not picked up by an other sibling bundles in this project or projects that directly depend on this project
[WARNING] Bundle org.eclipse.m2e:org.eclipse.m2e.maven.runtime:bundle:1.14.0-SNAPSHOT : Version for package org.eclipse.aether.transport.wagon is set to different values in the source (1.1.1) and in the manifest (1.4.1). The version in the manifest is not picked up by an other sibling bundles in this project or projects that directly depend on this project
[WARNING] Bundle org.eclipse.m2e:org.eclipse.m2e.maven.runtime:bundle:1.14.0-SNAPSHOT : Version for package org.eclipse.aether.util is set to different values in the source (1.1.1) and in the manifest (1.4.1). The version in the manifest is not picked up by an other sibling bundles in this project or projects that directly depend on this project
[WARNING] Bundle org.eclipse.m2e:org.eclipse.m2e.maven.runtime:bundle:1.14.0-SNAPSHOT : Version for package org.eclipse.aether.util.artifact is set to different values in the source (1.1.1) and in the manifest (1.4.1). The version in the manifest is not picked up by an other sibling bundles in this project or projects that directly depend on this project
[WARNING] Bundle org.eclipse.m2e:org.eclipse.m2e.maven.runtime:bundle:1.14.0-SNAPSHOT : Version for package org.eclipse.aether.util.concurrency is set to different values in the source (1.1.1) and in the manifest (1.4.1). The version in the manifest is not picked up by an other sibling bundles in this project or projects that directly depend on this project
[WARNING] Bundle org.eclipse.m2e:org.eclipse.m2e.maven.runtime:bundle:1.14.0-SNAPSHOT : Version for package org.eclipse.aether.util.filter is set to different values in the source (1.1.1) and in the manifest (1.4.1). The version in the manifest is not picked up by an other sibling bundles in this project or projects that directly depend on this project
[WARNING] Bundle org.eclipse.m2e:org.eclipse.m2e.maven.runtime:bundle:1.14.0-SNAPSHOT : Version for package org.eclipse.aether.util.graph.manager is set to different values in the source (1.1.1) and in the manifest (1.4.1). The version in the manifest is not picked up by an other sibling bundles in this project or projects that directly depend on this project
[WARNING] Bundle org.eclipse.m2e:org.eclipse.m2e.maven.runtime:bundle:1.14.0-SNAPSHOT : Version for package org.eclipse.aether.util.graph.selector is set to different values in the source (1.1.1) and in the manifest (1.4.1). The version in the manifest is not picked up by an other sibling bundles in this project or projects that directly depend on this project
[WARNING] Bundle org.eclipse.m2e:org.eclipse.m2e.maven.runtime:bundle:1.14.0-SNAPSHOT : Version for package org.eclipse.aether.util.graph.transformer is set to different values in the source (1.1.1) and in the manifest (1.4.1). The version in the manifest is not picked up by an other sibling bundles in this project or projects that directly depend on this project
[WARNING] Bundle org.eclipse.m2e:org.eclipse.m2e.maven.runtime:bundle:1.14.0-SNAPSHOT : Version for package org.eclipse.aether.util.graph.traverser is set to different values in the source (1.1.1) and in the manifest (1.4.1). The version in the manifest is not picked up by an other sibling bundles in this project or projects that directly depend on this project
[WARNING] Bundle org.eclipse.m2e:org.eclipse.m2e.maven.runtime:bundle:1.14.0-SNAPSHOT : Version for package org.eclipse.aether.util.graph.version is set to different values in the source (1.1.1) and in the manifest (1.4.1). The version in the manifest is not picked up by an other sibling bundles in this project or projects that directly depend on this project
[WARNING] Bundle org.eclipse.m2e:org.eclipse.m2e.maven.runtime:bundle:1.14.0-SNAPSHOT : Version for package org.eclipse.aether.util.graph.visitor is set to different values in the source (1.1.1) and in the manifest (1.4.1). The version in the manifest is not picked up by an other sibling bundles in this project or projects that directly depend on this project
[WARNING] Bundle org.eclipse.m2e:org.eclipse.m2e.maven.runtime:bundle:1.14.0-SNAPSHOT : Version for package org.eclipse.aether.util.listener is set to different values in the source (1.1.1) and in the manifest (1.4.1). The version in the manifest is not picked up by an other sibling bundles in this project or projects that directly depend on this project
[WARNING] Bundle org.eclipse.m2e:org.eclipse.m2e.maven.runtime:bundle:1.14.0-SNAPSHOT : Version for package org.eclipse.aether.util.repository is set to different values in the source (1.1.1) and in the manifest (1.4.1). The version in the manifest is not picked up by an other sibling bundles in this project or projects that directly depend on this project
[WARNING] Bundle org.eclipse.m2e:org.eclipse.m2e.maven.runtime:bundle:1.14.0-SNAPSHOT : Version for package org.eclipse.aether.util.version is set to different values in the source (1.1.1) and in the manifest (1.4.1). The version in the manifest is not picked up by an other sibling bundles in this project or projects that directly depend on this project
[WARNING] Bundle org.eclipse.m2e:org.eclipse.m2e.maven.runtime:bundle:1.14.0-SNAPSHOT : Version for package org.eclipse.aether.version is set to different values in the source (1.1.1) and in the manifest (1.4.1). The version in the manifest is not picked up by an other sibling bundles in this project or projects that directly depend on this project
[WARNING] Bundle org.eclipse.m2e:org.eclipse.m2e.maven.runtime:bundle:1.14.0-SNAPSHOT : Host org.eclipse.m2e.maven.runtime.slf4j.simple=bundle-version="[1.14.0,1.15.0)" for this fragment/require bundle cannot be found on the classpath
[WARNING] Bundle org.eclipse.m2e:org.eclipse.m2e.maven.runtime:bundle:1.14.0-SNAPSHOT : Host javax.inject=bundle-version="1.0.0";visibility:=reexport for this fragment/require bundle cannot be found on the classpath
[WARNING] Bundle org.eclipse.m2e:org.eclipse.m2e.maven.runtime:bundle:1.14.0-SNAPSHOT : Export org.apache.maven.cli,  has 1,  private references [org.apache.commons.cli]
[WARNING] Bundle org.eclipse.m2e:org.eclipse.m2e.maven.runtime:bundle:1.14.0-SNAPSHOT : Export org.apache.maven.extension.internal,  has 1,  private references [org.eclipse.sisu]
[WARNING] Bundle org.eclipse.m2e:org.eclipse.m2e.maven.runtime:bundle:1.14.0-SNAPSHOT : Export org.apache.maven.model.building,  has 1,  private references [org.eclipse.sisu]
[WARNING] Bundle org.eclipse.m2e:org.eclipse.m2e.maven.runtime:bundle:1.14.0-SNAPSHOT : Export org.apache.maven.shared.utils,  has 1,  private references [javax.annotation]
[WARNING] Bundle org.eclipse.m2e:org.eclipse.m2e.maven.runtime:bundle:1.14.0-SNAPSHOT : Export org.apache.maven.shared.utils.cli,  has 1,  private references [javax.annotation]
[WARNING] Bundle org.eclipse.m2e:org.eclipse.m2e.maven.runtime:bundle:1.14.0-SNAPSHOT : Export org.apache.maven.shared.utils.introspection,  has 1,  private references [javax.annotation]
[WARNING] Bundle org.eclipse.m2e:org.eclipse.m2e.maven.runtime:bundle:1.14.0-SNAPSHOT : Export org.apache.maven.shared.utils.io,  has 1,  private references [javax.annotation]
[WARNING] Bundle org.eclipse.m2e:org.eclipse.m2e.maven.runtime:bundle:1.14.0-SNAPSHOT : Export org.apache.maven.shared.utils.xml,  has 2,  private references [javax.annotation, org.apache.commons.io.output]
[WARNING] Bundle org.eclipse.m2e:org.eclipse.m2e.maven.runtime:bundle:1.14.0-SNAPSHOT : Export org.codehaus.plexus,  has 1,  private references [org.eclipse.sisu.plexus]
[WARNING] Bundle org.eclipse.m2e:org.eclipse.m2e.maven.runtime:bundle:1.14.0-SNAPSHOT : Export org.codehaus.plexus.component.configurator.converters.special,  has 1,  private references [org.codehaus.classworlds]
[WARNING] Bundle org.eclipse.m2e:org.eclipse.m2e.maven.runtime:bundle:1.14.0-SNAPSHOT : Export org.codehaus.plexus.component.factory,  has 1,  private references [org.codehaus.classworlds]
[WARNING] Bundle org.eclipse.m2e:org.eclipse.m2e.maven.runtime:bundle:1.14.0-SNAPSHOT : Export org.codehaus.plexus.logging,  has 1,  private references [org.eclipse.sisu.bean]
[WARNING] Bundle org.eclipse.m2e:org.eclipse.m2e.maven.runtime:bundle:1.14.0-SNAPSHOT : Export org.sonatype.plexus.components.cipher,  has 1,  private references [javax.enterprise.inject]
[WARNING] Bundle org.eclipse.m2e:org.eclipse.m2e.maven.runtime:bundle:1.14.0-SNAPSHOT : Export io.takari.aether.connector,  has 1,  private references [org.eclipse.sisu]
[WARNING] Bundle org.eclipse.m2e:org.eclipse.m2e.maven.runtime:bundle:1.14.0-SNAPSHOT : Invalid package name: 'META-INF.plexus' in Export-Package
[WARNING] Bundle org.eclipse.m2e:org.eclipse.m2e.maven.runtime:bundle:1.14.0-SNAPSHOT : Invalid package name: 'META-INF.sisu' in Export-Package
[INFO] 
[INFO] --- tycho-p2-plugin:1.4.0:p2-metadata (p2-metadata) @ org.eclipse.m2e.maven.runtime ---
[INFO] 
[INFO] --- tycho-p2-plugin:1.4.0:update-local-index (p2-metadata) @ org.eclipse.m2e.maven.runtime ---
[INFO] 
[INFO] --- tycho-pack200a-plugin:1.4.0:normalize (pack200-normalize) @ org.eclipse.m2e.maven.runtime ---
[INFO] Pack200 normalizing jar /home/jenkins/agent/workspace/m2e-gerrit/m2e-maven-runtime/org.eclipse.m2e.maven.runtime/target/org.eclipse.m2e.maven.runtime-1.14.0-SNAPSHOT.jar
[INFO] 
[INFO] --- eclipse-jarsigner-plugin:1.1.5:sign (sign) @ org.eclipse.m2e.maven.runtime ---
[INFO] Signing of nested jars of '/home/jenkins/agent/workspace/m2e-gerrit/m2e-maven-runtime/org.eclipse.m2e.maven.runtime/target/org.eclipse.m2e.maven.runtime-1.14.0-SNAPSHOT.jar' is disabled.
[INFO] Signing jar: /home/jenkins/agent/workspace/m2e-gerrit/m2e-maven-runtime/org.eclipse.m2e.maven.runtime/target/org.eclipse.m2e.maven.runtime-1.14.0-SNAPSHOT.jar
[INFO] 
[INFO] --- tycho-pack200b-plugin:1.4.0:pack (pack200-pack) @ org.eclipse.m2e.maven.runtime ---
[INFO] Pack200 packing jar /home/jenkins/agent/workspace/m2e-gerrit/m2e-maven-runtime/org.eclipse.m2e.maven.runtime/target/org.eclipse.m2e.maven.runtime-1.14.0-SNAPSHOT.jar
[INFO] 
[INFO] --- maven-install-plugin:2.3.1:install (default-install) @ org.eclipse.m2e.maven.runtime ---
[INFO] Installing /home/jenkins/agent/workspace/m2e-gerrit/m2e-maven-runtime/org.eclipse.m2e.maven.runtime/target/org.eclipse.m2e.maven.runtime-1.14.0-SNAPSHOT.jar to /home/jenkins/agent/workspace/m2e-gerrit/.repository/org/eclipse/m2e/org.eclipse.m2e.maven.runtime/1.14.0-SNAPSHOT/org.eclipse.m2e.maven.runtime-1.14.0-SNAPSHOT.jar
[INFO] Installing /home/jenkins/agent/workspace/m2e-gerrit/m2e-maven-runtime/org.eclipse.m2e.maven.runtime/pom.xml to /home/jenkins/agent/workspace/m2e-gerrit/.repository/org/eclipse/m2e/org.eclipse.m2e.maven.runtime/1.14.0-SNAPSHOT/org.eclipse.m2e.maven.runtime-1.14.0-SNAPSHOT.pom
[INFO] Installing /home/jenkins/agent/workspace/m2e-gerrit/m2e-maven-runtime/org.eclipse.m2e.maven.runtime/target/org.eclipse.m2e.maven.runtime-1.14.0-SNAPSHOT.jar.pack.gz to /home/jenkins/agent/workspace/m2e-gerrit/.repository/org/eclipse/m2e/org.eclipse.m2e.maven.runtime/1.14.0-SNAPSHOT/org.eclipse.m2e.maven.runtime-1.14.0-SNAPSHOT-pack200.jar.pack.gz
[INFO] 
[INFO] --- maven-bundle-plugin:4.2.0:install (default-install) @ org.eclipse.m2e.maven.runtime ---
[INFO] Installing org/eclipse/m2e/org.eclipse.m2e.maven.runtime/1.14.0-SNAPSHOT/org.eclipse.m2e.maven.runtime-1.14.0-SNAPSHOT.jar
[INFO] Writing OBR metadata
[INFO] 
[INFO] -----< org.eclipse.m2e:org.eclipse.m2e.maven.runtime.slf4j.simple >-----
[INFO] Building org.eclipse.m2e.maven.runtime.slf4j.simple 1.14.0-SNAPSHOT [5/5]
[INFO] -------------------------------[ bundle ]-------------------------------
Downloading from maven-3.6.2-staging: https://repository.apache.org/content/repositories/maven-1529/org/slf4j/slf4j-simple/1.7.5/slf4j-simple-1.7.5.pom
Downloading from eclipse.maven.central.mirror: https://repo.eclipse.org/content/repositories/maven_central/org/slf4j/slf4j-simple/1.7.5/slf4j-simple-1.7.5.pom
Progress (1): 1.5 kB
                    
Downloaded from eclipse.maven.central.mirror: https://repo.eclipse.org/content/repositories/maven_central/org/slf4j/slf4j-simple/1.7.5/slf4j-simple-1.7.5.pom (1.5 kB at 70 kB/s)
Downloading from maven-3.6.2-staging: https://repository.apache.org/content/repositories/maven-1529/org/slf4j/slf4j-parent/1.7.5/slf4j-parent-1.7.5.pom
Downloading from eclipse.maven.central.mirror: https://repo.eclipse.org/content/repositories/maven_central/org/slf4j/slf4j-parent/1.7.5/slf4j-parent-1.7.5.pom
Progress (1): 4.1/12 kB
Progress (1): 7.7/12 kB
Progress (1): 12/12 kB 
Progress (1): 12 kB   
                   
Downloaded from eclipse.maven.central.mirror: https://repo.eclipse.org/content/repositories/maven_central/org/slf4j/slf4j-parent/1.7.5/slf4j-parent-1.7.5.pom (12 kB at 694 kB/s)
Downloading from maven-3.6.2-staging: https://repository.apache.org/content/repositories/maven-1529/org/slf4j/slf4j-api/1.7.5/slf4j-api-1.7.5.pom
Downloading from eclipse.maven.central.mirror: https://repo.eclipse.org/content/repositories/maven_central/org/slf4j/slf4j-api/1.7.5/slf4j-api-1.7.5.pom
Progress (1): 2.7 kB
                    
Downloaded from eclipse.maven.central.mirror: https://repo.eclipse.org/content/repositories/maven_central/org/slf4j/slf4j-api/1.7.5/slf4j-api-1.7.5.pom (2.7 kB at 168 kB/s)
Downloading from maven-3.6.2-staging: https://repository.apache.org/content/repositories/maven-1529/org/slf4j/slf4j-simple/1.7.5/slf4j-simple-1.7.5.jar
Downloading from maven-3.6.2-staging: https://repository.apache.org/content/repositories/maven-1529/org/slf4j/slf4j-api/1.7.5/slf4j-api-1.7.5.jar
Downloading from eclipse.maven.central.mirror: https://repo.eclipse.org/content/repositories/maven_central/org/slf4j/slf4j-simple/1.7.5/slf4j-simple-1.7.5.jar
Downloading from eclipse.maven.central.mirror: https://repo.eclipse.org/content/repositories/maven_central/org/slf4j/slf4j-api/1.7.5/slf4j-api-1.7.5.jar
Progress (1): 4.1/11 kB
Progress (1): 7.7/11 kB
Progress (1): 11 kB    
Progress (2): 11 kB | 4.1/26 kB
Progress (2): 11 kB | 7.7/26 kB
Progress (2): 11 kB | 12/26 kB 
Progress (2): 11 kB | 16/26 kB
Progress (2): 11 kB | 20/26 kB
Progress (2): 11 kB | 24/26 kB
Progress (2): 11 kB | 26 kB   
                           
Downloaded from eclipse.maven.central.mirror: https://repo.eclipse.org/content/repositories/maven_central/org/slf4j/slf4j-simple/1.7.5/slf4j-simple-1.7.5.jar (11 kB at 668 kB/s)
Downloaded from eclipse.maven.central.mirror: https://repo.eclipse.org/content/repositories/maven_central/org/slf4j/slf4j-api/1.7.5/slf4j-api-1.7.5.jar (26 kB at 1.4 MB/s)
[INFO] 
[INFO] --- maven-clean-plugin:2.4.1:clean (default-clean) @ org.eclipse.m2e.maven.runtime.slf4j.simple ---
[INFO] 
[INFO] --- maven-resources-plugin:2.5:resources (default-resources) @ org.eclipse.m2e.maven.runtime.slf4j.simple ---
[debug] execute contextualize
[INFO] Using 'UTF-8' encoding to copy filtered resources.
[INFO] Copying 4 resources
[INFO] 
[INFO] --- maven-compiler-plugin:3.8.1:compile (default-compile) @ org.eclipse.m2e.maven.runtime.slf4j.simple ---
[INFO] No sources to compile
[INFO] 
[INFO] --- maven-resources-plugin:2.5:testResources (default-testResources) @ org.eclipse.m2e.maven.runtime.slf4j.simple ---
[debug] execute contextualize
[INFO] Using 'UTF-8' encoding to copy filtered resources.
[INFO] skip non existing resourceDirectory /home/jenkins/agent/workspace/m2e-gerrit/m2e-maven-runtime/org.eclipse.m2e.maven.runtime.slf4j.simple/src/test/resources
[INFO] 
[INFO] --- maven-compiler-plugin:3.8.1:testCompile (default-testCompile) @ org.eclipse.m2e.maven.runtime.slf4j.simple ---
[INFO] No sources to compile
[INFO] 
[INFO] --- maven-surefire-plugin:2.8:test (default-test) @ org.eclipse.m2e.maven.runtime.slf4j.simple ---
[INFO] No tests to run.
[INFO] Surefire report directory: /home/jenkins/agent/workspace/m2e-gerrit/m2e-maven-runtime/org.eclipse.m2e.maven.runtime.slf4j.simple/target/surefire-reports

-------------------------------------------------------
 T E S T S
-------------------------------------------------------
There are no tests to run.

Results :

Tests run: 0, Failures: 0, Errors: 0, Skipped: 0

[INFO] 
[INFO] --- maven-bundle-plugin:4.2.0:bundle (default-bundle) @ org.eclipse.m2e.maven.runtime.slf4j.simple ---
[INFO] 
[INFO] --- tycho-p2-plugin:1.4.0:p2-metadata (p2-metadata) @ org.eclipse.m2e.maven.runtime.slf4j.simple ---
[INFO] 
[INFO] --- tycho-p2-plugin:1.4.0:update-local-index (p2-metadata) @ org.eclipse.m2e.maven.runtime.slf4j.simple ---
[INFO] 
[INFO] --- tycho-pack200a-plugin:1.4.0:normalize (pack200-normalize) @ org.eclipse.m2e.maven.runtime.slf4j.simple ---
[INFO] Pack200 normalizing jar /home/jenkins/agent/workspace/m2e-gerrit/m2e-maven-runtime/org.eclipse.m2e.maven.runtime.slf4j.simple/target/org.eclipse.m2e.maven.runtime.slf4j.simple-1.14.0-SNAPSHOT.jar
[INFO] 
[INFO] --- eclipse-jarsigner-plugin:1.1.5:sign (sign) @ org.eclipse.m2e.maven.runtime.slf4j.simple ---
[INFO] Signing of nested jars of '/home/jenkins/agent/workspace/m2e-gerrit/m2e-maven-runtime/org.eclipse.m2e.maven.runtime.slf4j.simple/target/org.eclipse.m2e.maven.runtime.slf4j.simple-1.14.0-SNAPSHOT.jar' is disabled.
[INFO] Signing jar: /home/jenkins/agent/workspace/m2e-gerrit/m2e-maven-runtime/org.eclipse.m2e.maven.runtime.slf4j.simple/target/org.eclipse.m2e.maven.runtime.slf4j.simple-1.14.0-SNAPSHOT.jar
[INFO] 
[INFO] --- tycho-pack200b-plugin:1.4.0:pack (pack200-pack) @ org.eclipse.m2e.maven.runtime.slf4j.simple ---
[INFO] Pack200 packing jar /home/jenkins/agent/workspace/m2e-gerrit/m2e-maven-runtime/org.eclipse.m2e.maven.runtime.slf4j.simple/target/org.eclipse.m2e.maven.runtime.slf4j.simple-1.14.0-SNAPSHOT.jar
[INFO] 
[INFO] --- maven-install-plugin:2.3.1:install (default-install) @ org.eclipse.m2e.maven.runtime.slf4j.simple ---
[INFO] Installing /home/jenkins/agent/workspace/m2e-gerrit/m2e-maven-runtime/org.eclipse.m2e.maven.runtime.slf4j.simple/target/org.eclipse.m2e.maven.runtime.slf4j.simple-1.14.0-SNAPSHOT.jar to /home/jenkins/agent/workspace/m2e-gerrit/.repository/org/eclipse/m2e/org.eclipse.m2e.maven.runtime.slf4j.simple/1.14.0-SNAPSHOT/org.eclipse.m2e.maven.runtime.slf4j.simple-1.14.0-SNAPSHOT.jar
[INFO] Installing /home/jenkins/agent/workspace/m2e-gerrit/m2e-maven-runtime/org.eclipse.m2e.maven.runtime.slf4j.simple/pom.xml to /home/jenkins/agent/workspace/m2e-gerrit/.repository/org/eclipse/m2e/org.eclipse.m2e.maven.runtime.slf4j.simple/1.14.0-SNAPSHOT/org.eclipse.m2e.maven.runtime.slf4j.simple-1.14.0-SNAPSHOT.pom
[INFO] Installing /home/jenkins/agent/workspace/m2e-gerrit/m2e-maven-runtime/org.eclipse.m2e.maven.runtime.slf4j.simple/target/org.eclipse.m2e.maven.runtime.slf4j.simple-1.14.0-SNAPSHOT.jar.pack.gz to /home/jenkins/agent/workspace/m2e-gerrit/.repository/org/eclipse/m2e/org.eclipse.m2e.maven.runtime.slf4j.simple/1.14.0-SNAPSHOT/org.eclipse.m2e.maven.runtime.slf4j.simple-1.14.0-SNAPSHOT-pack200.jar.pack.gz
[INFO] 
[INFO] --- maven-bundle-plugin:4.2.0:install (default-install) @ org.eclipse.m2e.maven.runtime.slf4j.simple ---
[INFO] Installing org/eclipse/m2e/org.eclipse.m2e.maven.runtime.slf4j.simple/1.14.0-SNAPSHOT/org.eclipse.m2e.maven.runtime.slf4j.simple-1.14.0-SNAPSHOT.jar
[INFO] Writing OBR metadata
[INFO] ------------------------------------------------------------------------
[INFO] Reactor Summary for m2e-maven-runtime 1.14.0-SNAPSHOT:
[INFO] 
[INFO] m2e-maven-runtime .................................. SUCCESS [  4.421 s]
[INFO] Maven Archetype Common Bundle ...................... SUCCESS [ 27.620 s]
[INFO] Nexus Indexer Bundle ............................... SUCCESS [  5.997 s]
[INFO] Embedded Maven Runtime Bundle ...................... SUCCESS [ 20.273 s]
[INFO] org.eclipse.m2e.maven.runtime.slf4j.simple ......... SUCCESS [  2.168 s]
[INFO] ------------------------------------------------------------------------
[INFO] BUILD SUCCESS
[INFO] ------------------------------------------------------------------------
[INFO] Total time:  01:22 min
[INFO] Finished at: 2019-10-25T15:54:20Z
[INFO] ------------------------------------------------------------------------
[m2e-gerrit] $ /opt/tools/apache-maven/3.5.4/bin/mvn -f pom.xml -DGERRIT_BRANCH=master -DGERRIT_PATCHSET_REVISION=f8d35126dcdf6a4b9c73364814bcbbbad9d8337e -DGERRIT_HOST=gerrit-local -DGERRIT_CHANGE_OWNER_EMAIL=akurtako@redhat.com "-DGERRIT_EVENT_ACCOUNT_NAME=Fred Bricon" -DGERRIT_CHANGE_URL=https://git.eclipse.org/r/151640 -DGERRIT_PATCHSET_UPLOADER_EMAIL=fbricon@gmail.com -DGERRIT_EVENT_TYPE=patchset-created -DGERRIT_PROJECT=m2e/m2e-core -DGERRIT_CHANGE_NUMBER=151640 -DGERRIT_SCHEME=ssh '-DGERRIT_PATCHSET_UPLOADER=\"Fred Bricon\" <fbricon@gmail.com>' -DGERRIT_PORT=29418 -DGERRIT_CHANGE_PRIVATE_STATE=false -DGERRIT_REFSPEC=refs/changes/40/151640/2 "-DGERRIT_PATCHSET_UPLOADER_NAME=Fred Bricon" '-DGERRIT_CHANGE_OWNER=\"Alexander Kurtakov\" <akurtako@redhat.com>' -DGERRIT_CHANGE_COMMIT_MESSAGE=QnVpbGQgdXNpbmcgdHljaG8gMS41LjAuCgpDaGFuZ2UtSWQ6IEk0MWE1MjlmMzdkNTY1MjBhOTZhNzljY2EzNzA4ZTEwY2NmNmE1YjMwClNpZ25lZC1vZmYtYnk6IEFsZXhhbmRlciBLdXJ0YWtvdiA8YWt1cnRha29AcmVkaGF0LmNvbT4= "-DGERRIT_NAME=Eclipse Gerrit" -DGERRIT_TOPIC= "-DGERRIT_CHANGE_SUBJECT=Build using tycho 1.5.0." '-DGERRIT_EVENT_ACCOUNT=\"Fred Bricon\" <fbricon@gmail.com>' -DGERRIT_CHANGE_WIP_STATE=false -DGERRIT_CHANGE_ID=I41a529f37d56520a96a79cca3708e10ccf6a5b30 -DGERRIT_EVENT_HASH=686168085 -DGERRIT_VERSION=2.14.6 -DGERRIT_EVENT_ACCOUNT_EMAIL=fbricon@gmail.com -DGERRIT_PATCHSET_NUMBER=2 "-DGERRIT_CHANGE_OWNER_NAME=Alexander Kurtakov" -Dmaven.test.failure.ignore=true -Dmaven.test.error.ignore=true -Dtycho.disableP2Mirrors=true -Dtycho.surefire.timeout=7200 -Dmaven.repo.local=/home/jenkins/agent/workspace/m2e-gerrit/.repository clean install -Peclipse-sign,uts,its
Picked up JAVA_TOOL_OPTIONS: -XX:+IgnoreUnrecognizedVMOptions -XX:+UseContainerSupport -XX:+UnlockExperimentalVMOptions -XX:+UseCGroupMemoryLimitForHeap
Picked up _JAVA_OPTIONS: -XX:MaxRAMPercentage=64.0
[INFO] Scanning for projects...
Downloading from cbi-releases: https://repo.eclipse.org/content/repositories/cbi-releases/org/eclipse/tycho/tycho-maven-plugin/1.5.0/tycho-maven-plugin-1.5.0.pom
Downloading from tycho-snapshots: https://oss.sonatype.org/content/groups/staging/org/eclipse/tycho/tycho-maven-plugin/1.5.0/tycho-maven-plugin-1.5.0.pom
Downloading from eclipse.maven.central.mirror: https://repo.eclipse.org/content/repositories/maven_central/org/eclipse/tycho/tycho-maven-plugin/1.5.0/tycho-maven-plugin-1.5.0.pom
Progress (1): 2.1 kB
                    
Downloaded from eclipse.maven.central.mirror: https://repo.eclipse.org/content/repositories/maven_central/org/eclipse/tycho/tycho-maven-plugin/1.5.0/tycho-maven-plugin-1.5.0.pom (2.1 kB at 35 kB/s)
Downloading from cbi-releases: https://repo.eclipse.org/content/repositories/cbi-releases/org/eclipse/tycho/tycho/1.5.0/tycho-1.5.0.pom
Downloading from tycho-snapshots: https://oss.sonatype.org/content/groups/staging/org/eclipse/tycho/tycho/1.5.0/tycho-1.5.0.pom
Downloading from eclipse.maven.central.mirror: https://repo.eclipse.org/content/repositories/maven_central/org/eclipse/tycho/tycho/1.5.0/tycho-1.5.0.pom
Progress (1): 4.1/19 kB
Progress (1): 7.7/19 kB
Progress (1): 12/19 kB 
Progress (1): 16/19 kB
Progress (1): 19 kB   
                   
Downloaded from eclipse.maven.central.mirror: https://repo.eclipse.org/content/repositories/maven_central/org/eclipse/tycho/tycho/1.5.0/tycho-1.5.0.pom (19 kB at 384 kB/s)
Downloading from cbi-releases: https://repo.eclipse.org/content/repositories/cbi-releases/org/eclipse/tycho/tycho-core/1.5.0/tycho-core-1.5.0.pom
Downloading from tycho-snapshots: https://oss.sonatype.org/content/groups/staging/org/eclipse/tycho/tycho-core/1.5.0/tycho-core-1.5.0.pom
Downloading from eclipse.maven.central.mirror: https://repo.eclipse.org/content/repositories/maven_central/org/eclipse/tycho/tycho-core/1.5.0/tycho-core-1.5.0.pom
Progress (1): 4.1/4.8 kB
Progress (1): 4.8 kB    
                    
Downloaded from eclipse.maven.central.mirror: https://repo.eclipse.org/content/repositories/maven_central/org/eclipse/tycho/tycho-core/1.5.0/tycho-core-1.5.0.pom (4.8 kB at 134 kB/s)
Downloading from cbi-releases: https://repo.eclipse.org/content/repositories/cbi-releases/org/eclipse/tycho/org.eclipse.tycho.p2.tools.shared/1.5.0/org.eclipse.tycho.p2.tools.shared-1.5.0.pom
Downloading from tycho-snapshots: https://oss.sonatype.org/content/groups/staging/org/eclipse/tycho/org.eclipse.tycho.p2.tools.shared/1.5.0/org.eclipse.tycho.p2.tools.shared-1.5.0.pom
Downloading from eclipse.maven.central.mirror: https://repo.eclipse.org/content/repositories/maven_central/org/eclipse/tycho/org.eclipse.tycho.p2.tools.shared/1.5.0/org.eclipse.tycho.p2.tools.shared-1.5.0.pom
Progress (1): 1.1 kB
                    
Downloaded from eclipse.maven.central.mirror: https://repo.eclipse.org/content/repositories/maven_central/org/eclipse/tycho/org.eclipse.tycho.p2.tools.shared/1.5.0/org.eclipse.tycho.p2.tools.shared-1.5.0.pom (1.1 kB at 31 kB/s)
Downloading from cbi-releases: https://repo.eclipse.org/content/repositories/cbi-releases/org/eclipse/tycho/tycho-bundles/1.5.0/tycho-bundles-1.5.0.pom
Downloading from tycho-snapshots: https://oss.sonatype.org/content/groups/staging/org/eclipse/tycho/tycho-bundles/1.5.0/tycho-bundles-1.5.0.pom
Downloading from eclipse.maven.central.mirror: https://repo.eclipse.org/content/repositories/maven_central/org/eclipse/tycho/tycho-bundles/1.5.0/tycho-bundles-1.5.0.pom
Progress (1): 3.0 kB
                    
Downloaded from eclipse.maven.central.mirror: https://repo.eclipse.org/content/repositories/maven_central/org/eclipse/tycho/tycho-bundles/1.5.0/tycho-bundles-1.5.0.pom (3.0 kB at 77 kB/s)
Downloading from cbi-releases: https://repo.eclipse.org/content/repositories/cbi-releases/org/apache/commons/commons-compress/1.18/commons-compress-1.18.pom
Downloading from tycho-snapshots: https://oss.sonatype.org/content/groups/staging/org/apache/commons/commons-compress/1.18/commons-compress-1.18.pom
Downloading from eclipse.maven.central.mirror: https://repo.eclipse.org/content/repositories/maven_central/org/apache/commons/commons-compress/1.18/commons-compress-1.18.pom
Progress (1): 4.1/18 kB
Progress (1): 7.7/18 kB
Progress (1): 12/18 kB 
Progress (1): 16/18 kB
Progress (1): 18 kB   
                   
Downloaded from eclipse.maven.central.mirror: https://repo.eclipse.org/content/repositories/maven_central/org/apache/commons/commons-compress/1.18/commons-compress-1.18.pom (18 kB at 493 kB/s)
Downloading from cbi-releases: https://repo.eclipse.org/content/repositories/cbi-releases/org/eclipse/platform/org.eclipse.osgi.compatibility.state/1.1.600/org.eclipse.osgi.compatibility.state-1.1.600.pom
Downloading from tycho-snapshots: https://oss.sonatype.org/content/groups/staging/org/eclipse/platform/org.eclipse.osgi.compatibility.state/1.1.600/org.eclipse.osgi.compatibility.state-1.1.600.pom
Downloading from eclipse.maven.central.mirror: https://repo.eclipse.org/content/repositories/maven_central/org/eclipse/platform/org.eclipse.osgi.compatibility.state/1.1.600/org.eclipse.osgi.compatibility.state-1.1.600.pom
Progress (1): 2.0 kB
                    
Downloaded from eclipse.maven.central.mirror: https://repo.eclipse.org/content/repositories/maven_central/org/eclipse/platform/org.eclipse.osgi.compatibility.state/1.1.600/org.eclipse.osgi.compatibility.state-1.1.600.pom (2.0 kB at 57 kB/s)
Downloading from cbi-releases: https://repo.eclipse.org/content/repositories/cbi-releases/org/eclipse/platform/org.eclipse.osgi/3.15.0/org.eclipse.osgi-3.15.0.pom
Downloading from tycho-snapshots: https://oss.sonatype.org/content/groups/staging/org/eclipse/platform/org.eclipse.osgi/3.15.0/org.eclipse.osgi-3.15.0.pom
Downloading from eclipse.maven.central.mirror: https://repo.eclipse.org/content/repositories/maven_central/org/eclipse/platform/org.eclipse.osgi/3.15.0/org.eclipse.osgi-3.15.0.pom
Progress (1): 1.7 kB
                    
Downloaded from eclipse.maven.central.mirror: https://repo.eclipse.org/content/repositories/maven_central/org/eclipse/platform/org.eclipse.osgi/3.15.0/org.eclipse.osgi-3.15.0.pom (1.7 kB at 49 kB/s)
Downloading from cbi-releases: https://repo.eclipse.org/content/repositories/cbi-releases/org/eclipse/tycho/sisu-equinox-embedder/1.5.0/sisu-equinox-embedder-1.5.0.pom
Downloading from tycho-snapshots: https://oss.sonatype.org/content/groups/staging/org/eclipse/tycho/sisu-equinox-embedder/1.5.0/sisu-equinox-embedder-1.5.0.pom
Downloading from eclipse.maven.central.mirror: https://repo.eclipse.org/content/repositories/maven_central/org/eclipse/tycho/sisu-equinox-embedder/1.5.0/sisu-equinox-embedder-1.5.0.pom
Progress (1): 1.8 kB
                    
Downloaded from eclipse.maven.central.mirror: https://repo.eclipse.org/content/repositories/maven_central/org/eclipse/tycho/sisu-equinox-embedder/1.5.0/sisu-equinox-embedder-1.5.0.pom (1.8 kB at 48 kB/s)
Downloading from cbi-releases: https://repo.eclipse.org/content/repositories/cbi-releases/org/eclipse/tycho/sisu-equinox/1.5.0/sisu-equinox-1.5.0.pom
Downloading from tycho-snapshots: https://oss.sonatype.org/content/groups/staging/org/eclipse/tycho/sisu-equinox/1.5.0/sisu-equinox-1.5.0.pom
Downloading from eclipse.maven.central.mirror: https://repo.eclipse.org/content/repositories/maven_central/org/eclipse/tycho/sisu-equinox/1.5.0/sisu-equinox-1.5.0.pom
Progress (1): 1.0 kB
                    
Downloaded from eclipse.maven.central.mirror: https://repo.eclipse.org/content/repositories/maven_central/org/eclipse/tycho/sisu-equinox/1.5.0/sisu-equinox-1.5.0.pom (1.0 kB at 21 kB/s)
Downloading from cbi-releases: https://repo.eclipse.org/content/repositories/cbi-releases/org/eclipse/tycho/sisu-equinox-api/1.5.0/sisu-equinox-api-1.5.0.pom
Downloading from tycho-snapshots: https://oss.sonatype.org/content/groups/staging/org/eclipse/tycho/sisu-equinox-api/1.5.0/sisu-equinox-api-1.5.0.pom
Downloading from eclipse.maven.central.mirror: https://repo.eclipse.org/content/repositories/maven_central/org/eclipse/tycho/sisu-equinox-api/1.5.0/sisu-equinox-api-1.5.0.pom
Progress (1): 1.7 kB
                    
Downloaded from eclipse.maven.central.mirror: https://repo.eclipse.org/content/repositories/maven_central/org/eclipse/tycho/sisu-equinox-api/1.5.0/sisu-equinox-api-1.5.0.pom (1.7 kB at 52 kB/s)
Downloading from cbi-releases: https://repo.eclipse.org/content/repositories/cbi-releases/org/eclipse/tycho/tycho-metadata-model/1.5.0/tycho-metadata-model-1.5.0.pom
Downloading from tycho-snapshots: https://oss.sonatype.org/content/groups/staging/org/eclipse/tycho/tycho-metadata-model/1.5.0/tycho-metadata-model-1.5.0.pom
Downloading from eclipse.maven.central.mirror: https://repo.eclipse.org/content/repositories/maven_central/org/eclipse/tycho/tycho-metadata-model/1.5.0/tycho-metadata-model-1.5.0.pom
Progress (1): 1.3 kB
                    
Downloaded from eclipse.maven.central.mirror: https://repo.eclipse.org/content/repositories/maven_central/org/eclipse/tycho/tycho-metadata-model/1.5.0/tycho-metadata-model-1.5.0.pom (1.3 kB at 33 kB/s)
Downloading from cbi-releases: https://repo.eclipse.org/content/repositories/cbi-releases/org/eclipse/tycho/tycho-embedder-api/1.5.0/tycho-embedder-api-1.5.0.pom
Downloading from tycho-snapshots: https://oss.sonatype.org/content/groups/staging/org/eclipse/tycho/tycho-embedder-api/1.5.0/tycho-embedder-api-1.5.0.pom
Downloading from eclipse.maven.central.mirror: https://repo.eclipse.org/content/repositories/maven_central/org/eclipse/tycho/tycho-embedder-api/1.5.0/tycho-embedder-api-1.5.0.pom
Progress (1): 2.1 kB
                    
Downloaded from eclipse.maven.central.mirror: https://repo.eclipse.org/content/repositories/maven_central/org/eclipse/tycho/tycho-embedder-api/1.5.0/tycho-embedder-api-1.5.0.pom (2.1 kB at 62 kB/s)
Downloading from cbi-releases: https://repo.eclipse.org/content/repositories/cbi-releases/org/eclipse/tycho/org.eclipse.tycho.embedder.shared/1.5.0/org.eclipse.tycho.embedder.shared-1.5.0.pom
Downloading from tycho-snapshots: https://oss.sonatype.org/content/groups/staging/org/eclipse/tycho/org.eclipse.tycho.embedder.shared/1.5.0/org.eclipse.tycho.embedder.shared-1.5.0.pom
Downloading from eclipse.maven.central.mirror: https://repo.eclipse.org/content/repositories/maven_central/org/eclipse/tycho/org.eclipse.tycho.embedder.shared/1.5.0/org.eclipse.tycho.embedder.shared-1.5.0.pom
Progress (1): 1.1 kB
                    
Downloaded from eclipse.maven.central.mirror: https://repo.eclipse.org/content/repositories/maven_central/org/eclipse/tycho/org.eclipse.tycho.embedder.shared/1.5.0/org.eclipse.tycho.embedder.shared-1.5.0.pom (1.1 kB at 17 kB/s)
Downloading from cbi-releases: https://repo.eclipse.org/content/repositories/cbi-releases/org/eclipse/tycho/org.eclipse.tycho.core.shared/1.5.0/org.eclipse.tycho.core.shared-1.5.0.pom
Downloading from tycho-snapshots: https://oss.sonatype.org/content/groups/staging/org/eclipse/tycho/org.eclipse.tycho.core.shared/1.5.0/org.eclipse.tycho.core.shared-1.5.0.pom
Downloading from eclipse.maven.central.mirror: https://repo.eclipse.org/content/repositories/maven_central/org/eclipse/tycho/org.eclipse.tycho.core.shared/1.5.0/org.eclipse.tycho.core.shared-1.5.0.pom
Progress (1): 1.0 kB
                    
Downloaded from eclipse.maven.central.mirror: https://repo.eclipse.org/content/repositories/maven_central/org/eclipse/tycho/org.eclipse.tycho.core.shared/1.5.0/org.eclipse.tycho.core.shared-1.5.0.pom (1.0 kB at 25 kB/s)
Downloading from cbi-releases: https://repo.eclipse.org/content/repositories/cbi-releases/org/eclipse/tycho/tycho-p2-facade/1.5.0/tycho-p2-facade-1.5.0.pom
Downloading from tycho-snapshots: https://oss.sonatype.org/content/groups/staging/org/eclipse/tycho/tycho-p2-facade/1.5.0/tycho-p2-facade-1.5.0.pom
Downloading from eclipse.maven.central.mirror: https://repo.eclipse.org/content/repositories/maven_central/org/eclipse/tycho/tycho-p2-facade/1.5.0/tycho-p2-facade-1.5.0.pom
Progress (1): 2.1 kB
                    
Downloaded from eclipse.maven.central.mirror: https://repo.eclipse.org/content/repositories/maven_central/org/eclipse/tycho/tycho-p2-facade/1.5.0/tycho-p2-facade-1.5.0.pom (2.1 kB at 58 kB/s)
Downloading from cbi-releases: https://repo.eclipse.org/content/repositories/cbi-releases/org/eclipse/tycho/tycho-p2/1.5.0/tycho-p2-1.5.0.pom
Downloading from tycho-snapshots: https://oss.sonatype.org/content/groups/staging/org/eclipse/tycho/tycho-p2/1.5.0/tycho-p2-1.5.0.pom
Downloading from eclipse.maven.central.mirror: https://repo.eclipse.org/content/repositories/maven_central/org/eclipse/tycho/tycho-p2/1.5.0/tycho-p2-1.5.0.pom
Progress (1): 1.1 kB
                    
Downloaded from eclipse.maven.central.mirror: https://repo.eclipse.org/content/repositories/maven_central/org/eclipse/tycho/tycho-p2/1.5.0/tycho-p2-1.5.0.pom (1.1 kB at 30 kB/s)
Downloading from cbi-releases: https://repo.eclipse.org/content/repositories/cbi-releases/org/eclipse/tycho/org.eclipse.tycho.p2.resolver.shared/1.5.0/org.eclipse.tycho.p2.resolver.shared-1.5.0.pom
Downloading from tycho-snapshots: https://oss.sonatype.org/content/groups/staging/org/eclipse/tycho/org.eclipse.tycho.p2.resolver.shared/1.5.0/org.eclipse.tycho.p2.resolver.shared-1.5.0.pom
Downloading from eclipse.maven.central.mirror: https://repo.eclipse.org/content/repositories/maven_central/org/eclipse/tycho/org.eclipse.tycho.p2.resolver.shared/1.5.0/org.eclipse.tycho.p2.resolver.shared-1.5.0.pom
Progress (1): 1.1 kB
                    
Downloaded from eclipse.maven.central.mirror: https://repo.eclipse.org/content/repositories/maven_central/org/eclipse/tycho/org.eclipse.tycho.p2.resolver.shared/1.5.0/org.eclipse.tycho.p2.resolver.shared-1.5.0.pom (1.1 kB at 34 kB/s)
Downloading from cbi-releases: https://repo.eclipse.org/content/repositories/cbi-releases/org/eclipse/tycho/tycho-maven-plugin/1.5.0/tycho-maven-plugin-1.5.0.jar
Downloading from cbi-releases: https://repo.eclipse.org/content/repositories/cbi-releases/org/eclipse/tycho/tycho-core/1.5.0/tycho-core-1.5.0.jar
Downloading from cbi-releases: https://repo.eclipse.org/content/repositories/cbi-releases/org/eclipse/tycho/org.eclipse.tycho.p2.tools.shared/1.5.0/org.eclipse.tycho.p2.tools.shared-1.5.0.jar
Downloading from cbi-releases: https://repo.eclipse.org/content/repositories/cbi-releases/org/eclipse/platform/org.eclipse.osgi.compatibility.state/1.1.600/org.eclipse.osgi.compatibility.state-1.1.600.jar
Downloading from cbi-releases: https://repo.eclipse.org/content/repositories/cbi-releases/org/apache/commons/commons-compress/1.18/commons-compress-1.18.jar
Downloading from cbi-releases: https://repo.eclipse.org/content/repositories/cbi-releases/org/eclipse/platform/org.eclipse.osgi/3.15.0/org.eclipse.osgi-3.15.0.jar
Downloading from cbi-releases: https://repo.eclipse.org/content/repositories/cbi-releases/org/eclipse/tycho/sisu-equinox-embedder/1.5.0/sisu-equinox-embedder-1.5.0.jar
Downloading from cbi-releases: https://repo.eclipse.org/content/repositories/cbi-releases/org/eclipse/tycho/sisu-equinox-api/1.5.0/sisu-equinox-api-1.5.0.jar
Downloading from cbi-releases: https://repo.eclipse.org/content/repositories/cbi-releases/org/eclipse/tycho/tycho-metadata-model/1.5.0/tycho-metadata-model-1.5.0.jar
Downloading from cbi-releases: https://repo.eclipse.org/content/repositories/cbi-releases/org/eclipse/tycho/tycho-embedder-api/1.5.0/tycho-embedder-api-1.5.0.jar
Downloading from cbi-releases: https://repo.eclipse.org/content/repositories/cbi-releases/org/eclipse/tycho/org.eclipse.tycho.embedder.shared/1.5.0/org.eclipse.tycho.embedder.shared-1.5.0.jar
Downloading from cbi-releases: https://repo.eclipse.org/content/repositories/cbi-releases/org/eclipse/tycho/org.eclipse.tycho.core.shared/1.5.0/org.eclipse.tycho.core.shared-1.5.0.jar
Downloading from cbi-releases: https://repo.eclipse.org/content/repositories/cbi-releases/org/eclipse/tycho/tycho-p2-facade/1.5.0/tycho-p2-facade-1.5.0.jar
Downloading from cbi-releases: https://repo.eclipse.org/content/repositories/cbi-releases/org/eclipse/tycho/org.eclipse.tycho.p2.resolver.shared/1.5.0/org.eclipse.tycho.p2.resolver.shared-1.5.0.jar
Downloading from tycho-snapshots: https://oss.sonatype.org/content/groups/staging/org/eclipse/tycho/tycho-maven-plugin/1.5.0/tycho-maven-plugin-1.5.0.jar
Downloading from tycho-snapshots: https://oss.sonatype.org/content/groups/staging/org/eclipse/tycho/tycho-core/1.5.0/tycho-core-1.5.0.jar
Downloading from tycho-snapshots: https://oss.sonatype.org/content/groups/staging/org/eclipse/platform/org.eclipse.osgi.compatibility.state/1.1.600/org.eclipse.osgi.compatibility.state-1.1.600.jar
Downloading from tycho-snapshots: https://oss.sonatype.org/content/groups/staging/org/apache/commons/commons-compress/1.18/commons-compress-1.18.jar
Downloading from tycho-snapshots: https://oss.sonatype.org/content/groups/staging/org/eclipse/tycho/org.eclipse.tycho.p2.tools.shared/1.5.0/org.eclipse.tycho.p2.tools.shared-1.5.0.jar
Downloading from tycho-snapshots: https://oss.sonatype.org/content/groups/staging/org/eclipse/platform/org.eclipse.osgi/3.15.0/org.eclipse.osgi-3.15.0.jar
Downloading from tycho-snapshots: https://oss.sonatype.org/content/groups/staging/org/eclipse/tycho/sisu-equinox-embedder/1.5.0/sisu-equinox-embedder-1.5.0.jar
Downloading from tycho-snapshots: https://oss.sonatype.org/content/groups/staging/org/eclipse/tycho/sisu-equinox-api/1.5.0/sisu-equinox-api-1.5.0.jar
Downloading from tycho-snapshots: https://oss.sonatype.org/content/groups/staging/org/eclipse/tycho/tycho-metadata-model/1.5.0/tycho-metadata-model-1.5.0.jar
Downloading from tycho-snapshots: https://oss.sonatype.org/content/groups/staging/org/eclipse/tycho/tycho-embedder-api/1.5.0/tycho-embedder-api-1.5.0.jar
Downloading from tycho-snapshots: https://oss.sonatype.org/content/groups/staging/org/eclipse/tycho/org.eclipse.tycho.embedder.shared/1.5.0/org.eclipse.tycho.embedder.shared-1.5.0.jar
Downloading from tycho-snapshots: https://oss.sonatype.org/content/groups/staging/org/eclipse/tycho/org.eclipse.tycho.core.shared/1.5.0/org.eclipse.tycho.core.shared-1.5.0.jar
Downloading from tycho-snapshots: https://oss.sonatype.org/content/groups/staging/org/eclipse/tycho/tycho-p2-facade/1.5.0/tycho-p2-facade-1.5.0.jar
Downloading from tycho-snapshots: https://oss.sonatype.org/content/groups/staging/org/eclipse/tycho/org.eclipse.tycho.p2.resolver.shared/1.5.0/org.eclipse.tycho.p2.resolver.shared-1.5.0.jar
Downloading from eclipse.maven.central.mirror: https://repo.eclipse.org/content/repositories/maven_central/org/eclipse/tycho/tycho-maven-plugin/1.5.0/tycho-maven-plugin-1.5.0.jar
Downloading from eclipse.maven.central.mirror: https://repo.eclipse.org/content/repositories/maven_central/org/eclipse/tycho/org.eclipse.tycho.p2.tools.shared/1.5.0/org.eclipse.tycho.p2.tools.shared-1.5.0.jar
Downloading from eclipse.maven.central.mirror: https://repo.eclipse.org/content/repositories/maven_central/org/eclipse/platform/org.eclipse.osgi.compatibility.state/1.1.600/org.eclipse.osgi.compatibility.state-1.1.600.jar
Downloading from eclipse.maven.central.mirror: https://repo.eclipse.org/content/repositories/maven_central/org/apache/commons/commons-compress/1.18/commons-compress-1.18.jar
Downloading from eclipse.maven.central.mirror: https://repo.eclipse.org/content/repositories/maven_central/org/eclipse/tycho/tycho-core/1.5.0/tycho-core-1.5.0.jar
Progress (1): 4.1/22 kB
Progress (2): 4.1/22 kB | 4.1/248 kB
Progress (2): 7.7/22 kB | 4.1/248 kB
Progress (2): 7.7/22 kB | 7.7/248 kB
Progress (2): 12/22 kB | 7.7/248 kB 
Progress (2): 16/22 kB | 7.7/248 kB
Progress (2): 16/22 kB | 12/248 kB 
Progress (2): 20/22 kB | 12/248 kB
Progress (3): 20/22 kB | 12/248 kB | 4.1/592 kB
Progress (3): 20/22 kB | 16/248 kB | 4.1/592 kB
Progress (3): 20/22 kB | 16/248 kB | 7.7/592 kB
Progress (3): 22 kB | 16/248 kB | 7.7/592 kB   
Progress (3): 22 kB | 20/248 kB | 7.7/592 kB
Progress (3): 22 kB | 20/248 kB | 12/592 kB 
Progress (4): 22 kB | 20/248 kB | 12/592 kB | 4.1/5.4 kB
Progress (4): 22 kB | 20/248 kB | 16/592 kB | 4.1/5.4 kB
Progress (4): 22 kB | 24/248 kB | 16/592 kB | 4.1/5.4 kB
Progress (4): 22 kB | 24/248 kB | 20/592 kB | 4.1/5.4 kB
Progress (4): 22 kB | 24/248 kB | 20/592 kB | 5.4 kB    
Progress (4): 22 kB | 24/248 kB | 24/592 kB | 5.4 kB
Progress (4): 22 kB | 28/248 kB | 24/592 kB | 5.4 kB
Progress (4): 22 kB | 28/248 kB | 28/592 kB | 5.4 kB
Progress (5): 22 kB | 28/248 kB | 28/592 kB | 5.4 kB | 4.1/206 kB
Progress (5): 22 kB | 28/248 kB | 32/592 kB | 5.4 kB | 4.1/206 kB
Progress (5): 22 kB | 32/248 kB | 32/592 kB | 5.4 kB | 4.1/206 kB
Progress (5): 22 kB | 32/248 kB | 36/592 kB | 5.4 kB | 4.1/206 kB
Progress (5): 22 kB | 32/248 kB | 36/592 kB | 5.4 kB | 7.7/206 kB
Progress (5): 22 kB | 32/248 kB | 40/592 kB | 5.4 kB | 7.7/206 kB
Progress (5): 22 kB | 36/248 kB | 40/592 kB | 5.4 kB | 7.7/206 kB
Progress (5): 22 kB | 36/248 kB | 44/592 kB | 5.4 kB | 7.7/206 kB
Progress (5): 22 kB | 36/248 kB | 44/592 kB | 5.4 kB | 12/206 kB 
                                                                
Downloaded from eclipse.maven.central.mirror: https://repo.eclipse.org/content/repositories/maven_central/org/eclipse/tycho/org.eclipse.tycho.p2.tools.shared/1.5.0/org.eclipse.tycho.p2.tools.shared-1.5.0.jar (22 kB at 442 kB/s)
Progress (4): 36/248 kB | 48/592 kB | 5.4 kB | 12/206 kB
Progress (4): 40/248 kB | 48/592 kB | 5.4 kB | 12/206 kB
Progress (4): 40/248 kB | 52/592 kB | 5.4 kB | 12/206 kB
                                                        
Downloading from eclipse.maven.central.mirror: https://repo.eclipse.org/content/repositories/maven_central/org/eclipse/platform/org.eclipse.osgi/3.15.0/org.eclipse.osgi-3.15.0.jar
Progress (4): 40/248 kB | 52/592 kB | 5.4 kB | 16/206 kB
                                                        
Downloaded from eclipse.maven.central.mirror: https://repo.eclipse.org/content/repositories/maven_central/org/eclipse/tycho/tycho-maven-plugin/1.5.0/tycho-maven-plugin-1.5.0.jar (5.4 kB at 102 kB/s)
Progress (3): 40/248 kB | 52/592 kB | 20/206 kB
Progress (3): 40/248 kB | 56/592 kB | 20/206 kB
Progress (3): 44/248 kB | 56/592 kB | 20/206 kB
Progress (3): 44/248 kB | 56/592 kB | 24/206 kB
                                               
Downloading from eclipse.maven.central.mirror: https://repo.eclipse.org/content/repositories/maven_central/org/eclipse/tycho/sisu-equinox-embedder/1.5.0/sisu-equinox-embedder-1.5.0.jar
Progress (3): 44/248 kB | 56/592 kB | 28/206 kB
Progress (3): 44/248 kB | 60/592 kB | 28/206 kB
Progress (3): 48/248 kB | 60/592 kB | 28/206 kB
Progress (3): 48/248 kB | 64/592 kB | 28/206 kB
Progress (3): 48/248 kB | 64/592 kB | 32/206 kB
Progress (3): 52/248 kB | 64/592 kB | 32/206 kB
Progress (3): 52/248 kB | 68/592 kB | 32/206 kB
Progress (3): 52/248 kB | 68/592 kB | 36/206 kB
Progress (3): 56/248 kB | 68/592 kB | 36/206 kB
Progress (3): 56/248 kB | 68/592 kB | 40/206 kB
Progress (3): 56/248 kB | 72/592 kB | 40/206 kB
Progress (3): 60/248 kB | 72/592 kB | 40/206 kB
Progress (3): 60/248 kB | 72/592 kB | 44/206 kB
Progress (3): 64/248 kB | 72/592 kB | 44/206 kB
Progress (3): 64/248 kB | 76/592 kB | 44/206 kB
Progress (3): 64/248 kB | 76/592 kB | 48/206 kB
Progress (3): 68/248 kB | 76/592 kB | 48/206 kB
Progress (4): 68/248 kB | 76/592 kB | 48/206 kB | 0/1.5 MB
Progress (4): 68/248 kB | 80/592 kB | 48/206 kB | 0/1.5 MB
Progress (4): 68/248 kB | 80/592 kB | 48/206 kB | 0/1.5 MB
Progress (4): 68/248 kB | 80/592 kB | 52/206 kB | 0/1.5 MB
Progress (4): 72/248 kB | 80/592 kB | 52/206 kB | 0/1.5 MB
Progress (4): 72/248 kB | 80/592 kB | 56/206 kB | 0/1.5 MB
Progress (4): 72/248 kB | 80/592 kB | 56/206 kB | 0/1.5 MB
Progress (4): 72/248 kB | 84/592 kB | 56/206 kB | 0/1.5 MB
Progress (4): 72/248 kB | 84/592 kB | 56/206 kB | 0/1.5 MB
Progress (4): 72/248 kB | 84/592 kB | 60/206 kB | 0/1.5 MB
Progress (4): 76/248 kB | 84/592 kB | 60/206 kB | 0/1.5 MB
Progress (4): 76/248 kB | 84/592 kB | 64/206 kB | 0/1.5 MB
Progress (4): 76/248 kB | 84/592 kB | 64/206 kB | 0/1.5 MB
Progress (4): 76/248 kB | 88/592 kB | 64/206 kB | 0/1.5 MB
Progress (4): 76/248 kB | 88/592 kB | 64/206 kB | 0/1.5 MB
Progress (4): 76/248 kB | 88/592 kB | 68/206 kB | 0/1.5 MB
Progress (4): 80/248 kB | 88/592 kB | 68/206 kB | 0/1.5 MB
Progress (4): 80/248 kB | 88/592 kB | 68/206 kB | 0/1.5 MB
Progress (4): 80/248 kB | 88/592 kB | 72/206 kB | 0/1.5 MB
Progress (4): 80/248 kB | 92/592 kB | 72/206 kB | 0/1.5 MB
Progress (5): 80/248 kB | 92/592 kB | 72/206 kB | 0/1.5 MB | 4.1/13 kB
Progress (5): 80/248 kB | 96/592 kB | 72/206 kB | 0/1.5 MB | 4.1/13 kB
Progress (5): 80/248 kB | 96/592 kB | 76/206 kB | 0/1.5 MB | 4.1/13 kB
Progress (5): 84/248 kB | 96/592 kB | 76/206 kB | 0/1.5 MB | 4.1/13 kB
Progress (5): 84/248 kB | 96/592 kB | 76/206 kB | 0/1.5 MB | 4.1/13 kB
Progress (5): 88/248 kB | 96/592 kB | 76/206 kB | 0/1.5 MB | 4.1/13 kB
Progress (5): 88/248 kB | 96/592 kB | 80/206 kB | 0/1.5 MB | 4.1/13 kB
Progress (5): 88/248 kB | 100/592 kB | 80/206 kB | 0/1.5 MB | 4.1/13 kB
Progress (5): 88/248 kB | 100/592 kB | 80/206 kB | 0/1.5 MB | 7.7/13 kB
Progress (5): 88/248 kB | 104/592 kB | 80/206 kB | 0/1.5 MB | 7.7/13 kB
Progress (5): 88/248 kB | 104/592 kB | 84/206 kB | 0/1.5 MB | 7.7/13 kB
Progress (5): 92/248 kB | 104/592 kB | 84/206 kB | 0/1.5 MB | 7.7/13 kB
Progress (5): 92/248 kB | 104/592 kB | 84/206 kB | 0/1.5 MB | 7.7/13 kB
Progress (5): 96/248 kB | 104/592 kB | 84/206 kB | 0/1.5 MB | 7.7/13 kB
Progress (5): 96/248 kB | 108/592 kB | 84/206 kB | 0/1.5 MB | 7.7/13 kB
Progress (5): 96/248 kB | 108/592 kB | 88/206 kB | 0/1.5 MB | 7.7/13 kB
Progress (5): 96/248 kB | 108/592 kB | 88/206 kB | 0/1.5 MB | 12/13 kB 
Progress (5): 96/248 kB | 108/592 kB | 92/206 kB | 0/1.5 MB | 12/13 kB
Progress (5): 96/248 kB | 112/592 kB | 92/206 kB | 0/1.5 MB | 12/13 kB
Progress (5): 100/248 kB | 112/592 kB | 92/206 kB | 0/1.5 MB | 12/13 kB
Progress (5): 100/248 kB | 112/592 kB | 92/206 kB | 0/1.5 MB | 12/13 kB
Progress (5): 100/248 kB | 116/592 kB | 92/206 kB | 0/1.5 MB | 12/13 kB
Progress (5): 104/248 kB | 116/592 kB | 92/206 kB | 0/1.5 MB | 12/13 kB
Progress (5): 104/248 kB | 116/592 kB | 96/206 kB | 0/1.5 MB | 12/13 kB
Progress (5): 104/248 kB | 116/592 kB | 96/206 kB | 0/1.5 MB | 13 kB   
Progress (5): 108/248 kB | 116/592 kB | 96/206 kB | 0/1.5 MB | 13 kB
Progress (5): 108/248 kB | 120/592 kB | 96/206 kB | 0/1.5 MB | 13 kB
Progress (5): 108/248 kB | 120/592 kB | 96/206 kB | 0/1.5 MB | 13 kB
Progress (5): 112/248 kB | 120/592 kB | 96/206 kB | 0/1.5 MB | 13 kB
Progress (5): 112/248 kB | 120/592 kB | 100/206 kB | 0/1.5 MB | 13 kB
Progress (5): 112/248 kB | 124/592 kB | 100/206 kB | 0/1.5 MB | 13 kB
Progress (5): 112/248 kB | 124/592 kB | 100/206 kB | 0/1.5 MB | 13 kB
Progress (5): 112/248 kB | 124/592 kB | 104/206 kB | 0/1.5 MB | 13 kB
Progress (5): 112/248 kB | 124/592 kB | 104/206 kB | 0/1.5 MB | 13 kB
Progress (5): 112/248 kB | 128/592 kB | 104/206 kB | 0/1.5 MB | 13 kB
Progress (5): 116/248 kB | 128/592 kB | 104/206 kB | 0/1.5 MB | 13 kB
Progress (5): 116/248 kB | 128/592 kB | 104/206 kB | 0.1/1.5 MB | 13 kB
Progress (5): 116/248 kB | 128/592 kB | 108/206 kB | 0.1/1.5 MB | 13 kB
Progress (5): 116/248 kB | 128/592 kB | 108/206 kB | 0.1/1.5 MB | 13 kB
Progress (5): 116/248 kB | 132/592 kB | 108/206 kB | 0.1/1.5 MB | 13 kB
Progress (5): 120/248 kB | 132/592 kB | 108/206 kB | 0.1/1.5 MB | 13 kB
Progress (5): 120/248 kB | 132/592 kB | 108/206 kB | 0.1/1.5 MB | 13 kB
Progress (5): 120/248 kB | 136/592 kB | 108/206 kB | 0.1/1.5 MB | 13 kB
Progress (5): 120/248 kB | 136/592 kB | 112/206 kB | 0.1/1.5 MB | 13 kB
Progress (5): 124/248 kB | 136/592 kB | 112/206 kB | 0.1/1.5 MB | 13 kB
Progress (5): 124/248 kB | 136/592 kB | 112/206 kB | 0.1/1.5 MB | 13 kB
Progress (5): 128/248 kB | 136/592 kB | 112/206 kB | 0.1/1.5 MB | 13 kB
Progress (5): 128/248 kB | 140/592 kB | 112/206 kB | 0.1/1.5 MB | 13 kB
Progress (5): 128/248 kB | 140/592 kB | 116/206 kB | 0.1/1.5 MB | 13 kB
Progress (5): 128/248 kB | 140/592 kB | 116/206 kB | 0.1/1.5 MB | 13 kB
Progress (5): 128/248 kB | 144/592 kB | 116/206 kB | 0.1/1.5 MB | 13 kB
Progress (5): 128/248 kB | 144/592 kB | 116/206 kB | 0.1/1.5 MB | 13 kB
Progress (5): 132/248 kB | 144/592 kB | 116/206 kB | 0.1/1.5 MB | 13 kB
Progress (5): 132/248 kB | 144/592 kB | 120/206 kB | 0.1/1.5 MB | 13 kB
Progress (5): 136/248 kB | 144/592 kB | 120/206 kB | 0.1/1.5 MB | 13 kB
Progress (5): 136/248 kB | 148/592 kB | 120/206 kB | 0.1/1.5 MB | 13 kB
Progress (5): 136/248 kB | 148/592 kB | 124/206 kB | 0.1/1.5 MB | 13 kB
Progress (5): 136/248 kB | 148/592 kB | 124/206 kB | 0.1/1.5 MB | 13 kB
Progress (5): 136/248 kB | 148/592 kB | 128/206 kB | 0.1/1.5 MB | 13 kB
Progress (5): 140/248 kB | 148/592 kB | 128/206 kB | 0.1/1.5 MB | 13 kB
Progress (5): 140/248 kB | 152/592 kB | 128/206 kB | 0.1/1.5 MB | 13 kB
Progress (5): 144/248 kB | 152/592 kB | 128/206 kB | 0.1/1.5 MB | 13 kB
Progress (5): 144/248 kB | 152/592 kB | 128/206 kB | 0.1/1.5 MB | 13 kB
Progress (5): 144/248 kB | 152/592 kB | 132/206 kB | 0.1/1.5 MB | 13 kB
Progress (5): 144/248 kB | 156/592 kB | 132/206 kB | 0.1/1.5 MB | 13 kB
Progress (5): 148/248 kB | 156/592 kB | 132/206 kB | 0.1/1.5 MB | 13 kB
Progress (5): 148/248 kB | 156/592 kB | 136/206 kB | 0.1/1.5 MB | 13 kB
Progress (5): 152/248 kB | 156/592 kB | 136/206 kB | 0.1/1.5 MB | 13 kB
Progress (5): 152/248 kB | 156/592 kB | 136/206 kB | 0.1/1.5 MB | 13 kB
Progress (5): 152/248 kB | 160/592 kB | 136/206 kB | 0.1/1.5 MB | 13 kB
                                                                       
Downloaded from eclipse.maven.central.mirror: https://repo.eclipse.org/content/repositories/maven_central/org/eclipse/tycho/sisu-equinox-embedder/1.5.0/sisu-equinox-embedder-1.5.0.jar (13 kB at 85 kB/s)
Progress (4): 152/248 kB | 160/592 kB | 136/206 kB | 0.1/1.5 MB
Progress (4): 152/248 kB | 160/592 kB | 140/206 kB | 0.1/1.5 MB
                                                               
Downloading from eclipse.maven.central.mirror: https://repo.eclipse.org/content/repositories/maven_central/org/eclipse/tycho/sisu-equinox-api/1.5.0/sisu-equinox-api-1.5.0.jar
Progress (4): 152/248 kB | 164/592 kB | 140/206 kB | 0.1/1.5 MB
Progress (4): 156/248 kB | 164/592 kB | 140/206 kB | 0.1/1.5 MB
Progress (4): 156/248 kB | 168/592 kB | 140/206 kB | 0.1/1.5 MB
Progress (4): 156/248 kB | 168/592 kB | 140/206 kB | 0.1/1.5 MB
Progress (4): 156/248 kB | 168/592 kB | 144/206 kB | 0.1/1.5 MB
Progress (4): 156/248 kB | 168/592 kB | 144/206 kB | 0.1/1.5 MB
Progress (4): 160/248 kB | 168/592 kB | 144/206 kB | 0.1/1.5 MB
Progress (4): 160/248 kB | 172/592 kB | 144/206 kB | 0.1/1.5 MB
Progress (4): 160/248 kB | 172/592 kB | 144/206 kB | 0.1/1.5 MB
Progress (4): 160/248 kB | 172/592 kB | 148/206 kB | 0.1/1.5 MB
Progress (4): 164/248 kB | 172/592 kB | 148/206 kB | 0.1/1.5 MB
Progress (4): 164/248 kB | 172/592 kB | 148/206 kB | 0.1/1.5 MB
Progress (4): 164/248 kB | 176/592 kB | 148/206 kB | 0.1/1.5 MB
Progress (4): 168/248 kB | 176/592 kB | 148/206 kB | 0.1/1.5 MB
Progress (4): 168/248 kB | 176/592 kB | 152/206 kB | 0.1/1.5 MB
Progress (4): 168/248 kB | 176/592 kB | 152/206 kB | 0.1/1.5 MB
Progress (4): 168/248 kB | 180/592 kB | 152/206 kB | 0.1/1.5 MB
Progress (4): 172/248 kB | 180/592 kB | 152/206 kB | 0.1/1.5 MB
Progress (4): 172/248 kB | 180/592 kB | 152/206 kB | 0.1/1.5 MB
Progress (4): 172/248 kB | 180/592 kB | 156/206 kB | 0.1/1.5 MB
Progress (4): 176/248 kB | 180/592 kB | 156/206 kB | 0.1/1.5 MB
Progress (4): 176/248 kB | 184/592 kB | 156/206 kB | 0.1/1.5 MB
Progress (4): 176/248 kB | 184/592 kB | 156/206 kB | 0.1/1.5 MB
Progress (4): 176/248 kB | 184/592 kB | 160/206 kB | 0.1/1.5 MB
Progress (4): 176/248 kB | 184/592 kB | 160/206 kB | 0.1/1.5 MB
Progress (4): 180/248 kB | 184/592 kB | 160/206 kB | 0.1/1.5 MB
Progress (4): 180/248 kB | 188/592 kB | 160/206 kB | 0.1/1.5 MB
Progress (4): 184/248 kB | 188/592 kB | 160/206 kB | 0.1/1.5 MB
Progress (4): 184/248 kB | 188/592 kB | 164/206 kB | 0.1/1.5 MB
Progress (4): 184/248 kB | 192/592 kB | 164/206 kB | 0.1/1.5 MB
Progress (4): 184/248 kB | 192/592 kB | 164/206 kB | 0.1/1.5 MB
Progress (4): 188/248 kB | 192/592 kB | 164/206 kB | 0.1/1.5 MB
Progress (4): 188/248 kB | 192/592 kB | 168/206 kB | 0.1/1.5 MB
Progress (4): 188/248 kB | 196/592 kB | 168/206 kB | 0.1/1.5 MB
Progress (4): 192/248 kB | 196/592 kB | 168/206 kB | 0.1/1.5 MB
Progress (4): 192/248 kB | 196/592 kB | 168/206 kB | 0.1/1.5 MB
Progress (4): 192/248 kB | 196/592 kB | 172/206 kB | 0.1/1.5 MB
Progress (4): 192/248 kB | 200/592 kB | 172/206 kB | 0.1/1.5 MB
Progress (4): 196/248 kB | 200/592 kB | 172/206 kB | 0.1/1.5 MB
Progress (4): 196/248 kB | 200/592 kB | 176/206 kB | 0.1/1.5 MB
Progress (4): 200/248 kB | 200/592 kB | 176/206 kB | 0.1/1.5 MB
Progress (4): 200/248 kB | 200/592 kB | 176/206 kB | 0.1/1.5 MB
Progress (4): 200/248 kB | 204/592 kB | 176/206 kB | 0.1/1.5 MB
Progress (4): 200/248 kB | 204/592 kB | 180/206 kB | 0.1/1.5 MB
Progress (4): 204/248 kB | 204/592 kB | 180/206 kB | 0.1/1.5 MB
Progress (5): 204/248 kB | 204/592 kB | 180/206 kB | 0.1/1.5 MB | 3.1 kB
Progress (5): 204/248 kB | 204/592 kB | 180/206 kB | 0.1/1.5 MB | 3.1 kB
Progress (5): 208/248 kB | 204/592 kB | 180/206 kB | 0.1/1.5 MB | 3.1 kB
Progress (5): 208/248 kB | 204/592 kB | 184/206 kB | 0.1/1.5 MB | 3.1 kB
Progress (5): 208/248 kB | 208/592 kB | 184/206 kB | 0.1/1.5 MB | 3.1 kB
Progress (5): 208/248 kB | 208/592 kB | 184/206 kB | 0.1/1.5 MB | 3.1 kB
Progress (5): 212/248 kB | 208/592 kB | 184/206 kB | 0.1/1.5 MB | 3.1 kB
Progress (5): 212/248 kB | 208/592 kB | 184/206 kB | 0.1/1.5 MB | 3.1 kB
Progress (5): 212/248 kB | 208/592 kB | 188/206 kB | 0.1/1.5 MB | 3.1 kB
Progress (5): 216/248 kB | 208/592 kB | 188/206 kB | 0.1/1.5 MB | 3.1 kB
Progress (5): 216/248 kB | 212/592 kB | 188/206 kB | 0.1/1.5 MB | 3.1 kB
Progress (5): 216/248 kB | 216/592 kB | 188/206 kB | 0.1/1.5 MB | 3.1 kB
Progress (5): 216/248 kB | 220/592 kB | 188/206 kB | 0.1/1.5 MB | 3.1 kB
Progress (5): 216/248 kB | 224/592 kB | 188/206 kB | 0.1/1.5 MB | 3.1 kB
                                                                        
Downloaded from eclipse.maven.central.mirror: https://repo.eclipse.org/content/repositories/maven_central/org/eclipse/tycho/sisu-equinox-api/1.5.0/sisu-equinox-api-1.5.0.jar (3.1 kB at 18 kB/s)
Downloading from eclipse.maven.central.mirror: https://repo.eclipse.org/content/repositories/maven_central/org/eclipse/tycho/tycho-metadata-model/1.5.0/tycho-metadata-model-1.5.0.jar
Progress (4): 216/248 kB | 224/592 kB | 188/206 kB | 0.1/1.5 MB
Progress (4): 216/248 kB | 224/592 kB | 192/206 kB | 0.1/1.5 MB
Progress (4): 216/248 kB | 224/592 kB | 192/206 kB | 0.2/1.5 MB
Progress (4): 216/248 kB | 228/592 kB | 192/206 kB | 0.2/1.5 MB
Progress (4): 220/248 kB | 228/592 kB | 192/206 kB | 0.2/1.5 MB
Progress (4): 220/248 kB | 228/592 kB | 192/206 kB | 0.2/1.5 MB
Progress (4): 220/248 kB | 228/592 kB | 196/206 kB | 0.2/1.5 MB
Progress (4): 220/248 kB | 232/592 kB | 196/206 kB | 0.2/1.5 MB
Progress (4): 220/248 kB | 232/592 kB | 200/206 kB | 0.2/1.5 MB
Progress (4): 220/248 kB | 232/592 kB | 200/206 kB | 0.2/1.5 MB
Progress (4): 224/248 kB | 232/592 kB | 200/206 kB | 0.2/1.5 MB
Progress (4): 224/248 kB | 232/592 kB | 204/206 kB | 0.2/1.5 MB
Progress (4): 224/248 kB | 236/592 kB | 204/206 kB | 0.2/1.5 MB
Progress (4): 224/248 kB | 236/592 kB | 206 kB | 0.2/1.5 MB    
Progress (4): 224/248 kB | 240/592 kB | 206 kB | 0.2/1.5 MB
Progress (4): 224/248 kB | 240/592 kB | 206 kB | 0.2/1.5 MB
Progress (4): 228/248 kB | 240/592 kB | 206 kB | 0.2/1.5 MB
Progress (4): 228/248 kB | 240/592 kB | 206 kB | 0.2/1.5 MB
Progress (4): 232/248 kB | 240/592 kB | 206 kB | 0.2/1.5 MB
Progress (4): 232/248 kB | 244/592 kB | 206 kB | 0.2/1.5 MB
Progress (4): 232/248 kB | 248/592 kB | 206 kB | 0.2/1.5 MB
Progress (4): 232/248 kB | 248/592 kB | 206 kB | 0.2/1.5 MB
Progress (4): 236/248 kB | 248/592 kB | 206 kB | 0.2/1.5 MB
Progress (4): 236/248 kB | 248/592 kB | 206 kB | 0.2/1.5 MB
Progress (4): 240/248 kB | 248/592 kB | 206 kB | 0.2/1.5 MB
Progress (4): 240/248 kB | 252/592 kB | 206 kB | 0.2/1.5 MB
Progress (4): 240/248 kB | 252/592 kB | 206 kB | 0.2/1.5 MB
Progress (4): 244/248 kB | 252/592 kB | 206 kB | 0.2/1.5 MB
Progress (4): 244/248 kB | 256/592 kB | 206 kB | 0.2/1.5 MB
Progress (4): 248 kB | 256/592 kB | 206 kB | 0.2/1.5 MB    
Progress (4): 248 kB | 256/592 kB | 206 kB | 0.2/1.5 MB
Progress (4): 248 kB | 260/592 kB | 206 kB | 0.2/1.5 MB
Progress (4): 248 kB | 264/592 kB | 206 kB | 0.2/1.5 MB
Progress (4): 248 kB | 264/592 kB | 206 kB | 0.2/1.5 MB
Progress (4): 248 kB | 268/592 kB | 206 kB | 0.2/1.5 MB
Progress (4): 248 kB | 268/592 kB | 206 kB | 0.2/1.5 MB
Progress (4): 248 kB | 272/592 kB | 206 kB | 0.2/1.5 MB
Progress (4): 248 kB | 272/592 kB | 206 kB | 0.2/1.5 MB
Progress (4): 248 kB | 276/592 kB | 206 kB | 0.2/1.5 MB
Progress (4): 248 kB | 276/592 kB | 206 kB | 0.2/1.5 MB
Progress (4): 248 kB | 280/592 kB | 206 kB | 0.2/1.5 MB
Progress (4): 248 kB | 280/592 kB | 206 kB | 0.2/1.5 MB
Progress (4): 248 kB | 284/592 kB | 206 kB | 0.2/1.5 MB
Progress (4): 248 kB | 284/592 kB | 206 kB | 0.2/1.5 MB
Progress (4): 248 kB | 288/592 kB | 206 kB | 0.2/1.5 MB
Progress (4): 248 kB | 288/592 kB | 206 kB | 0.2/1.5 MB
Progress (4): 248 kB | 292/592 kB | 206 kB | 0.2/1.5 MB
Progress (4): 248 kB | 292/592 kB | 206 kB | 0.2/1.5 MB
Progress (4): 248 kB | 296/592 kB | 206 kB | 0.2/1.5 MB
Progress (4): 248 kB | 296/592 kB | 206 kB | 0.2/1.5 MB
Progress (4): 248 kB | 296/592 kB | 206 kB | 0.2/1.5 MB
Progress (4): 248 kB | 300/592 kB | 206 kB | 0.2/1.5 MB
Progress (5): 248 kB | 300/592 kB | 206 kB | 0.2/1.5 MB | 4.1/38 kB
Progress (5): 248 kB | 304/592 kB | 206 kB | 0.2/1.5 MB | 4.1/38 kB
Progress (5): 248 kB | 304/592 kB | 206 kB | 0.2/1.5 MB | 4.1/38 kB
Progress (5): 248 kB | 308/592 kB | 206 kB | 0.2/1.5 MB | 4.1/38 kB
Progress (5): 248 kB | 308/592 kB | 206 kB | 0.2/1.5 MB | 7.7/38 kB
Progress (5): 248 kB | 312/592 kB | 206 kB | 0.2/1.5 MB | 7.7/38 kB
Progress (5): 248 kB | 312/592 kB | 206 kB | 0.2/1.5 MB | 7.7/38 kB
Progress (5): 248 kB | 312/592 kB | 206 kB | 0.2/1.5 MB | 12/38 kB 
Progress (5): 248 kB | 312/592 kB | 206 kB | 0.2/1.5 MB | 12/38 kB
Progress (5): 248 kB | 316/592 kB | 206 kB | 0.2/1.5 MB | 12/38 kB
Progress (5): 248 kB | 316/592 kB | 206 kB | 0.2/1.5 MB | 12/38 kB
Progress (5): 248 kB | 316/592 kB | 206 kB | 0.2/1.5 MB | 16/38 kB
Progress (5): 248 kB | 320/592 kB | 206 kB | 0.2/1.5 MB | 16/38 kB
Progress (5): 248 kB | 320/592 kB | 206 kB | 0.2/1.5 MB | 16/38 kB
Progress (5): 248 kB | 324/592 kB | 206 kB | 0.2/1.5 MB | 16/38 kB
Progress (5): 248 kB | 324/592 kB | 206 kB | 0.2/1.5 MB | 20/38 kB
                                                                  
Downloaded from eclipse.maven.central.mirror: https://repo.eclipse.org/content/repositories/maven_central/org/eclipse/platform/org.eclipse.osgi.compatibility.state/1.1.600/org.eclipse.osgi.compatibility.state-1.1.600.jar (248 kB at 998 kB/s)
Progress (4): 328/592 kB | 206 kB | 0.2/1.5 MB | 20/38 kB
Progress (4): 328/592 kB | 206 kB | 0.2/1.5 MB | 20/38 kB
                                                         
Downloading from eclipse.maven.central.mirror: https://repo.eclipse.org/content/repositories/maven_central/org/eclipse/tycho/tycho-embedder-api/1.5.0/tycho-embedder-api-1.5.0.jar
Progress (4): 328/592 kB | 206 kB | 0.2/1.5 MB | 24/38 kB
                                                         
Downloaded from eclipse.maven.central.mirror: https://repo.eclipse.org/content/repositories/maven_central/org/eclipse/tycho/tycho-core/1.5.0/tycho-core-1.5.0.jar (206 kB at 821 kB/s)
Progress (3): 328/592 kB | 0.2/1.5 MB | 28/38 kB
Progress (3): 328/592 kB | 0.3/1.5 MB | 28/38 kB
Progress (3): 332/592 kB | 0.3/1.5 MB | 28/38 kB
Progress (3): 332/592 kB | 0.3/1.5 MB | 28/38 kB
Progress (3): 332/592 kB | 0.3/1.5 MB | 32/38 kB
                                                
Downloading from eclipse.maven.central.mirror: https://repo.eclipse.org/content/repositories/maven_central/org/eclipse/tycho/org.eclipse.tycho.embedder.shared/1.5.0/org.eclipse.tycho.embedder.shared-1.5.0.jar
Progress (3): 332/592 kB | 0.3/1.5 MB | 33/38 kB
Progress (3): 332/592 kB | 0.3/1.5 MB | 33/38 kB
Progress (3): 336/592 kB | 0.3/1.5 MB | 33/38 kB
Progress (3): 336/592 kB | 0.3/1.5 MB | 33/38 kB
Progress (3): 340/592 kB | 0.3/1.5 MB | 33/38 kB
Progress (3): 340/592 kB | 0.3/1.5 MB | 37/38 kB
Progress (3): 340/592 kB | 0.3/1.5 MB | 37/38 kB
Progress (3): 344/592 kB | 0.3/1.5 MB | 37/38 kB
Progress (3): 344/592 kB | 0.3/1.5 MB | 37/38 kB
Progress (3): 344/592 kB | 0.3/1.5 MB | 38 kB   
Progress (3): 348/592 kB | 0.3/1.5 MB | 38 kB
Progress (3): 348/592 kB | 0.3/1.5 MB | 38 kB
Progress (3): 352/592 kB | 0.3/1.5 MB | 38 kB
Progress (3): 352/592 kB | 0.3/1.5 MB | 38 kB
Progress (3): 356/592 kB | 0.3/1.5 MB | 38 kB
Progress (3): 360/592 kB | 0.3/1.5 MB | 38 kB
Progress (3): 360/592 kB | 0.3/1.5 MB | 38 kB
Progress (3): 364/592 kB | 0.3/1.5 MB | 38 kB
Progress (3): 364/592 kB | 0.3/1.5 MB | 38 kB
Progress (3): 368/592 kB | 0.3/1.5 MB | 38 kB
Progress (3): 368/592 kB | 0.3/1.5 MB | 38 kB
Progress (3): 368/592 kB | 0.3/1.5 MB | 38 kB
Progress (3): 372/592 kB | 0.3/1.5 MB | 38 kB
Progress (3): 376/592 kB | 0.3/1.5 MB | 38 kB
Progress (3): 376/592 kB | 0.3/1.5 MB | 38 kB
Progress (3): 380/592 kB | 0.3/1.5 MB | 38 kB
Progress (3): 380/592 kB | 0.3/1.5 MB | 38 kB
Progress (3): 384/592 kB | 0.3/1.5 MB | 38 kB
Progress (3): 384/592 kB | 0.3/1.5 MB | 38 kB
Progress (3): 388/592 kB | 0.3/1.5 MB | 38 kB
Progress (3): 388/592 kB | 0.3/1.5 MB | 38 kB
Progress (3): 392/592 kB | 0.3/1.5 MB | 38 kB
Progress (3): 392/592 kB | 0.3/1.5 MB | 38 kB
Progress (3): 396/592 kB | 0.3/1.5 MB | 38 kB
Progress (3): 396/592 kB | 0.3/1.5 MB | 38 kB
Progress (3): 400/592 kB | 0.3/1.5 MB | 38 kB
Progress (3): 400/592 kB | 0.3/1.5 MB | 38 kB
Progress (3): 404/592 kB | 0.3/1.5 MB | 38 kB
Progress (3): 404/592 kB | 0.3/1.5 MB | 38 kB
Progress (3): 408/592 kB | 0.3/1.5 MB | 38 kB
Progress (3): 408/592 kB | 0.3/1.5 MB | 38 kB
Progress (3): 412/592 kB | 0.3/1.5 MB | 38 kB
Progress (3): 412/592 kB | 0.3/1.5 MB | 38 kB
Progress (3): 416/592 kB | 0.3/1.5 MB | 38 kB
Progress (3): 416/592 kB | 0.3/1.5 MB | 38 kB
Progress (3): 420/592 kB | 0.3/1.5 MB | 38 kB
Progress (3): 420/592 kB | 0.3/1.5 MB | 38 kB
Progress (3): 424/592 kB | 0.3/1.5 MB | 38 kB
Progress (3): 424/592 kB | 0.3/1.5 MB | 38 kB
Progress (3): 428/592 kB | 0.3/1.5 MB | 38 kB
Progress (3): 428/592 kB | 0.4/1.5 MB | 38 kB
Progress (3): 432/592 kB | 0.4/1.5 MB | 38 kB
Progress (3): 432/592 kB | 0.4/1.5 MB | 38 kB
Progress (3): 436/592 kB | 0.4/1.5 MB | 38 kB
Progress (3): 436/592 kB | 0.4/1.5 MB | 38 kB
Progress (3): 440/592 kB | 0.4/1.5 MB | 38 kB
Progress (3): 440/592 kB | 0.4/1.5 MB | 38 kB
Progress (3): 440/592 kB | 0.4/1.5 MB | 38 kB
Progress (3): 444/592 kB | 0.4/1.5 MB | 38 kB
Progress (3): 448/592 kB | 0.4/1.5 MB | 38 kB
Progress (3): 448/592 kB | 0.4/1.5 MB | 38 kB
Progress (3): 452/592 kB | 0.4/1.5 MB | 38 kB
Progress (3): 452/592 kB | 0.4/1.5 MB | 38 kB
Progress (3): 456/592 kB | 0.4/1.5 MB | 38 kB
Progress (3): 456/592 kB | 0.4/1.5 MB | 38 kB
Progress (3): 460/592 kB | 0.4/1.5 MB | 38 kB
Progress (3): 460/592 kB | 0.4/1.5 MB | 38 kB
Progress (3): 464/592 kB | 0.4/1.5 MB | 38 kB
Progress (3): 464/592 kB | 0.4/1.5 MB | 38 kB
Progress (3): 468/592 kB | 0.4/1.5 MB | 38 kB
Progress (3): 468/592 kB | 0.4/1.5 MB | 38 kB
Progress (3): 472/592 kB | 0.4/1.5 MB | 38 kB
Progress (3): 472/592 kB | 0.4/1.5 MB | 38 kB
Progress (3): 476/592 kB | 0.4/1.5 MB | 38 kB
Progress (3): 480/592 kB | 0.4/1.5 MB | 38 kB
Progress (3): 484/592 kB | 0.4/1.5 MB | 38 kB
Progress (3): 488/592 kB | 0.4/1.5 MB | 38 kB
                                             
Downloaded from eclipse.maven.central.mirror: https://repo.eclipse.org/content/repositories/maven_central/org/eclipse/tycho/tycho-metadata-model/1.5.0/tycho-metadata-model-1.5.0.jar (38 kB at 115 kB/s)
Progress (2): 492/592 kB | 0.4/1.5 MB
Progress (3): 492/592 kB | 0.4/1.5 MB | 4.1/7.0 kB
Progress (3): 492/592 kB | 0.4/1.5 MB | 4.1/7.0 kB
Progress (3): 492/592 kB | 0.4/1.5 MB | 7.0 kB    
Progress (3): 496/592 kB | 0.4/1.5 MB | 7.0 kB
Progress (4): 496/592 kB | 0.4/1.5 MB | 7.0 kB | 4.1/9.4 kB
Progress (4): 500/592 kB | 0.4/1.5 MB | 7.0 kB | 4.1/9.4 kB
                                                           
Downloading from eclipse.maven.central.mirror: https://repo.eclipse.org/content/repositories/maven_central/org/eclipse/tycho/org.eclipse.tycho.core.shared/1.5.0/org.eclipse.tycho.core.shared-1.5.0.jar
Progress (4): 504/592 kB | 0.4/1.5 MB | 7.0 kB | 4.1/9.4 kB
Progress (4): 504/592 kB | 0.4/1.5 MB | 7.0 kB | 7.7/9.4 kB
Progress (4): 504/592 kB | 0.4/1.5 MB | 7.0 kB | 7.7/9.4 kB
Progress (4): 504/592 kB | 0.4/1.5 MB | 7.0 kB | 9.4 kB    
Progress (4): 508/592 kB | 0.4/1.5 MB | 7.0 kB | 9.4 kB
Progress (4): 508/592 kB | 0.4/1.5 MB | 7.0 kB | 9.4 kB
Progress (4): 512/592 kB | 0.4/1.5 MB | 7.0 kB | 9.4 kB
Progress (4): 512/592 kB | 0.4/1.5 MB | 7.0 kB | 9.4 kB
Progress (4): 516/592 kB | 0.4/1.5 MB | 7.0 kB | 9.4 kB
Progress (4): 516/592 kB | 0.4/1.5 MB | 7.0 kB | 9.4 kB
Progress (4): 520/592 kB | 0.4/1.5 MB | 7.0 kB | 9.4 kB
Progress (4): 520/592 kB | 0.4/1.5 MB | 7.0 kB | 9.4 kB
Progress (4): 524/592 kB | 0.4/1.5 MB | 7.0 kB | 9.4 kB
Progress (4): 524/592 kB | 0.4/1.5 MB | 7.0 kB | 9.4 kB
Progress (4): 528/592 kB | 0.4/1.5 MB | 7.0 kB | 9.4 kB
Progress (4): 528/592 kB | 0.4/1.5 MB | 7.0 kB | 9.4 kB
Progress (4): 532/592 kB | 0.4/1.5 MB | 7.0 kB | 9.4 kB
Progress (4): 532/592 kB | 0.4/1.5 MB | 7.0 kB | 9.4 kB
Progress (4): 536/592 kB | 0.4/1.5 MB | 7.0 kB | 9.4 kB
Progress (4): 536/592 kB | 0.4/1.5 MB | 7.0 kB | 9.4 kB
Progress (4): 536/592 kB | 0.4/1.5 MB | 7.0 kB | 9.4 kB
Progress (4): 540/592 kB | 0.4/1.5 MB | 7.0 kB | 9.4 kB
Progress (4): 540/592 kB | 0.4/1.5 MB | 7.0 kB | 9.4 kB
Progress (4): 544/592 kB | 0.4/1.5 MB | 7.0 kB | 9.4 kB
Progress (4): 544/592 kB | 0.4/1.5 MB | 7.0 kB | 9.4 kB
Progress (4): 548/592 kB | 0.4/1.5 MB | 7.0 kB | 9.4 kB
Progress (4): 548/592 kB | 0.5/1.5 MB | 7.0 kB | 9.4 kB
Progress (4): 552/592 kB | 0.5/1.5 MB | 7.0 kB | 9.4 kB
Progress (4): 552/592 kB | 0.5/1.5 MB | 7.0 kB | 9.4 kB
Progress (4): 556/592 kB | 0.5/1.5 MB | 7.0 kB | 9.4 kB
Progress (4): 556/592 kB | 0.5/1.5 MB | 7.0 kB | 9.4 kB
Progress (4): 560/592 kB | 0.5/1.5 MB | 7.0 kB | 9.4 kB
Progress (4): 560/592 kB | 0.5/1.5 MB | 7.0 kB | 9.4 kB
Progress (4): 564/592 kB | 0.5/1.5 MB | 7.0 kB | 9.4 kB
Progress (4): 564/592 kB | 0.5/1.5 MB | 7.0 kB | 9.4 kB
Progress (4): 568/592 kB | 0.5/1.5 MB | 7.0 kB | 9.4 kB
Progress (4): 568/592 kB | 0.5/1.5 MB | 7.0 kB | 9.4 kB
Progress (4): 572/592 kB | 0.5/1.5 MB | 7.0 kB | 9.4 kB
Progress (4): 572/592 kB | 0.5/1.5 MB | 7.0 kB | 9.4 kB
Progress (4): 576/592 kB | 0.5/1.5 MB | 7.0 kB | 9.4 kB
Progress (4): 576/592 kB | 0.5/1.5 MB | 7.0 kB | 9.4 kB
Progress (4): 580/592 kB | 0.5/1.5 MB | 7.0 kB | 9.4 kB
Progress (4): 580/592 kB | 0.5/1.5 MB | 7.0 kB | 9.4 kB
Progress (4): 584/592 kB | 0.5/1.5 MB | 7.0 kB | 9.4 kB
Progress (4): 584/592 kB | 0.5/1.5 MB | 7.0 kB | 9.4 kB
Progress (4): 588/592 kB | 0.5/1.5 MB | 7.0 kB | 9.4 kB
Progress (4): 588/592 kB | 0.5/1.5 MB | 7.0 kB | 9.4 kB
Progress (4): 592/592 kB | 0.5/1.5 MB | 7.0 kB | 9.4 kB
Progress (4): 592/592 kB | 0.5/1.5 MB | 7.0 kB | 9.4 kB
Progress (4): 592 kB | 0.5/1.5 MB | 7.0 kB | 9.4 kB    
Progress (4): 592 kB | 0.5/1.5 MB | 7.0 kB | 9.4 kB
Progress (4): 592 kB | 0.5/1.5 MB | 7.0 kB | 9.4 kB
                                                   
Downloaded from eclipse.maven.central.mirror: https://repo.eclipse.org/content/repositories/maven_central/org/eclipse/tycho/tycho-embedder-api/1.5.0/tycho-embedder-api-1.5.0.jar (7.0 kB at 20 kB/s)
Progress (3): 592 kB | 0.5/1.5 MB | 9.4 kB
                                          
Downloading from eclipse.maven.central.mirror: https://repo.eclipse.org/content/repositories/maven_central/org/eclipse/tycho/tycho-p2-facade/1.5.0/tycho-p2-facade-1.5.0.jar
Progress (3): 592 kB | 0.5/1.5 MB | 9.4 kB
Progress (3): 592 kB | 0.5/1.5 MB | 9.4 kB
Progress (3): 592 kB | 0.5/1.5 MB | 9.4 kB
                                          
Downloaded from eclipse.maven.central.mirror: https://repo.eclipse.org/content/repositories/maven_central/org/eclipse/tycho/org.eclipse.tycho.embedder.shared/1.5.0/org.eclipse.tycho.embedder.shared-1.5.0.jar (9.4 kB at 27 kB/s)
Progress (2): 592 kB | 0.5/1.5 MB
                                 
Downloading from eclipse.maven.central.mirror: https://repo.eclipse.org/content/repositories/maven_central/org/eclipse/tycho/org.eclipse.tycho.p2.resolver.shared/1.5.0/org.eclipse.tycho.p2.resolver.shared-1.5.0.jar
Progress (2): 592 kB | 0.5/1.5 MB
Progress (2): 592 kB | 0.5/1.5 MB
Progress (2): 592 kB | 0.5/1.5 MB
Progress (2): 592 kB | 0.5/1.5 MB
Progress (2): 592 kB | 0.5/1.5 MB
Progress (2): 592 kB | 0.5/1.5 MB
Progress (2): 592 kB | 0.6/1.5 MB
Progress (2): 592 kB | 0.6/1.5 MB
Progress (2): 592 kB | 0.6/1.5 MB
Progress (2): 592 kB | 0.6/1.5 MB
Progress (2): 592 kB | 0.6/1.5 MB
Progress (2): 592 kB | 0.6/1.5 MB
Progress (2): 592 kB | 0.6/1.5 MB
                                 
Downloaded from eclipse.maven.central.mirror: https://repo.eclipse.org/content/repositories/maven_central/org/apache/commons/commons-compress/1.18/commons-compress-1.18.jar (592 kB at 1.7 MB/s)
Progress (1): 0.6/1.5 MB
Progress (1): 0.6/1.5 MB
Progress (1): 0.6/1.5 MB
Progress (1): 0.6/1.5 MB
Progress (1): 0.6/1.5 MB
Progress (1): 0.6/1.5 MB
Progress (1): 0.6/1.5 MB
Progress (1): 0.6/1.5 MB
Progress (1): 0.6/1.5 MB
Progress (1): 0.6/1.5 MB
Progress (1): 0.6/1.5 MB
Progress (1): 0.6/1.5 MB
Progress (1): 0.6/1.5 MB
Progress (1): 0.6/1.5 MB
Progress (1): 0.6/1.5 MB
Progress (1): 0.6/1.5 MB
Progress (1): 0.6/1.5 MB
Progress (2): 0.6/1.5 MB | 4.1/37 kB
Progress (2): 0.6/1.5 MB | 4.1/37 kB
Progress (2): 0.6/1.5 MB | 7.7/37 kB
Progress (2): 0.7/1.5 MB | 7.7/37 kB
Progress (2): 0.7/1.5 MB | 12/37 kB 
Progress (2): 0.7/1.5 MB | 12/37 kB
Progress (2): 0.7/1.5 MB | 16/37 kB
Progress (2): 0.7/1.5 MB | 16/37 kB
Progress (2): 0.7/1.5 MB | 20/37 kB
Progress (2): 0.7/1.5 MB | 20/37 kB
Progress (2): 0.7/1.5 MB | 24/37 kB
Progress (2): 0.7/1.5 MB | 24/37 kB
Progress (2): 0.7/1.5 MB | 24/37 kB
Progress (2): 0.7/1.5 MB | 28/37 kB
Progress (2): 0.7/1.5 MB | 28/37 kB
Progress (2): 0.7/1.5 MB | 32/37 kB
Progress (2): 0.7/1.5 MB | 32/37 kB
Progress (2): 0.7/1.5 MB | 36/37 kB
Progress (2): 0.7/1.5 MB | 36/37 kB
Progress (2): 0.7/1.5 MB | 37 kB   
Progress (2): 0.7/1.5 MB | 37 kB
Progress (2): 0.7/1.5 MB | 37 kB
Progress (2): 0.7/1.5 MB | 37 kB
Progress (2): 0.7/1.5 MB | 37 kB
Progress (2): 0.7/1.5 MB | 37 kB
Progress (2): 0.7/1.5 MB | 37 kB
Progress (2): 0.7/1.5 MB | 37 kB
Progress (2): 0.7/1.5 MB | 37 kB
Progress (2): 0.7/1.5 MB | 37 kB
Progress (2): 0.7/1.5 MB | 37 kB
Progress (2): 0.7/1.5 MB | 37 kB
Progress (2): 0.7/1.5 MB | 37 kB
Progress (2): 0.7/1.5 MB | 37 kB
Progress (2): 0.7/1.5 MB | 37 kB
Progress (2): 0.7/1.5 MB | 37 kB
Progress (2): 0.7/1.5 MB | 37 kB
Progress (2): 0.8/1.5 MB | 37 kB
Progress (2): 0.8/1.5 MB | 37 kB
Progress (2): 0.8/1.5 MB | 37 kB
Progress (2): 0.8/1.5 MB | 37 kB
Progress (2): 0.8/1.5 MB | 37 kB
Progress (2): 0.8/1.5 MB | 37 kB
Progress (2): 0.8/1.5 MB | 37 kB
Progress (2): 0.8/1.5 MB | 37 kB
Progress (3): 0.8/1.5 MB | 37 kB | 4.1/37 kB
Progress (3): 0.8/1.5 MB | 37 kB | 4.1/37 kB
Progress (3): 0.8/1.5 MB | 37 kB | 7.7/37 kB
Progress (3): 0.8/1.5 MB | 37 kB | 7.7/37 kB
Progress (3): 0.8/1.5 MB | 37 kB | 7.7/37 kB
Progress (3): 0.8/1.5 MB | 37 kB | 12/37 kB 
Progress (3): 0.8/1.5 MB | 37 kB | 12/37 kB
Progress (3): 0.8/1.5 MB | 37 kB | 16/37 kB
Progress (3): 0.8/1.5 MB | 37 kB | 16/37 kB
                                           
Downloaded from eclipse.maven.central.mirror: https://repo.eclipse.org/content/repositories/maven_central/org/eclipse/tycho/org.eclipse.tycho.core.shared/1.5.0/org.eclipse.tycho.core.shared-1.5.0.jar (37 kB at 102 kB/s)
Progress (2): 0.8/1.5 MB | 16/37 kB
Progress (2): 0.8/1.5 MB | 20/37 kB
Progress (2): 0.8/1.5 MB | 20/37 kB
Progress (2): 0.8/1.5 MB | 24/37 kB
Progress (3): 0.8/1.5 MB | 24/37 kB | 4.1/29 kB
Progress (3): 0.8/1.5 MB | 28/37 kB | 4.1/29 kB
Progress (3): 0.8/1.5 MB | 32/37 kB | 4.1/29 kB
Progress (3): 0.8/1.5 MB | 33/37 kB | 4.1/29 kB
Progress (3): 0.8/1.5 MB | 37/37 kB | 4.1/29 kB
Progress (3): 0.8/1.5 MB | 37 kB | 4.1/29 kB   
Progress (3): 0.8/1.5 MB | 37 kB | 4.1/29 kB
Progress (3): 0.8/1.5 MB | 37 kB | 7.7/29 kB
Progress (3): 0.8/1.5 MB | 37 kB | 7.7/29 kB
Progress (3): 0.8/1.5 MB | 37 kB | 12/29 kB 
Progress (3): 0.8/1.5 MB | 37 kB | 16/29 kB
Progress (3): 0.8/1.5 MB | 37 kB | 16/29 kB
Progress (3): 0.8/1.5 MB | 37 kB | 20/29 kB
Progress (3): 0.8/1.5 MB | 37 kB | 20/29 kB
Progress (3): 0.8/1.5 MB | 37 kB | 24/29 kB
Progress (3): 0.8/1.5 MB | 37 kB | 24/29 kB
Progress (3): 0.8/1.5 MB | 37 kB | 28/29 kB
Progress (3): 0.8/1.5 MB | 37 kB | 28/29 kB
Progress (3): 0.8/1.5 MB | 37 kB | 29 kB   
Progress (3): 0.8/1.5 MB | 37 kB | 29 kB
Progress (3): 0.8/1.5 MB | 37 kB | 29 kB
Progress (3): 0.8/1.5 MB | 37 kB | 29 kB
Progress (3): 0.8/1.5 MB | 37 kB | 29 kB
Progress (3): 0.9/1.5 MB | 37 kB | 29 kB
Progress (3): 0.9/1.5 MB | 37 kB | 29 kB
Progress (3): 0.9/1.5 MB | 37 kB | 29 kB
Progress (3): 0.9/1.5 MB | 37 kB | 29 kB
Progress (3): 0.9/1.5 MB | 37 kB | 29 kB
Progress (3): 0.9/1.5 MB | 37 kB | 29 kB
Progress (3): 0.9/1.5 MB | 37 kB | 29 kB
Progress (3): 0.9/1.5 MB | 37 kB | 29 kB
Progress (3): 0.9/1.5 MB | 37 kB | 29 kB
Progress (3): 0.9/1.5 MB | 37 kB | 29 kB
Progress (3): 0.9/1.5 MB | 37 kB | 29 kB
Progress (3): 0.9/1.5 MB | 37 kB | 29 kB
Progress (3): 0.9/1.5 MB | 37 kB | 29 kB
Progress (3): 0.9/1.5 MB | 37 kB | 29 kB
Progress (3): 0.9/1.5 MB | 37 kB | 29 kB
Progress (3): 0.9/1.5 MB | 37 kB | 29 kB
Progress (3): 0.9/1.5 MB | 37 kB | 29 kB
Progress (3): 0.9/1.5 MB | 37 kB | 29 kB
Progress (3): 0.9/1.5 MB | 37 kB | 29 kB
Progress (3): 0.9/1.5 MB | 37 kB | 29 kB
Progress (3): 0.9/1.5 MB | 37 kB | 29 kB
Progress (3): 0.9/1.5 MB | 37 kB | 29 kB
Progress (3): 0.9/1.5 MB | 37 kB | 29 kB
Progress (3): 0.9/1.5 MB | 37 kB | 29 kB
Progress (3): 0.9/1.5 MB | 37 kB | 29 kB
Progress (3): 1.0/1.5 MB | 37 kB | 29 kB
Progress (3): 1.0/1.5 MB | 37 kB | 29 kB
Progress (3): 1.0/1.5 MB | 37 kB | 29 kB
Progress (3): 1.0/1.5 MB | 37 kB | 29 kB
Progress (3): 1.0/1.5 MB | 37 kB | 29 kB
Progress (3): 1.0/1.5 MB | 37 kB | 29 kB
Progress (3): 1.0/1.5 MB | 37 kB | 29 kB
Progress (3): 1.0/1.5 MB | 37 kB | 29 kB
Progress (3): 1.0/1.5 MB | 37 kB | 29 kB
Progress (3): 1.0/1.5 MB | 37 kB | 29 kB
Progress (3): 1.0/1.5 MB | 37 kB | 29 kB
Progress (3): 1.0/1.5 MB | 37 kB | 29 kB
Progress (3): 1.0/1.5 MB | 37 kB | 29 kB
Progress (3): 1.0/1.5 MB | 37 kB | 29 kB
Progress (3): 1.0/1.5 MB | 37 kB | 29 kB
Progress (3): 1.0/1.5 MB | 37 kB | 29 kB
Progress (3): 1.0/1.5 MB | 37 kB | 29 kB
Progress (3): 1.0/1.5 MB | 37 kB | 29 kB
Progress (3): 1.0/1.5 MB | 37 kB | 29 kB
Progress (3): 1.0/1.5 MB | 37 kB | 29 kB
Progress (3): 1.0/1.5 MB | 37 kB | 29 kB
Progress (3): 1.0/1.5 MB | 37 kB | 29 kB
Progress (3): 1.0/1.5 MB | 37 kB | 29 kB
Progress (3): 1.0/1.5 MB | 37 kB | 29 kB
Progress (3): 1.0/1.5 MB | 37 kB | 29 kB
                                        
Downloaded from eclipse.maven.central.mirror: https://repo.eclipse.org/content/repositories/maven_central/org/eclipse/tycho/org.eclipse.tycho.p2.resolver.shared/1.5.0/org.eclipse.tycho.p2.resolver.shared-1.5.0.jar (29 kB at 64 kB/s)
Progress (2): 1.1/1.5 MB | 37 kB
Progress (2): 1.1/1.5 MB | 37 kB
Progress (2): 1.1/1.5 MB | 37 kB
Progress (2): 1.1/1.5 MB | 37 kB
                                
Downloaded from eclipse.maven.central.mirror: https://repo.eclipse.org/content/repositories/maven_central/org/eclipse/tycho/tycho-p2-facade/1.5.0/tycho-p2-facade-1.5.0.jar (37 kB at 83 kB/s)
Progress (1): 1.1/1.5 MB
Progress (1): 1.1/1.5 MB
Progress (1): 1.1/1.5 MB
Progress (1): 1.1/1.5 MB
Progress (1): 1.1/1.5 MB
Progress (1): 1.1/1.5 MB
Progress (1): 1.1/1.5 MB
Progress (1): 1.1/1.5 MB
Progress (1): 1.1/1.5 MB
Progress (1): 1.1/1.5 MB
Progress (1): 1.1/1.5 MB
Progress (1): 1.1/1.5 MB
Progress (1): 1.1/1.5 MB
Progress (1): 1.1/1.5 MB
Progress (1): 1.1/1.5 MB
Progress (1): 1.1/1.5 MB
Progress (1): 1.1/1.5 MB
Progress (1): 1.1/1.5 MB
Progress (1): 1.1/1.5 MB
Progress (1): 1.1/1.5 MB
Progress (1): 1.1/1.5 MB
Progress (1): 1.2/1.5 MB
Progress (1): 1.2/1.5 MB
Progress (1): 1.2/1.5 MB
Progress (1): 1.2/1.5 MB
Progress (1): 1.2/1.5 MB
Progress (1): 1.2/1.5 MB
Progress (1): 1.2/1.5 MB
Progress (1): 1.2/1.5 MB
Progress (1): 1.2/1.5 MB
Progress (1): 1.2/1.5 MB
Progress (1): 1.2/1.5 MB
Progress (1): 1.2/1.5 MB
Progress (1): 1.2/1.5 MB
Progress (1): 1.2/1.5 MB
Progress (1): 1.2/1.5 MB
Progress (1): 1.2/1.5 MB
Progress (1): 1.2/1.5 MB
Progress (1): 1.2/1.5 MB
Progress (1): 1.2/1.5 MB
Progress (1): 1.2/1.5 MB
Progress (1): 1.2/1.5 MB
Progress (1): 1.2/1.5 MB
Progress (1): 1.2/1.5 MB
Progress (1): 1.2/1.5 MB
Progress (1): 1.2/1.5 MB
Progress (1): 1.3/1.5 MB
Progress (1): 1.3/1.5 MB
Progress (1): 1.3/1.5 MB
Progress (1): 1.3/1.5 MB
Progress (1): 1.3/1.5 MB
Progress (1): 1.3/1.5 MB
Progress (1): 1.3/1.5 MB
Progress (1): 1.3/1.5 MB
Progress (1): 1.3/1.5 MB
Progress (1): 1.3/1.5 MB
Progress (1): 1.3/1.5 MB
Progress (1): 1.3/1.5 MB
Progress (1): 1.3/1.5 MB
Progress (1): 1.3/1.5 MB
Progress (1): 1.3/1.5 MB
Progress (1): 1.3/1.5 MB
Progress (1): 1.3/1.5 MB
Progress (1): 1.3/1.5 MB
Progress (1): 1.3/1.5 MB
Progress (1): 1.3/1.5 MB
Progress (1): 1.3/1.5 MB
Progress (1): 1.3/1.5 MB
Progress (1): 1.3/1.5 MB
Progress (1): 1.3/1.5 MB
Progress (1): 1.3/1.5 MB
Progress (1): 1.4/1.5 MB
Progress (1): 1.4/1.5 MB
Progress (1): 1.4/1.5 MB
Progress (1): 1.4/1.5 MB
Progress (1): 1.4/1.5 MB
Progress (1): 1.4/1.5 MB
Progress (1): 1.4/1.5 MB
Progress (1): 1.4/1.5 MB
Progress (1): 1.4/1.5 MB
Progress (1): 1.4/1.5 MB
Progress (1): 1.4/1.5 MB
Progress (1): 1.4/1.5 MB
Progress (1): 1.4/1.5 MB
Progress (1): 1.4/1.5 MB
Progress (1): 1.4/1.5 MB
Progress (1): 1.4/1.5 MB
Progress (1): 1.4/1.5 MB
Progress (1): 1.4/1.5 MB
Progress (1): 1.4/1.5 MB
Progress (1): 1.4/1.5 MB
Progress (1): 1.4/1.5 MB
Progress (1): 1.4/1.5 MB
Progress (1): 1.4/1.5 MB
Progress (1): 1.4/1.5 MB
Progress (1): 1.4/1.5 MB
Progress (1): 1.5/1.5 MB
Progress (1): 1.5/1.5 MB
Progress (1): 1.5/1.5 MB
Progress (1): 1.5 MB    
                    
Downloaded from eclipse.maven.central.mirror: https://repo.eclipse.org/content/repositories/maven_central/org/eclipse/platform/org.eclipse.osgi/3.15.0/org.eclipse.osgi-3.15.0.jar (1.5 MB at 2.9 MB/s)
[ERROR] [ERROR] Some problems were encountered while processing the POMs:
[FATAL] Non-resolvable parent POM for org.eclipse.m2e:m2e-core-tests:[unknown-version]: Could not find artifact org.eclipse.m2e:m2e-core:pom:1.13.0-SNAPSHOT and 'parent.relativePath' points at wrong local POM @ line 7, column 10
 @ 
[ERROR] The build could not read 1 project -> [Help 1]
[ERROR]   
[ERROR]   The project org.eclipse.m2e:m2e-core-tests:[unknown-version] (/home/jenkins/agent/workspace/m2e-gerrit/m2e-core-tests/pom.xml) has 1 error
[ERROR]     Non-resolvable parent POM for org.eclipse.m2e:m2e-core-tests:[unknown-version]: Could not find artifact org.eclipse.m2e:m2e-core:pom:1.13.0-SNAPSHOT and 'parent.relativePath' points at wrong local POM @ line 7, column 10 -> [Help 2]
[ERROR] 
[ERROR] To see the full stack trace of the errors, re-run Maven with the -e switch.
[ERROR] Re-run Maven using the -X switch to enable full debug logging.
[ERROR] 
[ERROR] For more information about the errors and possible solutions, please read the following articles:
[ERROR] [Help 1] http://cwiki.apache.org/confluence/display/MAVEN/ProjectBuildingException
[ERROR] [Help 2] http://cwiki.apache.org/confluence/display/MAVEN/UnresolvableModelException
Build step 'Invoke top-level Maven targets' marked build as failure
Terminating xvnc.
Recording test results
ERROR: Step ‘Publish JUnit test result report’ failed: No test report files were found. Configuration error?
Archiving artifacts
Finished: FAILURE