FailedConsole Output

Skipping 1,089 KB.. Full Log
ess (5): 166/379 kB | 0/2.6 MB | 33/521 kB | 33/67 kB | 14 kB
Progress (5): 170/379 kB | 0/2.6 MB | 33/521 kB | 33/67 kB | 14 kB
Progress (5): 174/379 kB | 0/2.6 MB | 33/521 kB | 33/67 kB | 14 kB
Progress (5): 178/379 kB | 0/2.6 MB | 33/521 kB | 33/67 kB | 14 kB
Progress (5): 182/379 kB | 0/2.6 MB | 33/521 kB | 33/67 kB | 14 kB
Progress (5): 186/379 kB | 0/2.6 MB | 33/521 kB | 33/67 kB | 14 kB
Progress (5): 190/379 kB | 0/2.6 MB | 33/521 kB | 33/67 kB | 14 kB
Progress (5): 194/379 kB | 0/2.6 MB | 33/521 kB | 33/67 kB | 14 kB
Progress (5): 198/379 kB | 0/2.6 MB | 33/521 kB | 33/67 kB | 14 kB
Progress (5): 202/379 kB | 0/2.6 MB | 33/521 kB | 33/67 kB | 14 kB
Progress (5): 206/379 kB | 0/2.6 MB | 33/521 kB | 33/67 kB | 14 kB
Progress (5): 210/379 kB | 0/2.6 MB | 33/521 kB | 33/67 kB | 14 kB
Progress (5): 214/379 kB | 0/2.6 MB | 33/521 kB | 33/67 kB | 14 kB
Progress (5): 218/379 kB | 0/2.6 MB | 33/521 kB | 33/67 kB | 14 kB
Progress (5): 222/379 kB | 0/2.6 MB | 33/521 kB | 33/67 kB | 14 kB
Progress (5): 226/379 kB | 0/2.6 MB | 33/521 kB | 33/67 kB | 14 kB
Progress (5): 230/379 kB | 0/2.6 MB | 33/521 kB | 33/67 kB | 14 kB
Progress (5): 234/379 kB | 0/2.6 MB | 33/521 kB | 33/67 kB | 14 kB
Progress (5): 238/379 kB | 0/2.6 MB | 33/521 kB | 33/67 kB | 14 kB
Progress (5): 242/379 kB | 0/2.6 MB | 33/521 kB | 33/67 kB | 14 kB
Progress (5): 246/379 kB | 0/2.6 MB | 33/521 kB | 33/67 kB | 14 kB
Progress (5): 250/379 kB | 0/2.6 MB | 33/521 kB | 33/67 kB | 14 kB
Progress (5): 254/379 kB | 0/2.6 MB | 33/521 kB | 33/67 kB | 14 kB
Progress (5): 258/379 kB | 0/2.6 MB | 33/521 kB | 33/67 kB | 14 kB
Progress (5): 262/379 kB | 0/2.6 MB | 33/521 kB | 33/67 kB | 14 kB
Progress (5): 266/379 kB | 0/2.6 MB | 33/521 kB | 33/67 kB | 14 kB
Progress (5): 270/379 kB | 0/2.6 MB | 33/521 kB | 33/67 kB | 14 kB
Progress (5): 274/379 kB | 0/2.6 MB | 33/521 kB | 33/67 kB | 14 kB
Progress (5): 278/379 kB | 0/2.6 MB | 33/521 kB | 33/67 kB | 14 kB
Progress (5): 282/379 kB | 0/2.6 MB | 33/521 kB | 33/67 kB | 14 kB
Progress (5): 286/379 kB | 0/2.6 MB | 33/521 kB | 33/67 kB | 14 kB
Progress (5): 290/379 kB | 0/2.6 MB | 33/521 kB | 33/67 kB | 14 kB
Progress (5): 294/379 kB | 0/2.6 MB | 33/521 kB | 33/67 kB | 14 kB
Progress (5): 298/379 kB | 0/2.6 MB | 33/521 kB | 33/67 kB | 14 kB
Progress (5): 302/379 kB | 0/2.6 MB | 33/521 kB | 33/67 kB | 14 kB
Progress (5): 306/379 kB | 0/2.6 MB | 33/521 kB | 33/67 kB | 14 kB
Progress (5): 310/379 kB | 0/2.6 MB | 33/521 kB | 33/67 kB | 14 kB
Progress (5): 314/379 kB | 0/2.6 MB | 33/521 kB | 33/67 kB | 14 kB
Progress (5): 318/379 kB | 0/2.6 MB | 33/521 kB | 33/67 kB | 14 kB
Progress (5): 322/379 kB | 0/2.6 MB | 33/521 kB | 33/67 kB | 14 kB
Progress (5): 326/379 kB | 0/2.6 MB | 33/521 kB | 33/67 kB | 14 kB
Progress (5): 330/379 kB | 0/2.6 MB | 33/521 kB | 33/67 kB | 14 kB
Progress (5): 330/379 kB | 0/2.6 MB | 33/521 kB | 33/67 kB | 14 kB
Progress (5): 334/379 kB | 0/2.6 MB | 33/521 kB | 33/67 kB | 14 kB
Progress (5): 334/379 kB | 0/2.6 MB | 33/521 kB | 33/67 kB | 14 kB
Progress (5): 338/379 kB | 0/2.6 MB | 33/521 kB | 33/67 kB | 14 kB
Progress (5): 338/379 kB | 0.1/2.6 MB | 33/521 kB | 33/67 kB | 14 kB
Progress (5): 342/379 kB | 0.1/2.6 MB | 33/521 kB | 33/67 kB | 14 kB
Progress (5): 342/379 kB | 0.1/2.6 MB | 33/521 kB | 33/67 kB | 14 kB
Progress (5): 346/379 kB | 0.1/2.6 MB | 33/521 kB | 33/67 kB | 14 kB
Progress (5): 346/379 kB | 0.1/2.6 MB | 33/521 kB | 33/67 kB | 14 kB
Progress (5): 350/379 kB | 0.1/2.6 MB | 33/521 kB | 33/67 kB | 14 kB
Progress (5): 350/379 kB | 0.1/2.6 MB | 33/521 kB | 33/67 kB | 14 kB
Progress (5): 354/379 kB | 0.1/2.6 MB | 33/521 kB | 33/67 kB | 14 kB
Progress (5): 354/379 kB | 0.1/2.6 MB | 33/521 kB | 33/67 kB | 14 kB
Progress (5): 358/379 kB | 0.1/2.6 MB | 33/521 kB | 33/67 kB | 14 kB
Progress (5): 362/379 kB | 0.1/2.6 MB | 33/521 kB | 33/67 kB | 14 kB
Progress (5): 362/379 kB | 0.1/2.6 MB | 33/521 kB | 33/67 kB | 14 kB
Progress (5): 366/379 kB | 0.1/2.6 MB | 33/521 kB | 33/67 kB | 14 kB
Progress (5): 366/379 kB | 0.1/2.6 MB | 33/521 kB | 33/67 kB | 14 kB
Progress (5): 370/379 kB | 0.1/2.6 MB | 33/521 kB | 33/67 kB | 14 kB
Progress (5): 370/379 kB | 0.1/2.6 MB | 33/521 kB | 33/67 kB | 14 kB
Progress (5): 374/379 kB | 0.1/2.6 MB | 33/521 kB | 33/67 kB | 14 kB
Progress (5): 374/379 kB | 0.1/2.6 MB | 33/521 kB | 33/67 kB | 14 kB
Progress (5): 378/379 kB | 0.1/2.6 MB | 33/521 kB | 33/67 kB | 14 kB
Progress (5): 378/379 kB | 0.1/2.6 MB | 33/521 kB | 33/67 kB | 14 kB
Progress (5): 379 kB | 0.1/2.6 MB | 33/521 kB | 33/67 kB | 14 kB    
Progress (5): 379 kB | 0.1/2.6 MB | 33/521 kB | 33/67 kB | 14 kB
Progress (5): 379 kB | 0.1/2.6 MB | 33/521 kB | 33/67 kB | 14 kB
Progress (5): 379 kB | 0.1/2.6 MB | 33/521 kB | 33/67 kB | 14 kB
Progress (5): 379 kB | 0.1/2.6 MB | 33/521 kB | 33/67 kB | 14 kB
Progress (5): 379 kB | 0.1/2.6 MB | 33/521 kB | 33/67 kB | 14 kB
Progress (5): 379 kB | 0.1/2.6 MB | 33/521 kB | 33/67 kB | 14 kB
Progress (5): 379 kB | 0.1/2.6 MB | 33/521 kB | 33/67 kB | 14 kB
Progress (5): 379 kB | 0.1/2.6 MB | 33/521 kB | 33/67 kB | 14 kB
Progress (5): 379 kB | 0.1/2.6 MB | 33/521 kB | 33/67 kB | 14 kB
Progress (5): 379 kB | 0.1/2.6 MB | 33/521 kB | 33/67 kB | 14 kB
Progress (5): 379 kB | 0.1/2.6 MB | 33/521 kB | 33/67 kB | 14 kB
Progress (5): 379 kB | 0.1/2.6 MB | 33/521 kB | 33/67 kB | 14 kB
Progress (5): 379 kB | 0.1/2.6 MB | 33/521 kB | 33/67 kB | 14 kB
Progress (5): 379 kB | 0.1/2.6 MB | 33/521 kB | 33/67 kB | 14 kB
Progress (5): 379 kB | 0.1/2.6 MB | 33/521 kB | 33/67 kB | 14 kB
Progress (5): 379 kB | 0.1/2.6 MB | 33/521 kB | 33/67 kB | 14 kB
Progress (5): 379 kB | 0.2/2.6 MB | 33/521 kB | 33/67 kB | 14 kB
Progress (5): 379 kB | 0.2/2.6 MB | 33/521 kB | 33/67 kB | 14 kB
Progress (5): 379 kB | 0.2/2.6 MB | 33/521 kB | 33/67 kB | 14 kB
Progress (5): 379 kB | 0.2/2.6 MB | 33/521 kB | 33/67 kB | 14 kB
Progress (5): 379 kB | 0.2/2.6 MB | 33/521 kB | 33/67 kB | 14 kB
Progress (5): 379 kB | 0.2/2.6 MB | 33/521 kB | 33/67 kB | 14 kB
Progress (5): 379 kB | 0.2/2.6 MB | 33/521 kB | 33/67 kB | 14 kB
Progress (5): 379 kB | 0.2/2.6 MB | 33/521 kB | 33/67 kB | 14 kB
Progress (5): 379 kB | 0.2/2.6 MB | 33/521 kB | 33/67 kB | 14 kB
Progress (5): 379 kB | 0.2/2.6 MB | 33/521 kB | 33/67 kB | 14 kB
Progress (5): 379 kB | 0.2/2.6 MB | 33/521 kB | 33/67 kB | 14 kB
Progress (5): 379 kB | 0.2/2.6 MB | 33/521 kB | 33/67 kB | 14 kB
                                                                
Downloaded from eclipse.maven.central.mirror: https://repo.eclipse.org/content/repositories/maven_central/org/eclipse/sisu/org.eclipse.sisu.inject/0.3.3/org.eclipse.sisu.inject-0.3.3.jar (379 kB at 573 kB/s)
Progress (4): 0.2/2.6 MB | 33/521 kB | 33/67 kB | 14 kB
                                                       
Downloading from eclipse.maven.central.mirror: https://repo.eclipse.org/content/repositories/maven_central/com/google/j2objc/j2objc-annotations/1.1/j2objc-annotations-1.1.jar
Progress (4): 0.2/2.6 MB | 33/521 kB | 33/67 kB | 14 kB
Progress (4): 0.2/2.6 MB | 33/521 kB | 33/67 kB | 14 kB
Progress (4): 0.2/2.6 MB | 33/521 kB | 33/67 kB | 14 kB
Progress (4): 0.2/2.6 MB | 33/521 kB | 33/67 kB | 14 kB
Progress (4): 0.2/2.6 MB | 33/521 kB | 33/67 kB | 14 kB
Progress (4): 0.2/2.6 MB | 33/521 kB | 33/67 kB | 14 kB
Progress (4): 0.2/2.6 MB | 33/521 kB | 33/67 kB | 14 kB
Progress (4): 0.2/2.6 MB | 33/521 kB | 33/67 kB | 14 kB
Progress (4): 0.2/2.6 MB | 33/521 kB | 33/67 kB | 14 kB
Progress (4): 0.2/2.6 MB | 33/521 kB | 33/67 kB | 14 kB
Progress (4): 0.2/2.6 MB | 33/521 kB | 33/67 kB | 14 kB
Progress (4): 0.2/2.6 MB | 33/521 kB | 33/67 kB | 14 kB
Progress (4): 0.3/2.6 MB | 33/521 kB | 33/67 kB | 14 kB
Progress (4): 0.3/2.6 MB | 33/521 kB | 33/67 kB | 14 kB
Progress (4): 0.3/2.6 MB | 33/521 kB | 33/67 kB | 14 kB
Progress (4): 0.3/2.6 MB | 33/521 kB | 33/67 kB | 14 kB
Progress (4): 0.3/2.6 MB | 33/521 kB | 33/67 kB | 14 kB
Progress (4): 0.3/2.6 MB | 33/521 kB | 33/67 kB | 14 kB
Progress (4): 0.3/2.6 MB | 33/521 kB | 33/67 kB | 14 kB
Progress (4): 0.3/2.6 MB | 33/521 kB | 33/67 kB | 14 kB
Progress (4): 0.3/2.6 MB | 33/521 kB | 33/67 kB | 14 kB
Progress (4): 0.3/2.6 MB | 33/521 kB | 33/67 kB | 14 kB
Progress (4): 0.3/2.6 MB | 33/521 kB | 33/67 kB | 14 kB
Progress (4): 0.3/2.6 MB | 33/521 kB | 33/67 kB | 14 kB
Progress (4): 0.3/2.6 MB | 33/521 kB | 33/67 kB | 14 kB
Progress (4): 0.3/2.6 MB | 33/521 kB | 33/67 kB | 14 kB
Progress (5): 0.3/2.6 MB | 33/521 kB | 33/67 kB | 14 kB | 4.1/8.8 kB
Progress (5): 0.3/2.6 MB | 33/521 kB | 33/67 kB | 14 kB | 4.1/8.8 kB
Progress (5): 0.3/2.6 MB | 33/521 kB | 33/67 kB | 14 kB | 7.7/8.8 kB
Progress (5): 0.3/2.6 MB | 33/521 kB | 33/67 kB | 14 kB | 7.7/8.8 kB
Progress (5): 0.3/2.6 MB | 33/521 kB | 33/67 kB | 14 kB | 8.8 kB    
Progress (5): 0.3/2.6 MB | 33/521 kB | 33/67 kB | 14 kB | 8.8 kB
Progress (5): 0.3/2.6 MB | 33/521 kB | 33/67 kB | 14 kB | 8.8 kB
Progress (5): 0.3/2.6 MB | 33/521 kB | 33/67 kB | 14 kB | 8.8 kB
Progress (5): 0.3/2.6 MB | 33/521 kB | 33/67 kB | 14 kB | 8.8 kB
Progress (5): 0.3/2.6 MB | 33/521 kB | 33/67 kB | 14 kB | 8.8 kB
Progress (5): 0.3/2.6 MB | 33/521 kB | 33/67 kB | 14 kB | 8.8 kB
Progress (5): 0.3/2.6 MB | 33/521 kB | 33/67 kB | 14 kB | 8.8 kB
Progress (5): 0.3/2.6 MB | 33/521 kB | 33/67 kB | 14 kB | 8.8 kB
Progress (5): 0.3/2.6 MB | 33/521 kB | 33/67 kB | 14 kB | 8.8 kB
Progress (5): 0.4/2.6 MB | 33/521 kB | 33/67 kB | 14 kB | 8.8 kB
Progress (5): 0.4/2.6 MB | 33/521 kB | 33/67 kB | 14 kB | 8.8 kB
Progress (5): 0.4/2.6 MB | 33/521 kB | 33/67 kB | 14 kB | 8.8 kB
Progress (5): 0.4/2.6 MB | 33/521 kB | 33/67 kB | 14 kB | 8.8 kB
Progress (5): 0.4/2.6 MB | 33/521 kB | 33/67 kB | 14 kB | 8.8 kB
Progress (5): 0.4/2.6 MB | 33/521 kB | 33/67 kB | 14 kB | 8.8 kB
Progress (5): 0.4/2.6 MB | 33/521 kB | 33/67 kB | 14 kB | 8.8 kB
Progress (5): 0.4/2.6 MB | 33/521 kB | 33/67 kB | 14 kB | 8.8 kB
Progress (5): 0.4/2.6 MB | 33/521 kB | 33/67 kB | 14 kB | 8.8 kB
Progress (5): 0.4/2.6 MB | 33/521 kB | 33/67 kB | 14 kB | 8.8 kB
Progress (5): 0.4/2.6 MB | 33/521 kB | 33/67 kB | 14 kB | 8.8 kB
Progress (5): 0.4/2.6 MB | 33/521 kB | 33/67 kB | 14 kB | 8.8 kB
Progress (5): 0.4/2.6 MB | 33/521 kB | 33/67 kB | 14 kB | 8.8 kB
Progress (5): 0.4/2.6 MB | 33/521 kB | 33/67 kB | 14 kB | 8.8 kB
                                                                
Downloaded from eclipse.maven.central.mirror: https://repo.eclipse.org/content/repositories/maven_central/com/google/j2objc/j2objc-annotations/1.1/j2objc-annotations-1.1.jar (8.8 kB at 13 kB/s)
Progress (4): 0.4/2.6 MB | 33/521 kB | 33/67 kB | 14 kB
                                                       
Downloading from eclipse.maven.central.mirror: https://repo.eclipse.org/content/repositories/maven_central/org/codehaus/mojo/animal-sniffer-annotations/1.14/animal-sniffer-annotations-1.14.jar
Progress (4): 0.4/2.6 MB | 33/521 kB | 33/67 kB | 14 kB
Progress (4): 0.4/2.6 MB | 33/521 kB | 33/67 kB | 14 kB
Progress (4): 0.4/2.6 MB | 33/521 kB | 33/67 kB | 14 kB
Progress (4): 0.4/2.6 MB | 33/521 kB | 33/67 kB | 14 kB
Progress (4): 0.4/2.6 MB | 33/521 kB | 33/67 kB | 14 kB
Progress (4): 0.4/2.6 MB | 33/521 kB | 33/67 kB | 14 kB
Progress (4): 0.4/2.6 MB | 33/521 kB | 33/67 kB | 14 kB
Progress (4): 0.4/2.6 MB | 33/521 kB | 33/67 kB | 14 kB
Progress (4): 0.4/2.6 MB | 33/521 kB | 33/67 kB | 14 kB
Progress (4): 0.4/2.6 MB | 33/521 kB | 33/67 kB | 14 kB
Progress (4): 0.4/2.6 MB | 33/521 kB | 37/67 kB | 14 kB
Progress (4): 0.5/2.6 MB | 33/521 kB | 37/67 kB | 14 kB
Progress (4): 0.5/2.6 MB | 37/521 kB | 37/67 kB | 14 kB
Progress (4): 0.5/2.6 MB | 37/521 kB | 41/67 kB | 14 kB
Progress (4): 0.5/2.6 MB | 41/521 kB | 41/67 kB | 14 kB
Progress (4): 0.5/2.6 MB | 41/521 kB | 41/67 kB | 14 kB
Progress (4): 0.5/2.6 MB | 45/521 kB | 41/67 kB | 14 kB
Progress (4): 0.5/2.6 MB | 45/521 kB | 41/67 kB | 14 kB
Progress (4): 0.5/2.6 MB | 49/521 kB | 41/67 kB | 14 kB
Progress (4): 0.5/2.6 MB | 49/521 kB | 41/67 kB | 14 kB
Progress (4): 0.5/2.6 MB | 49/521 kB | 45/67 kB | 14 kB
Progress (4): 0.5/2.6 MB | 49/521 kB | 45/67 kB | 14 kB
Progress (4): 0.5/2.6 MB | 53/521 kB | 45/67 kB | 14 kB
Progress (4): 0.5/2.6 MB | 53/521 kB | 45/67 kB | 14 kB
Progress (4): 0.5/2.6 MB | 53/521 kB | 49/67 kB | 14 kB
Progress (4): 0.5/2.6 MB | 57/521 kB | 49/67 kB | 14 kB
Progress (4): 0.5/2.6 MB | 57/521 kB | 53/67 kB | 14 kB
Progress (4): 0.5/2.6 MB | 57/521 kB | 53/67 kB | 14 kB
Progress (4): 0.5/2.6 MB | 61/521 kB | 53/67 kB | 14 kB
Progress (4): 0.5/2.6 MB | 61/521 kB | 57/67 kB | 14 kB
Progress (4): 0.5/2.6 MB | 65/521 kB | 57/67 kB | 14 kB
Progress (4): 0.5/2.6 MB | 65/521 kB | 57/67 kB | 14 kB
Progress (4): 0.5/2.6 MB | 66/521 kB | 57/67 kB | 14 kB
Progress (4): 0.5/2.6 MB | 66/521 kB | 61/67 kB | 14 kB
Progress (4): 0.5/2.6 MB | 66/521 kB | 61/67 kB | 14 kB
Progress (4): 0.5/2.6 MB | 66/521 kB | 65/67 kB | 14 kB
Progress (4): 0.5/2.6 MB | 70/521 kB | 65/67 kB | 14 kB
Progress (4): 0.5/2.6 MB | 70/521 kB | 66/67 kB | 14 kB
Progress (4): 0.5/2.6 MB | 70/521 kB | 66/67 kB | 14 kB
Progress (4): 0.5/2.6 MB | 70/521 kB | 67 kB | 14 kB   
Progress (4): 0.5/2.6 MB | 74/521 kB | 67 kB | 14 kB
Progress (4): 0.5/2.6 MB | 74/521 kB | 67 kB | 14 kB
Progress (4): 0.5/2.6 MB | 78/521 kB | 67 kB | 14 kB
Progress (4): 0.5/2.6 MB | 78/521 kB | 67 kB | 14 kB
Progress (4): 0.5/2.6 MB | 82/521 kB | 67 kB | 14 kB
Progress (4): 0.5/2.6 MB | 82/521 kB | 67 kB | 14 kB
Progress (4): 0.5/2.6 MB | 82/521 kB | 67 kB | 14 kB
Progress (4): 0.5/2.6 MB | 86/521 kB | 67 kB | 14 kB
Progress (4): 0.5/2.6 MB | 86/521 kB | 67 kB | 14 kB
Progress (4): 0.5/2.6 MB | 90/521 kB | 67 kB | 14 kB
Progress (4): 0.5/2.6 MB | 90/521 kB | 67 kB | 14 kB
Progress (4): 0.5/2.6 MB | 94/521 kB | 67 kB | 14 kB
Progress (4): 0.5/2.6 MB | 94/521 kB | 67 kB | 14 kB
Progress (4): 0.5/2.6 MB | 98/521 kB | 67 kB | 14 kB
Progress (4): 0.5/2.6 MB | 98/521 kB | 67 kB | 14 kB
Progress (4): 0.5/2.6 MB | 102/521 kB | 67 kB | 14 kB
Progress (4): 0.5/2.6 MB | 102/521 kB | 67 kB | 14 kB
Progress (4): 0.5/2.6 MB | 106/521 kB | 67 kB | 14 kB
Progress (4): 0.5/2.6 MB | 106/521 kB | 67 kB | 14 kB
Progress (4): 0.5/2.6 MB | 110/521 kB | 67 kB | 14 kB
Progress (4): 0.5/2.6 MB | 110/521 kB | 67 kB | 14 kB
Progress (4): 0.5/2.6 MB | 114/521 kB | 67 kB | 14 kB
Progress (4): 0.5/2.6 MB | 114/521 kB | 67 kB | 14 kB
Progress (4): 0.5/2.6 MB | 118/521 kB | 67 kB | 14 kB
Progress (5): 0.5/2.6 MB | 118/521 kB | 67 kB | 14 kB | 3.5 kB
Progress (5): 0.5/2.6 MB | 118/521 kB | 67 kB | 14 kB | 3.5 kB
Progress (5): 0.5/2.6 MB | 122/521 kB | 67 kB | 14 kB | 3.5 kB
Progress (5): 0.5/2.6 MB | 122/521 kB | 67 kB | 14 kB | 3.5 kB
Progress (5): 0.5/2.6 MB | 126/521 kB | 67 kB | 14 kB | 3.5 kB
Progress (5): 0.5/2.6 MB | 126/521 kB | 67 kB | 14 kB | 3.5 kB
Progress (5): 0.5/2.6 MB | 130/521 kB | 67 kB | 14 kB | 3.5 kB
Progress (5): 0.6/2.6 MB | 130/521 kB | 67 kB | 14 kB | 3.5 kB
Progress (5): 0.6/2.6 MB | 134/521 kB | 67 kB | 14 kB | 3.5 kB
Progress (5): 0.6/2.6 MB | 134/521 kB | 67 kB | 14 kB | 3.5 kB
Progress (5): 0.6/2.6 MB | 138/521 kB | 67 kB | 14 kB | 3.5 kB
Progress (5): 0.6/2.6 MB | 138/521 kB | 67 kB | 14 kB | 3.5 kB
Progress (5): 0.6/2.6 MB | 142/521 kB | 67 kB | 14 kB | 3.5 kB
Progress (5): 0.6/2.6 MB | 142/521 kB | 67 kB | 14 kB | 3.5 kB
Progress (5): 0.6/2.6 MB | 146/521 kB | 67 kB | 14 kB | 3.5 kB
Progress (5): 0.6/2.6 MB | 146/521 kB | 67 kB | 14 kB | 3.5 kB
Progress (5): 0.6/2.6 MB | 150/521 kB | 67 kB | 14 kB | 3.5 kB
Progress (5): 0.6/2.6 MB | 150/521 kB | 67 kB | 14 kB | 3.5 kB
Progress (5): 0.6/2.6 MB | 154/521 kB | 67 kB | 14 kB | 3.5 kB
Progress (5): 0.6/2.6 MB | 154/521 kB | 67 kB | 14 kB | 3.5 kB
Progress (5): 0.6/2.6 MB | 158/521 kB | 67 kB | 14 kB | 3.5 kB
Progress (5): 0.6/2.6 MB | 158/521 kB | 67 kB | 14 kB | 3.5 kB
Progress (5): 0.6/2.6 MB | 162/521 kB | 67 kB | 14 kB | 3.5 kB
Progress (5): 0.6/2.6 MB | 162/521 kB | 67 kB | 14 kB | 3.5 kB
Progress (5): 0.6/2.6 MB | 166/521 kB | 67 kB | 14 kB | 3.5 kB
Progress (5): 0.6/2.6 MB | 166/521 kB | 67 kB | 14 kB | 3.5 kB
                                                              
Downloaded from eclipse.maven.central.mirror: https://repo.eclipse.org/content/repositories/maven_central/org/apache/maven/maven-resolver-provider/3.6.2/maven-resolver-provider-3.6.2.jar (67 kB at 95 kB/s)
Progress (4): 0.6/2.6 MB | 170/521 kB | 14 kB | 3.5 kB
                                                      
Downloading from eclipse.maven.central.mirror: https://repo.eclipse.org/content/repositories/maven_central/org/codehaus/plexus/plexus-utils/3.2.1/plexus-utils-3.2.1.jar
Progress (4): 0.6/2.6 MB | 170/521 kB | 14 kB | 3.5 kB
Progress (4): 0.6/2.6 MB | 174/521 kB | 14 kB | 3.5 kB
Progress (4): 0.6/2.6 MB | 174/521 kB | 14 kB | 3.5 kB
Progress (4): 0.6/2.6 MB | 178/521 kB | 14 kB | 3.5 kB
Progress (4): 0.6/2.6 MB | 178/521 kB | 14 kB | 3.5 kB
Progress (4): 0.6/2.6 MB | 182/521 kB | 14 kB | 3.5 kB
Progress (4): 0.6/2.6 MB | 182/521 kB | 14 kB | 3.5 kB
Progress (4): 0.6/2.6 MB | 186/521 kB | 14 kB | 3.5 kB
Progress (4): 0.6/2.6 MB | 186/521 kB | 14 kB | 3.5 kB
Progress (4): 0.6/2.6 MB | 190/521 kB | 14 kB | 3.5 kB
Progress (4): 0.6/2.6 MB | 190/521 kB | 14 kB | 3.5 kB
Progress (4): 0.6/2.6 MB | 194/521 kB | 14 kB | 3.5 kB
Progress (4): 0.6/2.6 MB | 194/521 kB | 14 kB | 3.5 kB
Progress (4): 0.6/2.6 MB | 198/521 kB | 14 kB | 3.5 kB
Progress (4): 0.6/2.6 MB | 202/521 kB | 14 kB | 3.5 kB
                                                      
Downloaded from eclipse.maven.central.mirror: https://repo.eclipse.org/content/repositories/maven_central/com/google/errorprone/error_prone_annotations/2.1.3/error_prone_annotations-2.1.3.jar (14 kB at 19 kB/s)
Downloading from eclipse.maven.central.mirror: https://repo.eclipse.org/content/repositories/maven_central/org/codehaus/plexus/plexus-classworlds/2.6.0/plexus-classworlds-2.6.0.jar
Progress (3): 0.6/2.6 MB | 202/521 kB | 3.5 kB
Progress (3): 0.6/2.6 MB | 206/521 kB | 3.5 kB
Progress (4): 0.6/2.6 MB | 206/521 kB | 3.5 kB | 4.1/262 kB
                                                           
Downloaded from eclipse.maven.central.mirror: https://repo.eclipse.org/content/repositories/maven_central/org/codehaus/mojo/animal-sniffer-annotations/1.14/animal-sniffer-annotations-1.14.jar (3.5 kB at 4.5 kB/s)
Progress (3): 0.6/2.6 MB | 206/521 kB | 7.7/262 kB
Progress (3): 0.6/2.6 MB | 210/521 kB | 7.7/262 kB
Progress (3): 0.6/2.6 MB | 210/521 kB | 12/262 kB 
Progress (3): 0.6/2.6 MB | 214/521 kB | 12/262 kB
Progress (3): 0.6/2.6 MB | 214/521 kB | 12/262 kB
Progress (3): 0.6/2.6 MB | 218/521 kB | 12/262 kB
Progress (3): 0.6/2.6 MB | 218/521 kB | 16/262 kB
                                                 
Downloading from eclipse.maven.central.mirror: https://repo.eclipse.org/content/repositories/maven_central/org/codehaus/plexus/plexus-component-annotations/2.0.0/plexus-component-annotations-2.0.0.jar
Progress (3): 0.6/2.6 MB | 222/521 kB | 16/262 kB
Progress (3): 0.6/2.6 MB | 222/521 kB | 16/262 kB
Progress (3): 0.6/2.6 MB | 226/521 kB | 16/262 kB
Progress (3): 0.6/2.6 MB | 226/521 kB | 16/262 kB
Progress (3): 0.6/2.6 MB | 230/521 kB | 16/262 kB
Progress (3): 0.6/2.6 MB | 230/521 kB | 20/262 kB
Progress (3): 0.6/2.6 MB | 234/521 kB | 20/262 kB
Progress (3): 0.6/2.6 MB | 234/521 kB | 20/262 kB
Progress (3): 0.6/2.6 MB | 234/521 kB | 24/262 kB
Progress (3): 0.6/2.6 MB | 234/521 kB | 24/262 kB
Progress (3): 0.6/2.6 MB | 238/521 kB | 24/262 kB
Progress (3): 0.6/2.6 MB | 238/521 kB | 24/262 kB
Progress (3): 0.6/2.6 MB | 238/521 kB | 28/262 kB
Progress (3): 0.6/2.6 MB | 238/521 kB | 28/262 kB
Progress (3): 0.6/2.6 MB | 242/521 kB | 28/262 kB
Progress (3): 0.7/2.6 MB | 242/521 kB | 28/262 kB
Progress (3): 0.7/2.6 MB | 242/521 kB | 32/262 kB
Progress (3): 0.7/2.6 MB | 246/521 kB | 32/262 kB
Progress (3): 0.7/2.6 MB | 246/521 kB | 32/262 kB
Progress (3): 0.7/2.6 MB | 250/521 kB | 32/262 kB
Progress (3): 0.7/2.6 MB | 250/521 kB | 32/262 kB
Progress (3): 0.7/2.6 MB | 250/521 kB | 33/262 kB
Progress (3): 0.7/2.6 MB | 250/521 kB | 33/262 kB
Progress (3): 0.7/2.6 MB | 254/521 kB | 33/262 kB
Progress (3): 0.7/2.6 MB | 254/521 kB | 33/262 kB
Progress (3): 0.7/2.6 MB | 258/521 kB | 33/262 kB
Progress (3): 0.7/2.6 MB | 258/521 kB | 33/262 kB
Progress (3): 0.7/2.6 MB | 262/521 kB | 33/262 kB
Progress (3): 0.7/2.6 MB | 262/521 kB | 33/262 kB
Progress (3): 0.7/2.6 MB | 266/521 kB | 33/262 kB
Progress (3): 0.7/2.6 MB | 266/521 kB | 33/262 kB
Progress (3): 0.7/2.6 MB | 266/521 kB | 37/262 kB
Progress (3): 0.7/2.6 MB | 266/521 kB | 37/262 kB
Progress (3): 0.7/2.6 MB | 270/521 kB | 37/262 kB
Progress (3): 0.7/2.6 MB | 270/521 kB | 37/262 kB
Progress (3): 0.7/2.6 MB | 270/521 kB | 41/262 kB
Progress (3): 0.7/2.6 MB | 270/521 kB | 41/262 kB
Progress (3): 0.7/2.6 MB | 274/521 kB | 41/262 kB
Progress (3): 0.7/2.6 MB | 274/521 kB | 41/262 kB
Progress (3): 0.7/2.6 MB | 278/521 kB | 41/262 kB
Progress (3): 0.7/2.6 MB | 278/521 kB | 41/262 kB
Progress (3): 0.7/2.6 MB | 282/521 kB | 41/262 kB
Progress (3): 0.7/2.6 MB | 282/521 kB | 41/262 kB
Progress (3): 0.7/2.6 MB | 286/521 kB | 41/262 kB
Progress (3): 0.7/2.6 MB | 286/521 kB | 41/262 kB
Progress (3): 0.7/2.6 MB | 290/521 kB | 41/262 kB
Progress (3): 0.7/2.6 MB | 290/521 kB | 41/262 kB
Progress (3): 0.7/2.6 MB | 294/521 kB | 41/262 kB
Progress (3): 0.7/2.6 MB | 294/521 kB | 41/262 kB
Progress (3): 0.7/2.6 MB | 298/521 kB | 41/262 kB
Progress (3): 0.7/2.6 MB | 298/521 kB | 41/262 kB
Progress (4): 0.7/2.6 MB | 298/521 kB | 41/262 kB | 4.1/53 kB
Progress (4): 0.7/2.6 MB | 298/521 kB | 41/262 kB | 4.1/53 kB
Progress (4): 0.7/2.6 MB | 298/521 kB | 41/262 kB | 7.7/53 kB
Progress (4): 0.7/2.6 MB | 298/521 kB | 41/262 kB | 7.7/53 kB
Progress (4): 0.7/2.6 MB | 298/521 kB | 41/262 kB | 12/53 kB 
Progress (4): 0.7/2.6 MB | 298/521 kB | 41/262 kB | 12/53 kB
Progress (4): 0.7/2.6 MB | 298/521 kB | 41/262 kB | 16/53 kB
Progress (4): 0.7/2.6 MB | 298/521 kB | 45/262 kB | 16/53 kB
Progress (4): 0.7/2.6 MB | 298/521 kB | 45/262 kB | 16/53 kB
Progress (4): 0.7/2.6 MB | 298/521 kB | 49/262 kB | 16/53 kB
Progress (4): 0.7/2.6 MB | 298/521 kB | 49/262 kB | 16/53 kB
Progress (4): 0.7/2.6 MB | 298/521 kB | 49/262 kB | 16/53 kB
Progress (4): 0.7/2.6 MB | 298/521 kB | 49/262 kB | 16/53 kB
Progress (4): 0.8/2.6 MB | 298/521 kB | 49/262 kB | 16/53 kB
Progress (4): 0.8/2.6 MB | 298/521 kB | 49/262 kB | 16/53 kB
Progress (4): 0.8/2.6 MB | 302/521 kB | 49/262 kB | 16/53 kB
Progress (4): 0.8/2.6 MB | 302/521 kB | 49/262 kB | 16/53 kB
Progress (4): 0.8/2.6 MB | 306/521 kB | 49/262 kB | 16/53 kB
Progress (4): 0.8/2.6 MB | 306/521 kB | 49/262 kB | 16/53 kB
Progress (4): 0.8/2.6 MB | 306/521 kB | 49/262 kB | 16/53 kB
Progress (4): 0.8/2.6 MB | 310/521 kB | 49/262 kB | 16/53 kB
Progress (4): 0.8/2.6 MB | 310/521 kB | 49/262 kB | 16/53 kB
Progress (4): 0.8/2.6 MB | 314/521 kB | 49/262 kB | 16/53 kB
Progress (4): 0.8/2.6 MB | 314/521 kB | 49/262 kB | 16/53 kB
Progress (4): 0.8/2.6 MB | 314/521 kB | 53/262 kB | 16/53 kB
Progress (5): 0.8/2.6 MB | 314/521 kB | 53/262 kB | 16/53 kB | 4.1/4.2 kB
Progress (5): 0.8/2.6 MB | 314/521 kB | 53/262 kB | 16/53 kB | 4.1/4.2 kB
Progress (5): 0.8/2.6 MB | 318/521 kB | 53/262 kB | 16/53 kB | 4.1/4.2 kB
Progress (5): 0.8/2.6 MB | 318/521 kB | 53/262 kB | 20/53 kB | 4.1/4.2 kB
Progress (5): 0.8/2.6 MB | 322/521 kB | 53/262 kB | 20/53 kB | 4.1/4.2 kB
Progress (5): 0.8/2.6 MB | 322/521 kB | 53/262 kB | 20/53 kB | 4.1/4.2 kB
Progress (5): 0.8/2.6 MB | 322/521 kB | 53/262 kB | 20/53 kB | 4.2 kB    
Progress (5): 0.8/2.6 MB | 322/521 kB | 57/262 kB | 20/53 kB | 4.2 kB
Progress (5): 0.8/2.6 MB | 322/521 kB | 57/262 kB | 20/53 kB | 4.2 kB
Progress (5): 0.8/2.6 MB | 326/521 kB | 57/262 kB | 20/53 kB | 4.2 kB
Progress (5): 0.8/2.6 MB | 326/521 kB | 57/262 kB | 24/53 kB | 4.2 kB
Progress (5): 0.8/2.6 MB | 330/521 kB | 57/262 kB | 24/53 kB | 4.2 kB
Progress (5): 0.8/2.6 MB | 330/521 kB | 57/262 kB | 24/53 kB | 4.2 kB
Progress (5): 0.8/2.6 MB | 330/521 kB | 61/262 kB | 24/53 kB | 4.2 kB
Progress (5): 0.8/2.6 MB | 330/521 kB | 61/262 kB | 24/53 kB | 4.2 kB
Progress (5): 0.8/2.6 MB | 334/521 kB | 61/262 kB | 24/53 kB | 4.2 kB
Progress (5): 0.8/2.6 MB | 334/521 kB | 61/262 kB | 28/53 kB | 4.2 kB
Progress (5): 0.8/2.6 MB | 338/521 kB | 61/262 kB | 28/53 kB | 4.2 kB
Progress (5): 0.8/2.6 MB | 338/521 kB | 61/262 kB | 28/53 kB | 4.2 kB
Progress (5): 0.8/2.6 MB | 338/521 kB | 65/262 kB | 28/53 kB | 4.2 kB
Progress (5): 0.8/2.6 MB | 338/521 kB | 65/262 kB | 28/53 kB | 4.2 kB
Progress (5): 0.8/2.6 MB | 342/521 kB | 65/262 kB | 28/53 kB | 4.2 kB
Progress (5): 0.8/2.6 MB | 342/521 kB | 65/262 kB | 32/53 kB | 4.2 kB
Progress (5): 0.8/2.6 MB | 346/521 kB | 65/262 kB | 32/53 kB | 4.2 kB
Progress (5): 0.8/2.6 MB | 346/521 kB | 65/262 kB | 32/53 kB | 4.2 kB
Progress (5): 0.8/2.6 MB | 346/521 kB | 66/262 kB | 32/53 kB | 4.2 kB
Progress (5): 0.8/2.6 MB | 346/521 kB | 66/262 kB | 32/53 kB | 4.2 kB
Progress (5): 0.8/2.6 MB | 350/521 kB | 66/262 kB | 32/53 kB | 4.2 kB
Progress (5): 0.8/2.6 MB | 350/521 kB | 66/262 kB | 36/53 kB | 4.2 kB
Progress (5): 0.8/2.6 MB | 354/521 kB | 66/262 kB | 36/53 kB | 4.2 kB
Progress (5): 0.8/2.6 MB | 354/521 kB | 66/262 kB | 36/53 kB | 4.2 kB
Progress (5): 0.8/2.6 MB | 354/521 kB | 70/262 kB | 36/53 kB | 4.2 kB
Progress (5): 0.8/2.6 MB | 358/521 kB | 70/262 kB | 36/53 kB | 4.2 kB
Progress (5): 0.8/2.6 MB | 358/521 kB | 70/262 kB | 40/53 kB | 4.2 kB
Progress (5): 0.8/2.6 MB | 362/521 kB | 70/262 kB | 40/53 kB | 4.2 kB
                                                                     
Downloaded from eclipse.maven.central.mirror: https://repo.eclipse.org/content/repositories/maven_central/org/codehaus/plexus/plexus-component-annotations/2.0.0/plexus-component-annotations-2.0.0.jar (4.2 kB at 5.3 kB/s)
Progress (4): 0.8/2.6 MB | 362/521 kB | 74/262 kB | 40/53 kB
Progress (4): 0.8/2.6 MB | 362/521 kB | 74/262 kB | 40/53 kB
                                                            
Downloading from eclipse.maven.central.mirror: https://repo.eclipse.org/content/repositories/maven_central/org/apache/commons/commons-lang3/3.8.1/commons-lang3-3.8.1.jar
Progress (4): 0.8/2.6 MB | 366/521 kB | 74/262 kB | 40/53 kB
Progress (4): 0.8/2.6 MB | 366/521 kB | 74/262 kB | 44/53 kB
Progress (4): 0.8/2.6 MB | 370/521 kB | 74/262 kB | 44/53 kB
Progress (4): 0.8/2.6 MB | 370/521 kB | 78/262 kB | 44/53 kB
Progress (4): 0.8/2.6 MB | 370/521 kB | 78/262 kB | 44/53 kB
Progress (4): 0.8/2.6 MB | 374/521 kB | 78/262 kB | 44/53 kB
Progress (4): 0.8/2.6 MB | 374/521 kB | 78/262 kB | 48/53 kB
Progress (4): 0.8/2.6 MB | 378/521 kB | 78/262 kB | 48/53 kB
Progress (4): 0.8/2.6 MB | 378/521 kB | 78/262 kB | 48/53 kB
Progress (4): 0.8/2.6 MB | 378/521 kB | 82/262 kB | 48/53 kB
Progress (4): 0.8/2.6 MB | 378/521 kB | 82/262 kB | 48/53 kB
Progress (4): 0.8/2.6 MB | 382/521 kB | 82/262 kB | 48/53 kB
Progress (4): 0.8/2.6 MB | 382/521 kB | 82/262 kB | 52/53 kB
Progress (4): 0.8/2.6 MB | 386/521 kB | 82/262 kB | 52/53 kB
Progress (4): 0.8/2.6 MB | 386/521 kB | 82/262 kB | 52/53 kB
Progress (4): 0.8/2.6 MB | 386/521 kB | 86/262 kB | 52/53 kB
Progress (4): 0.8/2.6 MB | 386/521 kB | 86/262 kB | 52/53 kB
Progress (4): 0.8/2.6 MB | 390/521 kB | 86/262 kB | 52/53 kB
Progress (4): 0.8/2.6 MB | 390/521 kB | 86/262 kB | 53 kB   
Progress (4): 0.8/2.6 MB | 394/521 kB | 86/262 kB | 53 kB
Progress (4): 0.8/2.6 MB | 394/521 kB | 86/262 kB | 53 kB
Progress (4): 0.8/2.6 MB | 394/521 kB | 90/262 kB | 53 kB
Progress (4): 0.8/2.6 MB | 398/521 kB | 90/262 kB | 53 kB
Progress (4): 0.8/2.6 MB | 398/521 kB | 90/262 kB | 53 kB
Progress (4): 0.8/2.6 MB | 402/521 kB | 90/262 kB | 53 kB
Progress (5): 0.8/2.6 MB | 402/521 kB | 90/262 kB | 53 kB | 4.1/502 kB
Progress (5): 0.8/2.6 MB | 402/521 kB | 90/262 kB | 53 kB | 7.7/502 kB
Progress (5): 0.8/2.6 MB | 402/521 kB | 94/262 kB | 53 kB | 7.7/502 kB
Progress (5): 0.8/2.6 MB | 402/521 kB | 94/262 kB | 53 kB | 12/502 kB 
Progress (5): 0.8/2.6 MB | 406/521 kB | 94/262 kB | 53 kB | 12/502 kB
Progress (5): 0.9/2.6 MB | 406/521 kB | 94/262 kB | 53 kB | 12/502 kB
Progress (5): 0.9/2.6 MB | 410/521 kB | 94/262 kB | 53 kB | 12/502 kB
Progress (5): 0.9/2.6 MB | 410/521 kB | 94/262 kB | 53 kB | 16/502 kB
Progress (5): 0.9/2.6 MB | 410/521 kB | 98/262 kB | 53 kB | 16/502 kB
Progress (5): 0.9/2.6 MB | 410/521 kB | 98/262 kB | 53 kB | 20/502 kB
Progress (5): 0.9/2.6 MB | 414/521 kB | 98/262 kB | 53 kB | 20/502 kB
Progress (5): 0.9/2.6 MB | 414/521 kB | 98/262 kB | 53 kB | 20/502 kB
Progress (5): 0.9/2.6 MB | 418/521 kB | 98/262 kB | 53 kB | 20/502 kB
Progress (5): 0.9/2.6 MB | 418/521 kB | 98/262 kB | 53 kB | 24/502 kB
Progress (5): 0.9/2.6 MB | 422/521 kB | 98/262 kB | 53 kB | 24/502 kB
Progress (5): 0.9/2.6 MB | 422/521 kB | 98/262 kB | 53 kB | 28/502 kB
Progress (5): 0.9/2.6 MB | 422/521 kB | 102/262 kB | 53 kB | 28/502 kB
Progress (5): 0.9/2.6 MB | 422/521 kB | 102/262 kB | 53 kB | 32/502 kB
Progress (5): 0.9/2.6 MB | 426/521 kB | 102/262 kB | 53 kB | 32/502 kB
Progress (5): 0.9/2.6 MB | 426/521 kB | 102/262 kB | 53 kB | 32/502 kB
Progress (5): 0.9/2.6 MB | 430/521 kB | 102/262 kB | 53 kB | 32/502 kB
Progress (5): 0.9/2.6 MB | 430/521 kB | 102/262 kB | 53 kB | 33/502 kB
Progress (5): 0.9/2.6 MB | 430/521 kB | 106/262 kB | 53 kB | 33/502 kB
Progress (5): 0.9/2.6 MB | 430/521 kB | 106/262 kB | 53 kB | 37/502 kB
Progress (5): 0.9/2.6 MB | 434/521 kB | 106/262 kB | 53 kB | 37/502 kB
Progress (5): 0.9/2.6 MB | 434/521 kB | 106/262 kB | 53 kB | 37/502 kB
Progress (5): 0.9/2.6 MB | 434/521 kB | 106/262 kB | 53 kB | 41/502 kB
Progress (5): 0.9/2.6 MB | 434/521 kB | 110/262 kB | 53 kB | 41/502 kB
Progress (5): 0.9/2.6 MB | 434/521 kB | 110/262 kB | 53 kB | 41/502 kB
Progress (5): 0.9/2.6 MB | 438/521 kB | 110/262 kB | 53 kB | 41/502 kB
Progress (5): 0.9/2.6 MB | 438/521 kB | 110/262 kB | 53 kB | 41/502 kB
Progress (5): 0.9/2.6 MB | 438/521 kB | 114/262 kB | 53 kB | 41/502 kB
                                                                      
Downloaded from eclipse.maven.central.mirror: https://repo.eclipse.org/content/repositories/maven_central/org/codehaus/plexus/plexus-classworlds/2.6.0/plexus-classworlds-2.6.0.jar (53 kB at 60 kB/s)
Progress (4): 0.9/2.6 MB | 438/521 kB | 114/262 kB | 45/502 kB
                                                              
Downloading from eclipse.maven.central.mirror: https://repo.eclipse.org/content/repositories/maven_central/org/apache/maven/maven-embedder/3.6.2/maven-embedder-3.6.2.jar
Progress (4): 0.9/2.6 MB | 438/521 kB | 118/262 kB | 45/502 kB
Progress (4): 0.9/2.6 MB | 438/521 kB | 118/262 kB | 45/502 kB
Progress (4): 0.9/2.6 MB | 442/521 kB | 118/262 kB | 45/502 kB
Progress (4): 0.9/2.6 MB | 442/521 kB | 118/262 kB | 45/502 kB
Progress (4): 0.9/2.6 MB | 442/521 kB | 122/262 kB | 45/502 kB
Progress (4): 0.9/2.6 MB | 442/521 kB | 122/262 kB | 49/502 kB
Progress (4): 0.9/2.6 MB | 442/521 kB | 126/262 kB | 49/502 kB
Progress (4): 0.9/2.6 MB | 442/521 kB | 126/262 kB | 49/502 kB
Progress (4): 0.9/2.6 MB | 446/521 kB | 126/262 kB | 49/502 kB
Progress (4): 0.9/2.6 MB | 446/521 kB | 126/262 kB | 49/502 kB
Progress (4): 0.9/2.6 MB | 446/521 kB | 126/262 kB | 53/502 kB
Progress (4): 0.9/2.6 MB | 446/521 kB | 126/262 kB | 53/502 kB
Progress (4): 0.9/2.6 MB | 446/521 kB | 130/262 kB | 53/502 kB
Progress (4): 0.9/2.6 MB | 446/521 kB | 130/262 kB | 53/502 kB
Progress (4): 0.9/2.6 MB | 446/521 kB | 130/262 kB | 57/502 kB
Progress (4): 0.9/2.6 MB | 450/521 kB | 130/262 kB | 57/502 kB
Progress (4): 0.9/2.6 MB | 450/521 kB | 130/262 kB | 61/502 kB
Progress (4): 0.9/2.6 MB | 450/521 kB | 130/262 kB | 61/502 kB
Progress (4): 0.9/2.6 MB | 450/521 kB | 134/262 kB | 61/502 kB
Progress (4): 0.9/2.6 MB | 450/521 kB | 134/262 kB | 61/502 kB
Progress (4): 0.9/2.6 MB | 450/521 kB | 134/262 kB | 65/502 kB
Progress (4): 0.9/2.6 MB | 454/521 kB | 134/262 kB | 65/502 kB
Progress (4): 0.9/2.6 MB | 454/521 kB | 134/262 kB | 66/502 kB
Progress (4): 0.9/2.6 MB | 454/521 kB | 134/262 kB | 66/502 kB
Progress (4): 0.9/2.6 MB | 454/521 kB | 138/262 kB | 66/502 kB
Progress (4): 0.9/2.6 MB | 454/521 kB | 138/262 kB | 66/502 kB
Progress (4): 0.9/2.6 MB | 454/521 kB | 138/262 kB | 70/502 kB
Progress (4): 0.9/2.6 MB | 458/521 kB | 138/262 kB | 70/502 kB
Progress (4): 0.9/2.6 MB | 458/521 kB | 138/262 kB | 74/502 kB
Progress (4): 0.9/2.6 MB | 458/521 kB | 138/262 kB | 74/502 kB
Progress (4): 0.9/2.6 MB | 458/521 kB | 142/262 kB | 74/502 kB
Progress (4): 0.9/2.6 MB | 458/521 kB | 142/262 kB | 74/502 kB
Progress (4): 0.9/2.6 MB | 458/521 kB | 142/262 kB | 78/502 kB
Progress (4): 0.9/2.6 MB | 462/521 kB | 142/262 kB | 78/502 kB
Progress (4): 0.9/2.6 MB | 462/521 kB | 142/262 kB | 82/502 kB
Progress (4): 0.9/2.6 MB | 462/521 kB | 142/262 kB | 82/502 kB
Progress (4): 0.9/2.6 MB | 462/521 kB | 146/262 kB | 82/502 kB
Progress (4): 0.9/2.6 MB | 462/521 kB | 146/262 kB | 86/502 kB
Progress (4): 0.9/2.6 MB | 462/521 kB | 146/262 kB | 86/502 kB
Progress (4): 0.9/2.6 MB | 466/521 kB | 146/262 kB | 86/502 kB
Progress (5): 0.9/2.6 MB | 466/521 kB | 146/262 kB | 86/502 kB | 4.1/99 kB
Progress (5): 0.9/2.6 MB | 466/521 kB | 146/262 kB | 86/502 kB | 4.1/99 kB
Progress (5): 0.9/2.6 MB | 466/521 kB | 150/262 kB | 86/502 kB | 4.1/99 kB
Progress (5): 0.9/2.6 MB | 466/521 kB | 150/262 kB | 90/502 kB | 4.1/99 kB
Progress (5): 0.9/2.6 MB | 466/521 kB | 154/262 kB | 90/502 kB | 4.1/99 kB
Progress (5): 0.9/2.6 MB | 466/521 kB | 154/262 kB | 90/502 kB | 4.1/99 kB
Progress (5): 0.9/2.6 MB | 466/521 kB | 154/262 kB | 90/502 kB | 7.7/99 kB
Progress (5): 0.9/2.6 MB | 470/521 kB | 154/262 kB | 90/502 kB | 7.7/99 kB
Progress (5): 0.9/2.6 MB | 470/521 kB | 154/262 kB | 90/502 kB | 12/99 kB 
Progress (5): 0.9/2.6 MB | 470/521 kB | 154/262 kB | 90/502 kB | 12/99 kB
Progress (5): 0.9/2.6 MB | 470/521 kB | 158/262 kB | 90/502 kB | 12/99 kB
Progress (5): 0.9/2.6 MB | 470/521 kB | 158/262 kB | 94/502 kB | 12/99 kB
Progress (5): 0.9/2.6 MB | 470/521 kB | 162/262 kB | 94/502 kB | 12/99 kB
Progress (5): 0.9/2.6 MB | 470/521 kB | 162/262 kB | 94/502 kB | 12/99 kB
Progress (5): 0.9/2.6 MB | 470/521 kB | 162/262 kB | 94/502 kB | 16/99 kB
Progress (5): 0.9/2.6 MB | 474/521 kB | 162/262 kB | 94/502 kB | 16/99 kB
Progress (5): 0.9/2.6 MB | 474/521 kB | 162/262 kB | 94/502 kB | 20/99 kB
Progress (5): 0.9/2.6 MB | 474/521 kB | 162/262 kB | 94/502 kB | 20/99 kB
Progress (5): 0.9/2.6 MB | 474/521 kB | 166/262 kB | 94/502 kB | 20/99 kB
Progress (5): 0.9/2.6 MB | 474/521 kB | 166/262 kB | 98/502 kB | 20/99 kB
Progress (5): 0.9/2.6 MB | 474/521 kB | 170/262 kB | 98/502 kB | 20/99 kB
Progress (5): 1.0/2.6 MB | 474/521 kB | 170/262 kB | 98/502 kB | 20/99 kB
Progress (5): 1.0/2.6 MB | 474/521 kB | 170/262 kB | 98/502 kB | 24/99 kB
Progress (5): 1.0/2.6 MB | 478/521 kB | 170/262 kB | 98/502 kB | 24/99 kB
Progress (5): 1.0/2.6 MB | 478/521 kB | 170/262 kB | 98/502 kB | 28/99 kB
Progress (5): 1.0/2.6 MB | 478/521 kB | 170/262 kB | 98/502 kB | 28/99 kB
Progress (5): 1.0/2.6 MB | 478/521 kB | 174/262 kB | 98/502 kB | 28/99 kB
Progress (5): 1.0/2.6 MB | 478/521 kB | 174/262 kB | 102/502 kB | 28/99 kB
Progress (5): 1.0/2.6 MB | 478/521 kB | 178/262 kB | 102/502 kB | 28/99 kB
Progress (5): 1.0/2.6 MB | 478/521 kB | 178/262 kB | 102/502 kB | 28/99 kB
Progress (5): 1.0/2.6 MB | 478/521 kB | 178/262 kB | 102/502 kB | 32/99 kB
Progress (5): 1.0/2.6 MB | 482/521 kB | 178/262 kB | 102/502 kB | 32/99 kB
Progress (5): 1.0/2.6 MB | 482/521 kB | 178/262 kB | 102/502 kB | 33/99 kB
Progress (5): 1.0/2.6 MB | 482/521 kB | 178/262 kB | 102/502 kB | 33/99 kB
Progress (5): 1.0/2.6 MB | 482/521 kB | 182/262 kB | 102/502 kB | 33/99 kB
Progress (5): 1.0/2.6 MB | 482/521 kB | 182/262 kB | 106/502 kB | 33/99 kB
Progress (5): 1.0/2.6 MB | 482/521 kB | 186/262 kB | 106/502 kB | 33/99 kB
Progress (5): 1.0/2.6 MB | 482/521 kB | 186/262 kB | 106/502 kB | 33/99 kB
Progress (5): 1.0/2.6 MB | 482/521 kB | 186/262 kB | 106/502 kB | 37/99 kB
Progress (5): 1.0/2.6 MB | 482/521 kB | 186/262 kB | 106/502 kB | 37/99 kB
Progress (5): 1.0/2.6 MB | 486/521 kB | 186/262 kB | 106/502 kB | 37/99 kB
Progress (5): 1.0/2.6 MB | 486/521 kB | 186/262 kB | 106/502 kB | 37/99 kB
Progress (5): 1.0/2.6 MB | 486/521 kB | 186/262 kB | 106/502 kB | 41/99 kB
Progress (5): 1.0/2.6 MB | 486/521 kB | 190/262 kB | 106/502 kB | 41/99 kB
Progress (5): 1.0/2.6 MB | 486/521 kB | 190/262 kB | 110/502 kB | 41/99 kB
Progress (5): 1.0/2.6 MB | 486/521 kB | 194/262 kB | 110/502 kB | 41/99 kB
Progress (5): 1.0/2.6 MB | 486/521 kB | 194/262 kB | 110/502 kB | 45/99 kB
Progress (5): 1.0/2.6 MB | 486/521 kB | 194/262 kB | 110/502 kB | 45/99 kB
Progress (5): 1.0/2.6 MB | 490/521 kB | 194/262 kB | 110/502 kB | 45/99 kB
Progress (5): 1.0/2.6 MB | 490/521 kB | 194/262 kB | 110/502 kB | 45/99 kB
Progress (5): 1.0/2.6 MB | 490/521 kB | 194/262 kB | 110/502 kB | 49/99 kB
Progress (5): 1.0/2.6 MB | 490/521 kB | 198/262 kB | 110/502 kB | 49/99 kB
Progress (5): 1.0/2.6 MB | 490/521 kB | 198/262 kB | 114/502 kB | 49/99 kB
Progress (5): 1.0/2.6 MB | 490/521 kB | 202/262 kB | 114/502 kB | 49/99 kB
Progress (5): 1.0/2.6 MB | 490/521 kB | 202/262 kB | 118/502 kB | 49/99 kB
Progress (5): 1.0/2.6 MB | 490/521 kB | 202/262 kB | 118/502 kB | 53/99 kB
Progress (5): 1.0/2.6 MB | 490/521 kB | 202/262 kB | 118/502 kB | 53/99 kB
Progress (5): 1.0/2.6 MB | 494/521 kB | 202/262 kB | 118/502 kB | 53/99 kB
Progress (5): 1.0/2.6 MB | 494/521 kB | 202/262 kB | 118/502 kB | 53/99 kB
Progress (5): 1.0/2.6 MB | 494/521 kB | 202/262 kB | 118/502 kB | 57/99 kB
Progress (5): 1.0/2.6 MB | 494/521 kB | 202/262 kB | 122/502 kB | 57/99 kB
Progress (5): 1.0/2.6 MB | 494/521 kB | 206/262 kB | 122/502 kB | 57/99 kB
Progress (5): 1.0/2.6 MB | 494/521 kB | 206/262 kB | 126/502 kB | 57/99 kB
Progress (5): 1.0/2.6 MB | 494/521 kB | 206/262 kB | 126/502 kB | 61/99 kB
Progress (5): 1.0/2.6 MB | 494/521 kB | 206/262 kB | 126/502 kB | 61/99 kB
Progress (5): 1.0/2.6 MB | 498/521 kB | 206/262 kB | 126/502 kB | 61/99 kB
Progress (5): 1.0/2.6 MB | 498/521 kB | 206/262 kB | 126/502 kB | 61/99 kB
Progress (5): 1.0/2.6 MB | 498/521 kB | 206/262 kB | 126/502 kB | 65/99 kB
Progress (5): 1.0/2.6 MB | 498/521 kB | 206/262 kB | 130/502 kB | 65/99 kB
Progress (5): 1.0/2.6 MB | 498/521 kB | 206/262 kB | 134/502 kB | 65/99 kB
Progress (5): 1.0/2.6 MB | 498/521 kB | 206/262 kB | 138/502 kB | 65/99 kB
Progress (5): 1.0/2.6 MB | 498/521 kB | 206/262 kB | 142/502 kB | 65/99 kB
Progress (5): 1.0/2.6 MB | 498/521 kB | 206/262 kB | 146/502 kB | 65/99 kB
Progress (5): 1.0/2.6 MB | 498/521 kB | 210/262 kB | 146/502 kB | 65/99 kB
Progress (5): 1.0/2.6 MB | 498/521 kB | 210/262 kB | 150/502 kB | 65/99 kB
Progress (5): 1.0/2.6 MB | 498/521 kB | 210/262 kB | 150/502 kB | 66/99 kB
Progress (5): 1.0/2.6 MB | 498/521 kB | 210/262 kB | 150/502 kB | 66/99 kB
Progress (5): 1.0/2.6 MB | 502/521 kB | 210/262 kB | 150/502 kB | 66/99 kB
Progress (5): 1.0/2.6 MB | 502/521 kB | 210/262 kB | 150/502 kB | 66/99 kB
Progress (5): 1.0/2.6 MB | 502/521 kB | 210/262 kB | 150/502 kB | 70/99 kB
Progress (5): 1.0/2.6 MB | 502/521 kB | 210/262 kB | 150/502 kB | 74/99 kB
Progress (5): 1.0/2.6 MB | 502/521 kB | 210/262 kB | 154/502 kB | 74/99 kB
Progress (5): 1.0/2.6 MB | 502/521 kB | 214/262 kB | 154/502 kB | 74/99 kB
Progress (5): 1.0/2.6 MB | 502/521 kB | 214/262 kB | 158/502 kB | 74/99 kB
Progress (5): 1.0/2.6 MB | 502/521 kB | 214/262 kB | 158/502 kB | 78/99 kB
Progress (5): 1.0/2.6 MB | 502/521 kB | 214/262 kB | 158/502 kB | 78/99 kB
Progress (5): 1.0/2.6 MB | 506/521 kB | 214/262 kB | 158/502 kB | 78/99 kB
Progress (5): 1.0/2.6 MB | 506/521 kB | 214/262 kB | 158/502 kB | 78/99 kB
Progress (5): 1.0/2.6 MB | 506/521 kB | 214/262 kB | 158/502 kB | 82/99 kB
Progress (5): 1.0/2.6 MB | 506/521 kB | 214/262 kB | 162/502 kB | 82/99 kB
Progress (5): 1.0/2.6 MB | 506/521 kB | 218/262 kB | 162/502 kB | 82/99 kB
Progress (5): 1.0/2.6 MB | 506/521 kB | 218/262 kB | 166/502 kB | 82/99 kB
Progress (5): 1.0/2.6 MB | 506/521 kB | 218/262 kB | 166/502 kB | 86/99 kB
Progress (5): 1.0/2.6 MB | 506/521 kB | 218/262 kB | 166/502 kB | 86/99 kB
Progress (5): 1.0/2.6 MB | 510/521 kB | 218/262 kB | 166/502 kB | 86/99 kB
Progress (5): 1.0/2.6 MB | 510/521 kB | 218/262 kB | 166/502 kB | 86/99 kB
Progress (5): 1.0/2.6 MB | 510/521 kB | 218/262 kB | 166/502 kB | 90/99 kB
Progress (5): 1.0/2.6 MB | 510/521 kB | 218/262 kB | 170/502 kB | 90/99 kB
Progress (5): 1.0/2.6 MB | 510/521 kB | 218/262 kB | 170/502 kB | 94/99 kB
Progress (5): 1.0/2.6 MB | 510/521 kB | 222/262 kB | 170/502 kB | 94/99 kB
Progress (5): 1.0/2.6 MB | 510/521 kB | 222/262 kB | 170/502 kB | 98/99 kB
Progress (5): 1.0/2.6 MB | 510/521 kB | 222/262 kB | 174/502 kB | 98/99 kB
Progress (5): 1.0/2.6 MB | 510/521 kB | 222/262 kB | 174/502 kB | 98/99 kB
Progress (5): 1.0/2.6 MB | 514/521 kB | 222/262 kB | 174/502 kB | 98/99 kB
Progress (5): 1.0/2.6 MB | 514/521 kB | 222/262 kB | 174/502 kB | 98/99 kB
Progress (5): 1.0/2.6 MB | 514/521 kB | 222/262 kB | 178/502 kB | 98/99 kB
Progress (5): 1.0/2.6 MB | 514/521 kB | 222/262 kB | 178/502 kB | 99 kB   
Progress (5): 1.0/2.6 MB | 514/521 kB | 222/262 kB | 182/502 kB | 99 kB
Progress (5): 1.0/2.6 MB | 514/521 kB | 226/262 kB | 182/502 kB | 99 kB
Progress (5): 1.0/2.6 MB | 514/521 kB | 226/262 kB | 186/502 kB | 99 kB
Progress (5): 1.0/2.6 MB | 514/521 kB | 226/262 kB | 186/502 kB | 99 kB
Progress (5): 1.0/2.6 MB | 518/521 kB | 226/262 kB | 186/502 kB | 99 kB
Progress (5): 1.0/2.6 MB | 518/521 kB | 226/262 kB | 186/502 kB | 99 kB
Progress (5): 1.0/2.6 MB | 518/521 kB | 226/262 kB | 190/502 kB | 99 kB
Progress (5): 1.0/2.6 MB | 518/521 kB | 230/262 kB | 190/502 kB | 99 kB
Progress (5): 1.0/2.6 MB | 518/521 kB | 230/262 kB | 194/502 kB | 99 kB
Progress (5): 1.0/2.6 MB | 518/521 kB | 230/262 kB | 194/502 kB | 99 kB
Progress (5): 1.0/2.6 MB | 521 kB | 230/262 kB | 194/502 kB | 99 kB    
Progress (5): 1.0/2.6 MB | 521 kB | 230/262 kB | 194/502 kB | 99 kB
Progress (5): 1.0/2.6 MB | 521 kB | 230/262 kB | 198/502 kB | 99 kB
Progress (5): 1.0/2.6 MB | 521 kB | 234/262 kB | 198/502 kB | 99 kB
Progress (5): 1.0/2.6 MB | 521 kB | 234/262 kB | 202/502 kB | 99 kB
Progress (5): 1.0/2.6 MB | 521 kB | 238/262 kB | 202/502 kB | 99 kB
Progress (5): 1.0/2.6 MB | 521 kB | 242/262 kB | 202/502 kB | 99 kB
Progress (5): 1.0/2.6 MB | 521 kB | 246/262 kB | 202/502 kB | 99 kB
Progress (5): 1.0/2.6 MB | 521 kB | 250/262 kB | 202/502 kB | 99 kB
Progress (5): 1.0/2.6 MB | 521 kB | 254/262 kB | 202/502 kB | 99 kB
Progress (5): 1.0/2.6 MB | 521 kB | 258/262 kB | 202/502 kB | 99 kB
Progress (5): 1.1/2.6 MB | 521 kB | 258/262 kB | 202/502 kB | 99 kB
Progress (5): 1.1/2.6 MB | 521 kB | 262/262 kB | 202/502 kB | 99 kB
Progress (5): 1.1/2.6 MB | 521 kB | 262/262 kB | 206/502 kB | 99 kB
Progress (5): 1.1/2.6 MB | 521 kB | 262 kB | 206/502 kB | 99 kB    
Progress (5): 1.1/2.6 MB | 521 kB | 262 kB | 206/502 kB | 99 kB
                                                               
Downloaded from eclipse.maven.central.mirror: https://repo.eclipse.org/content/repositories/maven_central/org/apache/maven/maven-embedder/3.6.2/maven-embedder-3.6.2.jar (99 kB at 100 kB/s)
Progress (4): 1.1/2.6 MB | 521 kB | 262 kB | 210/502 kB
                                                       
Downloading from eclipse.maven.central.mirror: https://repo.eclipse.org/content/repositories/maven_central/org/sonatype/plexus/plexus-sec-dispatcher/1.4/plexus-sec-dispatcher-1.4.jar
Progress (4): 1.1/2.6 MB | 521 kB | 262 kB | 210/502 kB
Progress (4): 1.1/2.6 MB | 521 kB | 262 kB | 214/502 kB
Progress (4): 1.1/2.6 MB | 521 kB | 262 kB | 214/502 kB
Progress (4): 1.1/2.6 MB | 521 kB | 262 kB | 218/502 kB
                                                       
Downloaded from eclipse.maven.central.mirror: https://repo.eclipse.org/content/repositories/maven_central/com/google/inject/guice/4.2.1/guice-4.2.1-no_aop.jar (521 kB at 527 kB/s)
Progress (3): 1.1/2.6 MB | 262 kB | 218/502 kB
                                              
Downloading from eclipse.maven.central.mirror: https://repo.eclipse.org/content/repositories/maven_central/commons-cli/commons-cli/1.4/commons-cli-1.4.jar
Progress (3): 1.1/2.6 MB | 262 kB | 222/502 kB
Progress (3): 1.1/2.6 MB | 262 kB | 226/502 kB
Progress (3): 1.1/2.6 MB | 262 kB | 230/502 kB
Progress (3): 1.1/2.6 MB | 262 kB | 230/502 kB
Progress (3): 1.1/2.6 MB | 262 kB | 234/502 kB
Progress (3): 1.1/2.6 MB | 262 kB | 234/502 kB
Progress (3): 1.1/2.6 MB | 262 kB | 238/502 kB
Progress (3): 1.1/2.6 MB | 262 kB | 238/502 kB
Progress (3): 1.1/2.6 MB | 262 kB | 242/502 kB
Progress (3): 1.1/2.6 MB | 262 kB | 242/502 kB
Progress (3): 1.1/2.6 MB | 262 kB | 246/502 kB
Progress (3): 1.1/2.6 MB | 262 kB | 246/502 kB
Progress (3): 1.1/2.6 MB | 262 kB | 250/502 kB
Progress (3): 1.1/2.6 MB | 262 kB | 250/502 kB
Progress (3): 1.1/2.6 MB | 262 kB | 254/502 kB
Progress (3): 1.1/2.6 MB | 262 kB | 254/502 kB
Progress (3): 1.1/2.6 MB | 262 kB | 258/502 kB
Progress (3): 1.1/2.6 MB | 262 kB | 258/502 kB
Progress (3): 1.1/2.6 MB | 262 kB | 262/502 kB
Progress (3): 1.1/2.6 MB | 262 kB | 262/502 kB
Progress (3): 1.1/2.6 MB | 262 kB | 266/502 kB
Progress (3): 1.1/2.6 MB | 262 kB | 266/502 kB
Progress (3): 1.1/2.6 MB | 262 kB | 270/502 kB
Progress (3): 1.1/2.6 MB | 262 kB | 270/502 kB
Progress (3): 1.1/2.6 MB | 262 kB | 274/502 kB
Progress (3): 1.1/2.6 MB | 262 kB | 274/502 kB
Progress (3): 1.1/2.6 MB | 262 kB | 278/502 kB
Progress (3): 1.1/2.6 MB | 262 kB | 278/502 kB
Progress (3): 1.1/2.6 MB | 262 kB | 282/502 kB
Progress (3): 1.1/2.6 MB | 262 kB | 282/502 kB
Progress (3): 1.1/2.6 MB | 262 kB | 286/502 kB
Progress (3): 1.1/2.6 MB | 262 kB | 286/502 kB
Progress (3): 1.1/2.6 MB | 262 kB | 290/502 kB
Progress (3): 1.1/2.6 MB | 262 kB | 290/502 kB
Progress (3): 1.1/2.6 MB | 262 kB | 294/502 kB
Progress (3): 1.1/2.6 MB | 262 kB | 294/502 kB
Progress (3): 1.1/2.6 MB | 262 kB | 298/502 kB
Progress (3): 1.1/2.6 MB | 262 kB | 298/502 kB
Progress (3): 1.1/2.6 MB | 262 kB | 302/502 kB
Progress (3): 1.1/2.6 MB | 262 kB | 302/502 kB
Progress (3): 1.1/2.6 MB | 262 kB | 306/502 kB
Progress (3): 1.1/2.6 MB | 262 kB | 306/502 kB
Progress (3): 1.1/2.6 MB | 262 kB | 310/502 kB
Progress (3): 1.2/2.6 MB | 262 kB | 310/502 kB
Progress (3): 1.2/2.6 MB | 262 kB | 314/502 kB
Progress (3): 1.2/2.6 MB | 262 kB | 314/502 kB
Progress (3): 1.2/2.6 MB | 262 kB | 318/502 kB
Progress (3): 1.2/2.6 MB | 262 kB | 318/502 kB
Progress (3): 1.2/2.6 MB | 262 kB | 322/502 kB
                                              
Downloaded from eclipse.maven.central.mirror: https://repo.eclipse.org/content/repositories/maven_central/org/codehaus/plexus/plexus-utils/3.2.1/plexus-utils-3.2.1.jar (262 kB at 262 kB/s)
Progress (2): 1.2/2.6 MB | 326/502 kB
Progress (2): 1.2/2.6 MB | 326/502 kB
Progress (2): 1.2/2.6 MB | 330/502 kB
                                     
Downloading from eclipse.maven.central.mirror: https://repo.eclipse.org/content/repositories/maven_central/org/apache/maven/maven-compat/3.6.2/maven-compat-3.6.2.jar
Progress (2): 1.2/2.6 MB | 334/502 kB
Progress (2): 1.2/2.6 MB | 334/502 kB
Progress (2): 1.2/2.6 MB | 338/502 kB
Progress (2): 1.2/2.6 MB | 338/502 kB
Progress (3): 1.2/2.6 MB | 338/502 kB | 4.1/54 kB
Progress (3): 1.2/2.6 MB | 342/502 kB | 4.1/54 kB
Progress (3): 1.2/2.6 MB | 342/502 kB | 4.1/54 kB
Progress (3): 1.2/2.6 MB | 346/502 kB | 4.1/54 kB
Progress (3): 1.2/2.6 MB | 346/502 kB | 7.7/54 kB
Progress (3): 1.2/2.6 MB | 346/502 kB | 7.7/54 kB
Progress (3): 1.2/2.6 MB | 350/502 kB | 7.7/54 kB
Progress (3): 1.2/2.6 MB | 350/502 kB | 12/54 kB 
Progress (4): 1.2/2.6 MB | 350/502 kB | 12/54 kB | 4.1/28 kB
Progress (4): 1.2/2.6 MB | 350/502 kB | 12/54 kB | 4.1/28 kB
Progress (4): 1.2/2.6 MB | 350/502 kB | 12/54 kB | 7.7/28 kB
Progress (4): 1.2/2.6 MB | 350/502 kB | 16/54 kB | 7.7/28 kB
Progress (4): 1.2/2.6 MB | 354/502 kB | 16/54 kB | 7.7/28 kB
Progress (4): 1.2/2.6 MB | 354/502 kB | 16/54 kB | 12/28 kB 
Progress (4): 1.2/2.6 MB | 354/502 kB | 16/54 kB | 12/28 kB
Progress (5): 1.2/2.6 MB | 354/502 kB | 16/54 kB | 12/28 kB | 4.1/291 kB
Progress (5): 1.2/2.6 MB | 354/502 kB | 16/54 kB | 12/28 kB | 4.1/291 kB
Progress (5): 1.2/2.6 MB | 354/502 kB | 16/54 kB | 16/28 kB | 4.1/291 kB
Progress (5): 1.2/2.6 MB | 358/502 kB | 16/54 kB | 16/28 kB | 4.1/291 kB
Progress (5): 1.2/2.6 MB | 358/502 kB | 20/54 kB | 16/28 kB | 4.1/291 kB
Progress (5): 1.2/2.6 MB | 362/502 kB | 20/54 kB | 16/28 kB | 4.1/291 kB
Progress (5): 1.2/2.6 MB | 362/502 kB | 20/54 kB | 20/28 kB | 4.1/291 kB
Progress (5): 1.2/2.6 MB | 362/502 kB | 20/54 kB | 20/28 kB | 4.1/291 kB
Progress (5): 1.2/2.6 MB | 362/502 kB | 20/54 kB | 20/28 kB | 7.7/291 kB
Progress (5): 1.2/2.6 MB | 362/502 kB | 20/54 kB | 20/28 kB | 7.7/291 kB
Progress (5): 1.2/2.6 MB | 362/502 kB | 20/54 kB | 24/28 kB | 7.7/291 kB
Progress (5): 1.2/2.6 MB | 366/502 kB | 20/54 kB | 24/28 kB | 7.7/291 kB
Progress (5): 1.2/2.6 MB | 366/502 kB | 24/54 kB | 24/28 kB | 7.7/291 kB
Progress (5): 1.2/2.6 MB | 370/502 kB | 24/54 kB | 24/28 kB | 7.7/291 kB
Progress (5): 1.2/2.6 MB | 370/502 kB | 24/54 kB | 28 kB | 7.7/291 kB   
Progress (5): 1.2/2.6 MB | 370/502 kB | 24/54 kB | 28 kB | 7.7/291 kB
Progress (5): 1.2/2.6 MB | 370/502 kB | 24/54 kB | 28 kB | 12/291 kB 
Progress (5): 1.2/2.6 MB | 370/502 kB | 24/54 kB | 28 kB | 12/291 kB
Progress (5): 1.2/2.6 MB | 374/502 kB | 24/54 kB | 28 kB | 12/291 kB
Progress (5): 1.2/2.6 MB | 374/502 kB | 28/54 kB | 28 kB | 12/291 kB
Progress (5): 1.2/2.6 MB | 378/502 kB | 28/54 kB | 28 kB | 12/291 kB
Progress (5): 1.2/2.6 MB | 378/502 kB | 28/54 kB | 28 kB | 12/291 kB
Progress (5): 1.2/2.6 MB | 378/502 kB | 28/54 kB | 28 kB | 16/291 kB
Progress (5): 1.2/2.6 MB | 378/502 kB | 28/54 kB | 28 kB | 16/291 kB
Progress (5): 1.2/2.6 MB | 382/502 kB | 28/54 kB | 28 kB | 16/291 kB
Progress (5): 1.2/2.6 MB | 382/502 kB | 32/54 kB | 28 kB | 16/291 kB
Progress (5): 1.2/2.6 MB | 386/502 kB | 32/54 kB | 28 kB | 16/291 kB
Progress (5): 1.2/2.6 MB | 386/502 kB | 32/54 kB | 28 kB | 16/291 kB
Progress (5): 1.2/2.6 MB | 386/502 kB | 32/54 kB | 28 kB | 20/291 kB
Progress (5): 1.2/2.6 MB | 386/502 kB | 32/54 kB | 28 kB | 20/291 kB
Progress (5): 1.2/2.6 MB | 390/502 kB | 32/54 kB | 28 kB | 20/291 kB
Progress (5): 1.2/2.6 MB | 390/502 kB | 32/54 kB | 28 kB | 20/291 kB
Progress (5): 1.2/2.6 MB | 390/502 kB | 32/54 kB | 28 kB | 20/291 kB
Progress (5): 1.2/2.6 MB | 390/502 kB | 32/54 kB | 28 kB | 20/291 kB
Progress (5): 1.2/2.6 MB | 390/502 kB | 32/54 kB | 28 kB | 20/291 kB
Progress (5): 1.2/2.6 MB | 390/502 kB | 32/54 kB | 28 kB | 20/291 kB
Progress (5): 1.2/2.6 MB | 390/502 kB | 32/54 kB | 28 kB | 20/291 kB
Progress (5): 1.3/2.6 MB | 390/502 kB | 32/54 kB | 28 kB | 20/291 kB
Progress (5): 1.3/2.6 MB | 390/502 kB | 32/54 kB | 28 kB | 20/291 kB
Progress (5): 1.3/2.6 MB | 390/502 kB | 36/54 kB | 28 kB | 20/291 kB
Progress (5): 1.3/2.6 MB | 390/502 kB | 36/54 kB | 28 kB | 20/291 kB
                                                                    
Downloaded from eclipse.maven.central.mirror: https://repo.eclipse.org/content/repositories/maven_central/org/sonatype/plexus/plexus-sec-dispatcher/1.4/plexus-sec-dispatcher-1.4.jar (28 kB at 26 kB/s)
Progress (4): 1.3/2.6 MB | 394/502 kB | 36/54 kB | 20/291 kB
Progress (4): 1.3/2.6 MB | 394/502 kB | 36/54 kB | 24/291 kB
Progress (4): 1.3/2.6 MB | 398/502 kB | 36/54 kB | 24/291 kB
Progress (4): 1.3/2.6 MB | 398/502 kB | 36/54 kB | 28/291 kB
                                                            
Downloading from eclipse.maven.central.mirror: https://repo.eclipse.org/content/repositories/maven_central/org/codehaus/plexus/plexus-interpolation/1.25/plexus-interpolation-1.25.jar
Progress (4): 1.3/2.6 MB | 398/502 kB | 36/54 kB | 28/291 kB
Progress (4): 1.3/2.6 MB | 398/502 kB | 40/54 kB | 28/291 kB
Progress (4): 1.3/2.6 MB | 398/502 kB | 40/54 kB | 28/291 kB
Progress (4): 1.3/2.6 MB | 398/502 kB | 40/54 kB | 32/291 kB
Progress (4): 1.3/2.6 MB | 402/502 kB | 40/54 kB | 32/291 kB
Progress (4): 1.3/2.6 MB | 402/502 kB | 40/54 kB | 33/291 kB
Progress (4): 1.3/2.6 MB | 406/502 kB | 40/54 kB | 33/291 kB
Progress (4): 1.3/2.6 MB | 406/502 kB | 40/54 kB | 33/291 kB
Progress (4): 1.3/2.6 MB | 406/502 kB | 44/54 kB | 33/291 kB
Progress (4): 1.3/2.6 MB | 410/502 kB | 44/54 kB | 33/291 kB
Progress (4): 1.3/2.6 MB | 410/502 kB | 44/54 kB | 37/291 kB
Progress (4): 1.3/2.6 MB | 410/502 kB | 44/54 kB | 41/291 kB
Progress (4): 1.3/2.6 MB | 414/502 kB | 44/54 kB | 41/291 kB
Progress (4): 1.3/2.6 MB | 414/502 kB | 48/54 kB | 41/291 kB
Progress (4): 1.3/2.6 MB | 414/502 kB | 48/54 kB | 41/291 kB
Progress (4): 1.3/2.6 MB | 414/502 kB | 52/54 kB | 41/291 kB
Progress (4): 1.3/2.6 MB | 414/502 kB | 54 kB | 41/291 kB   
Progress (4): 1.3/2.6 MB | 418/502 kB | 54 kB | 41/291 kB
Progress (4): 1.3/2.6 MB | 418/502 kB | 54 kB | 45/291 kB
Progress (4): 1.3/2.6 MB | 422/502 kB | 54 kB | 45/291 kB
Progress (4): 1.3/2.6 MB | 422/502 kB | 54 kB | 49/291 kB
Progress (4): 1.3/2.6 MB | 422/502 kB | 54 kB | 53/291 kB
Progress (4): 1.3/2.6 MB | 422/502 kB | 54 kB | 57/291 kB
Progress (4): 1.3/2.6 MB | 422/502 kB | 54 kB | 61/291 kB
Progress (4): 1.3/2.6 MB | 422/502 kB | 54 kB | 65/291 kB
Progress (4): 1.3/2.6 MB | 422/502 kB | 54 kB | 65/291 kB
Progress (4): 1.3/2.6 MB | 422/502 kB | 54 kB | 66/291 kB
Progress (4): 1.3/2.6 MB | 426/502 kB | 54 kB | 66/291 kB
Progress (4): 1.3/2.6 MB | 426/502 kB | 54 kB | 70/291 kB
Progress (4): 1.3/2.6 MB | 426/502 kB | 54 kB | 70/291 kB
Progress (4): 1.3/2.6 MB | 426/502 kB | 54 kB | 74/291 kB
Progress (4): 1.3/2.6 MB | 430/502 kB | 54 kB | 74/291 kB
Progress (4): 1.3/2.6 MB | 430/502 kB | 54 kB | 78/291 kB
Progress (4): 1.3/2.6 MB | 430/502 kB | 54 kB | 78/291 kB
Progress (4): 1.3/2.6 MB | 430/502 kB | 54 kB | 82/291 kB
Progress (4): 1.3/2.6 MB | 434/502 kB | 54 kB | 82/291 kB
Progress (4): 1.3/2.6 MB | 434/502 kB | 54 kB | 86/291 kB
Progress (4): 1.3/2.6 MB | 434/502 kB | 54 kB | 86/291 kB
Progress (4): 1.3/2.6 MB | 434/502 kB | 54 kB | 90/291 kB
Progress (4): 1.3/2.6 MB | 438/502 kB | 54 kB | 90/291 kB
Progress (4): 1.3/2.6 MB | 438/502 kB | 54 kB | 94/291 kB
Progress (4): 1.3/2.6 MB | 438/502 kB | 54 kB | 94/291 kB
Progress (4): 1.3/2.6 MB | 438/502 kB | 54 kB | 98/291 kB
Progress (4): 1.3/2.6 MB | 442/502 kB | 54 kB | 98/291 kB
Progress (4): 1.3/2.6 MB | 442/502 kB | 54 kB | 98/291 kB
Progress (4): 1.3/2.6 MB | 442/502 kB | 54 kB | 102/291 kB
Progress (4): 1.3/2.6 MB | 442/502 kB | 54 kB | 102/291 kB
Progress (4): 1.3/2.6 MB | 446/502 kB | 54 kB | 102/291 kB
Progress (4): 1.3/2.6 MB | 446/502 kB | 54 kB | 102/291 kB
Progress (4): 1.3/2.6 MB | 446/502 kB | 54 kB | 106/291 kB
Progress (4): 1.3/2.6 MB | 446/502 kB | 54 kB | 106/291 kB
                                                          
Downloaded from eclipse.maven.central.mirror: https://repo.eclipse.org/content/repositories/maven_central/commons-cli/commons-cli/1.4/commons-cli-1.4.jar (54 kB at 49 kB/s)
Progress (3): 1.3/2.6 MB | 450/502 kB | 106/291 kB
                                                  
Downloading from eclipse.maven.central.mirror: https://repo.eclipse.org/content/repositories/maven_central/org/apache/maven/wagon/wagon-provider-api/3.3.3/wagon-provider-api-3.3.3.jar
Progress (3): 1.3/2.6 MB | 450/502 kB | 106/291 kB
Progress (3): 1.3/2.6 MB | 450/502 kB | 110/291 kB
Progress (3): 1.3/2.6 MB | 450/502 kB | 110/291 kB
Progress (3): 1.3/2.6 MB | 454/502 kB | 110/291 kB
Progress (3): 1.3/2.6 MB | 454/502 kB | 110/291 kB
Progress (3): 1.3/2.6 MB | 454/502 kB | 114/291 kB
Progress (4): 1.3/2.6 MB | 454/502 kB | 114/291 kB | 4.1/85 kB
Progress (4): 1.3/2.6 MB | 454/502 kB | 114/291 kB | 4.1/85 kB
Progress (4): 1.3/2.6 MB | 458/502 kB | 114/291 kB | 4.1/85 kB
Progress (4): 1.3/2.6 MB | 458/502 kB | 114/291 kB | 4.1/85 kB
Progress (4): 1.3/2.6 MB | 458/502 kB | 114/291 kB | 7.7/85 kB
Progress (4): 1.3/2.6 MB | 458/502 kB | 118/291 kB | 7.7/85 kB
Progress (4): 1.3/2.6 MB | 458/502 kB | 118/291 kB | 7.7/85 kB
Progress (4): 1.3/2.6 MB | 462/502 kB | 118/291 kB | 7.7/85 kB
Progress (4): 1.3/2.6 MB | 462/502 kB | 118/291 kB | 12/85 kB 
Progress (4): 1.3/2.6 MB | 462/502 kB | 122/291 kB | 12/85 kB
Progress (4): 1.3/2.6 MB | 462/502 kB | 122/291 kB | 16/85 kB
Progress (4): 1.3/2.6 MB | 466/502 kB | 122/291 kB | 16/85 kB
Progress (4): 1.3/2.6 MB | 466/502 kB | 122/291 kB | 16/85 kB
Progress (4): 1.3/2.6 MB | 466/502 kB | 122/291 kB | 20/85 kB
Progress (4): 1.3/2.6 MB | 466/502 kB | 126/291 kB | 20/85 kB
Progress (4): 1.3/2.6 MB | 466/502 kB | 126/291 kB | 24/85 kB
Progress (4): 1.3/2.6 MB | 466/502 kB | 126/291 kB | 24/85 kB
Progress (4): 1.3/2.6 MB | 470/502 kB | 126/291 kB | 24/85 kB
Progress (4): 1.3/2.6 MB | 470/502 kB | 126/291 kB | 24/85 kB
Progress (4): 1.3/2.6 MB | 470/502 kB | 126/291 kB | 28/85 kB
Progress (4): 1.3/2.6 MB | 470/502 kB | 130/291 kB | 28/85 kB
Progress (4): 1.3/2.6 MB | 470/502 kB | 130/291 kB | 32/85 kB
Progress (4): 1.4/2.6 MB | 470/502 kB | 130/291 kB | 32/85 kB
Progress (4): 1.4/2.6 MB | 470/502 kB | 130/291 kB | 32/85 kB
Progress (4): 1.4/2.6 MB | 474/502 kB | 130/291 kB | 32/85 kB
Progress (4): 1.4/2.6 MB | 474/502 kB | 130/291 kB | 32/85 kB
Progress (4): 1.4/2.6 MB | 474/502 kB | 130/291 kB | 33/85 kB
Progress (4): 1.4/2.6 MB | 474/502 kB | 134/291 kB | 33/85 kB
Progress (4): 1.4/2.6 MB | 474/502 kB | 134/291 kB | 33/85 kB
Progress (4): 1.4/2.6 MB | 478/502 kB | 134/291 kB | 33/85 kB
Progress (4): 1.4/2.6 MB | 478/502 kB | 134/291 kB | 33/85 kB
Progress (4): 1.4/2.6 MB | 478/502 kB | 138/291 kB | 33/85 kB
Progress (4): 1.4/2.6 MB | 478/502 kB | 138/291 kB | 37/85 kB
Progress (4): 1.4/2.6 MB | 478/502 kB | 142/291 kB | 37/85 kB
Progress (4): 1.4/2.6 MB | 478/502 kB | 142/291 kB | 37/85 kB
Progress (4): 1.4/2.6 MB | 482/502 kB | 142/291 kB | 37/85 kB
Progress (4): 1.4/2.6 MB | 482/502 kB | 142/291 kB | 37/85 kB
Progress (4): 1.4/2.6 MB | 486/502 kB | 142/291 kB | 37/85 kB
Progress (4): 1.4/2.6 MB | 486/502 kB | 146/291 kB | 37/85 kB
Progress (4): 1.4/2.6 MB | 486/502 kB | 146/291 kB | 41/85 kB
Progress (4): 1.4/2.6 MB | 486/502 kB | 150/291 kB | 41/85 kB
Progress (4): 1.4/2.6 MB | 490/502 kB | 150/291 kB | 41/85 kB
Progress (4): 1.4/2.6 MB | 490/502 kB | 150/291 kB | 41/85 kB
Progress (5): 1.4/2.6 MB | 490/502 kB | 150/291 kB | 41/85 kB | 4.1/56 kB
Progress (5): 1.4/2.6 MB | 490/502 kB | 150/291 kB | 41/85 kB | 4.1/56 kB
Progress (5): 1.4/2.6 MB | 490/502 kB | 150/291 kB | 41/85 kB | 4.1/56 kB
Progress (5): 1.4/2.6 MB | 490/502 kB | 150/291 kB | 41/85 kB | 4.1/56 kB
Progress (5): 1.4/2.6 MB | 494/502 kB | 150/291 kB | 41/85 kB | 4.1/56 kB
Progress (5): 1.4/2.6 MB | 494/502 kB | 154/291 kB | 41/85 kB | 4.1/56 kB
Progress (5): 1.4/2.6 MB | 494/502 kB | 154/291 kB | 45/85 kB | 4.1/56 kB
Progress (5): 1.4/2.6 MB | 494/502 kB | 158/291 kB | 45/85 kB | 4.1/56 kB
Progress (5): 1.4/2.6 MB | 498/502 kB | 158/291 kB | 45/85 kB | 4.1/56 kB
Progress (5): 1.4/2.6 MB | 498/502 kB | 158/291 kB | 45/85 kB | 4.1/56 kB
Progress (5): 1.4/2.6 MB | 498/502 kB | 158/291 kB | 45/85 kB | 7.7/56 kB
Progress (5): 1.4/2.6 MB | 498/502 kB | 158/291 kB | 45/85 kB | 7.7/56 kB
Progress (5): 1.4/2.6 MB | 502/502 kB | 158/291 kB | 45/85 kB | 7.7/56 kB
Progress (5): 1.4/2.6 MB | 502 kB | 158/291 kB | 45/85 kB | 7.7/56 kB    
Progress (5): 1.4/2.6 MB | 502 kB | 162/291 kB | 45/85 kB | 7.7/56 kB
Progress (5): 1.4/2.6 MB | 502 kB | 162/291 kB | 49/85 kB | 7.7/56 kB
Progress (5): 1.4/2.6 MB | 502 kB | 166/291 kB | 49/85 kB | 7.7/56 kB
Progress (5): 1.4/2.6 MB | 502 kB | 166/291 kB | 49/85 kB | 7.7/56 kB
Progress (5): 1.4/2.6 MB | 502 kB | 166/291 kB | 49/85 kB | 12/56 kB 
Progress (5): 1.4/2.6 MB | 502 kB | 166/291 kB | 49/85 kB | 12/56 kB
Progress (5): 1.4/2.6 MB | 502 kB | 170/291 kB | 49/85 kB | 12/56 kB
Progress (5): 1.4/2.6 MB | 502 kB | 170/291 kB | 49/85 kB | 12/56 kB
Progress (5): 1.4/2.6 MB | 502 kB | 170/291 kB | 49/85 kB | 12/56 kB
Progress (5): 1.4/2.6 MB | 502 kB | 170/291 kB | 49/85 kB | 12/56 kB
Progress (5): 1.4/2.6 MB | 502 kB | 170/291 kB | 49/85 kB | 12/56 kB
Progress (5): 1.4/2.6 MB | 502 kB | 170/291 kB | 53/85 kB | 12/56 kB
Progress (5): 1.4/2.6 MB | 502 kB | 170/291 kB | 53/85 kB | 12/56 kB
Progress (5): 1.4/2.6 MB | 502 kB | 174/291 kB | 53/85 kB | 12/56 kB
Progress (5): 1.4/2.6 MB | 502 kB | 174/291 kB | 53/85 kB | 16/56 kB
Progress (5): 1.4/2.6 MB | 502 kB | 178/291 kB | 53/85 kB | 16/56 kB
Progress (5): 1.4/2.6 MB | 502 kB | 178/291 kB | 53/85 kB | 20/56 kB
Progress (5): 1.4/2.6 MB | 502 kB | 178/291 kB | 53/85 kB | 20/56 kB
Progress (5): 1.4/2.6 MB | 502 kB | 178/291 kB | 57/85 kB | 20/56 kB
Progress (5): 1.4/2.6 MB | 502 kB | 178/291 kB | 57/85 kB | 20/56 kB
Progress (5): 1.4/2.6 MB | 502 kB | 178/291 kB | 61/85 kB | 20/56 kB
Progress (5): 1.4/2.6 MB | 502 kB | 178/291 kB | 61/85 kB | 24/56 kB
Progress (5): 1.4/2.6 MB | 502 kB | 182/291 kB | 61/85 kB | 24/56 kB
Progress (5): 1.4/2.6 MB | 502 kB | 182/291 kB | 61/85 kB | 28/56 kB
Progress (5): 1.4/2.6 MB | 502 kB | 182/291 kB | 65/85 kB | 28/56 kB
Progress (5): 1.4/2.6 MB | 502 kB | 182/291 kB | 65/85 kB | 28/56 kB
Progress (5): 1.4/2.6 MB | 502 kB | 182/291 kB | 69/85 kB | 28/56 kB
Progress (5): 1.4/2.6 MB | 502 kB | 182/291 kB | 69/85 kB | 32/56 kB
Progress (5): 1.4/2.6 MB | 502 kB | 186/291 kB | 69/85 kB | 32/56 kB
Progress (5): 1.4/2.6 MB | 502 kB | 186/291 kB | 69/85 kB | 36/56 kB
Progress (5): 1.4/2.6 MB | 502 kB | 186/291 kB | 73/85 kB | 36/56 kB
Progress (5): 1.4/2.6 MB | 502 kB | 186/291 kB | 73/85 kB | 36/56 kB
Progress (5): 1.4/2.6 MB | 502 kB | 186/291 kB | 73/85 kB | 40/56 kB
Progress (5): 1.4/2.6 MB | 502 kB | 190/291 kB | 73/85 kB | 40/56 kB
Progress (5): 1.4/2.6 MB | 502 kB | 190/291 kB | 73/85 kB | 40/56 kB
Progress (5): 1.4/2.6 MB | 502 kB | 190/291 kB | 77/85 kB | 40/56 kB
Progress (5): 1.5/2.6 MB | 502 kB | 190/291 kB | 77/85 kB | 40/56 kB
Progress (5): 1.5/2.6 MB | 502 kB | 194/291 kB | 77/85 kB | 40/56 kB
Progress (5): 1.5/2.6 MB | 502 kB | 194/291 kB | 77/85 kB | 44/56 kB
Progress (5): 1.5/2.6 MB | 502 kB | 198/291 kB | 77/85 kB | 44/56 kB
Progress (5): 1.5/2.6 MB | 502 kB | 198/291 kB | 77/85 kB | 44/56 kB
Progress (5): 1.5/2.6 MB | 502 kB | 198/291 kB | 81/85 kB | 44/56 kB
Progress (5): 1.5/2.6 MB | 502 kB | 198/291 kB | 81/85 kB | 44/56 kB
Progress (5): 1.5/2.6 MB | 502 kB | 202/291 kB | 81/85 kB | 44/56 kB
Progress (5): 1.5/2.6 MB | 502 kB | 202/291 kB | 81/85 kB | 48/56 kB
Progress (5): 1.5/2.6 MB | 502 kB | 206/291 kB | 81/85 kB | 48/56 kB
Progress (5): 1.5/2.6 MB | 502 kB | 206/291 kB | 81/85 kB | 48/56 kB
Progress (5): 1.5/2.6 MB | 502 kB | 206/291 kB | 85/85 kB | 48/56 kB
Progress (5): 1.5/2.6 MB | 502 kB | 210/291 kB | 85/85 kB | 48/56 kB
Progress (5): 1.5/2.6 MB | 502 kB | 210/291 kB | 85/85 kB | 52/56 kB
Progress (5): 1.5/2.6 MB | 502 kB | 210/291 kB | 85/85 kB | 52/56 kB
Progress (5): 1.5/2.6 MB | 502 kB | 214/291 kB | 85/85 kB | 52/56 kB
Progress (5): 1.5/2.6 MB | 502 kB | 214/291 kB | 85 kB | 52/56 kB   
Progress (5): 1.5/2.6 MB | 502 kB | 218/291 kB | 85 kB | 52/56 kB
Progress (5): 1.5/2.6 MB | 502 kB | 218/291 kB | 85 kB | 52/56 kB
Progress (5): 1.5/2.6 MB | 502 kB | 218/291 kB | 85 kB | 56/56 kB
Progress (5): 1.5/2.6 MB | 502 kB | 218/291 kB | 85 kB | 56/56 kB
Progress (5): 1.5/2.6 MB | 502 kB | 222/291 kB | 85 kB | 56/56 kB
Progress (5): 1.5/2.6 MB | 502 kB | 222/291 kB | 85 kB | 56/56 kB
Progress (5): 1.5/2.6 MB | 502 kB | 222/291 kB | 85 kB | 56 kB   
Progress (5): 1.5/2.6 MB | 502 kB | 222/291 kB | 85 kB | 56 kB
Progress (5): 1.5/2.6 MB | 502 kB | 226/291 kB | 85 kB | 56 kB
Progress (5): 1.5/2.6 MB | 502 kB | 226/291 kB | 85 kB | 56 kB
Progress (5): 1.5/2.6 MB | 502 kB | 230/291 kB | 85 kB | 56 kB
Progress (5): 1.5/2.6 MB | 502 kB | 230/291 kB | 85 kB | 56 kB
Progress (5): 1.5/2.6 MB | 502 kB | 234/291 kB | 85 kB | 56 kB
Progress (5): 1.5/2.6 MB | 502 kB | 234/291 kB | 85 kB | 56 kB
Progress (5): 1.5/2.6 MB | 502 kB | 238/291 kB | 85 kB | 56 kB
Progress (5): 1.5/2.6 MB | 502 kB | 238/291 kB | 85 kB | 56 kB
Progress (5): 1.5/2.6 MB | 502 kB | 242/291 kB | 85 kB | 56 kB
Progress (5): 1.5/2.6 MB | 502 kB | 242/291 kB | 85 kB | 56 kB
Progress (5): 1.5/2.6 MB | 502 kB | 246/291 kB | 85 kB | 56 kB
Progress (5): 1.5/2.6 MB | 502 kB | 246/291 kB | 85 kB | 56 kB
Progress (5): 1.5/2.6 MB | 502 kB | 250/291 kB | 85 kB | 56 kB
Progress (5): 1.5/2.6 MB | 502 kB | 250/291 kB | 85 kB | 56 kB
Progress (5): 1.5/2.6 MB | 502 kB | 254/291 kB | 85 kB | 56 kB
Progress (5): 1.5/2.6 MB | 502 kB | 254/291 kB | 85 kB | 56 kB
Progress (5): 1.5/2.6 MB | 502 kB | 258/291 kB | 85 kB | 56 kB
Progress (5): 1.5/2.6 MB | 502 kB | 258/291 kB | 85 kB | 56 kB
Progress (5): 1.5/2.6 MB | 502 kB | 262/291 kB | 85 kB | 56 kB
Progress (5): 1.5/2.6 MB | 502 kB | 262/291 kB | 85 kB | 56 kB
Progress (5): 1.5/2.6 MB | 502 kB | 266/291 kB | 85 kB | 56 kB
Progress (5): 1.5/2.6 MB | 502 kB | 266/291 kB | 85 kB | 56 kB
Progress (5): 1.5/2.6 MB | 502 kB | 270/291 kB | 85 kB | 56 kB
Progress (5): 1.5/2.6 MB | 502 kB | 270/291 kB | 85 kB | 56 kB
Progress (5): 1.5/2.6 MB | 502 kB | 274/291 kB | 85 kB | 56 kB
Progress (5): 1.5/2.6 MB | 502 kB | 274/291 kB | 85 kB | 56 kB
Progress (5): 1.5/2.6 MB | 502 kB | 278/291 kB | 85 kB | 56 kB
Progress (5): 1.5/2.6 MB | 502 kB | 278/291 kB | 85 kB | 56 kB
                                                              
Downloaded from eclipse.maven.central.mirror: https://repo.eclipse.org/content/repositories/maven_central/org/codehaus/plexus/plexus-interpolation/1.25/plexus-interpolation-1.25.jar (85 kB at 72 kB/s)
Progress (4): 1.5/2.6 MB | 502 kB | 282/291 kB | 56 kB
                                                      
Downloading from eclipse.maven.central.mirror: https://repo.eclipse.org/content/repositories/maven_central/org/eclipse/sisu/org.eclipse.sisu.plexus/0.3.3/org.eclipse.sisu.plexus-0.3.3.jar
Downloaded from eclipse.maven.central.mirror: https://repo.eclipse.org/content/repositories/maven_central/org/apache/maven/wagon/wagon-provider-api/3.3.3/wagon-provider-api-3.3.3.jar (56 kB at 47 kB/s)
Downloading from eclipse.maven.central.mirror: https://repo.eclipse.org/content/repositories/maven_central/io/takari/aether/aether-connector-okhttp/0.17.6/aether-connector-okhttp-0.17.6.jar
Progress (3): 1.5/2.6 MB | 502 kB | 282/291 kB
Progress (3): 1.5/2.6 MB | 502 kB | 286/291 kB
Progress (3): 1.5/2.6 MB | 502 kB | 290/291 kB
Progress (3): 1.5/2.6 MB | 502 kB | 290/291 kB
Progress (3): 1.5/2.6 MB | 502 kB | 291 kB    
Progress (3): 1.6/2.6 MB | 502 kB | 291 kB
Progress (3): 1.6/2.6 MB | 502 kB | 291 kB
Progress (3): 1.6/2.6 MB | 502 kB | 291 kB
Progress (3): 1.6/2.6 MB | 502 kB | 291 kB
Progress (3): 1.6/2.6 MB | 502 kB | 291 kB
Progress (3): 1.6/2.6 MB | 502 kB | 291 kB
Progress (3): 1.6/2.6 MB | 502 kB | 291 kB
Progress (3): 1.6/2.6 MB | 502 kB | 291 kB
Progress (3): 1.6/2.6 MB | 502 kB | 291 kB
Progress (3): 1.6/2.6 MB | 502 kB | 291 kB
Progress (3): 1.6/2.6 MB | 502 kB | 291 kB
Progress (3): 1.6/2.6 MB | 502 kB | 291 kB
Progress (3): 1.6/2.6 MB | 502 kB | 291 kB
Progress (3): 1.6/2.6 MB | 502 kB | 291 kB
Progress (3): 1.6/2.6 MB | 502 kB | 291 kB
Progress (3): 1.6/2.6 MB | 502 kB | 291 kB
Progress (3): 1.6/2.6 MB | 502 kB | 291 kB
Progress (3): 1.6/2.6 MB | 502 kB | 291 kB
Progress (3): 1.6/2.6 MB | 502 kB | 291 kB
Progress (3): 1.6/2.6 MB | 502 kB | 291 kB
Progress (3): 1.6/2.6 MB | 502 kB | 291 kB
Progress (3): 1.6/2.6 MB | 502 kB | 291 kB
Progress (3): 1.6/2.6 MB | 502 kB | 291 kB
Progress (3): 1.6/2.6 MB | 502 kB | 291 kB
Progress (3): 1.6/2.6 MB | 502 kB | 291 kB
Progress (3): 1.7/2.6 MB | 502 kB | 291 kB
Progress (4): 1.7/2.6 MB | 502 kB | 291 kB | 4.1/205 kB
Progress (4): 1.7/2.6 MB | 502 kB | 291 kB | 4.1/205 kB
                                                       
Downloaded from eclipse.maven.central.mirror: https://repo.eclipse.org/content/repositories/maven_central/org/apache/maven/maven-compat/3.6.2/maven-compat-3.6.2.jar (291 kB at 230 kB/s)
Progress (4): 1.7/2.6 MB | 502 kB | 4.1/205 kB | 4.1/51 kB
                                                          
Downloading from eclipse.maven.central.mirror: https://repo.eclipse.org/content/repositories/maven_central/com/squareup/okhttp3/okhttp/3.14.1/okhttp-3.14.1.jar
Progress (4): 1.7/2.6 MB | 502 kB | 4.1/205 kB | 4.1/51 kB
                                                          
Downloaded from eclipse.maven.central.mirror: https://repo.eclipse.org/content/repositories/maven_central/org/apache/commons/commons-lang3/3.8.1/commons-lang3-3.8.1.jar (502 kB at 396 kB/s)
Progress (3): 1.7/2.6 MB | 7.7/205 kB | 4.1/51 kB
                                                 
Downloading from eclipse.maven.central.mirror: https://repo.eclipse.org/content/repositories/maven_central/com/squareup/okio/okio/1.17.3/okio-1.17.3.jar
Progress (3): 1.7/2.6 MB | 7.7/205 kB | 4.1/51 kB
Progress (3): 1.7/2.6 MB | 7.7/205 kB | 7.7/51 kB
Progress (3): 1.7/2.6 MB | 7.7/205 kB | 7.7/51 kB
Progress (3): 1.7/2.6 MB | 12/205 kB | 7.7/51 kB 
Progress (3): 1.7/2.6 MB | 12/205 kB | 7.7/51 kB
Progress (3): 1.7/2.6 MB | 12/205 kB | 12/51 kB 
Progress (3): 1.7/2.6 MB | 12/205 kB | 12/51 kB
Progress (3): 1.7/2.6 MB | 16/205 kB | 12/51 kB
Progress (3): 1.7/2.6 MB | 16/205 kB | 12/51 kB
Progress (3): 1.7/2.6 MB | 20/205 kB | 12/51 kB
Progress (3): 1.7/2.6 MB | 20/205 kB | 16/51 kB
Progress (3): 1.7/2.6 MB | 24/205 kB | 16/51 kB
Progress (3): 1.7/2.6 MB | 24/205 kB | 16/51 kB
Progress (3): 1.7/2.6 MB | 24/205 kB | 20/51 kB
Progress (3): 1.7/2.6 MB | 24/205 kB | 20/51 kB
Progress (3): 1.7/2.6 MB | 28/205 kB | 20/51 kB
Progress (3): 1.7/2.6 MB | 28/205 kB | 24/51 kB
Progress (3): 1.7/2.6 MB | 32/205 kB | 24/51 kB
Progress (3): 1.7/2.6 MB | 32/205 kB | 24/51 kB
Progress (3): 1.7/2.6 MB | 33/205 kB | 24/51 kB
Progress (3): 1.7/2.6 MB | 33/205 kB | 28/51 kB
Progress (3): 1.7/2.6 MB | 33/205 kB | 28/51 kB
Progress (3): 1.7/2.6 MB | 33/205 kB | 32/51 kB
Progress (3): 1.7/2.6 MB | 33/205 kB | 32/51 kB
Progress (3): 1.7/2.6 MB | 37/205 kB | 32/51 kB
Progress (3): 1.7/2.6 MB | 37/205 kB | 32/51 kB
Progress (3): 1.7/2.6 MB | 37/205 kB | 33/51 kB
Progress (3): 1.7/2.6 MB | 37/205 kB | 33/51 kB
Progress (3): 1.7/2.6 MB | 41/205 kB | 33/51 kB
Progress (3): 1.7/2.6 MB | 41/205 kB | 33/51 kB
Progress (3): 1.7/2.6 MB | 41/205 kB | 37/51 kB
Progress (3): 1.7/2.6 MB | 41/205 kB | 37/51 kB
Progress (3): 1.7/2.6 MB | 45/205 kB | 37/51 kB
Progress (3): 1.7/2.6 MB | 45/205 kB | 37/51 kB
Progress (4): 1.7/2.6 MB | 45/205 kB | 37/51 kB | 4.1/426 kB
Progress (4): 1.7/2.6 MB | 45/205 kB | 41/51 kB | 4.1/426 kB
Progress (4): 1.7/2.6 MB | 45/205 kB | 41/51 kB | 7.7/426 kB
Progress (4): 1.7/2.6 MB | 45/205 kB | 41/51 kB | 7.7/426 kB
Progress (4): 1.7/2.6 MB | 49/205 kB | 41/51 kB | 7.7/426 kB
Progress (4): 1.7/2.6 MB | 49/205 kB | 41/51 kB | 7.7/426 kB
Progress (4): 1.7/2.6 MB | 53/205 kB | 41/51 kB | 7.7/426 kB
Progress (4): 1.7/2.6 MB | 53/205 kB | 41/51 kB | 12/426 kB 
Progress (4): 1.7/2.6 MB | 53/205 kB | 45/51 kB | 12/426 kB
Progress (4): 1.7/2.6 MB | 53/205 kB | 45/51 kB | 16/426 kB
Progress (4): 1.7/2.6 MB | 57/205 kB | 45/51 kB | 16/426 kB
Progress (4): 1.7/2.6 MB | 57/205 kB | 45/51 kB | 16/426 kB
Progress (4): 1.7/2.6 MB | 61/205 kB | 45/51 kB | 16/426 kB
Progress (4): 1.7/2.6 MB | 61/205 kB | 45/51 kB | 20/426 kB
Progress (4): 1.7/2.6 MB | 61/205 kB | 49/51 kB | 20/426 kB
Progress (4): 1.7/2.6 MB | 61/205 kB | 49/51 kB | 24/426 kB
Progress (5): 1.7/2.6 MB | 61/205 kB | 49/51 kB | 24/426 kB | 4.1/92 kB
Progress (5): 1.7/2.6 MB | 65/205 kB | 49/51 kB | 24/426 kB | 4.1/92 kB
Progress (5): 1.7/2.6 MB | 65/205 kB | 49/51 kB | 24/426 kB | 4.1/92 kB
Progress (5): 1.7/2.6 MB | 66/205 kB | 49/51 kB | 24/426 kB | 4.1/92 kB
Progress (5): 1.7/2.6 MB | 66/205 kB | 49/51 kB | 24/426 kB | 7.7/92 kB
Progress (5): 1.7/2.6 MB | 66/205 kB | 49/51 kB | 28/426 kB | 7.7/92 kB
Progress (5): 1.7/2.6 MB | 66/205 kB | 51 kB | 28/426 kB | 7.7/92 kB   
Progress (5): 1.7/2.6 MB | 66/205 kB | 51 kB | 32/426 kB | 7.7/92 kB
Progress (5): 1.7/2.6 MB | 66/205 kB | 51 kB | 32/426 kB | 12/92 kB 
Progress (5): 1.7/2.6 MB | 70/205 kB | 51 kB | 32/426 kB | 12/92 kB
Progress (5): 1.7/2.6 MB | 70/205 kB | 51 kB | 32/426 kB | 12/92 kB
Progress (5): 1.7/2.6 MB | 74/205 kB | 51 kB | 32/426 kB | 12/92 kB
Progress (5): 1.7/2.6 MB | 74/205 kB | 51 kB | 32/426 kB | 16/92 kB
Progress (5): 1.7/2.6 MB | 74/205 kB | 51 kB | 33/426 kB | 16/92 kB
Progress (5): 1.7/2.6 MB | 74/205 kB | 51 kB | 33/426 kB | 20/92 kB
Progress (5): 1.7/2.6 MB | 74/205 kB | 51 kB | 37/426 kB | 20/92 kB
Progress (5): 1.7/2.6 MB | 78/205 kB | 51 kB | 37/426 kB | 20/92 kB
Progress (5): 1.7/2.6 MB | 78/205 kB | 51 kB | 37/426 kB | 20/92 kB
Progress (5): 1.7/2.6 MB | 82/205 kB | 51 kB | 37/426 kB | 20/92 kB
Progress (5): 1.7/2.6 MB | 82/205 kB | 51 kB | 41/426 kB | 20/92 kB
Progress (5): 1.7/2.6 MB | 82/205 kB | 51 kB | 41/426 kB | 24/92 kB
Progress (5): 1.7/2.6 MB | 86/205 kB | 51 kB | 41/426 kB | 24/92 kB
Progress (5): 1.7/2.6 MB | 86/205 kB | 51 kB | 41/426 kB | 24/92 kB
Progress (5): 1.7/2.6 MB | 90/205 kB | 51 kB | 41/426 kB | 24/92 kB
Progress (5): 1.7/2.6 MB | 90/205 kB | 51 kB | 41/426 kB | 28/92 kB
Progress (5): 1.7/2.6 MB | 90/205 kB | 51 kB | 45/426 kB | 28/92 kB
Progress (5): 1.7/2.6 MB | 90/205 kB | 51 kB | 45/426 kB | 32/92 kB
Progress (5): 1.7/2.6 MB | 94/205 kB | 51 kB | 45/426 kB | 32/92 kB
Progress (5): 1.8/2.6 MB | 94/205 kB | 51 kB | 45/426 kB | 32/92 kB
Progress (5): 1.8/2.6 MB | 98/205 kB | 51 kB | 45/426 kB | 32/92 kB
Progress (5): 1.8/2.6 MB | 98/205 kB | 51 kB | 45/426 kB | 33/92 kB
Progress (5): 1.8/2.6 MB | 98/205 kB | 51 kB | 49/426 kB | 33/92 kB
Progress (5): 1.8/2.6 MB | 98/205 kB | 51 kB | 49/426 kB | 37/92 kB
Progress (5): 1.8/2.6 MB | 102/205 kB | 51 kB | 49/426 kB | 37/92 kB
                                                                    
Downloaded from eclipse.maven.central.mirror: https://repo.eclipse.org/content/repositories/maven_central/io/takari/aether/aether-connector-okhttp/0.17.6/aether-connector-okhttp-0.17.6.jar (51 kB at 39 kB/s)
Progress (4): 1.8/2.6 MB | 102/205 kB | 49/426 kB | 37/92 kB
                                                            
Downloading from eclipse.maven.central.mirror: https://repo.eclipse.org/content/repositories/maven_central/org/apache/maven/resolver/maven-resolver-impl/1.4.1/maven-resolver-impl-1.4.1.jar
Progress (4): 1.8/2.6 MB | 106/205 kB | 49/426 kB | 37/92 kB
Progress (4): 1.8/2.6 MB | 106/205 kB | 49/426 kB | 41/92 kB
Progress (4): 1.8/2.6 MB | 110/205 kB | 49/426 kB | 41/92 kB
Progress (4): 1.8/2.6 MB | 110/205 kB | 53/426 kB | 41/92 kB
Progress (4): 1.8/2.6 MB | 114/205 kB | 53/426 kB | 41/92 kB
Progress (4): 1.8/2.6 MB | 114/205 kB | 53/426 kB | 45/92 kB
Progress (4): 1.8/2.6 MB | 118/205 kB | 53/426 kB | 45/92 kB
Progress (4): 1.8/2.6 MB | 122/205 kB | 53/426 kB | 45/92 kB
Progress (4): 1.8/2.6 MB | 126/205 kB | 53/426 kB | 45/92 kB
Progress (4): 1.8/2.6 MB | 130/205 kB | 53/426 kB | 45/92 kB
Progress (4): 1.8/2.6 MB | 134/205 kB | 53/426 kB | 45/92 kB
Progress (4): 1.8/2.6 MB | 138/205 kB | 53/426 kB | 45/92 kB
Progress (4): 1.8/2.6 MB | 142/205 kB | 53/426 kB | 45/92 kB
Progress (4): 1.8/2.6 MB | 142/205 kB | 53/426 kB | 45/92 kB
Progress (4): 1.8/2.6 MB | 146/205 kB | 53/426 kB | 45/92 kB
Progress (5): 1.8/2.6 MB | 146/205 kB | 53/426 kB | 45/92 kB | 4.1/181 kB
Progress (5): 1.8/2.6 MB | 146/205 kB | 53/426 kB | 49/92 kB | 4.1/181 kB
Progress (5): 1.8/2.6 MB | 146/205 kB | 57/426 kB | 49/92 kB | 4.1/181 kB
Progress (5): 1.8/2.6 MB | 146/205 kB | 57/426 kB | 53/92 kB | 4.1/181 kB
Progress (5): 1.8/2.6 MB | 146/205 kB | 57/426 kB | 53/92 kB | 7.7/181 kB
Progress (5): 1.8/2.6 MB | 150/205 kB | 57/426 kB | 53/92 kB | 7.7/181 kB
Progress (5): 1.8/2.6 MB | 154/205 kB | 57/426 kB | 53/92 kB | 7.7/181 kB
Progress (5): 1.8/2.6 MB | 158/205 kB | 57/426 kB | 53/92 kB | 7.7/181 kB
Progress (5): 1.8/2.6 MB | 162/205 kB | 57/426 kB | 53/92 kB | 7.7/181 kB
Progress (5): 1.8/2.6 MB | 166/205 kB | 57/426 kB | 53/92 kB | 7.7/181 kB
Progress (5): 1.8/2.6 MB | 166/205 kB | 57/426 kB | 53/92 kB | 7.7/181 kB
Progress (5): 1.8/2.6 MB | 170/205 kB | 57/426 kB | 53/92 kB | 7.7/181 kB
Progress (5): 1.8/2.6 MB | 170/205 kB | 57/426 kB | 53/92 kB | 12/181 kB 
Progress (5): 1.8/2.6 MB | 170/205 kB | 57/426 kB | 57/92 kB | 12/181 kB
Progress (5): 1.8/2.6 MB | 170/205 kB | 61/426 kB | 57/92 kB | 12/181 kB
Progress (5): 1.8/2.6 MB | 170/205 kB | 61/426 kB | 61/92 kB | 12/181 kB
Progress (5): 1.8/2.6 MB | 170/205 kB | 61/426 kB | 61/92 kB | 16/181 kB
Progress (5): 1.8/2.6 MB | 174/205 kB | 61/426 kB | 61/92 kB | 16/181 kB
Progress (5): 1.8/2.6 MB | 174/205 kB | 61/426 kB | 61/92 kB | 16/181 kB
Progress (5): 1.8/2.6 MB | 178/205 kB | 61/426 kB | 61/92 kB | 16/181 kB
Progress (5): 1.8/2.6 MB | 178/205 kB | 61/426 kB | 61/92 kB | 20/181 kB
Progress (5): 1.8/2.6 MB | 178/205 kB | 61/426 kB | 65/92 kB | 20/181 kB
Progress (5): 1.8/2.6 MB | 178/205 kB | 65/426 kB | 65/92 kB | 20/181 kB
Progress (5): 1.8/2.6 MB | 178/205 kB | 65/426 kB | 66/92 kB | 20/181 kB
Progress (5): 1.8/2.6 MB | 178/205 kB | 65/426 kB | 66/92 kB | 24/181 kB
Progress (5): 1.8/2.6 MB | 182/205 kB | 65/426 kB | 66/92 kB | 24/181 kB
Progress (5): 1.8/2.6 MB | 182/205 kB | 65/426 kB | 66/92 kB | 24/181 kB
Progress (5): 1.8/2.6 MB | 186/205 kB | 65/426 kB | 66/92 kB | 24/181 kB
Progress (5): 1.8/2.6 MB | 186/205 kB | 65/426 kB | 66/92 kB | 28/181 kB
Progress (5): 1.8/2.6 MB | 186/205 kB | 65/426 kB | 70/92 kB | 28/181 kB
Progress (5): 1.8/2.6 MB | 186/205 kB | 69/426 kB | 70/92 kB | 28/181 kB
Progress (5): 1.8/2.6 MB | 186/205 kB | 69/426 kB | 74/92 kB | 28/181 kB
Progress (5): 1.8/2.6 MB | 186/205 kB | 69/426 kB | 74/92 kB | 32/181 kB
Progress (5): 1.8/2.6 MB | 190/205 kB | 69/426 kB | 74/92 kB | 32/181 kB
Progress (5): 1.8/2.6 MB | 190/205 kB | 69/426 kB | 74/92 kB | 32/181 kB
Progress (5): 1.8/2.6 MB | 194/205 kB | 69/426 kB | 74/92 kB | 32/181 kB
Progress (5): 1.8/2.6 MB | 194/205 kB | 69/426 kB | 78/92 kB | 32/181 kB
Progress (5): 1.8/2.6 MB | 194/205 kB | 69/426 kB | 78/92 kB | 33/181 kB
Progress (5): 1.8/2.6 MB | 194/205 kB | 73/426 kB | 78/92 kB | 33/181 kB
Progress (5): 1.8/2.6 MB | 194/205 kB | 73/426 kB | 78/92 kB | 37/181 kB
Progress (5): 1.8/2.6 MB | 194/205 kB | 73/426 kB | 82/92 kB | 37/181 kB
Progress (5): 1.8/2.6 MB | 198/205 kB | 73/426 kB | 82/92 kB | 37/181 kB
Progress (5): 1.8/2.6 MB | 198/205 kB | 73/426 kB | 82/92 kB | 37/181 kB
Progress (5): 1.8/2.6 MB | 202/205 kB | 73/426 kB | 82/92 kB | 37/181 kB
Progress (5): 1.8/2.6 MB | 202/205 kB | 73/426 kB | 86/92 kB | 37/181 kB
Progress (5): 1.8/2.6 MB | 202/205 kB | 77/426 kB | 86/92 kB | 37/181 kB
Progress (5): 1.8/2.6 MB | 202/205 kB | 77/426 kB | 86/92 kB | 41/181 kB
Progress (5): 1.8/2.6 MB | 202/205 kB | 81/426 kB | 86/92 kB | 41/181 kB
Progress (5): 1.8/2.6 MB | 202/205 kB | 81/426 kB | 90/92 kB | 41/181 kB
Progress (5): 1.8/2.6 MB | 205 kB | 81/426 kB | 90/92 kB | 41/181 kB    
Progress (5): 1.8/2.6 MB | 205 kB | 81/426 kB | 90/92 kB | 41/181 kB
Progress (5): 1.8/2.6 MB | 205 kB | 81/426 kB | 92 kB | 41/181 kB   
Progress (5): 1.8/2.6 MB | 205 kB | 85/426 kB | 92 kB | 41/181 kB
Progress (5): 1.8/2.6 MB | 205 kB | 85/426 kB | 92 kB | 45/181 kB
Progress (5): 1.8/2.6 MB | 205 kB | 89/426 kB | 92 kB | 45/181 kB
Progress (5): 1.8/2.6 MB | 205 kB | 89/426 kB | 92 kB | 45/181 kB
Progress (5): 1.8/2.6 MB | 205 kB | 93/426 kB | 92 kB | 45/181 kB
Progress (5): 1.8/2.6 MB | 205 kB | 93/426 kB | 92 kB | 49/181 kB
Progress (5): 1.8/2.6 MB | 205 kB | 97/426 kB | 92 kB | 49/181 kB
Progress (5): 1.8/2.6 MB | 205 kB | 97/426 kB | 92 kB | 49/181 kB
Progress (5): 1.8/2.6 MB | 205 kB | 101/426 kB | 92 kB | 49/181 kB
Progress (5): 1.8/2.6 MB | 205 kB | 101/426 kB | 92 kB | 49/181 kB
Progress (5): 1.8/2.6 MB | 205 kB | 101/426 kB | 92 kB | 53/181 kB
Progress (5): 1.8/2.6 MB | 205 kB | 101/426 kB | 92 kB | 53/181 kB
Progress (5): 1.8/2.6 MB | 205 kB | 105/426 kB | 92 kB | 53/181 kB
Progress (5): 1.8/2.6 MB | 205 kB | 105/426 kB | 92 kB | 53/181 kB
Progress (5): 1.8/2.6 MB | 205 kB | 105/426 kB | 92 kB | 57/181 kB
Progress (5): 1.8/2.6 MB | 205 kB | 105/426 kB | 92 kB | 57/181 kB
Progress (5): 1.8/2.6 MB | 205 kB | 109/426 kB | 92 kB | 57/181 kB
Progress (5): 1.8/2.6 MB | 205 kB | 109/426 kB | 92 kB | 57/181 kB
Progress (5): 1.8/2.6 MB | 205 kB | 109/426 kB | 92 kB | 61/181 kB
Progress (5): 1.8/2.6 MB | 205 kB | 109/426 kB | 92 kB | 61/181 kB
Progress (5): 1.8/2.6 MB | 205 kB | 113/426 kB | 92 kB | 61/181 kB
Progress (5): 1.8/2.6 MB | 205 kB | 113/426 kB | 92 kB | 65/181 kB
Progress (5): 1.8/2.6 MB | 205 kB | 113/426 kB | 92 kB | 65/181 kB
Progress (5): 1.8/2.6 MB | 205 kB | 113/426 kB | 92 kB | 66/181 kB
Progress (5): 1.8/2.6 MB | 205 kB | 113/426 kB | 92 kB | 66/181 kB
Progress (5): 1.8/2.6 MB | 205 kB | 113/426 kB | 92 kB | 70/181 kB
Progress (5): 1.8/2.6 MB | 205 kB | 117/426 kB | 92 kB | 70/181 kB
Progress (5): 1.8/2.6 MB | 205 kB | 117/426 kB | 92 kB | 74/181 kB
                                                                  
Downloaded from eclipse.maven.central.mirror: https://repo.eclipse.org/content/repositories/maven_central/org/eclipse/sisu/org.eclipse.sisu.plexus/0.3.3/org.eclipse.sisu.plexus-0.3.3.jar (205 kB at 147 kB/s)
Progress (4): 1.8/2.6 MB | 117/426 kB | 92 kB | 74/181 kB
                                                         
Downloading from eclipse.maven.central.mirror: https://repo.eclipse.org/content/repositories/maven_central/org/apache/maven/resolver/maven-resolver-connector-basic/1.4.1/maven-resolver-connector-basic-1.4.1.jar
Progress (4): 1.8/2.6 MB | 117/426 kB | 92 kB | 78/181 kB
Progress (4): 1.8/2.6 MB | 121/426 kB | 92 kB | 78/181 kB
Progress (4): 1.8/2.6 MB | 121/426 kB | 92 kB | 82/181 kB
Progress (4): 1.8/2.6 MB | 121/426 kB | 92 kB | 82/181 kB
Progress (4): 1.8/2.6 MB | 121/426 kB | 92 kB | 86/181 kB
Progress (4): 1.8/2.6 MB | 125/426 kB | 92 kB | 86/181 kB
Progress (4): 1.8/2.6 MB | 125/426 kB | 92 kB | 90/181 kB
Progress (4): 1.8/2.6 MB | 125/426 kB | 92 kB | 90/181 kB
Progress (4): 1.8/2.6 MB | 125/426 kB | 92 kB | 94/181 kB
Progress (4): 1.8/2.6 MB | 129/426 kB | 92 kB | 94/181 kB
Progress (4): 1.8/2.6 MB | 129/426 kB | 92 kB | 98/181 kB
Progress (4): 1.8/2.6 MB | 129/426 kB | 92 kB | 98/181 kB
Progress (4): 1.8/2.6 MB | 129/426 kB | 92 kB | 98/181 kB
Progress (4): 1.8/2.6 MB | 133/426 kB | 92 kB | 98/181 kB
Progress (4): 1.8/2.6 MB | 133/426 kB | 92 kB | 102/181 kB
Progress (4): 1.8/2.6 MB | 133/426 kB | 92 kB | 102/181 kB
Progress (4): 1.8/2.6 MB | 133/426 kB | 92 kB | 106/181 kB
Progress (4): 1.8/2.6 MB | 137/426 kB | 92 kB | 106/181 kB
Progress (4): 1.8/2.6 MB | 137/426 kB | 92 kB | 110/181 kB
                                                          
Downloaded from eclipse.maven.central.mirror: https://repo.eclipse.org/content/repositories/maven_central/com/squareup/okio/okio/1.17.3/okio-1.17.3.jar (92 kB at 66 kB/s)
Progress (3): 1.8/2.6 MB | 137/426 kB | 110/181 kB
                                                  
Downloading from eclipse.maven.central.mirror: https://repo.eclipse.org/content/repositories/maven_central/org/apache/maven/resolver/maven-resolver-transport-wagon/1.4.1/maven-resolver-transport-wagon-1.4.1.jar
Progress (3): 1.8/2.6 MB | 137/426 kB | 114/181 kB
Progress (3): 1.8/2.6 MB | 141/426 kB | 114/181 kB
Progress (3): 1.8/2.6 MB | 141/426 kB | 118/181 kB
Progress (3): 1.9/2.6 MB | 141/426 kB | 118/181 kB
Progress (3): 1.9/2.6 MB | 141/426 kB | 122/181 kB
Progress (3): 1.9/2.6 MB | 145/426 kB | 122/181 kB
Progress (3): 1.9/2.6 MB | 145/426 kB | 122/181 kB
Progress (3): 1.9/2.6 MB | 149/426 kB | 122/181 kB
Progress (3): 1.9/2.6 MB | 149/426 kB | 126/181 kB
Progress (3): 1.9/2.6 MB | 149/426 kB | 126/181 kB
Progress (3): 1.9/2.6 MB | 153/426 kB | 126/181 kB
Progress (3): 1.9/2.6 MB | 153/426 kB | 126/181 kB
Progress (3): 1.9/2.6 MB | 153/426 kB | 130/181 kB
Progress (3): 1.9/2.6 MB | 157/426 kB | 130/181 kB
Progress (3): 1.9/2.6 MB | 157/426 kB | 130/181 kB
Progress (3): 1.9/2.6 MB | 157/426 kB | 131/181 kB
Progress (3): 1.9/2.6 MB | 157/426 kB | 131/181 kB
Progress (3): 1.9/2.6 MB | 161/426 kB | 131/181 kB
Progress (3): 1.9/2.6 MB | 161/426 kB | 135/181 kB
Progress (3): 1.9/2.6 MB | 161/426 kB | 135/181 kB
Progress (3): 1.9/2.6 MB | 161/426 kB | 135/181 kB
Progress (3): 1.9/2.6 MB | 161/426 kB | 135/181 kB
Progress (3): 1.9/2.6 MB | 161/426 kB | 135/181 kB
Progress (3): 1.9/2.6 MB | 161/426 kB | 135/181 kB
Progress (3): 1.9/2.6 MB | 161/426 kB | 135/181 kB
Progress (4): 1.9/2.6 MB | 161/426 kB | 135/181 kB | 4.1/44 kB
Progress (4): 1.9/2.6 MB | 161/426 kB | 135/181 kB | 7.7/44 kB
Progress (4): 1.9/2.6 MB | 161/426 kB | 139/181 kB | 7.7/44 kB
Progress (4): 1.9/2.6 MB | 165/426 kB | 139/181 kB | 7.7/44 kB
Progress (4): 1.9/2.6 MB | 165/426 kB | 143/181 kB | 7.7/44 kB
Progress (4): 1.9/2.6 MB | 165/426 kB | 143/181 kB | 12/44 kB 
Progress (4): 1.9/2.6 MB | 165/426 kB | 143/181 kB | 12/44 kB
Progress (5): 1.9/2.6 MB | 165/426 kB | 143/181 kB | 12/44 kB | 4.1/31 kB
Progress (5): 1.9/2.6 MB | 165/426 kB | 143/181 kB | 12/44 kB | 4.1/31 kB
Progress (5): 1.9/2.6 MB | 165/426 kB | 143/181 kB | 16/44 kB | 4.1/31 kB
Progress (5): 1.9/2.6 MB | 165/426 kB | 147/181 kB | 16/44 kB | 4.1/31 kB
Progress (5): 1.9/2.6 MB | 169/426 kB | 147/181 kB | 16/44 kB | 4.1/31 kB
Progress (5): 1.9/2.6 MB | 169/426 kB | 151/181 kB | 16/44 kB | 4.1/31 kB
Progress (5): 1.9/2.6 MB | 169/426 kB | 151/181 kB | 20/44 kB | 4.1/31 kB
Progress (5): 1.9/2.6 MB | 169/426 kB | 151/181 kB | 20/44 kB | 4.1/31 kB
Progress (5): 1.9/2.6 MB | 169/426 kB | 151/181 kB | 20/44 kB | 7.7/31 kB
Progress (5): 1.9/2.6 MB | 169/426 kB | 151/181 kB | 20/44 kB | 7.7/31 kB
Progress (5): 1.9/2.6 MB | 169/426 kB | 151/181 kB | 24/44 kB | 7.7/31 kB
Progress (5): 1.9/2.6 MB | 169/426 kB | 155/181 kB | 24/44 kB | 7.7/31 kB
Progress (5): 1.9/2.6 MB | 173/426 kB | 155/181 kB | 24/44 kB | 7.7/31 kB
Progress (5): 1.9/2.6 MB | 173/426 kB | 159/181 kB | 24/44 kB | 7.7/31 kB
Progress (5): 1.9/2.6 MB | 173/426 kB | 159/181 kB | 28/44 kB | 7.7/31 kB
Progress (5): 1.9/2.6 MB | 173/426 kB | 159/181 kB | 28/44 kB | 7.7/31 kB
Progress (5): 1.9/2.6 MB | 173/426 kB | 159/181 kB | 28/44 kB | 12/31 kB 
Progress (5): 1.9/2.6 MB | 173/426 kB | 159/181 kB | 28/44 kB | 12/31 kB
Progress (5): 1.9/2.6 MB | 173/426 kB | 159/181 kB | 32/44 kB | 12/31 kB
Progress (5): 1.9/2.6 MB | 173/426 kB | 159/181 kB | 32/44 kB | 12/31 kB
Progress (5): 1.9/2.6 MB | 173/426 kB | 163/181 kB | 32/44 kB | 12/31 kB
Progress (5): 1.9/2.6 MB | 177/426 kB | 163/181 kB | 32/44 kB | 12/31 kB
Progress (5): 1.9/2.6 MB | 177/426 kB | 167/181 kB | 32/44 kB | 12/31 kB
Progress (5): 1.9/2.6 MB | 177/426 kB | 167/181 kB | 32/44 kB | 12/31 kB
Progress (5): 1.9/2.6 MB | 177/426 kB | 167/181 kB | 36/44 kB | 12/31 kB
Progress (5): 1.9/2.6 MB | 177/426 kB | 167/181 kB | 36/44 kB | 12/31 kB
Progress (5): 1.9/2.6 MB | 177/426 kB | 167/181 kB | 36/44 kB | 16/31 kB
Progress (5): 1.9/2.6 MB | 177/426 kB | 167/181 kB | 36/44 kB | 16/31 kB
Progress (5): 1.9/2.6 MB | 177/426 kB | 167/181 kB | 40/44 kB | 16/31 kB
Progress (5): 1.9/2.6 MB | 177/426 kB | 171/181 kB | 40/44 kB | 16/31 kB
Progress (5): 1.9/2.6 MB | 181/426 kB | 171/181 kB | 40/44 kB | 16/31 kB
Progress (5): 1.9/2.6 MB | 181/426 kB | 175/181 kB | 40/44 kB | 16/31 kB
Progress (5): 1.9/2.6 MB | 181/426 kB | 179/181 kB | 40/44 kB | 16/31 kB
Progress (5): 1.9/2.6 MB | 181/426 kB | 181 kB | 40/44 kB | 16/31 kB    
Progress (5): 1.9/2.6 MB | 181/426 kB | 181 kB | 44/44 kB | 16/31 kB
Progress (5): 1.9/2.6 MB | 181/426 kB | 181 kB | 44/44 kB | 16/31 kB
Progress (5): 1.9/2.6 MB | 181/426 kB | 181 kB | 44/44 kB | 20/31 kB
Progress (5): 1.9/2.6 MB | 181/426 kB | 181 kB | 44/44 kB | 20/31 kB
Progress (5): 1.9/2.6 MB | 181/426 kB | 181 kB | 44 kB | 20/31 kB   
Progress (5): 1.9/2.6 MB | 185/426 kB | 181 kB | 44 kB | 20/31 kB
Progress (5): 1.9/2.6 MB | 185/426 kB | 181 kB | 44 kB | 20/31 kB
Progress (5): 1.9/2.6 MB | 185/426 kB | 181 kB | 44 kB | 24/31 kB
Progress (5): 2.0/2.6 MB | 185/426 kB | 181 kB | 44 kB | 24/31 kB
Progress (5): 2.0/2.6 MB | 189/426 kB | 181 kB | 44 kB | 24/31 kB
Progress (5): 2.0/2.6 MB | 189/426 kB | 181 kB | 44 kB | 28/31 kB
Progress (5): 2.0/2.6 MB | 193/426 kB | 181 kB | 44 kB | 28/31 kB
Progress (5): 2.0/2.6 MB | 193/426 kB | 181 kB | 44 kB | 28/31 kB
Progress (5): 2.0/2.6 MB | 197/426 kB | 181 kB | 44 kB | 28/31 kB
Progress (5): 2.0/2.6 MB | 197/426 kB | 181 kB | 44 kB | 31 kB   
Progress (5): 2.0/2.6 MB | 201/426 kB | 181 kB | 44 kB | 31 kB
Progress (5): 2.0/2.6 MB | 201/426 kB | 181 kB | 44 kB | 31 kB
Progress (5): 2.0/2.6 MB | 205/426 kB | 181 kB | 44 kB | 31 kB
Progress (5): 2.0/2.6 MB | 205/426 kB | 181 kB | 44 kB | 31 kB
Progress (5): 2.0/2.6 MB | 209/426 kB | 181 kB | 44 kB | 31 kB
Progress (5): 2.0/2.6 MB | 209/426 kB | 181 kB | 44 kB | 31 kB
Progress (5): 2.0/2.6 MB | 213/426 kB | 181 kB | 44 kB | 31 kB
Progress (5): 2.0/2.6 MB | 213/426 kB | 181 kB | 44 kB | 31 kB
Progress (5): 2.0/2.6 MB | 217/426 kB | 181 kB | 44 kB | 31 kB
Progress (5): 2.0/2.6 MB | 217/426 kB | 181 kB | 44 kB | 31 kB
Progress (5): 2.0/2.6 MB | 221/426 kB | 181 kB | 44 kB | 31 kB
Progress (5): 2.0/2.6 MB | 225/426 kB | 181 kB | 44 kB | 31 kB
Progress (5): 2.0/2.6 MB | 225/426 kB | 181 kB | 44 kB | 31 kB
Progress (5): 2.0/2.6 MB | 229/426 kB | 181 kB | 44 kB | 31 kB
Progress (5): 2.0/2.6 MB | 229/426 kB | 181 kB | 44 kB | 31 kB
Progress (5): 2.0/2.6 MB | 233/426 kB | 181 kB | 44 kB | 31 kB
Progress (5): 2.0/2.6 MB | 233/426 kB | 181 kB | 44 kB | 31 kB
Progress (5): 2.0/2.6 MB | 237/426 kB | 181 kB | 44 kB | 31 kB
Progress (5): 2.0/2.6 MB | 237/426 kB | 181 kB | 44 kB | 31 kB
Progress (5): 2.0/2.6 MB | 241/426 kB | 181 kB | 44 kB | 31 kB
Progress (5): 2.0/2.6 MB | 241/426 kB | 181 kB | 44 kB | 31 kB
Progress (5): 2.0/2.6 MB | 245/426 kB | 181 kB | 44 kB | 31 kB
                                                              
Downloaded from eclipse.maven.central.mirror: https://repo.eclipse.org/content/repositories/maven_central/org/apache/maven/resolver/maven-resolver-connector-basic/1.4.1/maven-resolver-connector-basic-1.4.1.jar (44 kB at 30 kB/s)
Progress (4): 2.0/2.6 MB | 245/426 kB | 181 kB | 31 kB
                                                      
Downloading from eclipse.maven.central.mirror: https://repo.eclipse.org/content/repositories/maven_central/org/apache/maven/wagon/wagon-file/3.3.3/wagon-file-3.3.3.jar
Downloaded from eclipse.maven.central.mirror: https://repo.eclipse.org/content/repositories/maven_central/org/apache/maven/resolver/maven-resolver-impl/1.4.1/maven-resolver-impl-1.4.1.jar (181 kB at 121 kB/s)
Progress (3): 2.0/2.6 MB | 249/426 kB | 31 kB
                                             
Downloading from eclipse.maven.central.mirror: https://repo.eclipse.org/content/repositories/maven_central/org/fusesource/jansi/jansi/1.17.1/jansi-1.17.1.jar
Progress (3): 2.0/2.6 MB | 249/426 kB | 31 kB
Progress (3): 2.0/2.6 MB | 253/426 kB | 31 kB
Progress (3): 2.0/2.6 MB | 253/426 kB | 31 kB
Progress (3): 2.0/2.6 MB | 257/426 kB | 31 kB
Progress (3): 2.0/2.6 MB | 257/426 kB | 31 kB
Progress (3): 2.0/2.6 MB | 261/426 kB | 31 kB
Progress (3): 2.0/2.6 MB | 261/426 kB | 31 kB
Progress (3): 2.0/2.6 MB | 265/426 kB | 31 kB
Progress (3): 2.0/2.6 MB | 265/426 kB | 31 kB
Progress (3): 2.0/2.6 MB | 269/426 kB | 31 kB
Progress (3): 2.0/2.6 MB | 269/426 kB | 31 kB
Progress (3): 2.0/2.6 MB | 273/426 kB | 31 kB
Progress (3): 2.0/2.6 MB | 273/426 kB | 31 kB
Progress (3): 2.0/2.6 MB | 277/426 kB | 31 kB
Progress (3): 2.0/2.6 MB | 277/426 kB | 31 kB
Progress (3): 2.0/2.6 MB | 281/426 kB | 31 kB
Progress (3): 2.0/2.6 MB | 281/426 kB | 31 kB
Progress (3): 2.0/2.6 MB | 285/426 kB | 31 kB
Progress (3): 2.0/2.6 MB | 285/426 kB | 31 kB
Progress (3): 2.0/2.6 MB | 289/426 kB | 31 kB
Progress (3): 2.0/2.6 MB | 289/426 kB | 31 kB
Progress (3): 2.0/2.6 MB | 293/426 kB | 31 kB
Progress (3): 2.0/2.6 MB | 293/426 kB | 31 kB
                                             
Downloaded from eclipse.maven.central.mirror: https://repo.eclipse.org/content/repositories/maven_central/org/apache/maven/resolver/maven-resolver-transport-wagon/1.4.1/maven-resolver-transport-wagon-1.4.1.jar (31 kB at 21 kB/s)
Progress (2): 2.0/2.6 MB | 297/426 kB
Progress (2): 2.1/2.6 MB | 297/426 kB
Progress (2): 2.1/2.6 MB | 301/426 kB
Progress (2): 2.1/2.6 MB | 301/426 kB
Progress (2): 2.1/2.6 MB | 305/426 kB
Progress (2): 2.1/2.6 MB | 305/426 kB
Progress (2): 2.1/2.6 MB | 309/426 kB
Progress (2): 2.1/2.6 MB | 309/426 kB
Progress (2): 2.1/2.6 MB | 313/426 kB
Progress (2): 2.1/2.6 MB | 313/426 kB
Progress (2): 2.1/2.6 MB | 317/426 kB
Progress (2): 2.1/2.6 MB | 317/426 kB
Progress (2): 2.1/2.6 MB | 321/426 kB
Progress (2): 2.1/2.6 MB | 321/426 kB
Progress (2): 2.1/2.6 MB | 325/426 kB
Progress (2): 2.1/2.6 MB | 325/426 kB
Progress (2): 2.1/2.6 MB | 329/426 kB
Progress (2): 2.1/2.6 MB | 329/426 kB
Progress (2): 2.1/2.6 MB | 333/426 kB
Progress (2): 2.1/2.6 MB | 333/426 kB
Progress (2): 2.1/2.6 MB | 337/426 kB
Progress (2): 2.1/2.6 MB | 337/426 kB
Progress (2): 2.1/2.6 MB | 341/426 kB
Progress (2): 2.1/2.6 MB | 341/426 kB
Progress (2): 2.1/2.6 MB | 345/426 kB
Progress (2): 2.1/2.6 MB | 345/426 kB
Progress (2): 2.1/2.6 MB | 349/426 kB
Progress (2): 2.1/2.6 MB | 349/426 kB
Progress (2): 2.1/2.6 MB | 353/426 kB
Progress (2): 2.1/2.6 MB | 353/426 kB
Progress (2): 2.1/2.6 MB | 357/426 kB
Progress (2): 2.1/2.6 MB | 357/426 kB
Progress (2): 2.1/2.6 MB | 361/426 kB
Progress (2): 2.1/2.6 MB | 361/426 kB
Progress (2): 2.1/2.6 MB | 365/426 kB
Progress (2): 2.1/2.6 MB | 365/426 kB
Progress (2): 2.1/2.6 MB | 369/426 kB
Progress (3): 2.1/2.6 MB | 369/426 kB | 4.1/12 kB
Progress (3): 2.1/2.6 MB | 373/426 kB | 4.1/12 kB
Progress (3): 2.1/2.6 MB | 373/426 kB | 4.1/12 kB
Progress (4): 2.1/2.6 MB | 373/426 kB | 4.1/12 kB | 4.1/284 kB
Progress (4): 2.1/2.6 MB | 377/426 kB | 4.1/12 kB | 4.1/284 kB
Progress (4): 2.1/2.6 MB | 377/426 kB | 7.7/12 kB | 4.1/284 kB
Progress (4): 2.1/2.6 MB | 381/426 kB | 7.7/12 kB | 4.1/284 kB
Progress (4): 2.1/2.6 MB | 385/426 kB | 7.7/12 kB | 4.1/284 kB
Progress (4): 2.1/2.6 MB | 385/426 kB | 7.7/12 kB | 7.7/284 kB
Progress (4): 2.1/2.6 MB | 385/426 kB | 7.7/12 kB | 7.7/284 kB
Progress (4): 2.1/2.6 MB | 385/426 kB | 7.7/12 kB | 12/284 kB 
Progress (4): 2.1/2.6 MB | 389/426 kB | 7.7/12 kB | 12/284 kB
Progress (4): 2.1/2.6 MB | 389/426 kB | 12 kB | 12/284 kB    
Progress (4): 2.1/2.6 MB | 393/426 kB | 12 kB | 12/284 kB
Progress (4): 2.1/2.6 MB | 393/426 kB | 12 kB | 16/284 kB
Progress (4): 2.1/2.6 MB | 393/426 kB | 12 kB | 16/284 kB
Progress (4): 2.1/2.6 MB | 393/426 kB | 12 kB | 20/284 kB
Progress (4): 2.1/2.6 MB | 397/426 kB | 12 kB | 20/284 kB
Progress (4): 2.1/2.6 MB | 397/426 kB | 12 kB | 24/284 kB
Progress (4): 2.1/2.6 MB | 397/426 kB | 12 kB | 24/284 kB
Progress (4): 2.1/2.6 MB | 397/426 kB | 12 kB | 28/284 kB
Progress (4): 2.1/2.6 MB | 401/426 kB | 12 kB | 28/284 kB
Progress (4): 2.1/2.6 MB | 401/426 kB | 12 kB | 32/284 kB
Progress (4): 2.1/2.6 MB | 401/426 kB | 12 kB | 32/284 kB
Progress (4): 2.1/2.6 MB | 401/426 kB | 12 kB | 33/284 kB
Progress (4): 2.1/2.6 MB | 405/426 kB | 12 kB | 33/284 kB
Progress (4): 2.1/2.6 MB | 405/426 kB | 12 kB | 37/284 kB
Progress (4): 2.1/2.6 MB | 405/426 kB | 12 kB | 37/284 kB
Progress (4): 2.1/2.6 MB | 405/426 kB | 12 kB | 41/284 kB
Progress (4): 2.1/2.6 MB | 409/426 kB | 12 kB | 41/284 kB
Progress (4): 2.1/2.6 MB | 409/426 kB | 12 kB | 45/284 kB
Progress (4): 2.1/2.6 MB | 409/426 kB | 12 kB | 45/284 kB
Progress (4): 2.1/2.6 MB | 413/426 kB | 12 kB | 45/284 kB
Progress (4): 2.1/2.6 MB | 413/426 kB | 12 kB | 49/284 kB
Progress (4): 2.1/2.6 MB | 417/426 kB | 12 kB | 49/284 kB
Progress (4): 2.2/2.6 MB | 417/426 kB | 12 kB | 49/284 kB
Progress (4): 2.2/2.6 MB | 421/426 kB | 12 kB | 49/284 kB
Progress (4): 2.2/2.6 MB | 421/426 kB | 12 kB | 53/284 kB
Progress (4): 2.2/2.6 MB | 425/426 kB | 12 kB | 53/284 kB
Progress (4): 2.2/2.6 MB | 425/426 kB | 12 kB | 53/284 kB
Progress (4): 2.2/2.6 MB | 426 kB | 12 kB | 53/284 kB    
Progress (4): 2.2/2.6 MB | 426 kB | 12 kB | 57/284 kB
Progress (4): 2.2/2.6 MB | 426 kB | 12 kB | 57/284 kB
                                                     
Downloaded from eclipse.maven.central.mirror: https://repo.eclipse.org/content/repositories/maven_central/org/apache/maven/wagon/wagon-file/3.3.3/wagon-file-3.3.3.jar (12 kB at 7.3 kB/s)
Progress (3): 2.2/2.6 MB | 426 kB | 57/284 kB
Progress (3): 2.2/2.6 MB | 426 kB | 57/284 kB
Progress (3): 2.2/2.6 MB | 426 kB | 57/284 kB
Progress (3): 2.2/2.6 MB | 426 kB | 57/284 kB
Progress (3): 2.2/2.6 MB | 426 kB | 57/284 kB
Progress (3): 2.2/2.6 MB | 426 kB | 57/284 kB
Progress (3): 2.2/2.6 MB | 426 kB | 57/284 kB
Progress (3): 2.2/2.6 MB | 426 kB | 57/284 kB
Progress (3): 2.2/2.6 MB | 426 kB | 57/284 kB
Progress (3): 2.2/2.6 MB | 426 kB | 57/284 kB
Progress (3): 2.2/2.6 MB | 426 kB | 57/284 kB
Progress (3): 2.2/2.6 MB | 426 kB | 57/284 kB
Progress (3): 2.2/2.6 MB | 426 kB | 57/284 kB
Progress (3): 2.2/2.6 MB | 426 kB | 57/284 kB
Progress (3): 2.2/2.6 MB | 426 kB | 57/284 kB
Progress (3): 2.2/2.6 MB | 426 kB | 57/284 kB
Progress (3): 2.2/2.6 MB | 426 kB | 57/284 kB
Progress (3): 2.2/2.6 MB | 426 kB | 57/284 kB
                                             
Downloaded from eclipse.maven.central.mirror: https://repo.eclipse.org/content/repositories/maven_central/com/squareup/okhttp3/okhttp/3.14.1/okhttp-3.14.1.jar (426 kB at 269 kB/s)
Progress (2): 2.2/2.6 MB | 57/284 kB
Progress (2): 2.2/2.6 MB | 57/284 kB
Progress (2): 2.2/2.6 MB | 57/284 kB
Progress (2): 2.2/2.6 MB | 57/284 kB
Progress (2): 2.3/2.6 MB | 57/284 kB
Progress (2): 2.3/2.6 MB | 57/284 kB
Progress (2): 2.3/2.6 MB | 57/284 kB
Progress (2): 2.3/2.6 MB | 57/284 kB
Progress (2): 2.3/2.6 MB | 57/284 kB
Progress (2): 2.3/2.6 MB | 57/284 kB
Progress (2): 2.3/2.6 MB | 57/284 kB
Progress (2): 2.3/2.6 MB | 57/284 kB
Progress (2): 2.3/2.6 MB | 57/284 kB
Progress (2): 2.3/2.6 MB | 57/284 kB
Progress (2): 2.3/2.6 MB | 57/284 kB
Progress (2): 2.3/2.6 MB | 57/284 kB
Progress (2): 2.3/2.6 MB | 57/284 kB
Progress (2): 2.3/2.6 MB | 57/284 kB
Progress (2): 2.3/2.6 MB | 57/284 kB
Progress (2): 2.3/2.6 MB | 57/284 kB
Progress (2): 2.3/2.6 MB | 57/284 kB
Progress (2): 2.3/2.6 MB | 57/284 kB
Progress (2): 2.3/2.6 MB | 57/284 kB
Progress (2): 2.3/2.6 MB | 57/284 kB
Progress (2): 2.3/2.6 MB | 57/284 kB
Progress (2): 2.3/2.6 MB | 57/284 kB
Progress (2): 2.3/2.6 MB | 57/284 kB
Progress (2): 2.3/2.6 MB | 57/284 kB
Progress (2): 2.3/2.6 MB | 57/284 kB
Progress (2): 2.4/2.6 MB | 57/284 kB
Progress (2): 2.4/2.6 MB | 57/284 kB
Progress (2): 2.4/2.6 MB | 57/284 kB
Progress (2): 2.4/2.6 MB | 57/284 kB
Progress (2): 2.4/2.6 MB | 57/284 kB
Progress (2): 2.4/2.6 MB | 57/284 kB
Progress (2): 2.4/2.6 MB | 57/284 kB
Progress (2): 2.4/2.6 MB | 57/284 kB
Progress (2): 2.4/2.6 MB | 57/284 kB
Progress (2): 2.4/2.6 MB | 57/284 kB
Progress (2): 2.4/2.6 MB | 57/284 kB
Progress (2): 2.4/2.6 MB | 57/284 kB
Progress (2): 2.4/2.6 MB | 57/284 kB
Progress (2): 2.4/2.6 MB | 57/284 kB
Progress (2): 2.4/2.6 MB | 57/284 kB
Progress (2): 2.4/2.6 MB | 57/284 kB
Progress (2): 2.4/2.6 MB | 57/284 kB
Progress (2): 2.4/2.6 MB | 57/284 kB
Progress (2): 2.4/2.6 MB | 57/284 kB
Progress (2): 2.4/2.6 MB | 57/284 kB
Progress (2): 2.4/2.6 MB | 57/284 kB
Progress (2): 2.4/2.6 MB | 57/284 kB
Progress (2): 2.4/2.6 MB | 57/284 kB
Progress (2): 2.4/2.6 MB | 57/284 kB
Progress (2): 2.4/2.6 MB | 57/284 kB
Progress (2): 2.5/2.6 MB | 57/284 kB
Progress (2): 2.5/2.6 MB | 57/284 kB
Progress (2): 2.5/2.6 MB | 57/284 kB
Progress (2): 2.5/2.6 MB | 57/284 kB
Progress (2): 2.5/2.6 MB | 57/284 kB
Progress (2): 2.5/2.6 MB | 57/284 kB
Progress (2): 2.5/2.6 MB | 57/284 kB
Progress (2): 2.5/2.6 MB | 57/284 kB
Progress (2): 2.5/2.6 MB | 57/284 kB
Progress (2): 2.5/2.6 MB | 57/284 kB
Progress (2): 2.5/2.6 MB | 57/284 kB
Progress (2): 2.5/2.6 MB | 57/284 kB
Progress (2): 2.5/2.6 MB | 57/284 kB
Progress (2): 2.5/2.6 MB | 57/284 kB
Progress (2): 2.5/2.6 MB | 57/284 kB
Progress (2): 2.5/2.6 MB | 57/284 kB
Progress (2): 2.5/2.6 MB | 57/284 kB
Progress (2): 2.5/2.6 MB | 57/284 kB
Progress (2): 2.5/2.6 MB | 57/284 kB
Progress (2): 2.5/2.6 MB | 57/284 kB
Progress (2): 2.5/2.6 MB | 57/284 kB
Progress (2): 2.5/2.6 MB | 57/284 kB
Progress (2): 2.5/2.6 MB | 57/284 kB
Progress (2): 2.5/2.6 MB | 57/284 kB
Progress (2): 2.5/2.6 MB | 57/284 kB
Progress (2): 2.6/2.6 MB | 57/284 kB
Progress (2): 2.6/2.6 MB | 57/284 kB
Progress (2): 2.6/2.6 MB | 57/284 kB
Progress (2): 2.6/2.6 MB | 57/284 kB
Progress (2): 2.6/2.6 MB | 57/284 kB
Progress (2): 2.6/2.6 MB | 57/284 kB
Progress (2): 2.6/2.6 MB | 57/284 kB
Progress (2): 2.6/2.6 MB | 57/284 kB
Progress (2): 2.6/2.6 MB | 57/284 kB
Progress (2): 2.6/2.6 MB | 57/284 kB
Progress (2): 2.6 MB | 57/284 kB    
                                
Downloaded from eclipse.maven.central.mirror: https://repo.eclipse.org/content/repositories/maven_central/com/google/guava/guava/25.1-android/guava-25.1-android.jar (2.6 MB at 1.6 MB/s)
Progress (1): 61/284 kB
Progress (1): 65/284 kB
Progress (1): 66/284 kB
Progress (1): 70/284 kB
Progress (1): 74/284 kB
Progress (1): 78/284 kB
Progress (1): 82/284 kB
Progress (1): 86/284 kB
Progress (1): 90/284 kB
Progress (1): 94/284 kB
Progress (1): 98/284 kB
Progress (1): 102/284 kB
Progress (1): 106/284 kB
Progress (1): 110/284 kB
Progress (1): 114/284 kB
Progress (1): 118/284 kB
Progress (1): 122/284 kB
Progress (1): 126/284 kB
Progress (1): 130/284 kB
Progress (1): 134/284 kB
Progress (1): 138/284 kB
Progress (1): 142/284 kB
Progress (1): 146/284 kB
Progress (1): 150/284 kB
Progress (1): 154/284 kB
Progress (1): 158/284 kB
Progress (1): 162/284 kB
Progress (1): 166/284 kB
Progress (1): 170/284 kB
Progress (1): 174/284 kB
Progress (1): 178/284 kB
Progress (1): 182/284 kB
Progress (1): 186/284 kB
Progress (1): 190/284 kB
Progress (1): 194/284 kB
Progress (1): 198/284 kB
Progress (1): 202/284 kB
Progress (1): 206/284 kB
Progress (1): 210/284 kB
Progress (1): 214/284 kB
Progress (1): 218/284 kB
Progress (1): 222/284 kB
Progress (1): 226/284 kB
Progress (1): 230/284 kB
Progress (1): 234/284 kB
Progress (1): 238/284 kB
Progress (1): 242/284 kB
Progress (1): 246/284 kB
Progress (1): 250/284 kB
Progress (1): 254/284 kB
Progress (1): 258/284 kB
Progress (1): 262/284 kB
Progress (1): 266/284 kB
Progress (1): 270/284 kB
Progress (1): 274/284 kB
Progress (1): 278/284 kB
Progress (1): 282/284 kB
Progress (1): 284 kB    
                    
Downloaded from eclipse.maven.central.mirror: https://repo.eclipse.org/content/repositories/maven_central/org/fusesource/jansi/jansi/1.17.1/jansi-1.17.1.jar (284 kB at 158 kB/s)
[INFO] 
[INFO] --- maven-clean-plugin:2.4.1:clean (default-clean) @ org.eclipse.m2e.maven.runtime ---
[INFO] 
[INFO] --- maven-resources-plugin:2.5:resources (default-resources) @ org.eclipse.m2e.maven.runtime ---
[debug] execute contextualize
[INFO] Using 'UTF-8' encoding to copy filtered resources.
[INFO] Copying 3 resources
[INFO] 
[INFO] --- maven-compiler-plugin:3.8.1:compile (default-compile) @ org.eclipse.m2e.maven.runtime ---
[INFO] No sources to compile
[INFO] 
[INFO] --- maven-resources-plugin:2.5:testResources (default-testResources) @ org.eclipse.m2e.maven.runtime ---
[debug] execute contextualize
[INFO] Using 'UTF-8' encoding to copy filtered resources.
[INFO] skip non existing resourceDirectory /home/jenkins/agent/workspace/m2e-gerrit/m2e-maven-runtime/org.eclipse.m2e.maven.runtime/src/test/resources
[INFO] 
[INFO] --- maven-compiler-plugin:3.8.1:testCompile (default-testCompile) @ org.eclipse.m2e.maven.runtime ---
[INFO] No sources to compile
[INFO] 
[INFO] --- maven-surefire-plugin:2.8:test (default-test) @ org.eclipse.m2e.maven.runtime ---
[INFO] No tests to run.
[INFO] Surefire report directory: /home/jenkins/agent/workspace/m2e-gerrit/m2e-maven-runtime/org.eclipse.m2e.maven.runtime/target/surefire-reports

-------------------------------------------------------
 T E S T S
-------------------------------------------------------
There are no tests to run.

Results :

Tests run: 0, Failures: 0, Errors: 0, Skipped: 0

[INFO] 
[INFO] --- maven-bundle-plugin:4.2.0:bundle (default-bundle) @ org.eclipse.m2e.maven.runtime ---
[WARNING] Bundle org.eclipse.m2e:org.eclipse.m2e.maven.runtime:bundle:1.14.0-SNAPSHOT : Version for package org.eclipse.aether is set to different values in the source (1.1.1) and in the manifest (1.4.1). The version in the manifest is not picked up by an other sibling bundles in this project or projects that directly depend on this project
[WARNING] Bundle org.eclipse.m2e:org.eclipse.m2e.maven.runtime:bundle:1.14.0-SNAPSHOT : Version for package org.eclipse.aether.artifact is set to different values in the source (1.1.1) and in the manifest (1.4.1). The version in the manifest is not picked up by an other sibling bundles in this project or projects that directly depend on this project
[WARNING] Bundle org.eclipse.m2e:org.eclipse.m2e.maven.runtime:bundle:1.14.0-SNAPSHOT : Version for package org.eclipse.aether.collection is set to different values in the source (1.1.1) and in the manifest (1.4.1). The version in the manifest is not picked up by an other sibling bundles in this project or projects that directly depend on this project
[WARNING] Bundle org.eclipse.m2e:org.eclipse.m2e.maven.runtime:bundle:1.14.0-SNAPSHOT : Version for package org.eclipse.aether.connector.basic is set to different values in the source (1.1.1) and in the manifest (1.4.1). The version in the manifest is not picked up by an other sibling bundles in this project or projects that directly depend on this project
[WARNING] Bundle org.eclipse.m2e:org.eclipse.m2e.maven.runtime:bundle:1.14.0-SNAPSHOT : Version for package org.eclipse.aether.deployment is set to different values in the source (1.1.1) and in the manifest (1.4.1). The version in the manifest is not picked up by an other sibling bundles in this project or projects that directly depend on this project
[WARNING] Bundle org.eclipse.m2e:org.eclipse.m2e.maven.runtime:bundle:1.14.0-SNAPSHOT : Version for package org.eclipse.aether.graph is set to different values in the source (1.1.1) and in the manifest (1.4.1). The version in the manifest is not picked up by an other sibling bundles in this project or projects that directly depend on this project
[WARNING] Bundle org.eclipse.m2e:org.eclipse.m2e.maven.runtime:bundle:1.14.0-SNAPSHOT : Version for package org.eclipse.aether.impl is set to different values in the source (1.1.1) and in the manifest (1.4.1). The version in the manifest is not picked up by an other sibling bundles in this project or projects that directly depend on this project
[WARNING] Bundle org.eclipse.m2e:org.eclipse.m2e.maven.runtime:bundle:1.14.0-SNAPSHOT : Version for package org.eclipse.aether.impl.guice is set to different values in the source (1.1.1) and in the manifest (1.4.1). The version in the manifest is not picked up by an other sibling bundles in this project or projects that directly depend on this project
[WARNING] Bundle org.eclipse.m2e:org.eclipse.m2e.maven.runtime:bundle:1.14.0-SNAPSHOT : Version for package org.eclipse.aether.installation is set to different values in the source (1.1.1) and in the manifest (1.4.1). The version in the manifest is not picked up by an other sibling bundles in this project or projects that directly depend on this project
[WARNING] Bundle org.eclipse.m2e:org.eclipse.m2e.maven.runtime:bundle:1.14.0-SNAPSHOT : Version for package org.eclipse.aether.metadata is set to different values in the source (1.1.1) and in the manifest (1.4.1). The version in the manifest is not picked up by an other sibling bundles in this project or projects that directly depend on this project
[WARNING] Bundle org.eclipse.m2e:org.eclipse.m2e.maven.runtime:bundle:1.14.0-SNAPSHOT : Version for package org.eclipse.aether.repository is set to different values in the source (1.1.1) and in the manifest (1.4.1). The version in the manifest is not picked up by an other sibling bundles in this project or projects that directly depend on this project
[WARNING] Bundle org.eclipse.m2e:org.eclipse.m2e.maven.runtime:bundle:1.14.0-SNAPSHOT : Version for package org.eclipse.aether.resolution is set to different values in the source (1.1.1) and in the manifest (1.4.1). The version in the manifest is not picked up by an other sibling bundles in this project or projects that directly depend on this project
[WARNING] Bundle org.eclipse.m2e:org.eclipse.m2e.maven.runtime:bundle:1.14.0-SNAPSHOT : Version for package org.eclipse.aether.spi.connector is set to different values in the source (1.1.1) and in the manifest (1.4.1). The version in the manifest is not picked up by an other sibling bundles in this project or projects that directly depend on this project
[WARNING] Bundle org.eclipse.m2e:org.eclipse.m2e.maven.runtime:bundle:1.14.0-SNAPSHOT : Version for package org.eclipse.aether.spi.connector.checksum is set to different values in the source (1.1.1) and in the manifest (1.4.1). The version in the manifest is not picked up by an other sibling bundles in this project or projects that directly depend on this project
[WARNING] Bundle org.eclipse.m2e:org.eclipse.m2e.maven.runtime:bundle:1.14.0-SNAPSHOT : Version for package org.eclipse.aether.spi.connector.layout is set to different values in the source (1.1.1) and in the manifest (1.4.1). The version in the manifest is not picked up by an other sibling bundles in this project or projects that directly depend on this project
[WARNING] Bundle org.eclipse.m2e:org.eclipse.m2e.maven.runtime:bundle:1.14.0-SNAPSHOT : Version for package org.eclipse.aether.spi.connector.transport is set to different values in the source (1.1.1) and in the manifest (1.4.1). The version in the manifest is not picked up by an other sibling bundles in this project or projects that directly depend on this project
[WARNING] Bundle org.eclipse.m2e:org.eclipse.m2e.maven.runtime:bundle:1.14.0-SNAPSHOT : Version for package org.eclipse.aether.spi.io is set to different values in the source (1.1.1) and in the manifest (1.4.1). The version in the manifest is not picked up by an other sibling bundles in this project or projects that directly depend on this project
[WARNING] Bundle org.eclipse.m2e:org.eclipse.m2e.maven.runtime:bundle:1.14.0-SNAPSHOT : Version for package org.eclipse.aether.spi.localrepo is set to different values in the source (1.1.1) and in the manifest (1.4.1). The version in the manifest is not picked up by an other sibling bundles in this project or projects that directly depend on this project
[WARNING] Bundle org.eclipse.m2e:org.eclipse.m2e.maven.runtime:bundle:1.14.0-SNAPSHOT : Version for package org.eclipse.aether.spi.locator is set to different values in the source (1.1.1) and in the manifest (1.4.1). The version in the manifest is not picked up by an other sibling bundles in this project or projects that directly depend on this project
[WARNING] Bundle org.eclipse.m2e:org.eclipse.m2e.maven.runtime:bundle:1.14.0-SNAPSHOT : Version for package org.eclipse.aether.spi.log is set to different values in the source (1.1.1) and in the manifest (1.4.1). The version in the manifest is not picked up by an other sibling bundles in this project or projects that directly depend on this project
[WARNING] Bundle org.eclipse.m2e:org.eclipse.m2e.maven.runtime:bundle:1.14.0-SNAPSHOT : Version for package org.eclipse.aether.transfer is set to different values in the source (1.1.1) and in the manifest (1.4.1). The version in the manifest is not picked up by an other sibling bundles in this project or projects that directly depend on this project
[WARNING] Bundle org.eclipse.m2e:org.eclipse.m2e.maven.runtime:bundle:1.14.0-SNAPSHOT : Version for package org.eclipse.aether.transform is set to different values in the source (1.1.1) and in the manifest (1.4.1). The version in the manifest is not picked up by an other sibling bundles in this project or projects that directly depend on this project
[WARNING] Bundle org.eclipse.m2e:org.eclipse.m2e.maven.runtime:bundle:1.14.0-SNAPSHOT : Version for package org.eclipse.aether.transport.wagon is set to different values in the source (1.1.1) and in the manifest (1.4.1). The version in the manifest is not picked up by an other sibling bundles in this project or projects that directly depend on this project
[WARNING] Bundle org.eclipse.m2e:org.eclipse.m2e.maven.runtime:bundle:1.14.0-SNAPSHOT : Version for package org.eclipse.aether.util is set to different values in the source (1.1.1) and in the manifest (1.4.1). The version in the manifest is not picked up by an other sibling bundles in this project or projects that directly depend on this project
[WARNING] Bundle org.eclipse.m2e:org.eclipse.m2e.maven.runtime:bundle:1.14.0-SNAPSHOT : Version for package org.eclipse.aether.util.artifact is set to different values in the source (1.1.1) and in the manifest (1.4.1). The version in the manifest is not picked up by an other sibling bundles in this project or projects that directly depend on this project
[WARNING] Bundle org.eclipse.m2e:org.eclipse.m2e.maven.runtime:bundle:1.14.0-SNAPSHOT : Version for package org.eclipse.aether.util.concurrency is set to different values in the source (1.1.1) and in the manifest (1.4.1). The version in the manifest is not picked up by an other sibling bundles in this project or projects that directly depend on this project
[WARNING] Bundle org.eclipse.m2e:org.eclipse.m2e.maven.runtime:bundle:1.14.0-SNAPSHOT : Version for package org.eclipse.aether.util.filter is set to different values in the source (1.1.1) and in the manifest (1.4.1). The version in the manifest is not picked up by an other sibling bundles in this project or projects that directly depend on this project
[WARNING] Bundle org.eclipse.m2e:org.eclipse.m2e.maven.runtime:bundle:1.14.0-SNAPSHOT : Version for package org.eclipse.aether.util.graph.manager is set to different values in the source (1.1.1) and in the manifest (1.4.1). The version in the manifest is not picked up by an other sibling bundles in this project or projects that directly depend on this project
[WARNING] Bundle org.eclipse.m2e:org.eclipse.m2e.maven.runtime:bundle:1.14.0-SNAPSHOT : Version for package org.eclipse.aether.util.graph.selector is set to different values in the source (1.1.1) and in the manifest (1.4.1). The version in the manifest is not picked up by an other sibling bundles in this project or projects that directly depend on this project
[WARNING] Bundle org.eclipse.m2e:org.eclipse.m2e.maven.runtime:bundle:1.14.0-SNAPSHOT : Version for package org.eclipse.aether.util.graph.transformer is set to different values in the source (1.1.1) and in the manifest (1.4.1). The version in the manifest is not picked up by an other sibling bundles in this project or projects that directly depend on this project
[WARNING] Bundle org.eclipse.m2e:org.eclipse.m2e.maven.runtime:bundle:1.14.0-SNAPSHOT : Version for package org.eclipse.aether.util.graph.traverser is set to different values in the source (1.1.1) and in the manifest (1.4.1). The version in the manifest is not picked up by an other sibling bundles in this project or projects that directly depend on this project
[WARNING] Bundle org.eclipse.m2e:org.eclipse.m2e.maven.runtime:bundle:1.14.0-SNAPSHOT : Version for package org.eclipse.aether.util.graph.version is set to different values in the source (1.1.1) and in the manifest (1.4.1). The version in the manifest is not picked up by an other sibling bundles in this project or projects that directly depend on this project
[WARNING] Bundle org.eclipse.m2e:org.eclipse.m2e.maven.runtime:bundle:1.14.0-SNAPSHOT : Version for package org.eclipse.aether.util.graph.visitor is set to different values in the source (1.1.1) and in the manifest (1.4.1). The version in the manifest is not picked up by an other sibling bundles in this project or projects that directly depend on this project
[WARNING] Bundle org.eclipse.m2e:org.eclipse.m2e.maven.runtime:bundle:1.14.0-SNAPSHOT : Version for package org.eclipse.aether.util.listener is set to different values in the source (1.1.1) and in the manifest (1.4.1). The version in the manifest is not picked up by an other sibling bundles in this project or projects that directly depend on this project
[WARNING] Bundle org.eclipse.m2e:org.eclipse.m2e.maven.runtime:bundle:1.14.0-SNAPSHOT : Version for package org.eclipse.aether.util.repository is set to different values in the source (1.1.1) and in the manifest (1.4.1). The version in the manifest is not picked up by an other sibling bundles in this project or projects that directly depend on this project
[WARNING] Bundle org.eclipse.m2e:org.eclipse.m2e.maven.runtime:bundle:1.14.0-SNAPSHOT : Version for package org.eclipse.aether.util.version is set to different values in the source (1.1.1) and in the manifest (1.4.1). The version in the manifest is not picked up by an other sibling bundles in this project or projects that directly depend on this project
[WARNING] Bundle org.eclipse.m2e:org.eclipse.m2e.maven.runtime:bundle:1.14.0-SNAPSHOT : Version for package org.eclipse.aether.version is set to different values in the source (1.1.1) and in the manifest (1.4.1). The version in the manifest is not picked up by an other sibling bundles in this project or projects that directly depend on this project
[WARNING] Bundle org.eclipse.m2e:org.eclipse.m2e.maven.runtime:bundle:1.14.0-SNAPSHOT : Host org.eclipse.m2e.maven.runtime.slf4j.simple=bundle-version="[1.14.0,1.15.0)" for this fragment/require bundle cannot be found on the classpath
[WARNING] Bundle org.eclipse.m2e:org.eclipse.m2e.maven.runtime:bundle:1.14.0-SNAPSHOT : Host javax.inject=bundle-version="1.0.0";visibility:=reexport for this fragment/require bundle cannot be found on the classpath
[WARNING] Bundle org.eclipse.m2e:org.eclipse.m2e.maven.runtime:bundle:1.14.0-SNAPSHOT : Export org.apache.maven.cli,  has 1,  private references [org.apache.commons.cli]
[WARNING] Bundle org.eclipse.m2e:org.eclipse.m2e.maven.runtime:bundle:1.14.0-SNAPSHOT : Export org.apache.maven.extension.internal,  has 1,  private references [org.eclipse.sisu]
[WARNING] Bundle org.eclipse.m2e:org.eclipse.m2e.maven.runtime:bundle:1.14.0-SNAPSHOT : Export org.apache.maven.model.building,  has 1,  private references [org.eclipse.sisu]
[WARNING] Bundle org.eclipse.m2e:org.eclipse.m2e.maven.runtime:bundle:1.14.0-SNAPSHOT : Export org.apache.maven.shared.utils,  has 1,  private references [javax.annotation]
[WARNING] Bundle org.eclipse.m2e:org.eclipse.m2e.maven.runtime:bundle:1.14.0-SNAPSHOT : Export org.apache.maven.shared.utils.cli,  has 1,  private references [javax.annotation]
[WARNING] Bundle org.eclipse.m2e:org.eclipse.m2e.maven.runtime:bundle:1.14.0-SNAPSHOT : Export org.apache.maven.shared.utils.introspection,  has 1,  private references [javax.annotation]
[WARNING] Bundle org.eclipse.m2e:org.eclipse.m2e.maven.runtime:bundle:1.14.0-SNAPSHOT : Export org.apache.maven.shared.utils.io,  has 1,  private references [javax.annotation]
[WARNING] Bundle org.eclipse.m2e:org.eclipse.m2e.maven.runtime:bundle:1.14.0-SNAPSHOT : Export org.apache.maven.shared.utils.xml,  has 2,  private references [javax.annotation, org.apache.commons.io.output]
[WARNING] Bundle org.eclipse.m2e:org.eclipse.m2e.maven.runtime:bundle:1.14.0-SNAPSHOT : Export org.codehaus.plexus,  has 1,  private references [org.eclipse.sisu.plexus]
[WARNING] Bundle org.eclipse.m2e:org.eclipse.m2e.maven.runtime:bundle:1.14.0-SNAPSHOT : Export org.codehaus.plexus.component.configurator.converters.special,  has 1,  private references [org.codehaus.classworlds]
[WARNING] Bundle org.eclipse.m2e:org.eclipse.m2e.maven.runtime:bundle:1.14.0-SNAPSHOT : Export org.codehaus.plexus.component.factory,  has 1,  private references [org.codehaus.classworlds]
[WARNING] Bundle org.eclipse.m2e:org.eclipse.m2e.maven.runtime:bundle:1.14.0-SNAPSHOT : Export org.codehaus.plexus.logging,  has 1,  private references [org.eclipse.sisu.bean]
[WARNING] Bundle org.eclipse.m2e:org.eclipse.m2e.maven.runtime:bundle:1.14.0-SNAPSHOT : Export org.sonatype.plexus.components.cipher,  has 1,  private references [javax.enterprise.inject]
[WARNING] Bundle org.eclipse.m2e:org.eclipse.m2e.maven.runtime:bundle:1.14.0-SNAPSHOT : Export io.takari.aether.connector,  has 1,  private references [org.eclipse.sisu]
[WARNING] Bundle org.eclipse.m2e:org.eclipse.m2e.maven.runtime:bundle:1.14.0-SNAPSHOT : Invalid package name: 'META-INF.plexus' in Export-Package
[WARNING] Bundle org.eclipse.m2e:org.eclipse.m2e.maven.runtime:bundle:1.14.0-SNAPSHOT : Invalid package name: 'META-INF.sisu' in Export-Package
[INFO] 
[INFO] --- tycho-p2-plugin:1.4.0:p2-metadata (p2-metadata) @ org.eclipse.m2e.maven.runtime ---
[INFO] 
[INFO] --- tycho-p2-plugin:1.4.0:update-local-index (p2-metadata) @ org.eclipse.m2e.maven.runtime ---
[INFO] 
[INFO] --- tycho-pack200a-plugin:1.4.0:normalize (pack200-normalize) @ org.eclipse.m2e.maven.runtime ---
[INFO] Pack200 normalizing jar /home/jenkins/agent/workspace/m2e-gerrit/m2e-maven-runtime/org.eclipse.m2e.maven.runtime/target/org.eclipse.m2e.maven.runtime-1.14.0-SNAPSHOT.jar
[INFO] 
[INFO] --- eclipse-jarsigner-plugin:1.1.5:sign (sign) @ org.eclipse.m2e.maven.runtime ---
[INFO] Signing of nested jars of '/home/jenkins/agent/workspace/m2e-gerrit/m2e-maven-runtime/org.eclipse.m2e.maven.runtime/target/org.eclipse.m2e.maven.runtime-1.14.0-SNAPSHOT.jar' is disabled.
[INFO] Signing jar: /home/jenkins/agent/workspace/m2e-gerrit/m2e-maven-runtime/org.eclipse.m2e.maven.runtime/target/org.eclipse.m2e.maven.runtime-1.14.0-SNAPSHOT.jar
[INFO] 
[INFO] --- tycho-pack200b-plugin:1.4.0:pack (pack200-pack) @ org.eclipse.m2e.maven.runtime ---
[INFO] Pack200 packing jar /home/jenkins/agent/workspace/m2e-gerrit/m2e-maven-runtime/org.eclipse.m2e.maven.runtime/target/org.eclipse.m2e.maven.runtime-1.14.0-SNAPSHOT.jar
[INFO] 
[INFO] --- maven-install-plugin:2.3.1:install (default-install) @ org.eclipse.m2e.maven.runtime ---
[INFO] Installing /home/jenkins/agent/workspace/m2e-gerrit/m2e-maven-runtime/org.eclipse.m2e.maven.runtime/target/org.eclipse.m2e.maven.runtime-1.14.0-SNAPSHOT.jar to /home/jenkins/agent/workspace/m2e-gerrit/.repository/org/eclipse/m2e/org.eclipse.m2e.maven.runtime/1.14.0-SNAPSHOT/org.eclipse.m2e.maven.runtime-1.14.0-SNAPSHOT.jar
[INFO] Installing /home/jenkins/agent/workspace/m2e-gerrit/m2e-maven-runtime/org.eclipse.m2e.maven.runtime/pom.xml to /home/jenkins/agent/workspace/m2e-gerrit/.repository/org/eclipse/m2e/org.eclipse.m2e.maven.runtime/1.14.0-SNAPSHOT/org.eclipse.m2e.maven.runtime-1.14.0-SNAPSHOT.pom
[INFO] Installing /home/jenkins/agent/workspace/m2e-gerrit/m2e-maven-runtime/org.eclipse.m2e.maven.runtime/target/org.eclipse.m2e.maven.runtime-1.14.0-SNAPSHOT.jar.pack.gz to /home/jenkins/agent/workspace/m2e-gerrit/.repository/org/eclipse/m2e/org.eclipse.m2e.maven.runtime/1.14.0-SNAPSHOT/org.eclipse.m2e.maven.runtime-1.14.0-SNAPSHOT-pack200.jar.pack.gz
[INFO] 
[INFO] --- maven-bundle-plugin:4.2.0:install (default-install) @ org.eclipse.m2e.maven.runtime ---
[INFO] Installing org/eclipse/m2e/org.eclipse.m2e.maven.runtime/1.14.0-SNAPSHOT/org.eclipse.m2e.maven.runtime-1.14.0-SNAPSHOT.jar
[INFO] Writing OBR metadata
[INFO] 
[INFO] -----< org.eclipse.m2e:org.eclipse.m2e.maven.runtime.slf4j.simple >-----
[INFO] Building org.eclipse.m2e.maven.runtime.slf4j.simple 1.14.0-SNAPSHOT [5/5]
[INFO] -------------------------------[ bundle ]-------------------------------
Downloading from maven-3.6.2-staging: https://repository.apache.org/content/repositories/maven-1529/org/slf4j/slf4j-simple/1.7.5/slf4j-simple-1.7.5.pom
Downloading from eclipse.maven.central.mirror: https://repo.eclipse.org/content/repositories/maven_central/org/slf4j/slf4j-simple/1.7.5/slf4j-simple-1.7.5.pom
Progress (1): 1.5 kB
                    
Downloaded from eclipse.maven.central.mirror: https://repo.eclipse.org/content/repositories/maven_central/org/slf4j/slf4j-simple/1.7.5/slf4j-simple-1.7.5.pom (1.5 kB at 67 kB/s)
Downloading from maven-3.6.2-staging: https://repository.apache.org/content/repositories/maven-1529/org/slf4j/slf4j-parent/1.7.5/slf4j-parent-1.7.5.pom
Downloading from eclipse.maven.central.mirror: https://repo.eclipse.org/content/repositories/maven_central/org/slf4j/slf4j-parent/1.7.5/slf4j-parent-1.7.5.pom
Progress (1): 4.1/12 kB
Progress (1): 7.7/12 kB
Progress (1): 12/12 kB 
Progress (1): 12 kB   
                   
Downloaded from eclipse.maven.central.mirror: https://repo.eclipse.org/content/repositories/maven_central/org/slf4j/slf4j-parent/1.7.5/slf4j-parent-1.7.5.pom (12 kB at 562 kB/s)
Downloading from maven-3.6.2-staging: https://repository.apache.org/content/repositories/maven-1529/org/slf4j/slf4j-api/1.7.5/slf4j-api-1.7.5.pom
Downloading from eclipse.maven.central.mirror: https://repo.eclipse.org/content/repositories/maven_central/org/slf4j/slf4j-api/1.7.5/slf4j-api-1.7.5.pom
Progress (1): 2.7 kB
                    
Downloaded from eclipse.maven.central.mirror: https://repo.eclipse.org/content/repositories/maven_central/org/slf4j/slf4j-api/1.7.5/slf4j-api-1.7.5.pom (2.7 kB at 122 kB/s)
Downloading from maven-3.6.2-staging: https://repository.apache.org/content/repositories/maven-1529/org/slf4j/slf4j-simple/1.7.5/slf4j-simple-1.7.5.jar
Downloading from maven-3.6.2-staging: https://repository.apache.org/content/repositories/maven-1529/org/slf4j/slf4j-api/1.7.5/slf4j-api-1.7.5.jar
Downloading from eclipse.maven.central.mirror: https://repo.eclipse.org/content/repositories/maven_central/org/slf4j/slf4j-simple/1.7.5/slf4j-simple-1.7.5.jar
Downloading from eclipse.maven.central.mirror: https://repo.eclipse.org/content/repositories/maven_central/org/slf4j/slf4j-api/1.7.5/slf4j-api-1.7.5.jar
Progress (1): 4.1/11 kB
Progress (1): 7.7/11 kB
Progress (1): 11 kB    
Progress (2): 11 kB | 4.1/26 kB
Progress (2): 11 kB | 7.7/26 kB
Progress (2): 11 kB | 12/26 kB 
Progress (2): 11 kB | 16/26 kB
Progress (2): 11 kB | 20/26 kB
Progress (2): 11 kB | 24/26 kB
Progress (2): 11 kB | 26 kB   
                           
Downloaded from eclipse.maven.central.mirror: https://repo.eclipse.org/content/repositories/maven_central/org/slf4j/slf4j-simple/1.7.5/slf4j-simple-1.7.5.jar (11 kB at 534 kB/s)
Downloaded from eclipse.maven.central.mirror: https://repo.eclipse.org/content/repositories/maven_central/org/slf4j/slf4j-api/1.7.5/slf4j-api-1.7.5.jar (26 kB at 1.2 MB/s)
[INFO] 
[INFO] --- maven-clean-plugin:2.4.1:clean (default-clean) @ org.eclipse.m2e.maven.runtime.slf4j.simple ---
[INFO] 
[INFO] --- maven-resources-plugin:2.5:resources (default-resources) @ org.eclipse.m2e.maven.runtime.slf4j.simple ---
[debug] execute contextualize
[INFO] Using 'UTF-8' encoding to copy filtered resources.
[INFO] Copying 4 resources
[INFO] 
[INFO] --- maven-compiler-plugin:3.8.1:compile (default-compile) @ org.eclipse.m2e.maven.runtime.slf4j.simple ---
[INFO] No sources to compile
[INFO] 
[INFO] --- maven-resources-plugin:2.5:testResources (default-testResources) @ org.eclipse.m2e.maven.runtime.slf4j.simple ---
[debug] execute contextualize
[INFO] Using 'UTF-8' encoding to copy filtered resources.
[INFO] skip non existing resourceDirectory /home/jenkins/agent/workspace/m2e-gerrit/m2e-maven-runtime/org.eclipse.m2e.maven.runtime.slf4j.simple/src/test/resources
[INFO] 
[INFO] --- maven-compiler-plugin:3.8.1:testCompile (default-testCompile) @ org.eclipse.m2e.maven.runtime.slf4j.simple ---
[INFO] No sources to compile
[INFO] 
[INFO] --- maven-surefire-plugin:2.8:test (default-test) @ org.eclipse.m2e.maven.runtime.slf4j.simple ---
[INFO] No tests to run.
[INFO] Surefire report directory: /home/jenkins/agent/workspace/m2e-gerrit/m2e-maven-runtime/org.eclipse.m2e.maven.runtime.slf4j.simple/target/surefire-reports

-------------------------------------------------------
 T E S T S
-------------------------------------------------------
There are no tests to run.

Results :

Tests run: 0, Failures: 0, Errors: 0, Skipped: 0

[INFO] 
[INFO] --- maven-bundle-plugin:4.2.0:bundle (default-bundle) @ org.eclipse.m2e.maven.runtime.slf4j.simple ---
[INFO] 
[INFO] --- tycho-p2-plugin:1.4.0:p2-metadata (p2-metadata) @ org.eclipse.m2e.maven.runtime.slf4j.simple ---
[INFO] 
[INFO] --- tycho-p2-plugin:1.4.0:update-local-index (p2-metadata) @ org.eclipse.m2e.maven.runtime.slf4j.simple ---
[INFO] 
[INFO] --- tycho-pack200a-plugin:1.4.0:normalize (pack200-normalize) @ org.eclipse.m2e.maven.runtime.slf4j.simple ---
[INFO] Pack200 normalizing jar /home/jenkins/agent/workspace/m2e-gerrit/m2e-maven-runtime/org.eclipse.m2e.maven.runtime.slf4j.simple/target/org.eclipse.m2e.maven.runtime.slf4j.simple-1.14.0-SNAPSHOT.jar
[INFO] 
[INFO] --- eclipse-jarsigner-plugin:1.1.5:sign (sign) @ org.eclipse.m2e.maven.runtime.slf4j.simple ---
[INFO] Signing of nested jars of '/home/jenkins/agent/workspace/m2e-gerrit/m2e-maven-runtime/org.eclipse.m2e.maven.runtime.slf4j.simple/target/org.eclipse.m2e.maven.runtime.slf4j.simple-1.14.0-SNAPSHOT.jar' is disabled.
[INFO] Signing jar: /home/jenkins/agent/workspace/m2e-gerrit/m2e-maven-runtime/org.eclipse.m2e.maven.runtime.slf4j.simple/target/org.eclipse.m2e.maven.runtime.slf4j.simple-1.14.0-SNAPSHOT.jar
[INFO] 
[INFO] --- tycho-pack200b-plugin:1.4.0:pack (pack200-pack) @ org.eclipse.m2e.maven.runtime.slf4j.simple ---
[INFO] Pack200 packing jar /home/jenkins/agent/workspace/m2e-gerrit/m2e-maven-runtime/org.eclipse.m2e.maven.runtime.slf4j.simple/target/org.eclipse.m2e.maven.runtime.slf4j.simple-1.14.0-SNAPSHOT.jar
[INFO] 
[INFO] --- maven-install-plugin:2.3.1:install (default-install) @ org.eclipse.m2e.maven.runtime.slf4j.simple ---
[INFO] Installing /home/jenkins/agent/workspace/m2e-gerrit/m2e-maven-runtime/org.eclipse.m2e.maven.runtime.slf4j.simple/target/org.eclipse.m2e.maven.runtime.slf4j.simple-1.14.0-SNAPSHOT.jar to /home/jenkins/agent/workspace/m2e-gerrit/.repository/org/eclipse/m2e/org.eclipse.m2e.maven.runtime.slf4j.simple/1.14.0-SNAPSHOT/org.eclipse.m2e.maven.runtime.slf4j.simple-1.14.0-SNAPSHOT.jar
[INFO] Installing /home/jenkins/agent/workspace/m2e-gerrit/m2e-maven-runtime/org.eclipse.m2e.maven.runtime.slf4j.simple/pom.xml to /home/jenkins/agent/workspace/m2e-gerrit/.repository/org/eclipse/m2e/org.eclipse.m2e.maven.runtime.slf4j.simple/1.14.0-SNAPSHOT/org.eclipse.m2e.maven.runtime.slf4j.simple-1.14.0-SNAPSHOT.pom
[INFO] Installing /home/jenkins/agent/workspace/m2e-gerrit/m2e-maven-runtime/org.eclipse.m2e.maven.runtime.slf4j.simple/target/org.eclipse.m2e.maven.runtime.slf4j.simple-1.14.0-SNAPSHOT.jar.pack.gz to /home/jenkins/agent/workspace/m2e-gerrit/.repository/org/eclipse/m2e/org.eclipse.m2e.maven.runtime.slf4j.simple/1.14.0-SNAPSHOT/org.eclipse.m2e.maven.runtime.slf4j.simple-1.14.0-SNAPSHOT-pack200.jar.pack.gz
[INFO] 
[INFO] --- maven-bundle-plugin:4.2.0:install (default-install) @ org.eclipse.m2e.maven.runtime.slf4j.simple ---
[INFO] Installing org/eclipse/m2e/org.eclipse.m2e.maven.runtime.slf4j.simple/1.14.0-SNAPSHOT/org.eclipse.m2e.maven.runtime.slf4j.simple-1.14.0-SNAPSHOT.jar
[INFO] Writing OBR metadata
[INFO] ------------------------------------------------------------------------
[INFO] Reactor Summary for m2e-maven-runtime 1.14.0-SNAPSHOT:
[INFO] 
[INFO] m2e-maven-runtime .................................. SUCCESS [ 10.966 s]
[INFO] Maven Archetype Common Bundle ...................... SUCCESS [ 26.139 s]
[INFO] Nexus Indexer Bundle ............................... SUCCESS [ 12.032 s]
[INFO] Embedded Maven Runtime Bundle ...................... SUCCESS [ 35.196 s]
[INFO] org.eclipse.m2e.maven.runtime.slf4j.simple ......... SUCCESS [  2.807 s]
[INFO] ------------------------------------------------------------------------
[INFO] BUILD SUCCESS
[INFO] ------------------------------------------------------------------------
[INFO] Total time:  02:11 min
[INFO] Finished at: 2019-10-25T15:53:14Z
[INFO] ------------------------------------------------------------------------
[m2e-gerrit] $ /opt/tools/apache-maven/3.5.4/bin/mvn -f pom.xml -DGERRIT_BRANCH=master -DGERRIT_PATCHSET_REVISION=9729e2300d76a178943bf0122937766029de84a1 -DGERRIT_HOST=gerrit-local -DGERRIT_CHANGE_OWNER_EMAIL=akurtako@redhat.com "-DGERRIT_EVENT_ACCOUNT_NAME=Fred Bricon" -DGERRIT_CHANGE_URL=https://git.eclipse.org/r/151642 -DGERRIT_PATCHSET_UPLOADER_EMAIL=fbricon@gmail.com -DGERRIT_EVENT_TYPE=patchset-created -DGERRIT_PROJECT=m2e/m2e-core -DGERRIT_CHANGE_NUMBER=151642 -DGERRIT_SCHEME=ssh '-DGERRIT_PATCHSET_UPLOADER=\"Fred Bricon\" <fbricon@gmail.com>' -DGERRIT_PORT=29418 -DGERRIT_CHANGE_PRIVATE_STATE=false -DGERRIT_REFSPEC=refs/changes/42/151642/3 "-DGERRIT_PATCHSET_UPLOADER_NAME=Fred Bricon" '-DGERRIT_CHANGE_OWNER=\"Alexander Kurtakov\" <akurtako@redhat.com>' -DGERRIT_CHANGE_COMMIT_MESSAGE=T3JiaXQgMjAxOS0wNiBNMyBubyBsb25nZXIgZXhpc3RzLgoKVXNlIDIwMTktMDkgcmVsZWFzZS4KCkNoYW5nZS1JZDogSWU3ZDA3Mjc2YzUzZjI4YWIzNTFkYjc2MjU2MjUzODM1Yjg4NjYwMGUKU2lnbmVkLW9mZi1ieTogQWxleGFuZGVyIEt1cnRha292IDxha3VydGFrb0ByZWRoYXQuY29tPg== "-DGERRIT_NAME=Eclipse Gerrit" -DGERRIT_TOPIC= "-DGERRIT_CHANGE_SUBJECT=Orbit 2019-06 M3 no longer exists." '-DGERRIT_EVENT_ACCOUNT=\"Fred Bricon\" <fbricon@gmail.com>' -DGERRIT_CHANGE_WIP_STATE=false -DGERRIT_CHANGE_ID=Ie7d07276c53f28ab351db76256253835b886600e -DGERRIT_EVENT_HASH=-360752145 -DGERRIT_VERSION=2.14.6 -DGERRIT_EVENT_ACCOUNT_EMAIL=fbricon@gmail.com -DGERRIT_PATCHSET_NUMBER=3 "-DGERRIT_CHANGE_OWNER_NAME=Alexander Kurtakov" -Dmaven.test.failure.ignore=true -Dmaven.test.error.ignore=true -Dtycho.disableP2Mirrors=true -Dtycho.surefire.timeout=7200 -Dmaven.repo.local=/home/jenkins/agent/workspace/m2e-gerrit/.repository clean install -Peclipse-sign,uts,its
Picked up JAVA_TOOL_OPTIONS: -XX:+IgnoreUnrecognizedVMOptions -XX:+UseContainerSupport -XX:+UnlockExperimentalVMOptions -XX:+UseCGroupMemoryLimitForHeap
Picked up _JAVA_OPTIONS: -XX:MaxRAMPercentage=64.0
[INFO] Scanning for projects...
[ERROR] [ERROR] Some problems were encountered while processing the POMs:
[FATAL] Non-resolvable parent POM for org.eclipse.m2e:m2e-core-tests:[unknown-version]: Could not find artifact org.eclipse.m2e:m2e-core:pom:1.13.0-SNAPSHOT and 'parent.relativePath' points at wrong local POM @ line 7, column 10
 @ 
[ERROR] The build could not read 1 project -> [Help 1]
[ERROR]   
[ERROR]   The project org.eclipse.m2e:m2e-core-tests:[unknown-version] (/home/jenkins/agent/workspace/m2e-gerrit/m2e-core-tests/pom.xml) has 1 error
[ERROR]     Non-resolvable parent POM for org.eclipse.m2e:m2e-core-tests:[unknown-version]: Could not find artifact org.eclipse.m2e:m2e-core:pom:1.13.0-SNAPSHOT and 'parent.relativePath' points at wrong local POM @ line 7, column 10 -> [Help 2]
[ERROR] 
[ERROR] To see the full stack trace of the errors, re-run Maven with the -e switch.
[ERROR] Re-run Maven using the -X switch to enable full debug logging.
[ERROR] 
[ERROR] For more information about the errors and possible solutions, please read the following articles:
[ERROR] [Help 1] http://cwiki.apache.org/confluence/display/MAVEN/ProjectBuildingException
[ERROR] [Help 2] http://cwiki.apache.org/confluence/display/MAVEN/UnresolvableModelException
Build step 'Invoke top-level Maven targets' marked build as failure
Terminating xvnc.
Recording test results
ERROR: Step ‘Publish JUnit test result report’ failed: No test report files were found. Configuration error?
Archiving artifacts
Finished: FAILURE