FailedConsole Output

Skipping 1,067 KB.. Full Log
                            
Downloading from eclipse.maven.central.mirror: https://repo.eclipse.org/content/repositories/maven_central/org/eclipse/sisu/org.eclipse.sisu.inject/0.3.3/org.eclipse.sisu.inject-0.3.3.jar
Progress (2): 640 kB | 149 kB
                             
Downloaded from eclipse.maven.central.mirror: https://repo.eclipse.org/content/repositories/maven_central/org/apache/maven/maven-core/3.6.2/maven-core-3.6.2.jar (640 kB at 3.2 MB/s)
Downloading from eclipse.maven.central.mirror: https://repo.eclipse.org/content/repositories/maven_central/com/google/inject/guice/4.2.1/guice-4.2.1-no_aop.jar
Downloaded from eclipse.maven.central.mirror: https://repo.eclipse.org/content/repositories/maven_central/org/apache/maven/resolver/maven-resolver-api/1.4.1/maven-resolver-api-1.4.1.jar (149 kB at 752 kB/s)
Downloading from eclipse.maven.central.mirror: https://repo.eclipse.org/content/repositories/maven_central/com/google/guava/guava/25.1-android/guava-25.1-android.jar
Progress (1): 4.1/379 kB
Progress (1): 7.7/379 kB
Progress (1): 12/379 kB 
Progress (1): 16/379 kB
Progress (1): 20/379 kB
Progress (1): 24/379 kB
Progress (1): 28/379 kB
Progress (1): 32/379 kB
Progress (1): 33/379 kB
Progress (1): 37/379 kB
Progress (1): 41/379 kB
Progress (1): 45/379 kB
Progress (1): 49/379 kB
Progress (1): 53/379 kB
Progress (1): 57/379 kB
Progress (1): 61/379 kB
Progress (1): 65/379 kB
Progress (1): 66/379 kB
Progress (1): 70/379 kB
Progress (1): 74/379 kB
Progress (1): 78/379 kB
Progress (1): 82/379 kB
Progress (1): 86/379 kB
Progress (1): 90/379 kB
Progress (1): 94/379 kB
Progress (1): 98/379 kB
Progress (1): 98/379 kB
Progress (1): 102/379 kB
Progress (1): 106/379 kB
Progress (1): 110/379 kB
Progress (1): 114/379 kB
Progress (1): 118/379 kB
Progress (1): 122/379 kB
Progress (1): 126/379 kB
Progress (1): 130/379 kB
Progress (1): 131/379 kB
Progress (1): 135/379 kB
Progress (1): 139/379 kB
Progress (1): 143/379 kB
Progress (1): 147/379 kB
Progress (1): 151/379 kB
Progress (1): 155/379 kB
Progress (1): 159/379 kB
Progress (1): 163/379 kB
Progress (1): 164/379 kB
Progress (1): 168/379 kB
Progress (1): 172/379 kB
Progress (1): 176/379 kB
Progress (1): 180/379 kB
Progress (1): 184/379 kB
Progress (1): 188/379 kB
Progress (1): 192/379 kB
Progress (1): 196/379 kB
Progress (1): 197/379 kB
Progress (1): 201/379 kB
Progress (1): 205/379 kB
Progress (1): 209/379 kB
Progress (1): 213/379 kB
Progress (1): 217/379 kB
Progress (2): 217/379 kB | 0/2.6 MB
Progress (2): 221/379 kB | 0/2.6 MB
Progress (2): 221/379 kB | 0/2.6 MB
Progress (2): 225/379 kB | 0/2.6 MB
Progress (2): 229/379 kB | 0/2.6 MB
Progress (2): 229/379 kB | 0/2.6 MB
Progress (2): 229/379 kB | 0/2.6 MB
Progress (2): 229/379 kB | 0/2.6 MB
Progress (2): 233/379 kB | 0/2.6 MB
Progress (2): 237/379 kB | 0/2.6 MB
Progress (2): 237/379 kB | 0/2.6 MB
Progress (2): 241/379 kB | 0/2.6 MB
Progress (2): 241/379 kB | 0/2.6 MB
Progress (2): 245/379 kB | 0/2.6 MB
Progress (2): 245/379 kB | 0/2.6 MB
Progress (2): 249/379 kB | 0/2.6 MB
Progress (2): 249/379 kB | 0/2.6 MB
Progress (2): 253/379 kB | 0/2.6 MB
Progress (2): 253/379 kB | 0/2.6 MB
Progress (2): 257/379 kB | 0/2.6 MB
Progress (2): 261/379 kB | 0/2.6 MB
Progress (2): 261/379 kB | 0/2.6 MB
Progress (2): 262/379 kB | 0/2.6 MB
Progress (2): 262/379 kB | 0/2.6 MB
Progress (2): 266/379 kB | 0/2.6 MB
Progress (2): 266/379 kB | 0/2.6 MB
Progress (2): 270/379 kB | 0/2.6 MB
Progress (2): 274/379 kB | 0/2.6 MB
Progress (2): 278/379 kB | 0/2.6 MB
Progress (2): 282/379 kB | 0/2.6 MB
Progress (2): 286/379 kB | 0/2.6 MB
Progress (2): 286/379 kB | 0/2.6 MB
Progress (2): 290/379 kB | 0/2.6 MB
Progress (3): 290/379 kB | 0/2.6 MB | 4.1/521 kB
Progress (3): 290/379 kB | 0.1/2.6 MB | 4.1/521 kB
Progress (3): 294/379 kB | 0.1/2.6 MB | 4.1/521 kB
Progress (4): 294/379 kB | 0.1/2.6 MB | 4.1/521 kB | 4.1/67 kB
Progress (4): 298/379 kB | 0.1/2.6 MB | 4.1/521 kB | 4.1/67 kB
Progress (4): 298/379 kB | 0.1/2.6 MB | 4.1/521 kB | 7.7/67 kB
Progress (4): 298/379 kB | 0.1/2.6 MB | 4.1/521 kB | 7.7/67 kB
Progress (4): 298/379 kB | 0.1/2.6 MB | 7.7/521 kB | 7.7/67 kB
Progress (5): 298/379 kB | 0.1/2.6 MB | 7.7/521 kB | 7.7/67 kB | 4.1/168 kB
Progress (5): 298/379 kB | 0.1/2.6 MB | 12/521 kB | 7.7/67 kB | 4.1/168 kB 
Progress (5): 298/379 kB | 0.1/2.6 MB | 12/521 kB | 7.7/67 kB | 4.1/168 kB
Progress (5): 298/379 kB | 0.1/2.6 MB | 12/521 kB | 12/67 kB | 4.1/168 kB 
Progress (5): 302/379 kB | 0.1/2.6 MB | 12/521 kB | 12/67 kB | 4.1/168 kB
Progress (5): 302/379 kB | 0.1/2.6 MB | 12/521 kB | 16/67 kB | 4.1/168 kB
Progress (5): 302/379 kB | 0.1/2.6 MB | 12/521 kB | 16/67 kB | 4.1/168 kB
Progress (5): 302/379 kB | 0.1/2.6 MB | 12/521 kB | 20/67 kB | 4.1/168 kB
Progress (5): 302/379 kB | 0.1/2.6 MB | 16/521 kB | 20/67 kB | 4.1/168 kB
Progress (5): 302/379 kB | 0.1/2.6 MB | 16/521 kB | 20/67 kB | 7.7/168 kB
Progress (5): 302/379 kB | 0.1/2.6 MB | 20/521 kB | 20/67 kB | 7.7/168 kB
Progress (5): 302/379 kB | 0.1/2.6 MB | 20/521 kB | 24/67 kB | 7.7/168 kB
Progress (5): 302/379 kB | 0.1/2.6 MB | 20/521 kB | 24/67 kB | 7.7/168 kB
Progress (5): 306/379 kB | 0.1/2.6 MB | 20/521 kB | 24/67 kB | 7.7/168 kB
Progress (5): 306/379 kB | 0.1/2.6 MB | 20/521 kB | 24/67 kB | 7.7/168 kB
Progress (5): 306/379 kB | 0.1/2.6 MB | 20/521 kB | 28/67 kB | 7.7/168 kB
Progress (5): 306/379 kB | 0.1/2.6 MB | 24/521 kB | 28/67 kB | 7.7/168 kB
Progress (5): 306/379 kB | 0.1/2.6 MB | 24/521 kB | 28/67 kB | 12/168 kB 
Progress (5): 306/379 kB | 0.1/2.6 MB | 28/521 kB | 28/67 kB | 12/168 kB
Progress (5): 306/379 kB | 0.1/2.6 MB | 28/521 kB | 32/67 kB | 12/168 kB
Progress (5): 306/379 kB | 0.1/2.6 MB | 28/521 kB | 32/67 kB | 12/168 kB
Progress (5): 310/379 kB | 0.1/2.6 MB | 28/521 kB | 32/67 kB | 12/168 kB
Progress (5): 310/379 kB | 0.1/2.6 MB | 28/521 kB | 32/67 kB | 12/168 kB
Progress (5): 310/379 kB | 0.1/2.6 MB | 28/521 kB | 33/67 kB | 12/168 kB
Progress (5): 310/379 kB | 0.1/2.6 MB | 32/521 kB | 33/67 kB | 12/168 kB
Progress (5): 310/379 kB | 0.1/2.6 MB | 32/521 kB | 37/67 kB | 12/168 kB
Progress (5): 310/379 kB | 0.1/2.6 MB | 32/521 kB | 37/67 kB | 16/168 kB
Progress (5): 310/379 kB | 0.1/2.6 MB | 32/521 kB | 41/67 kB | 16/168 kB
Progress (5): 310/379 kB | 0.1/2.6 MB | 33/521 kB | 41/67 kB | 16/168 kB
Progress (5): 310/379 kB | 0.1/2.6 MB | 33/521 kB | 45/67 kB | 16/168 kB
Progress (5): 310/379 kB | 0.1/2.6 MB | 37/521 kB | 45/67 kB | 16/168 kB
Progress (5): 310/379 kB | 0.1/2.6 MB | 37/521 kB | 45/67 kB | 16/168 kB
Progress (5): 314/379 kB | 0.1/2.6 MB | 37/521 kB | 45/67 kB | 16/168 kB
Progress (5): 314/379 kB | 0.1/2.6 MB | 37/521 kB | 45/67 kB | 16/168 kB
Progress (5): 314/379 kB | 0.1/2.6 MB | 41/521 kB | 45/67 kB | 16/168 kB
Progress (5): 314/379 kB | 0.1/2.6 MB | 41/521 kB | 49/67 kB | 16/168 kB
Progress (5): 314/379 kB | 0.1/2.6 MB | 45/521 kB | 49/67 kB | 16/168 kB
Progress (5): 314/379 kB | 0.1/2.6 MB | 45/521 kB | 49/67 kB | 20/168 kB
Progress (5): 314/379 kB | 0.1/2.6 MB | 49/521 kB | 49/67 kB | 20/168 kB
Progress (5): 314/379 kB | 0.1/2.6 MB | 49/521 kB | 53/67 kB | 20/168 kB
Progress (5): 314/379 kB | 0.1/2.6 MB | 49/521 kB | 53/67 kB | 20/168 kB
Progress (5): 318/379 kB | 0.1/2.6 MB | 49/521 kB | 53/67 kB | 20/168 kB
Progress (5): 318/379 kB | 0.1/2.6 MB | 49/521 kB | 53/67 kB | 20/168 kB
Progress (5): 322/379 kB | 0.1/2.6 MB | 49/521 kB | 53/67 kB | 20/168 kB
Progress (5): 322/379 kB | 0.1/2.6 MB | 49/521 kB | 57/67 kB | 20/168 kB
Progress (5): 322/379 kB | 0.1/2.6 MB | 53/521 kB | 57/67 kB | 20/168 kB
Progress (5): 322/379 kB | 0.1/2.6 MB | 53/521 kB | 61/67 kB | 20/168 kB
Progress (5): 322/379 kB | 0.1/2.6 MB | 53/521 kB | 61/67 kB | 24/168 kB
Progress (5): 322/379 kB | 0.1/2.6 MB | 53/521 kB | 65/67 kB | 24/168 kB
Progress (5): 322/379 kB | 0.1/2.6 MB | 57/521 kB | 65/67 kB | 24/168 kB
Progress (5): 326/379 kB | 0.1/2.6 MB | 57/521 kB | 65/67 kB | 24/168 kB
Progress (5): 326/379 kB | 0.1/2.6 MB | 61/521 kB | 65/67 kB | 24/168 kB
Progress (5): 330/379 kB | 0.1/2.6 MB | 61/521 kB | 65/67 kB | 24/168 kB
Progress (5): 330/379 kB | 0.1/2.6 MB | 61/521 kB | 65/67 kB | 24/168 kB
Progress (5): 334/379 kB | 0.1/2.6 MB | 61/521 kB | 65/67 kB | 24/168 kB
Progress (5): 334/379 kB | 0.1/2.6 MB | 65/521 kB | 65/67 kB | 24/168 kB
Progress (5): 334/379 kB | 0.1/2.6 MB | 65/521 kB | 67 kB | 24/168 kB   
Progress (5): 334/379 kB | 0.1/2.6 MB | 65/521 kB | 67 kB | 28/168 kB
Progress (5): 334/379 kB | 0.1/2.6 MB | 66/521 kB | 67 kB | 28/168 kB
Progress (5): 338/379 kB | 0.1/2.6 MB | 66/521 kB | 67 kB | 28/168 kB
Progress (5): 338/379 kB | 0.1/2.6 MB | 66/521 kB | 67 kB | 28/168 kB
Progress (5): 342/379 kB | 0.1/2.6 MB | 66/521 kB | 67 kB | 28/168 kB
Progress (5): 342/379 kB | 0.1/2.6 MB | 70/521 kB | 67 kB | 28/168 kB
Progress (5): 346/379 kB | 0.1/2.6 MB | 70/521 kB | 67 kB | 28/168 kB
Progress (5): 346/379 kB | 0.1/2.6 MB | 70/521 kB | 67 kB | 32/168 kB
Progress (5): 350/379 kB | 0.1/2.6 MB | 70/521 kB | 67 kB | 32/168 kB
Progress (5): 350/379 kB | 0.1/2.6 MB | 74/521 kB | 67 kB | 32/168 kB
Progress (5): 354/379 kB | 0.1/2.6 MB | 74/521 kB | 67 kB | 32/168 kB
Progress (5): 354/379 kB | 0.1/2.6 MB | 74/521 kB | 67 kB | 32/168 kB
Progress (5): 358/379 kB | 0.1/2.6 MB | 74/521 kB | 67 kB | 32/168 kB
Progress (5): 358/379 kB | 0.1/2.6 MB | 78/521 kB | 67 kB | 32/168 kB
Progress (5): 358/379 kB | 0.1/2.6 MB | 78/521 kB | 67 kB | 33/168 kB
Progress (5): 358/379 kB | 0.1/2.6 MB | 82/521 kB | 67 kB | 33/168 kB
Progress (5): 362/379 kB | 0.1/2.6 MB | 82/521 kB | 67 kB | 33/168 kB
Progress (5): 362/379 kB | 0.1/2.6 MB | 82/521 kB | 67 kB | 33/168 kB
Progress (5): 366/379 kB | 0.1/2.6 MB | 82/521 kB | 67 kB | 33/168 kB
Progress (5): 366/379 kB | 0.1/2.6 MB | 86/521 kB | 67 kB | 33/168 kB
Progress (5): 366/379 kB | 0.1/2.6 MB | 86/521 kB | 67 kB | 37/168 kB
Progress (5): 366/379 kB | 0.1/2.6 MB | 90/521 kB | 67 kB | 37/168 kB
Progress (5): 370/379 kB | 0.1/2.6 MB | 90/521 kB | 67 kB | 37/168 kB
Progress (5): 370/379 kB | 0.1/2.6 MB | 94/521 kB | 67 kB | 37/168 kB
Progress (5): 370/379 kB | 0.1/2.6 MB | 94/521 kB | 67 kB | 37/168 kB
Progress (5): 370/379 kB | 0.1/2.6 MB | 98/521 kB | 67 kB | 37/168 kB
Progress (5): 374/379 kB | 0.1/2.6 MB | 98/521 kB | 67 kB | 37/168 kB
Progress (5): 374/379 kB | 0.1/2.6 MB | 98/521 kB | 67 kB | 41/168 kB
Progress (5): 378/379 kB | 0.1/2.6 MB | 98/521 kB | 67 kB | 41/168 kB
Progress (5): 378/379 kB | 0.1/2.6 MB | 98/521 kB | 67 kB | 41/168 kB
Progress (5): 378/379 kB | 0.1/2.6 MB | 98/521 kB | 67 kB | 41/168 kB
Progress (5): 378/379 kB | 0.1/2.6 MB | 102/521 kB | 67 kB | 41/168 kB
Progress (5): 379 kB | 0.1/2.6 MB | 102/521 kB | 67 kB | 41/168 kB    
Progress (5): 379 kB | 0.1/2.6 MB | 102/521 kB | 67 kB | 45/168 kB
                                                                  
Downloaded from eclipse.maven.central.mirror: https://repo.eclipse.org/content/repositories/maven_central/org/apache/maven/maven-resolver-provider/3.6.2/maven-resolver-provider-3.6.2.jar (67 kB at 229 kB/s)
Progress (4): 379 kB | 0.1/2.6 MB | 106/521 kB | 45/168 kB
Progress (4): 379 kB | 0.1/2.6 MB | 106/521 kB | 45/168 kB
Progress (4): 379 kB | 0.1/2.6 MB | 110/521 kB | 45/168 kB
                                                          
Downloading from eclipse.maven.central.mirror: https://repo.eclipse.org/content/repositories/maven_central/com/google/errorprone/error_prone_annotations/2.1.3/error_prone_annotations-2.1.3.jar
Progress (4): 379 kB | 0.1/2.6 MB | 110/521 kB | 49/168 kB
Progress (4): 379 kB | 0.1/2.6 MB | 114/521 kB | 49/168 kB
Progress (4): 379 kB | 0.1/2.6 MB | 114/521 kB | 53/168 kB
Progress (4): 379 kB | 0.1/2.6 MB | 118/521 kB | 53/168 kB
Progress (4): 379 kB | 0.1/2.6 MB | 118/521 kB | 53/168 kB
Progress (4): 379 kB | 0.1/2.6 MB | 122/521 kB | 53/168 kB
Progress (4): 379 kB | 0.1/2.6 MB | 122/521 kB | 57/168 kB
Progress (4): 379 kB | 0.1/2.6 MB | 126/521 kB | 57/168 kB
Progress (4): 379 kB | 0.1/2.6 MB | 126/521 kB | 61/168 kB
Progress (4): 379 kB | 0.1/2.6 MB | 126/521 kB | 61/168 kB
Progress (4): 379 kB | 0.1/2.6 MB | 126/521 kB | 65/168 kB
Progress (4): 379 kB | 0.1/2.6 MB | 130/521 kB | 65/168 kB
Progress (4): 379 kB | 0.1/2.6 MB | 130/521 kB | 66/168 kB
Progress (4): 379 kB | 0.1/2.6 MB | 130/521 kB | 66/168 kB
Progress (4): 379 kB | 0.1/2.6 MB | 130/521 kB | 70/168 kB
Progress (4): 379 kB | 0.1/2.6 MB | 134/521 kB | 70/168 kB
Progress (4): 379 kB | 0.1/2.6 MB | 134/521 kB | 74/168 kB
Progress (4): 379 kB | 0.1/2.6 MB | 134/521 kB | 74/168 kB
Progress (4): 379 kB | 0.1/2.6 MB | 134/521 kB | 78/168 kB
Progress (4): 379 kB | 0.1/2.6 MB | 138/521 kB | 78/168 kB
Progress (4): 379 kB | 0.1/2.6 MB | 138/521 kB | 82/168 kB
Progress (4): 379 kB | 0.1/2.6 MB | 138/521 kB | 82/168 kB
Progress (4): 379 kB | 0.1/2.6 MB | 142/521 kB | 82/168 kB
Progress (4): 379 kB | 0.1/2.6 MB | 142/521 kB | 82/168 kB
Progress (4): 379 kB | 0.1/2.6 MB | 142/521 kB | 86/168 kB
Progress (4): 379 kB | 0.1/2.6 MB | 146/521 kB | 86/168 kB
Progress (4): 379 kB | 0.1/2.6 MB | 146/521 kB | 90/168 kB
Progress (4): 379 kB | 0.1/2.6 MB | 150/521 kB | 90/168 kB
Progress (4): 379 kB | 0.1/2.6 MB | 150/521 kB | 94/168 kB
Progress (4): 379 kB | 0.1/2.6 MB | 150/521 kB | 94/168 kB
Progress (4): 379 kB | 0.1/2.6 MB | 150/521 kB | 98/168 kB
Progress (4): 379 kB | 0.1/2.6 MB | 154/521 kB | 98/168 kB
                                                          
Downloaded from eclipse.maven.central.mirror: https://repo.eclipse.org/content/repositories/maven_central/org/eclipse/sisu/org.eclipse.sisu.inject/0.3.3/org.eclipse.sisu.inject-0.3.3.jar (379 kB at 1.3 MB/s)
Progress (3): 0.1/2.6 MB | 158/521 kB | 98/168 kB
Progress (3): 0.1/2.6 MB | 158/521 kB | 102/168 kB
Progress (3): 0.1/2.6 MB | 158/521 kB | 102/168 kB
Progress (3): 0.1/2.6 MB | 158/521 kB | 106/168 kB
Progress (3): 0.1/2.6 MB | 162/521 kB | 106/168 kB
                                                  
Downloading from eclipse.maven.central.mirror: https://repo.eclipse.org/content/repositories/maven_central/com/google/j2objc/j2objc-annotations/1.1/j2objc-annotations-1.1.jar
Progress (3): 0.1/2.6 MB | 166/521 kB | 106/168 kB
Progress (3): 0.1/2.6 MB | 166/521 kB | 110/168 kB
Progress (3): 0.2/2.6 MB | 166/521 kB | 110/168 kB
Progress (3): 0.2/2.6 MB | 166/521 kB | 114/168 kB
Progress (3): 0.2/2.6 MB | 170/521 kB | 114/168 kB
Progress (3): 0.2/2.6 MB | 170/521 kB | 114/168 kB
Progress (3): 0.2/2.6 MB | 170/521 kB | 118/168 kB
Progress (4): 0.2/2.6 MB | 170/521 kB | 118/168 kB | 4.1/14 kB
Progress (4): 0.2/2.6 MB | 174/521 kB | 118/168 kB | 4.1/14 kB
Progress (4): 0.2/2.6 MB | 174/521 kB | 118/168 kB | 7.7/14 kB
Progress (4): 0.2/2.6 MB | 174/521 kB | 122/168 kB | 7.7/14 kB
Progress (4): 0.2/2.6 MB | 174/521 kB | 122/168 kB | 7.7/14 kB
Progress (4): 0.2/2.6 MB | 174/521 kB | 126/168 kB | 7.7/14 kB
Progress (4): 0.2/2.6 MB | 174/521 kB | 126/168 kB | 12/14 kB 
Progress (4): 0.2/2.6 MB | 178/521 kB | 126/168 kB | 12/14 kB
Progress (4): 0.2/2.6 MB | 178/521 kB | 126/168 kB | 14 kB   
Progress (4): 0.2/2.6 MB | 178/521 kB | 130/168 kB | 14 kB
Progress (4): 0.2/2.6 MB | 178/521 kB | 130/168 kB | 14 kB
Progress (4): 0.2/2.6 MB | 178/521 kB | 134/168 kB | 14 kB
Progress (4): 0.2/2.6 MB | 182/521 kB | 134/168 kB | 14 kB
Progress (4): 0.2/2.6 MB | 182/521 kB | 138/168 kB | 14 kB
Progress (4): 0.2/2.6 MB | 182/521 kB | 138/168 kB | 14 kB
Progress (4): 0.2/2.6 MB | 182/521 kB | 142/168 kB | 14 kB
Progress (4): 0.2/2.6 MB | 186/521 kB | 142/168 kB | 14 kB
Progress (4): 0.2/2.6 MB | 186/521 kB | 146/168 kB | 14 kB
Progress (4): 0.2/2.6 MB | 186/521 kB | 146/168 kB | 14 kB
Progress (4): 0.2/2.6 MB | 190/521 kB | 146/168 kB | 14 kB
Progress (4): 0.2/2.6 MB | 190/521 kB | 146/168 kB | 14 kB
Progress (4): 0.2/2.6 MB | 190/521 kB | 150/168 kB | 14 kB
Progress (4): 0.2/2.6 MB | 194/521 kB | 150/168 kB | 14 kB
Progress (4): 0.2/2.6 MB | 194/521 kB | 154/168 kB | 14 kB
Progress (4): 0.2/2.6 MB | 194/521 kB | 154/168 kB | 14 kB
Progress (4): 0.2/2.6 MB | 194/521 kB | 158/168 kB | 14 kB
Progress (4): 0.2/2.6 MB | 198/521 kB | 158/168 kB | 14 kB
Progress (4): 0.2/2.6 MB | 198/521 kB | 162/168 kB | 14 kB
Progress (4): 0.2/2.6 MB | 198/521 kB | 162/168 kB | 14 kB
Progress (4): 0.2/2.6 MB | 198/521 kB | 166/168 kB | 14 kB
Progress (4): 0.2/2.6 MB | 202/521 kB | 166/168 kB | 14 kB
Progress (4): 0.2/2.6 MB | 202/521 kB | 168 kB | 14 kB    
Progress (4): 0.2/2.6 MB | 206/521 kB | 168 kB | 14 kB
Progress (4): 0.2/2.6 MB | 210/521 kB | 168 kB | 14 kB
Progress (4): 0.2/2.6 MB | 214/521 kB | 168 kB | 14 kB
Progress (4): 0.2/2.6 MB | 218/521 kB | 168 kB | 14 kB
Progress (4): 0.2/2.6 MB | 222/521 kB | 168 kB | 14 kB
Progress (4): 0.2/2.6 MB | 226/521 kB | 168 kB | 14 kB
Progress (4): 0.2/2.6 MB | 230/521 kB | 168 kB | 14 kB
Progress (4): 0.2/2.6 MB | 230/521 kB | 168 kB | 14 kB
Progress (4): 0.2/2.6 MB | 234/521 kB | 168 kB | 14 kB
Progress (4): 0.2/2.6 MB | 234/521 kB | 168 kB | 14 kB
Progress (4): 0.2/2.6 MB | 238/521 kB | 168 kB | 14 kB
Progress (4): 0.2/2.6 MB | 238/521 kB | 168 kB | 14 kB
Progress (4): 0.2/2.6 MB | 242/521 kB | 168 kB | 14 kB
Progress (4): 0.2/2.6 MB | 242/521 kB | 168 kB | 14 kB
Progress (4): 0.2/2.6 MB | 242/521 kB | 168 kB | 14 kB
Progress (4): 0.2/2.6 MB | 246/521 kB | 168 kB | 14 kB
Progress (4): 0.2/2.6 MB | 246/521 kB | 168 kB | 14 kB
Progress (4): 0.2/2.6 MB | 250/521 kB | 168 kB | 14 kB
Progress (4): 0.2/2.6 MB | 250/521 kB | 168 kB | 14 kB
Progress (4): 0.2/2.6 MB | 254/521 kB | 168 kB | 14 kB
Progress (4): 0.2/2.6 MB | 254/521 kB | 168 kB | 14 kB
Progress (4): 0.2/2.6 MB | 258/521 kB | 168 kB | 14 kB
Progress (4): 0.2/2.6 MB | 258/521 kB | 168 kB | 14 kB
Progress (4): 0.2/2.6 MB | 262/521 kB | 168 kB | 14 kB
Progress (4): 0.2/2.6 MB | 262/521 kB | 168 kB | 14 kB
Progress (4): 0.2/2.6 MB | 266/521 kB | 168 kB | 14 kB
Progress (4): 0.2/2.6 MB | 266/521 kB | 168 kB | 14 kB
Progress (4): 0.2/2.6 MB | 270/521 kB | 168 kB | 14 kB
Progress (4): 0.2/2.6 MB | 270/521 kB | 168 kB | 14 kB
Progress (4): 0.2/2.6 MB | 274/521 kB | 168 kB | 14 kB
Progress (4): 0.2/2.6 MB | 274/521 kB | 168 kB | 14 kB
Progress (4): 0.2/2.6 MB | 278/521 kB | 168 kB | 14 kB
Progress (4): 0.2/2.6 MB | 278/521 kB | 168 kB | 14 kB
Progress (4): 0.2/2.6 MB | 282/521 kB | 168 kB | 14 kB
Progress (4): 0.2/2.6 MB | 282/521 kB | 168 kB | 14 kB
Progress (4): 0.2/2.6 MB | 286/521 kB | 168 kB | 14 kB
Progress (4): 0.2/2.6 MB | 286/521 kB | 168 kB | 14 kB
Progress (4): 0.2/2.6 MB | 290/521 kB | 168 kB | 14 kB
Progress (4): 0.2/2.6 MB | 290/521 kB | 168 kB | 14 kB
Progress (4): 0.2/2.6 MB | 294/521 kB | 168 kB | 14 kB
Progress (4): 0.2/2.6 MB | 294/521 kB | 168 kB | 14 kB
Progress (4): 0.2/2.6 MB | 298/521 kB | 168 kB | 14 kB
Progress (4): 0.2/2.6 MB | 298/521 kB | 168 kB | 14 kB
Progress (4): 0.2/2.6 MB | 302/521 kB | 168 kB | 14 kB
Progress (4): 0.3/2.6 MB | 302/521 kB | 168 kB | 14 kB
Progress (4): 0.3/2.6 MB | 306/521 kB | 168 kB | 14 kB
Progress (4): 0.3/2.6 MB | 306/521 kB | 168 kB | 14 kB
Progress (4): 0.3/2.6 MB | 310/521 kB | 168 kB | 14 kB
Progress (4): 0.3/2.6 MB | 310/521 kB | 168 kB | 14 kB
                                                      
Downloaded from eclipse.maven.central.mirror: https://repo.eclipse.org/content/repositories/maven_central/org/apache/maven/resolver/maven-resolver-util/1.4.1/maven-resolver-util-1.4.1.jar (168 kB at 444 kB/s)
Downloading from eclipse.maven.central.mirror: https://repo.eclipse.org/content/repositories/maven_central/org/codehaus/mojo/animal-sniffer-annotations/1.14/animal-sniffer-annotations-1.14.jar
Progress (3): 0.3/2.6 MB | 310/521 kB | 14 kB
Progress (3): 0.3/2.6 MB | 314/521 kB | 14 kB
Progress (3): 0.3/2.6 MB | 314/521 kB | 14 kB
Progress (3): 0.3/2.6 MB | 318/521 kB | 14 kB
Progress (3): 0.3/2.6 MB | 318/521 kB | 14 kB
Progress (3): 0.3/2.6 MB | 322/521 kB | 14 kB
Progress (3): 0.3/2.6 MB | 322/521 kB | 14 kB
Progress (3): 0.3/2.6 MB | 326/521 kB | 14 kB
Progress (3): 0.3/2.6 MB | 326/521 kB | 14 kB
Progress (3): 0.3/2.6 MB | 330/521 kB | 14 kB
Progress (3): 0.3/2.6 MB | 330/521 kB | 14 kB
Progress (3): 0.3/2.6 MB | 334/521 kB | 14 kB
Progress (3): 0.3/2.6 MB | 334/521 kB | 14 kB
Progress (3): 0.3/2.6 MB | 338/521 kB | 14 kB
Progress (3): 0.3/2.6 MB | 338/521 kB | 14 kB
Progress (3): 0.3/2.6 MB | 342/521 kB | 14 kB
Progress (3): 0.3/2.6 MB | 342/521 kB | 14 kB
Progress (3): 0.3/2.6 MB | 346/521 kB | 14 kB
Progress (3): 0.3/2.6 MB | 346/521 kB | 14 kB
Progress (3): 0.3/2.6 MB | 350/521 kB | 14 kB
Progress (3): 0.3/2.6 MB | 350/521 kB | 14 kB
Progress (3): 0.3/2.6 MB | 354/521 kB | 14 kB
Progress (3): 0.3/2.6 MB | 354/521 kB | 14 kB
Progress (3): 0.3/2.6 MB | 358/521 kB | 14 kB
Progress (3): 0.3/2.6 MB | 358/521 kB | 14 kB
Progress (3): 0.3/2.6 MB | 362/521 kB | 14 kB
Progress (3): 0.3/2.6 MB | 362/521 kB | 14 kB
Progress (3): 0.3/2.6 MB | 366/521 kB | 14 kB
Progress (3): 0.3/2.6 MB | 366/521 kB | 14 kB
Progress (3): 0.3/2.6 MB | 370/521 kB | 14 kB
Progress (3): 0.3/2.6 MB | 370/521 kB | 14 kB
Progress (3): 0.3/2.6 MB | 374/521 kB | 14 kB
Progress (3): 0.3/2.6 MB | 374/521 kB | 14 kB
Progress (3): 0.3/2.6 MB | 378/521 kB | 14 kB
Progress (3): 0.3/2.6 MB | 378/521 kB | 14 kB
Progress (3): 0.3/2.6 MB | 382/521 kB | 14 kB
Progress (3): 0.3/2.6 MB | 382/521 kB | 14 kB
Progress (3): 0.3/2.6 MB | 386/521 kB | 14 kB
Progress (3): 0.3/2.6 MB | 386/521 kB | 14 kB
Progress (3): 0.3/2.6 MB | 390/521 kB | 14 kB
Progress (3): 0.3/2.6 MB | 390/521 kB | 14 kB
Progress (3): 0.3/2.6 MB | 394/521 kB | 14 kB
Progress (3): 0.3/2.6 MB | 394/521 kB | 14 kB
Progress (3): 0.3/2.6 MB | 398/521 kB | 14 kB
Progress (3): 0.3/2.6 MB | 398/521 kB | 14 kB
Progress (3): 0.3/2.6 MB | 402/521 kB | 14 kB
Progress (3): 0.3/2.6 MB | 402/521 kB | 14 kB
Progress (3): 0.3/2.6 MB | 406/521 kB | 14 kB
Progress (3): 0.4/2.6 MB | 406/521 kB | 14 kB
Progress (3): 0.4/2.6 MB | 410/521 kB | 14 kB
Progress (3): 0.4/2.6 MB | 410/521 kB | 14 kB
Progress (3): 0.4/2.6 MB | 414/521 kB | 14 kB
Progress (3): 0.4/2.6 MB | 414/521 kB | 14 kB
Progress (3): 0.4/2.6 MB | 418/521 kB | 14 kB
Progress (3): 0.4/2.6 MB | 418/521 kB | 14 kB
Progress (3): 0.4/2.6 MB | 422/521 kB | 14 kB
Progress (3): 0.4/2.6 MB | 426/521 kB | 14 kB
Progress (3): 0.4/2.6 MB | 426/521 kB | 14 kB
Progress (3): 0.4/2.6 MB | 430/521 kB | 14 kB
Progress (3): 0.4/2.6 MB | 430/521 kB | 14 kB
Progress (3): 0.4/2.6 MB | 434/521 kB | 14 kB
Progress (3): 0.4/2.6 MB | 434/521 kB | 14 kB
Progress (3): 0.4/2.6 MB | 438/521 kB | 14 kB
Progress (3): 0.4/2.6 MB | 438/521 kB | 14 kB
Progress (3): 0.4/2.6 MB | 442/521 kB | 14 kB
Progress (3): 0.4/2.6 MB | 442/521 kB | 14 kB
Progress (3): 0.4/2.6 MB | 446/521 kB | 14 kB
Progress (3): 0.4/2.6 MB | 446/521 kB | 14 kB
Progress (3): 0.4/2.6 MB | 450/521 kB | 14 kB
Progress (3): 0.4/2.6 MB | 450/521 kB | 14 kB
Progress (3): 0.4/2.6 MB | 454/521 kB | 14 kB
Progress (4): 0.4/2.6 MB | 454/521 kB | 14 kB | 3.5 kB
Progress (4): 0.4/2.6 MB | 458/521 kB | 14 kB | 3.5 kB
Progress (4): 0.4/2.6 MB | 458/521 kB | 14 kB | 3.5 kB
Progress (4): 0.4/2.6 MB | 462/521 kB | 14 kB | 3.5 kB
Progress (4): 0.4/2.6 MB | 466/521 kB | 14 kB | 3.5 kB
Progress (4): 0.4/2.6 MB | 466/521 kB | 14 kB | 3.5 kB
Progress (4): 0.4/2.6 MB | 470/521 kB | 14 kB | 3.5 kB
Progress (4): 0.4/2.6 MB | 470/521 kB | 14 kB | 3.5 kB
Progress (4): 0.4/2.6 MB | 474/521 kB | 14 kB | 3.5 kB
Progress (4): 0.4/2.6 MB | 474/521 kB | 14 kB | 3.5 kB
Progress (4): 0.4/2.6 MB | 478/521 kB | 14 kB | 3.5 kB
Progress (4): 0.4/2.6 MB | 478/521 kB | 14 kB | 3.5 kB
Progress (4): 0.4/2.6 MB | 482/521 kB | 14 kB | 3.5 kB
Progress (4): 0.4/2.6 MB | 482/521 kB | 14 kB | 3.5 kB
Progress (4): 0.4/2.6 MB | 486/521 kB | 14 kB | 3.5 kB
Progress (4): 0.4/2.6 MB | 486/521 kB | 14 kB | 3.5 kB
Progress (4): 0.4/2.6 MB | 490/521 kB | 14 kB | 3.5 kB
Progress (4): 0.4/2.6 MB | 490/521 kB | 14 kB | 3.5 kB
Progress (4): 0.4/2.6 MB | 494/521 kB | 14 kB | 3.5 kB
Progress (4): 0.4/2.6 MB | 494/521 kB | 14 kB | 3.5 kB
Progress (4): 0.4/2.6 MB | 498/521 kB | 14 kB | 3.5 kB
Progress (4): 0.4/2.6 MB | 498/521 kB | 14 kB | 3.5 kB
Progress (4): 0.4/2.6 MB | 502/521 kB | 14 kB | 3.5 kB
Progress (4): 0.4/2.6 MB | 502/521 kB | 14 kB | 3.5 kB
Progress (4): 0.4/2.6 MB | 506/521 kB | 14 kB | 3.5 kB
Progress (4): 0.4/2.6 MB | 506/521 kB | 14 kB | 3.5 kB
Progress (4): 0.4/2.6 MB | 510/521 kB | 14 kB | 3.5 kB
Progress (4): 0.4/2.6 MB | 510/521 kB | 14 kB | 3.5 kB
Progress (4): 0.4/2.6 MB | 514/521 kB | 14 kB | 3.5 kB
Progress (4): 0.4/2.6 MB | 514/521 kB | 14 kB | 3.5 kB
Progress (4): 0.4/2.6 MB | 518/521 kB | 14 kB | 3.5 kB
Progress (4): 0.4/2.6 MB | 518/521 kB | 14 kB | 3.5 kB
Progress (4): 0.4/2.6 MB | 521 kB | 14 kB | 3.5 kB    
Progress (4): 0.5/2.6 MB | 521 kB | 14 kB | 3.5 kB
Progress (4): 0.5/2.6 MB | 521 kB | 14 kB | 3.5 kB
Progress (4): 0.5/2.6 MB | 521 kB | 14 kB | 3.5 kB
                                                  
Downloaded from eclipse.maven.central.mirror: https://repo.eclipse.org/content/repositories/maven_central/org/codehaus/mojo/animal-sniffer-annotations/1.14/animal-sniffer-annotations-1.14.jar (3.5 kB at 8.8 kB/s)
Progress (3): 0.5/2.6 MB | 521 kB | 14 kB
                                         
Downloading from eclipse.maven.central.mirror: https://repo.eclipse.org/content/repositories/maven_central/org/codehaus/plexus/plexus-utils/3.2.1/plexus-utils-3.2.1.jar
Progress (3): 0.5/2.6 MB | 521 kB | 14 kB
Progress (3): 0.5/2.6 MB | 521 kB | 14 kB
Progress (3): 0.5/2.6 MB | 521 kB | 14 kB
Progress (3): 0.5/2.6 MB | 521 kB | 14 kB
Progress (3): 0.5/2.6 MB | 521 kB | 14 kB
Progress (3): 0.5/2.6 MB | 521 kB | 14 kB
Progress (3): 0.5/2.6 MB | 521 kB | 14 kB
Progress (3): 0.5/2.6 MB | 521 kB | 14 kB
Progress (3): 0.5/2.6 MB | 521 kB | 14 kB
Progress (3): 0.5/2.6 MB | 521 kB | 14 kB
Progress (3): 0.5/2.6 MB | 521 kB | 14 kB
Progress (3): 0.5/2.6 MB | 521 kB | 14 kB
Progress (3): 0.5/2.6 MB | 521 kB | 14 kB
Progress (3): 0.5/2.6 MB | 521 kB | 14 kB
Progress (3): 0.5/2.6 MB | 521 kB | 14 kB
Progress (3): 0.5/2.6 MB | 521 kB | 14 kB
Progress (3): 0.5/2.6 MB | 521 kB | 14 kB
Progress (3): 0.5/2.6 MB | 521 kB | 14 kB
Progress (3): 0.5/2.6 MB | 521 kB | 14 kB
Progress (3): 0.5/2.6 MB | 521 kB | 14 kB
Progress (3): 0.5/2.6 MB | 521 kB | 14 kB
Progress (3): 0.6/2.6 MB | 521 kB | 14 kB
Progress (3): 0.6/2.6 MB | 521 kB | 14 kB
Progress (3): 0.6/2.6 MB | 521 kB | 14 kB
Progress (3): 0.6/2.6 MB | 521 kB | 14 kB
Progress (3): 0.6/2.6 MB | 521 kB | 14 kB
Progress (3): 0.6/2.6 MB | 521 kB | 14 kB
Progress (3): 0.6/2.6 MB | 521 kB | 14 kB
Progress (3): 0.6/2.6 MB | 521 kB | 14 kB
Progress (3): 0.6/2.6 MB | 521 kB | 14 kB
Progress (3): 0.6/2.6 MB | 521 kB | 14 kB
Progress (3): 0.6/2.6 MB | 521 kB | 14 kB
Progress (3): 0.6/2.6 MB | 521 kB | 14 kB
Progress (3): 0.6/2.6 MB | 521 kB | 14 kB
Progress (3): 0.6/2.6 MB | 521 kB | 14 kB
Progress (3): 0.6/2.6 MB | 521 kB | 14 kB
Progress (3): 0.6/2.6 MB | 521 kB | 14 kB
Progress (3): 0.6/2.6 MB | 521 kB | 14 kB
Progress (3): 0.6/2.6 MB | 521 kB | 14 kB
                                         
Downloaded from eclipse.maven.central.mirror: https://repo.eclipse.org/content/repositories/maven_central/com/google/inject/guice/4.2.1/guice-4.2.1-no_aop.jar (521 kB at 1.3 MB/s)
Progress (2): 0.6/2.6 MB | 14 kB
                                
Downloading from eclipse.maven.central.mirror: https://repo.eclipse.org/content/repositories/maven_central/org/codehaus/plexus/plexus-classworlds/2.6.0/plexus-classworlds-2.6.0.jar
Progress (2): 0.6/2.6 MB | 14 kB
Progress (2): 0.6/2.6 MB | 14 kB
Progress (2): 0.6/2.6 MB | 14 kB
Progress (2): 0.6/2.6 MB | 14 kB
Progress (3): 0.6/2.6 MB | 14 kB | 4.1/262 kB
Progress (3): 0.6/2.6 MB | 14 kB | 4.1/262 kB
Progress (3): 0.6/2.6 MB | 14 kB | 7.7/262 kB
Progress (3): 0.6/2.6 MB | 14 kB | 7.7/262 kB
Progress (3): 0.6/2.6 MB | 14 kB | 12/262 kB 
Progress (3): 0.7/2.6 MB | 14 kB | 12/262 kB
Progress (3): 0.7/2.6 MB | 14 kB | 16/262 kB
Progress (3): 0.7/2.6 MB | 14 kB | 16/262 kB
Progress (3): 0.7/2.6 MB | 14 kB | 20/262 kB
Progress (3): 0.7/2.6 MB | 14 kB | 20/262 kB
Progress (3): 0.7/2.6 MB | 14 kB | 24/262 kB
Progress (3): 0.7/2.6 MB | 14 kB | 24/262 kB
Progress (3): 0.7/2.6 MB | 14 kB | 24/262 kB
Progress (3): 0.7/2.6 MB | 14 kB | 24/262 kB
Progress (3): 0.7/2.6 MB | 14 kB | 28/262 kB
Progress (3): 0.7/2.6 MB | 14 kB | 28/262 kB
Progress (3): 0.7/2.6 MB | 14 kB | 32/262 kB
Progress (3): 0.7/2.6 MB | 14 kB | 32/262 kB
Progress (3): 0.7/2.6 MB | 14 kB | 33/262 kB
Progress (3): 0.7/2.6 MB | 14 kB | 33/262 kB
Progress (3): 0.7/2.6 MB | 14 kB | 33/262 kB
Progress (3): 0.7/2.6 MB | 14 kB | 37/262 kB
Progress (3): 0.7/2.6 MB | 14 kB | 41/262 kB
Progress (3): 0.7/2.6 MB | 14 kB | 41/262 kB
Progress (4): 0.7/2.6 MB | 14 kB | 41/262 kB | 4.1/53 kB
Progress (4): 0.7/2.6 MB | 14 kB | 45/262 kB | 4.1/53 kB
Progress (4): 0.7/2.6 MB | 14 kB | 45/262 kB | 4.1/53 kB
Progress (4): 0.7/2.6 MB | 14 kB | 49/262 kB | 4.1/53 kB
Progress (4): 0.7/2.6 MB | 14 kB | 49/262 kB | 7.7/53 kB
Progress (4): 0.7/2.6 MB | 14 kB | 49/262 kB | 7.7/53 kB
Progress (4): 0.7/2.6 MB | 14 kB | 53/262 kB | 7.7/53 kB
Progress (4): 0.7/2.6 MB | 14 kB | 53/262 kB | 7.7/53 kB
Progress (4): 0.7/2.6 MB | 14 kB | 53/262 kB | 12/53 kB 
Progress (4): 0.7/2.6 MB | 14 kB | 57/262 kB | 12/53 kB
Progress (4): 0.7/2.6 MB | 14 kB | 57/262 kB | 16/53 kB
Progress (4): 0.7/2.6 MB | 14 kB | 57/262 kB | 16/53 kB
Progress (4): 0.7/2.6 MB | 14 kB | 61/262 kB | 16/53 kB
Progress (4): 0.7/2.6 MB | 14 kB | 61/262 kB | 16/53 kB
Progress (4): 0.7/2.6 MB | 14 kB | 61/262 kB | 20/53 kB
Progress (4): 0.7/2.6 MB | 14 kB | 65/262 kB | 20/53 kB
Progress (4): 0.7/2.6 MB | 14 kB | 65/262 kB | 24/53 kB
Progress (4): 0.7/2.6 MB | 14 kB | 65/262 kB | 24/53 kB
Progress (4): 0.7/2.6 MB | 14 kB | 66/262 kB | 24/53 kB
Progress (4): 0.7/2.6 MB | 14 kB | 66/262 kB | 24/53 kB
Progress (4): 0.7/2.6 MB | 14 kB | 66/262 kB | 28/53 kB
Progress (4): 0.7/2.6 MB | 14 kB | 70/262 kB | 28/53 kB
Progress (4): 0.7/2.6 MB | 14 kB | 70/262 kB | 32/53 kB
Progress (4): 0.7/2.6 MB | 14 kB | 70/262 kB | 32/53 kB
Progress (4): 0.7/2.6 MB | 14 kB | 70/262 kB | 33/53 kB
Progress (4): 0.7/2.6 MB | 14 kB | 74/262 kB | 33/53 kB
Progress (4): 0.7/2.6 MB | 14 kB | 74/262 kB | 37/53 kB
Progress (4): 0.7/2.6 MB | 14 kB | 74/262 kB | 37/53 kB
Progress (4): 0.7/2.6 MB | 14 kB | 78/262 kB | 37/53 kB
Progress (4): 0.7/2.6 MB | 14 kB | 78/262 kB | 41/53 kB
Progress (4): 0.7/2.6 MB | 14 kB | 82/262 kB | 41/53 kB
Progress (4): 0.7/2.6 MB | 14 kB | 82/262 kB | 41/53 kB
Progress (4): 0.7/2.6 MB | 14 kB | 82/262 kB | 45/53 kB
Progress (4): 0.7/2.6 MB | 14 kB | 86/262 kB | 45/53 kB
Progress (4): 0.7/2.6 MB | 14 kB | 86/262 kB | 45/53 kB
Progress (4): 0.7/2.6 MB | 14 kB | 90/262 kB | 45/53 kB
Progress (4): 0.7/2.6 MB | 14 kB | 90/262 kB | 49/53 kB
Progress (4): 0.7/2.6 MB | 14 kB | 90/262 kB | 49/53 kB
Progress (4): 0.7/2.6 MB | 14 kB | 94/262 kB | 49/53 kB
Progress (4): 0.7/2.6 MB | 14 kB | 94/262 kB | 49/53 kB
Progress (4): 0.7/2.6 MB | 14 kB | 94/262 kB | 53/53 kB
Progress (4): 0.7/2.6 MB | 14 kB | 98/262 kB | 53/53 kB
Progress (4): 0.7/2.6 MB | 14 kB | 98/262 kB | 53/53 kB
Progress (4): 0.7/2.6 MB | 14 kB | 98/262 kB | 53 kB   
Progress (4): 0.8/2.6 MB | 14 kB | 98/262 kB | 53 kB
Progress (4): 0.8/2.6 MB | 14 kB | 98/262 kB | 53 kB
Progress (4): 0.8/2.6 MB | 14 kB | 98/262 kB | 53 kB
Progress (4): 0.8/2.6 MB | 14 kB | 98/262 kB | 53 kB
Progress (4): 0.8/2.6 MB | 14 kB | 102/262 kB | 53 kB
Progress (4): 0.8/2.6 MB | 14 kB | 102/262 kB | 53 kB
Progress (4): 0.8/2.6 MB | 14 kB | 106/262 kB | 53 kB
Progress (4): 0.8/2.6 MB | 14 kB | 106/262 kB | 53 kB
Progress (4): 0.8/2.6 MB | 14 kB | 110/262 kB | 53 kB
Progress (4): 0.8/2.6 MB | 14 kB | 110/262 kB | 53 kB
Progress (4): 0.8/2.6 MB | 14 kB | 114/262 kB | 53 kB
Progress (4): 0.8/2.6 MB | 14 kB | 114/262 kB | 53 kB
Progress (4): 0.8/2.6 MB | 14 kB | 118/262 kB | 53 kB
Progress (4): 0.8/2.6 MB | 14 kB | 118/262 kB | 53 kB
Progress (4): 0.8/2.6 MB | 14 kB | 122/262 kB | 53 kB
Progress (4): 0.8/2.6 MB | 14 kB | 122/262 kB | 53 kB
Progress (4): 0.8/2.6 MB | 14 kB | 126/262 kB | 53 kB
Progress (4): 0.8/2.6 MB | 14 kB | 126/262 kB | 53 kB
Progress (4): 0.8/2.6 MB | 14 kB | 130/262 kB | 53 kB
Progress (4): 0.8/2.6 MB | 14 kB | 130/262 kB | 53 kB
Progress (4): 0.8/2.6 MB | 14 kB | 131/262 kB | 53 kB
Progress (4): 0.8/2.6 MB | 14 kB | 131/262 kB | 53 kB
Progress (4): 0.8/2.6 MB | 14 kB | 131/262 kB | 53 kB
Progress (4): 0.8/2.6 MB | 14 kB | 135/262 kB | 53 kB
Progress (4): 0.8/2.6 MB | 14 kB | 135/262 kB | 53 kB
Progress (4): 0.8/2.6 MB | 14 kB | 139/262 kB | 53 kB
Progress (4): 0.8/2.6 MB | 14 kB | 139/262 kB | 53 kB
Progress (4): 0.8/2.6 MB | 14 kB | 143/262 kB | 53 kB
Progress (4): 0.8/2.6 MB | 14 kB | 143/262 kB | 53 kB
Progress (4): 0.8/2.6 MB | 14 kB | 147/262 kB | 53 kB
Progress (4): 0.8/2.6 MB | 14 kB | 147/262 kB | 53 kB
Progress (4): 0.8/2.6 MB | 14 kB | 151/262 kB | 53 kB
Progress (4): 0.8/2.6 MB | 14 kB | 151/262 kB | 53 kB
Progress (4): 0.8/2.6 MB | 14 kB | 155/262 kB | 53 kB
Progress (4): 0.8/2.6 MB | 14 kB | 155/262 kB | 53 kB
Progress (4): 0.8/2.6 MB | 14 kB | 159/262 kB | 53 kB
Progress (4): 0.8/2.6 MB | 14 kB | 159/262 kB | 53 kB
Progress (4): 0.8/2.6 MB | 14 kB | 163/262 kB | 53 kB
Progress (4): 0.8/2.6 MB | 14 kB | 163/262 kB | 53 kB
Progress (4): 0.8/2.6 MB | 14 kB | 167/262 kB | 53 kB
Progress (4): 0.8/2.6 MB | 14 kB | 167/262 kB | 53 kB
Progress (4): 0.8/2.6 MB | 14 kB | 171/262 kB | 53 kB
Progress (4): 0.8/2.6 MB | 14 kB | 171/262 kB | 53 kB
Progress (4): 0.8/2.6 MB | 14 kB | 175/262 kB | 53 kB
Progress (4): 0.8/2.6 MB | 14 kB | 175/262 kB | 53 kB
Progress (4): 0.8/2.6 MB | 14 kB | 179/262 kB | 53 kB
Progress (4): 0.8/2.6 MB | 14 kB | 179/262 kB | 53 kB
                                                     
Downloaded from eclipse.maven.central.mirror: https://repo.eclipse.org/content/repositories/maven_central/org/codehaus/plexus/plexus-classworlds/2.6.0/plexus-classworlds-2.6.0.jar (53 kB at 109 kB/s)
Progress (3): 0.9/2.6 MB | 14 kB | 179/262 kB
Progress (3): 0.9/2.6 MB | 14 kB | 183/262 kB
Progress (3): 0.9/2.6 MB | 14 kB | 183/262 kB
                                             
Downloading from eclipse.maven.central.mirror: https://repo.eclipse.org/content/repositories/maven_central/org/codehaus/plexus/plexus-component-annotations/2.0.0/plexus-component-annotations-2.0.0.jar
Progress (3): 0.9/2.6 MB | 14 kB | 183/262 kB
Progress (3): 0.9/2.6 MB | 14 kB | 187/262 kB
Progress (3): 0.9/2.6 MB | 14 kB | 187/262 kB
Progress (3): 0.9/2.6 MB | 14 kB | 191/262 kB
Progress (3): 0.9/2.6 MB | 14 kB | 191/262 kB
Progress (3): 0.9/2.6 MB | 14 kB | 195/262 kB
Progress (3): 0.9/2.6 MB | 14 kB | 195/262 kB
Progress (3): 0.9/2.6 MB | 14 kB | 199/262 kB
Progress (3): 0.9/2.6 MB | 14 kB | 199/262 kB
Progress (3): 0.9/2.6 MB | 14 kB | 203/262 kB
Progress (3): 0.9/2.6 MB | 14 kB | 203/262 kB
Progress (3): 0.9/2.6 MB | 14 kB | 207/262 kB
Progress (3): 0.9/2.6 MB | 14 kB | 207/262 kB
Progress (3): 0.9/2.6 MB | 14 kB | 211/262 kB
Progress (3): 0.9/2.6 MB | 14 kB | 211/262 kB
Progress (3): 0.9/2.6 MB | 14 kB | 215/262 kB
Progress (3): 0.9/2.6 MB | 14 kB | 215/262 kB
Progress (3): 0.9/2.6 MB | 14 kB | 219/262 kB
Progress (3): 0.9/2.6 MB | 14 kB | 219/262 kB
Progress (3): 0.9/2.6 MB | 14 kB | 223/262 kB
Progress (3): 0.9/2.6 MB | 14 kB | 223/262 kB
Progress (3): 0.9/2.6 MB | 14 kB | 227/262 kB
Progress (3): 0.9/2.6 MB | 14 kB | 227/262 kB
Progress (3): 0.9/2.6 MB | 14 kB | 231/262 kB
Progress (3): 0.9/2.6 MB | 14 kB | 231/262 kB
Progress (3): 0.9/2.6 MB | 14 kB | 235/262 kB
Progress (3): 0.9/2.6 MB | 14 kB | 235/262 kB
Progress (3): 0.9/2.6 MB | 14 kB | 239/262 kB
Progress (3): 0.9/2.6 MB | 14 kB | 239/262 kB
Progress (3): 0.9/2.6 MB | 14 kB | 243/262 kB
Progress (3): 0.9/2.6 MB | 14 kB | 243/262 kB
Progress (3): 0.9/2.6 MB | 14 kB | 247/262 kB
Progress (3): 0.9/2.6 MB | 14 kB | 247/262 kB
Progress (3): 0.9/2.6 MB | 14 kB | 251/262 kB
Progress (3): 0.9/2.6 MB | 14 kB | 251/262 kB
Progress (3): 0.9/2.6 MB | 14 kB | 255/262 kB
Progress (3): 0.9/2.6 MB | 14 kB | 255/262 kB
Progress (3): 0.9/2.6 MB | 14 kB | 259/262 kB
Progress (3): 0.9/2.6 MB | 14 kB | 259/262 kB
Progress (3): 0.9/2.6 MB | 14 kB | 262 kB    
Progress (3): 0.9/2.6 MB | 14 kB | 262 kB
Progress (3): 0.9/2.6 MB | 14 kB | 262 kB
Progress (3): 0.9/2.6 MB | 14 kB | 262 kB
Progress (3): 1.0/2.6 MB | 14 kB | 262 kB
Progress (3): 1.0/2.6 MB | 14 kB | 262 kB
Progress (3): 1.0/2.6 MB | 14 kB | 262 kB
Progress (3): 1.0/2.6 MB | 14 kB | 262 kB
Progress (3): 1.0/2.6 MB | 14 kB | 262 kB
Progress (3): 1.0/2.6 MB | 14 kB | 262 kB
Progress (3): 1.0/2.6 MB | 14 kB | 262 kB
Progress (3): 1.0/2.6 MB | 14 kB | 262 kB
Progress (3): 1.0/2.6 MB | 14 kB | 262 kB
Progress (3): 1.0/2.6 MB | 14 kB | 262 kB
Progress (3): 1.0/2.6 MB | 14 kB | 262 kB
Progress (3): 1.0/2.6 MB | 14 kB | 262 kB
Progress (3): 1.0/2.6 MB | 14 kB | 262 kB
Progress (3): 1.0/2.6 MB | 14 kB | 262 kB
Progress (3): 1.0/2.6 MB | 14 kB | 262 kB
Progress (3): 1.0/2.6 MB | 14 kB | 262 kB
Progress (3): 1.0/2.6 MB | 14 kB | 262 kB
Progress (3): 1.0/2.6 MB | 14 kB | 262 kB
Progress (3): 1.0/2.6 MB | 14 kB | 262 kB
Progress (3): 1.0/2.6 MB | 14 kB | 262 kB
Progress (3): 1.0/2.6 MB | 14 kB | 262 kB
Progress (3): 1.0/2.6 MB | 14 kB | 262 kB
Progress (3): 1.0/2.6 MB | 14 kB | 262 kB
Progress (3): 1.0/2.6 MB | 14 kB | 262 kB
Progress (3): 1.0/2.6 MB | 14 kB | 262 kB
Progress (3): 1.1/2.6 MB | 14 kB | 262 kB
Progress (3): 1.1/2.6 MB | 14 kB | 262 kB
Progress (3): 1.1/2.6 MB | 14 kB | 262 kB
Progress (3): 1.1/2.6 MB | 14 kB | 262 kB
Progress (3): 1.1/2.6 MB | 14 kB | 262 kB
Progress (3): 1.1/2.6 MB | 14 kB | 262 kB
Progress (3): 1.1/2.6 MB | 14 kB | 262 kB
                                         
Downloaded from eclipse.maven.central.mirror: https://repo.eclipse.org/content/repositories/maven_central/org/codehaus/plexus/plexus-utils/3.2.1/plexus-utils-3.2.1.jar (262 kB at 522 kB/s)
Progress (2): 1.1/2.6 MB | 14 kB
                                
Downloading from eclipse.maven.central.mirror: https://repo.eclipse.org/content/repositories/maven_central/org/apache/commons/commons-lang3/3.8.1/commons-lang3-3.8.1.jar
Progress (2): 1.1/2.6 MB | 14 kB
Progress (3): 1.1/2.6 MB | 14 kB | 4.1/4.2 kB
Progress (3): 1.1/2.6 MB | 14 kB | 4.1/4.2 kB
Progress (3): 1.1/2.6 MB | 14 kB | 4.2 kB    
Progress (3): 1.1/2.6 MB | 14 kB | 4.2 kB
Progress (3): 1.1/2.6 MB | 14 kB | 4.2 kB
Progress (3): 1.1/2.6 MB | 14 kB | 4.2 kB
Progress (3): 1.1/2.6 MB | 14 kB | 4.2 kB
Progress (3): 1.1/2.6 MB | 14 kB | 4.2 kB
Progress (3): 1.1/2.6 MB | 14 kB | 4.2 kB
Progress (3): 1.1/2.6 MB | 14 kB | 4.2 kB
Progress (3): 1.1/2.6 MB | 14 kB | 4.2 kB
Progress (3): 1.1/2.6 MB | 14 kB | 4.2 kB
Progress (3): 1.1/2.6 MB | 14 kB | 4.2 kB
Progress (3): 1.1/2.6 MB | 14 kB | 4.2 kB
Progress (3): 1.1/2.6 MB | 14 kB | 4.2 kB
Progress (3): 1.1/2.6 MB | 14 kB | 4.2 kB
Progress (3): 1.1/2.6 MB | 14 kB | 4.2 kB
Progress (3): 1.1/2.6 MB | 14 kB | 4.2 kB
Progress (3): 1.2/2.6 MB | 14 kB | 4.2 kB
Progress (3): 1.2/2.6 MB | 14 kB | 4.2 kB
Progress (3): 1.2/2.6 MB | 14 kB | 4.2 kB
Progress (3): 1.2/2.6 MB | 14 kB | 4.2 kB
Progress (3): 1.2/2.6 MB | 14 kB | 4.2 kB
Progress (3): 1.2/2.6 MB | 14 kB | 4.2 kB
Progress (3): 1.2/2.6 MB | 14 kB | 4.2 kB
Progress (3): 1.2/2.6 MB | 14 kB | 4.2 kB
Progress (3): 1.2/2.6 MB | 14 kB | 4.2 kB
Progress (3): 1.2/2.6 MB | 14 kB | 4.2 kB
Progress (3): 1.2/2.6 MB | 14 kB | 4.2 kB
Progress (3): 1.2/2.6 MB | 14 kB | 4.2 kB
Progress (3): 1.2/2.6 MB | 14 kB | 4.2 kB
Progress (3): 1.2/2.6 MB | 14 kB | 4.2 kB
Progress (3): 1.2/2.6 MB | 14 kB | 4.2 kB
Progress (3): 1.2/2.6 MB | 14 kB | 4.2 kB
Progress (3): 1.2/2.6 MB | 14 kB | 4.2 kB
Progress (3): 1.2/2.6 MB | 14 kB | 4.2 kB
Progress (3): 1.2/2.6 MB | 14 kB | 4.2 kB
Progress (3): 1.2/2.6 MB | 14 kB | 4.2 kB
Progress (3): 1.2/2.6 MB | 14 kB | 4.2 kB
Progress (3): 1.2/2.6 MB | 14 kB | 4.2 kB
Progress (3): 1.2/2.6 MB | 14 kB | 4.2 kB
Progress (3): 1.2/2.6 MB | 14 kB | 4.2 kB
Progress (3): 1.2/2.6 MB | 14 kB | 4.2 kB
Progress (3): 1.3/2.6 MB | 14 kB | 4.2 kB
Progress (3): 1.3/2.6 MB | 14 kB | 4.2 kB
Progress (3): 1.3/2.6 MB | 14 kB | 4.2 kB
Progress (3): 1.3/2.6 MB | 14 kB | 4.2 kB
Progress (3): 1.3/2.6 MB | 14 kB | 4.2 kB
Progress (3): 1.3/2.6 MB | 14 kB | 4.2 kB
Progress (3): 1.3/2.6 MB | 14 kB | 4.2 kB
Progress (3): 1.3/2.6 MB | 14 kB | 4.2 kB
Progress (3): 1.3/2.6 MB | 14 kB | 4.2 kB
Progress (3): 1.3/2.6 MB | 14 kB | 4.2 kB
Progress (3): 1.3/2.6 MB | 14 kB | 4.2 kB
Progress (3): 1.3/2.6 MB | 14 kB | 4.2 kB
Progress (3): 1.3/2.6 MB | 14 kB | 4.2 kB
Progress (3): 1.3/2.6 MB | 14 kB | 4.2 kB
                                         
Downloaded from eclipse.maven.central.mirror: https://repo.eclipse.org/content/repositories/maven_central/org/codehaus/plexus/plexus-component-annotations/2.0.0/plexus-component-annotations-2.0.0.jar (4.2 kB at 7.4 kB/s)
Downloading from eclipse.maven.central.mirror: https://repo.eclipse.org/content/repositories/maven_central/org/apache/maven/maven-embedder/3.6.2/maven-embedder-3.6.2.jar
Downloaded from eclipse.maven.central.mirror: https://repo.eclipse.org/content/repositories/maven_central/com/google/errorprone/error_prone_annotations/2.1.3/error_prone_annotations-2.1.3.jar (14 kB at 24 kB/s)
Downloading from eclipse.maven.central.mirror: https://repo.eclipse.org/content/repositories/maven_central/org/sonatype/plexus/plexus-sec-dispatcher/1.4/plexus-sec-dispatcher-1.4.jar
Progress (2): 1.3/2.6 MB | 4.1/502 kB
Progress (2): 1.3/2.6 MB | 4.1/502 kB
Progress (3): 1.3/2.6 MB | 4.1/502 kB | 4.1/8.8 kB
Progress (3): 1.3/2.6 MB | 4.1/502 kB | 4.1/8.8 kB
Progress (3): 1.3/2.6 MB | 7.7/502 kB | 4.1/8.8 kB
Progress (3): 1.3/2.6 MB | 7.7/502 kB | 7.7/8.8 kB
Progress (3): 1.3/2.6 MB | 7.7/502 kB | 7.7/8.8 kB
Progress (3): 1.3/2.6 MB | 7.7/502 kB | 8.8 kB    
Progress (3): 1.3/2.6 MB | 12/502 kB | 8.8 kB 
Progress (3): 1.3/2.6 MB | 12/502 kB | 8.8 kB
Progress (3): 1.3/2.6 MB | 16/502 kB | 8.8 kB
Progress (3): 1.3/2.6 MB | 16/502 kB | 8.8 kB
Progress (3): 1.3/2.6 MB | 20/502 kB | 8.8 kB
Progress (3): 1.3/2.6 MB | 20/502 kB | 8.8 kB
Progress (3): 1.3/2.6 MB | 24/502 kB | 8.8 kB
Progress (3): 1.3/2.6 MB | 24/502 kB | 8.8 kB
Progress (3): 1.3/2.6 MB | 28/502 kB | 8.8 kB
Progress (3): 1.3/2.6 MB | 28/502 kB | 8.8 kB
Progress (3): 1.3/2.6 MB | 32/502 kB | 8.8 kB
Progress (3): 1.3/2.6 MB | 33/502 kB | 8.8 kB
Progress (3): 1.3/2.6 MB | 33/502 kB | 8.8 kB
Progress (3): 1.3/2.6 MB | 37/502 kB | 8.8 kB
Progress (3): 1.3/2.6 MB | 37/502 kB | 8.8 kB
Progress (3): 1.3/2.6 MB | 41/502 kB | 8.8 kB
Progress (3): 1.3/2.6 MB | 41/502 kB | 8.8 kB
Progress (3): 1.4/2.6 MB | 41/502 kB | 8.8 kB
Progress (3): 1.4/2.6 MB | 45/502 kB | 8.8 kB
Progress (3): 1.4/2.6 MB | 49/502 kB | 8.8 kB
Progress (3): 1.4/2.6 MB | 49/502 kB | 8.8 kB
Progress (3): 1.4/2.6 MB | 49/502 kB | 8.8 kB
Progress (3): 1.4/2.6 MB | 53/502 kB | 8.8 kB
Progress (3): 1.4/2.6 MB | 53/502 kB | 8.8 kB
Progress (3): 1.4/2.6 MB | 57/502 kB | 8.8 kB
Progress (3): 1.4/2.6 MB | 57/502 kB | 8.8 kB
Progress (3): 1.4/2.6 MB | 61/502 kB | 8.8 kB
Progress (3): 1.4/2.6 MB | 65/502 kB | 8.8 kB
Progress (3): 1.4/2.6 MB | 65/502 kB | 8.8 kB
Progress (3): 1.4/2.6 MB | 66/502 kB | 8.8 kB
Progress (3): 1.4/2.6 MB | 66/502 kB | 8.8 kB
Progress (3): 1.4/2.6 MB | 70/502 kB | 8.8 kB
Progress (3): 1.4/2.6 MB | 70/502 kB | 8.8 kB
Progress (3): 1.4/2.6 MB | 74/502 kB | 8.8 kB
Progress (3): 1.4/2.6 MB | 74/502 kB | 8.8 kB
Progress (3): 1.4/2.6 MB | 78/502 kB | 8.8 kB
Progress (3): 1.4/2.6 MB | 78/502 kB | 8.8 kB
Progress (3): 1.4/2.6 MB | 82/502 kB | 8.8 kB
Progress (3): 1.4/2.6 MB | 82/502 kB | 8.8 kB
Progress (3): 1.4/2.6 MB | 86/502 kB | 8.8 kB
Progress (3): 1.4/2.6 MB | 90/502 kB | 8.8 kB
Progress (3): 1.4/2.6 MB | 90/502 kB | 8.8 kB
Progress (3): 1.4/2.6 MB | 94/502 kB | 8.8 kB
Progress (3): 1.4/2.6 MB | 94/502 kB | 8.8 kB
Progress (3): 1.4/2.6 MB | 98/502 kB | 8.8 kB
Progress (3): 1.4/2.6 MB | 98/502 kB | 8.8 kB
Progress (3): 1.4/2.6 MB | 98/502 kB | 8.8 kB
Progress (3): 1.4/2.6 MB | 98/502 kB | 8.8 kB
Progress (3): 1.4/2.6 MB | 102/502 kB | 8.8 kB
Progress (3): 1.4/2.6 MB | 102/502 kB | 8.8 kB
Progress (3): 1.4/2.6 MB | 106/502 kB | 8.8 kB
Progress (3): 1.4/2.6 MB | 106/502 kB | 8.8 kB
Progress (3): 1.4/2.6 MB | 110/502 kB | 8.8 kB
Progress (3): 1.4/2.6 MB | 110/502 kB | 8.8 kB
Progress (3): 1.4/2.6 MB | 114/502 kB | 8.8 kB
Progress (3): 1.4/2.6 MB | 114/502 kB | 8.8 kB
Progress (3): 1.4/2.6 MB | 118/502 kB | 8.8 kB
Progress (3): 1.4/2.6 MB | 118/502 kB | 8.8 kB
Progress (3): 1.4/2.6 MB | 122/502 kB | 8.8 kB
Progress (3): 1.4/2.6 MB | 122/502 kB | 8.8 kB
Progress (3): 1.4/2.6 MB | 126/502 kB | 8.8 kB
Progress (3): 1.4/2.6 MB | 126/502 kB | 8.8 kB
Progress (3): 1.4/2.6 MB | 130/502 kB | 8.8 kB
Progress (3): 1.4/2.6 MB | 130/502 kB | 8.8 kB
Progress (3): 1.4/2.6 MB | 131/502 kB | 8.8 kB
                                              
Downloaded from eclipse.maven.central.mirror: https://repo.eclipse.org/content/repositories/maven_central/com/google/j2objc/j2objc-annotations/1.1/j2objc-annotations-1.1.jar (8.8 kB at 15 kB/s)
Progress (2): 1.4/2.6 MB | 135/502 kB
Progress (2): 1.4/2.6 MB | 135/502 kB
Progress (2): 1.4/2.6 MB | 139/502 kB
                                     
Downloading from eclipse.maven.central.mirror: https://repo.eclipse.org/content/repositories/maven_central/commons-cli/commons-cli/1.4/commons-cli-1.4.jar
Progress (2): 1.4/2.6 MB | 143/502 kB
Progress (2): 1.4/2.6 MB | 143/502 kB
Progress (2): 1.4/2.6 MB | 147/502 kB
Progress (2): 1.5/2.6 MB | 147/502 kB
Progress (2): 1.5/2.6 MB | 151/502 kB
Progress (2): 1.5/2.6 MB | 151/502 kB
Progress (2): 1.5/2.6 MB | 155/502 kB
Progress (2): 1.5/2.6 MB | 155/502 kB
Progress (3): 1.5/2.6 MB | 155/502 kB | 4.1/28 kB
Progress (3): 1.5/2.6 MB | 159/502 kB | 4.1/28 kB
Progress (3): 1.5/2.6 MB | 159/502 kB | 4.1/28 kB
Progress (3): 1.5/2.6 MB | 163/502 kB | 4.1/28 kB
Progress (3): 1.5/2.6 MB | 163/502 kB | 7.7/28 kB
Progress (3): 1.5/2.6 MB | 163/502 kB | 7.7/28 kB
Progress (3): 1.5/2.6 MB | 167/502 kB | 7.7/28 kB
Progress (4): 1.5/2.6 MB | 167/502 kB | 7.7/28 kB | 4.1/99 kB
Progress (4): 1.5/2.6 MB | 171/502 kB | 7.7/28 kB | 4.1/99 kB
Progress (4): 1.5/2.6 MB | 171/502 kB | 12/28 kB | 4.1/99 kB 
Progress (4): 1.5/2.6 MB | 171/502 kB | 12/28 kB | 4.1/99 kB
Progress (4): 1.5/2.6 MB | 171/502 kB | 16/28 kB | 4.1/99 kB
Progress (4): 1.5/2.6 MB | 175/502 kB | 16/28 kB | 4.1/99 kB
Progress (4): 1.5/2.6 MB | 175/502 kB | 16/28 kB | 7.7/99 kB
Progress (4): 1.5/2.6 MB | 179/502 kB | 16/28 kB | 7.7/99 kB
Progress (4): 1.5/2.6 MB | 179/502 kB | 20/28 kB | 7.7/99 kB
Progress (4): 1.5/2.6 MB | 179/502 kB | 20/28 kB | 7.7/99 kB
Progress (4): 1.5/2.6 MB | 179/502 kB | 24/28 kB | 7.7/99 kB
Progress (4): 1.5/2.6 MB | 183/502 kB | 24/28 kB | 7.7/99 kB
Progress (4): 1.5/2.6 MB | 183/502 kB | 24/28 kB | 12/99 kB 
Progress (4): 1.5/2.6 MB | 187/502 kB | 24/28 kB | 12/99 kB
Progress (4): 1.5/2.6 MB | 187/502 kB | 28 kB | 12/99 kB   
Progress (4): 1.5/2.6 MB | 187/502 kB | 28 kB | 12/99 kB
Progress (4): 1.5/2.6 MB | 191/502 kB | 28 kB | 12/99 kB
Progress (4): 1.5/2.6 MB | 191/502 kB | 28 kB | 16/99 kB
Progress (4): 1.5/2.6 MB | 195/502 kB | 28 kB | 16/99 kB
Progress (4): 1.5/2.6 MB | 195/502 kB | 28 kB | 16/99 kB
Progress (4): 1.5/2.6 MB | 195/502 kB | 28 kB | 20/99 kB
Progress (4): 1.5/2.6 MB | 199/502 kB | 28 kB | 20/99 kB
Progress (4): 1.5/2.6 MB | 199/502 kB | 28 kB | 20/99 kB
Progress (4): 1.5/2.6 MB | 203/502 kB | 28 kB | 20/99 kB
Progress (4): 1.5/2.6 MB | 203/502 kB | 28 kB | 24/99 kB
Progress (4): 1.5/2.6 MB | 203/502 kB | 28 kB | 24/99 kB
Progress (4): 1.5/2.6 MB | 207/502 kB | 28 kB | 24/99 kB
Progress (4): 1.5/2.6 MB | 207/502 kB | 28 kB | 28/99 kB
Progress (4): 1.5/2.6 MB | 207/502 kB | 28 kB | 28/99 kB
Progress (4): 1.5/2.6 MB | 207/502 kB | 28 kB | 32/99 kB
Progress (4): 1.5/2.6 MB | 207/502 kB | 28 kB | 32/99 kB
Progress (4): 1.5/2.6 MB | 211/502 kB | 28 kB | 32/99 kB
Progress (4): 1.5/2.6 MB | 211/502 kB | 28 kB | 32/99 kB
Progress (4): 1.5/2.6 MB | 211/502 kB | 28 kB | 33/99 kB
Progress (4): 1.5/2.6 MB | 215/502 kB | 28 kB | 33/99 kB
Progress (4): 1.5/2.6 MB | 215/502 kB | 28 kB | 33/99 kB
Progress (4): 1.5/2.6 MB | 215/502 kB | 28 kB | 37/99 kB
Progress (4): 1.5/2.6 MB | 219/502 kB | 28 kB | 37/99 kB
Progress (4): 1.5/2.6 MB | 219/502 kB | 28 kB | 41/99 kB
Progress (4): 1.5/2.6 MB | 219/502 kB | 28 kB | 41/99 kB
Progress (4): 1.5/2.6 MB | 223/502 kB | 28 kB | 41/99 kB
Progress (4): 1.5/2.6 MB | 223/502 kB | 28 kB | 45/99 kB
Progress (4): 1.5/2.6 MB | 227/502 kB | 28 kB | 45/99 kB
Progress (4): 1.5/2.6 MB | 227/502 kB | 28 kB | 45/99 kB
Progress (4): 1.5/2.6 MB | 227/502 kB | 28 kB | 49/99 kB
Progress (4): 1.5/2.6 MB | 227/502 kB | 28 kB | 49/99 kB
Progress (4): 1.5/2.6 MB | 231/502 kB | 28 kB | 49/99 kB
Progress (4): 1.5/2.6 MB | 231/502 kB | 28 kB | 53/99 kB
Progress (4): 1.5/2.6 MB | 235/502 kB | 28 kB | 53/99 kB
Progress (4): 1.5/2.6 MB | 235/502 kB | 28 kB | 53/99 kB
Progress (4): 1.5/2.6 MB | 239/502 kB | 28 kB | 53/99 kB
                                                        
Downloaded from eclipse.maven.central.mirror: https://repo.eclipse.org/content/repositories/maven_central/org/sonatype/plexus/plexus-sec-dispatcher/1.4/plexus-sec-dispatcher-1.4.jar (28 kB at 46 kB/s)
Progress (3): 1.5/2.6 MB | 239/502 kB | 57/99 kB
                                                
Downloading from eclipse.maven.central.mirror: https://repo.eclipse.org/content/repositories/maven_central/org/apache/maven/maven-compat/3.6.2/maven-compat-3.6.2.jar
Progress (3): 1.5/2.6 MB | 243/502 kB | 57/99 kB
Progress (3): 1.5/2.6 MB | 243/502 kB | 57/99 kB
Progress (3): 1.5/2.6 MB | 243/502 kB | 61/99 kB
Progress (3): 1.5/2.6 MB | 247/502 kB | 61/99 kB
Progress (3): 1.5/2.6 MB | 247/502 kB | 65/99 kB
Progress (3): 1.5/2.6 MB | 247/502 kB | 65/99 kB
Progress (3): 1.5/2.6 MB | 247/502 kB | 66/99 kB
Progress (4): 1.5/2.6 MB | 247/502 kB | 66/99 kB | 4.1/54 kB
Progress (4): 1.5/2.6 MB | 251/502 kB | 66/99 kB | 4.1/54 kB
Progress (4): 1.5/2.6 MB | 251/502 kB | 66/99 kB | 7.7/54 kB
Progress (4): 1.5/2.6 MB | 251/502 kB | 70/99 kB | 7.7/54 kB
Progress (4): 1.5/2.6 MB | 251/502 kB | 70/99 kB | 7.7/54 kB
Progress (4): 1.5/2.6 MB | 251/502 kB | 70/99 kB | 12/54 kB 
Progress (4): 1.5/2.6 MB | 251/502 kB | 74/99 kB | 12/54 kB
Progress (4): 1.5/2.6 MB | 255/502 kB | 74/99 kB | 12/54 kB
Progress (4): 1.5/2.6 MB | 255/502 kB | 78/99 kB | 12/54 kB
Progress (4): 1.5/2.6 MB | 255/502 kB | 78/99 kB | 16/54 kB
Progress (4): 1.5/2.6 MB | 255/502 kB | 78/99 kB | 16/54 kB
Progress (4): 1.5/2.6 MB | 255/502 kB | 82/99 kB | 16/54 kB
Progress (4): 1.5/2.6 MB | 259/502 kB | 82/99 kB | 16/54 kB
Progress (4): 1.5/2.6 MB | 259/502 kB | 86/99 kB | 16/54 kB
Progress (4): 1.5/2.6 MB | 259/502 kB | 86/99 kB | 20/54 kB
Progress (4): 1.5/2.6 MB | 259/502 kB | 86/99 kB | 20/54 kB
Progress (4): 1.5/2.6 MB | 259/502 kB | 86/99 kB | 24/54 kB
Progress (4): 1.5/2.6 MB | 259/502 kB | 86/99 kB | 24/54 kB
Progress (4): 1.5/2.6 MB | 259/502 kB | 90/99 kB | 24/54 kB
Progress (4): 1.5/2.6 MB | 263/502 kB | 90/99 kB | 24/54 kB
Progress (4): 1.5/2.6 MB | 263/502 kB | 94/99 kB | 24/54 kB
Progress (4): 1.5/2.6 MB | 267/502 kB | 94/99 kB | 24/54 kB
Progress (4): 1.6/2.6 MB | 267/502 kB | 94/99 kB | 24/54 kB
Progress (4): 1.6/2.6 MB | 267/502 kB | 94/99 kB | 28/54 kB
Progress (4): 1.6/2.6 MB | 267/502 kB | 94/99 kB | 28/54 kB
Progress (4): 1.6/2.6 MB | 271/502 kB | 94/99 kB | 28/54 kB
Progress (4): 1.6/2.6 MB | 271/502 kB | 98/99 kB | 28/54 kB
Progress (4): 1.6/2.6 MB | 275/502 kB | 98/99 kB | 28/54 kB
Progress (4): 1.6/2.6 MB | 275/502 kB | 98/99 kB | 28/54 kB
Progress (5): 1.6/2.6 MB | 275/502 kB | 98/99 kB | 28/54 kB | 4.1/291 kB
Progress (5): 1.6/2.6 MB | 275/502 kB | 98/99 kB | 28/54 kB | 7.7/291 kB
Progress (5): 1.6/2.6 MB | 275/502 kB | 98/99 kB | 28/54 kB | 12/291 kB 
Progress (5): 1.6/2.6 MB | 275/502 kB | 98/99 kB | 32/54 kB | 12/291 kB
Progress (5): 1.6/2.6 MB | 275/502 kB | 98/99 kB | 32/54 kB | 16/291 kB
Progress (5): 1.6/2.6 MB | 275/502 kB | 98/99 kB | 32/54 kB | 16/291 kB
Progress (5): 1.6/2.6 MB | 279/502 kB | 98/99 kB | 32/54 kB | 16/291 kB
Progress (5): 1.6/2.6 MB | 279/502 kB | 99 kB | 32/54 kB | 16/291 kB   
Progress (5): 1.6/2.6 MB | 283/502 kB | 99 kB | 32/54 kB | 16/291 kB
Progress (5): 1.6/2.6 MB | 283/502 kB | 99 kB | 32/54 kB | 16/291 kB
Progress (5): 1.6/2.6 MB | 287/502 kB | 99 kB | 32/54 kB | 16/291 kB
Progress (5): 1.6/2.6 MB | 287/502 kB | 99 kB | 32/54 kB | 20/291 kB
Progress (5): 1.6/2.6 MB | 287/502 kB | 99 kB | 33/54 kB | 20/291 kB
Progress (5): 1.6/2.6 MB | 287/502 kB | 99 kB | 33/54 kB | 24/291 kB
Progress (5): 1.6/2.6 MB | 287/502 kB | 99 kB | 37/54 kB | 24/291 kB
Progress (5): 1.6/2.6 MB | 291/502 kB | 99 kB | 37/54 kB | 24/291 kB
Progress (5): 1.6/2.6 MB | 291/502 kB | 99 kB | 37/54 kB | 24/291 kB
Progress (5): 1.6/2.6 MB | 295/502 kB | 99 kB | 37/54 kB | 24/291 kB
Progress (5): 1.6/2.6 MB | 295/502 kB | 99 kB | 41/54 kB | 24/291 kB
Progress (5): 1.6/2.6 MB | 295/502 kB | 99 kB | 41/54 kB | 28/291 kB
Progress (5): 1.6/2.6 MB | 295/502 kB | 99 kB | 45/54 kB | 28/291 kB
Progress (5): 1.6/2.6 MB | 299/502 kB | 99 kB | 45/54 kB | 28/291 kB
Progress (5): 1.6/2.6 MB | 299/502 kB | 99 kB | 45/54 kB | 28/291 kB
Progress (5): 1.6/2.6 MB | 303/502 kB | 99 kB | 45/54 kB | 28/291 kB
Progress (5): 1.6/2.6 MB | 303/502 kB | 99 kB | 49/54 kB | 28/291 kB
Progress (5): 1.6/2.6 MB | 303/502 kB | 99 kB | 49/54 kB | 32/291 kB
Progress (5): 1.6/2.6 MB | 303/502 kB | 99 kB | 53/54 kB | 32/291 kB
Progress (5): 1.6/2.6 MB | 307/502 kB | 99 kB | 53/54 kB | 32/291 kB
Progress (5): 1.6/2.6 MB | 307/502 kB | 99 kB | 53/54 kB | 32/291 kB
Progress (5): 1.6/2.6 MB | 311/502 kB | 99 kB | 53/54 kB | 32/291 kB
Progress (5): 1.6/2.6 MB | 311/502 kB | 99 kB | 54 kB | 32/291 kB   
Progress (5): 1.6/2.6 MB | 311/502 kB | 99 kB | 54 kB | 33/291 kB
Progress (5): 1.6/2.6 MB | 315/502 kB | 99 kB | 54 kB | 33/291 kB
Progress (5): 1.6/2.6 MB | 315/502 kB | 99 kB | 54 kB | 33/291 kB
Progress (5): 1.6/2.6 MB | 319/502 kB | 99 kB | 54 kB | 33/291 kB
Progress (5): 1.6/2.6 MB | 319/502 kB | 99 kB | 54 kB | 37/291 kB
                                                                 
Downloaded from eclipse.maven.central.mirror: https://repo.eclipse.org/content/repositories/maven_central/org/apache/maven/maven-embedder/3.6.2/maven-embedder-3.6.2.jar (99 kB at 145 kB/s)
Progress (4): 1.6/2.6 MB | 319/502 kB | 54 kB | 37/291 kB
Progress (4): 1.6/2.6 MB | 323/502 kB | 54 kB | 37/291 kB
Progress (4): 1.6/2.6 MB | 323/502 kB | 54 kB | 37/291 kB
                                                         
Downloading from eclipse.maven.central.mirror: https://repo.eclipse.org/content/repositories/maven_central/org/codehaus/plexus/plexus-interpolation/1.25/plexus-interpolation-1.25.jar
Progress (4): 1.6/2.6 MB | 323/502 kB | 54 kB | 41/291 kB
Progress (4): 1.6/2.6 MB | 323/502 kB | 54 kB | 41/291 kB
Progress (4): 1.6/2.6 MB | 327/502 kB | 54 kB | 41/291 kB
Progress (4): 1.6/2.6 MB | 327/502 kB | 54 kB | 41/291 kB
Progress (4): 1.6/2.6 MB | 327/502 kB | 54 kB | 45/291 kB
Progress (4): 1.6/2.6 MB | 331/502 kB | 54 kB | 45/291 kB
Progress (4): 1.6/2.6 MB | 331/502 kB | 54 kB | 49/291 kB
Progress (4): 1.6/2.6 MB | 331/502 kB | 54 kB | 49/291 kB
Progress (4): 1.6/2.6 MB | 331/502 kB | 54 kB | 53/291 kB
Progress (4): 1.6/2.6 MB | 335/502 kB | 54 kB | 53/291 kB
Progress (4): 1.6/2.6 MB | 335/502 kB | 54 kB | 57/291 kB
Progress (4): 1.6/2.6 MB | 335/502 kB | 54 kB | 57/291 kB
Progress (4): 1.6/2.6 MB | 335/502 kB | 54 kB | 61/291 kB
Progress (4): 1.6/2.6 MB | 339/502 kB | 54 kB | 61/291 kB
Progress (4): 1.6/2.6 MB | 339/502 kB | 54 kB | 65/291 kB
Progress (4): 1.6/2.6 MB | 343/502 kB | 54 kB | 65/291 kB
Progress (4): 1.6/2.6 MB | 343/502 kB | 54 kB | 65/291 kB
Progress (4): 1.6/2.6 MB | 347/502 kB | 54 kB | 65/291 kB
Progress (4): 1.6/2.6 MB | 347/502 kB | 54 kB | 66/291 kB
Progress (4): 1.6/2.6 MB | 351/502 kB | 54 kB | 66/291 kB
Progress (4): 1.6/2.6 MB | 351/502 kB | 54 kB | 66/291 kB
Progress (4): 1.6/2.6 MB | 355/502 kB | 54 kB | 66/291 kB
Progress (4): 1.6/2.6 MB | 355/502 kB | 54 kB | 70/291 kB
                                                         
Downloaded from eclipse.maven.central.mirror: https://repo.eclipse.org/content/repositories/maven_central/commons-cli/commons-cli/1.4/commons-cli-1.4.jar (54 kB at 78 kB/s)
Progress (3): 1.6/2.6 MB | 355/502 kB | 70/291 kB
Progress (3): 1.6/2.6 MB | 355/502 kB | 74/291 kB
Progress (3): 1.6/2.6 MB | 359/502 kB | 74/291 kB
Progress (3): 1.6/2.6 MB | 359/502 kB | 78/291 kB
Progress (3): 1.6/2.6 MB | 359/502 kB | 78/291 kB
Progress (4): 1.6/2.6 MB | 359/502 kB | 78/291 kB | 4.1/85 kB
                                                             
Downloading from eclipse.maven.central.mirror: https://repo.eclipse.org/content/repositories/maven_central/org/apache/maven/wagon/wagon-provider-api/3.3.3/wagon-provider-api-3.3.3.jar
Progress (4): 1.6/2.6 MB | 359/502 kB | 78/291 kB | 4.1/85 kB
Progress (4): 1.6/2.6 MB | 359/502 kB | 78/291 kB | 7.7/85 kB
Progress (4): 1.6/2.6 MB | 359/502 kB | 82/291 kB | 7.7/85 kB
Progress (4): 1.6/2.6 MB | 363/502 kB | 82/291 kB | 7.7/85 kB
Progress (4): 1.6/2.6 MB | 363/502 kB | 86/291 kB | 7.7/85 kB
Progress (4): 1.6/2.6 MB | 363/502 kB | 86/291 kB | 12/85 kB 
Progress (4): 1.6/2.6 MB | 363/502 kB | 86/291 kB | 12/85 kB
Progress (4): 1.6/2.6 MB | 363/502 kB | 86/291 kB | 16/85 kB
Progress (4): 1.6/2.6 MB | 363/502 kB | 86/291 kB | 16/85 kB
Progress (4): 1.6/2.6 MB | 363/502 kB | 90/291 kB | 16/85 kB
Progress (4): 1.6/2.6 MB | 367/502 kB | 90/291 kB | 16/85 kB
Progress (4): 1.6/2.6 MB | 367/502 kB | 90/291 kB | 16/85 kB
Progress (4): 1.6/2.6 MB | 367/502 kB | 90/291 kB | 20/85 kB
Progress (4): 1.6/2.6 MB | 367/502 kB | 90/291 kB | 20/85 kB
Progress (4): 1.6/2.6 MB | 371/502 kB | 90/291 kB | 20/85 kB
Progress (4): 1.6/2.6 MB | 371/502 kB | 94/291 kB | 20/85 kB
Progress (4): 1.6/2.6 MB | 371/502 kB | 94/291 kB | 20/85 kB
Progress (4): 1.6/2.6 MB | 371/502 kB | 94/291 kB | 24/85 kB
Progress (4): 1.6/2.6 MB | 371/502 kB | 98/291 kB | 24/85 kB
Progress (4): 1.6/2.6 MB | 375/502 kB | 98/291 kB | 24/85 kB
Progress (4): 1.6/2.6 MB | 375/502 kB | 98/291 kB | 24/85 kB
Progress (4): 1.6/2.6 MB | 375/502 kB | 98/291 kB | 28/85 kB
Progress (4): 1.7/2.6 MB | 375/502 kB | 98/291 kB | 28/85 kB
Progress (4): 1.7/2.6 MB | 375/502 kB | 98/291 kB | 32/85 kB
Progress (4): 1.7/2.6 MB | 375/502 kB | 102/291 kB | 32/85 kB
Progress (4): 1.7/2.6 MB | 379/502 kB | 102/291 kB | 32/85 kB
Progress (4): 1.7/2.6 MB | 379/502 kB | 106/291 kB | 32/85 kB
Progress (4): 1.7/2.6 MB | 379/502 kB | 106/291 kB | 33/85 kB
Progress (4): 1.7/2.6 MB | 379/502 kB | 110/291 kB | 33/85 kB
Progress (4): 1.7/2.6 MB | 379/502 kB | 110/291 kB | 37/85 kB
Progress (4): 1.7/2.6 MB | 379/502 kB | 110/291 kB | 37/85 kB
Progress (4): 1.7/2.6 MB | 379/502 kB | 110/291 kB | 41/85 kB
Progress (4): 1.7/2.6 MB | 379/502 kB | 114/291 kB | 41/85 kB
Progress (4): 1.7/2.6 MB | 383/502 kB | 114/291 kB | 41/85 kB
Progress (4): 1.7/2.6 MB | 383/502 kB | 118/291 kB | 41/85 kB
Progress (4): 1.7/2.6 MB | 383/502 kB | 118/291 kB | 45/85 kB
Progress (4): 1.7/2.6 MB | 383/502 kB | 118/291 kB | 45/85 kB
Progress (4): 1.7/2.6 MB | 383/502 kB | 118/291 kB | 49/85 kB
Progress (4): 1.7/2.6 MB | 383/502 kB | 122/291 kB | 49/85 kB
Progress (4): 1.7/2.6 MB | 383/502 kB | 122/291 kB | 53/85 kB
Progress (4): 1.7/2.6 MB | 383/502 kB | 126/291 kB | 53/85 kB
Progress (4): 1.7/2.6 MB | 387/502 kB | 126/291 kB | 53/85 kB
Progress (4): 1.7/2.6 MB | 387/502 kB | 130/291 kB | 53/85 kB
Progress (4): 1.7/2.6 MB | 387/502 kB | 130/291 kB | 57/85 kB
Progress (4): 1.7/2.6 MB | 387/502 kB | 134/291 kB | 57/85 kB
Progress (4): 1.7/2.6 MB | 387/502 kB | 134/291 kB | 57/85 kB
Progress (4): 1.7/2.6 MB | 387/502 kB | 138/291 kB | 57/85 kB
Progress (4): 1.7/2.6 MB | 387/502 kB | 138/291 kB | 57/85 kB
Progress (4): 1.7/2.6 MB | 387/502 kB | 138/291 kB | 61/85 kB
Progress (5): 1.7/2.6 MB | 387/502 kB | 138/291 kB | 61/85 kB | 4.1/56 kB
Progress (5): 1.7/2.6 MB | 391/502 kB | 138/291 kB | 61/85 kB | 4.1/56 kB
Progress (5): 1.7/2.6 MB | 391/502 kB | 138/291 kB | 61/85 kB | 7.7/56 kB
Progress (5): 1.7/2.6 MB | 391/502 kB | 138/291 kB | 65/85 kB | 7.7/56 kB
Progress (5): 1.7/2.6 MB | 391/502 kB | 138/291 kB | 65/85 kB | 7.7/56 kB
Progress (5): 1.7/2.6 MB | 391/502 kB | 142/291 kB | 65/85 kB | 7.7/56 kB
Progress (5): 1.7/2.6 MB | 391/502 kB | 142/291 kB | 65/85 kB | 7.7/56 kB
Progress (5): 1.7/2.6 MB | 391/502 kB | 142/291 kB | 69/85 kB | 7.7/56 kB
Progress (5): 1.7/2.6 MB | 391/502 kB | 142/291 kB | 69/85 kB | 12/56 kB 
Progress (5): 1.7/2.6 MB | 395/502 kB | 142/291 kB | 69/85 kB | 12/56 kB
Progress (5): 1.7/2.6 MB | 395/502 kB | 142/291 kB | 69/85 kB | 16/56 kB
Progress (5): 1.7/2.6 MB | 395/502 kB | 142/291 kB | 73/85 kB | 16/56 kB
Progress (5): 1.7/2.6 MB | 395/502 kB | 142/291 kB | 73/85 kB | 16/56 kB
Progress (5): 1.7/2.6 MB | 395/502 kB | 142/291 kB | 77/85 kB | 16/56 kB
Progress (5): 1.7/2.6 MB | 395/502 kB | 142/291 kB | 77/85 kB | 16/56 kB
Progress (5): 1.7/2.6 MB | 395/502 kB | 146/291 kB | 77/85 kB | 16/56 kB
Progress (5): 1.7/2.6 MB | 395/502 kB | 146/291 kB | 77/85 kB | 16/56 kB
Progress (5): 1.7/2.6 MB | 395/502 kB | 146/291 kB | 81/85 kB | 16/56 kB
Progress (5): 1.7/2.6 MB | 395/502 kB | 146/291 kB | 81/85 kB | 20/56 kB
Progress (5): 1.7/2.6 MB | 399/502 kB | 146/291 kB | 81/85 kB | 20/56 kB
Progress (5): 1.7/2.6 MB | 399/502 kB | 146/291 kB | 81/85 kB | 24/56 kB
Progress (5): 1.7/2.6 MB | 399/502 kB | 146/291 kB | 85/85 kB | 24/56 kB
Progress (5): 1.7/2.6 MB | 399/502 kB | 146/291 kB | 85/85 kB | 24/56 kB
Progress (5): 1.7/2.6 MB | 399/502 kB | 150/291 kB | 85/85 kB | 24/56 kB
Progress (5): 1.7/2.6 MB | 399/502 kB | 150/291 kB | 85/85 kB | 24/56 kB
Progress (5): 1.7/2.6 MB | 399/502 kB | 150/291 kB | 85/85 kB | 28/56 kB
Progress (5): 1.7/2.6 MB | 399/502 kB | 150/291 kB | 85 kB | 28/56 kB   
Progress (5): 1.7/2.6 MB | 403/502 kB | 150/291 kB | 85 kB | 28/56 kB
Progress (5): 1.7/2.6 MB | 403/502 kB | 150/291 kB | 85 kB | 32/56 kB
Progress (5): 1.7/2.6 MB | 403/502 kB | 150/291 kB | 85 kB | 32/56 kB
Progress (5): 1.7/2.6 MB | 403/502 kB | 154/291 kB | 85 kB | 32/56 kB
Progress (5): 1.7/2.6 MB | 403/502 kB | 154/291 kB | 85 kB | 32/56 kB
Progress (5): 1.7/2.6 MB | 403/502 kB | 154/291 kB | 85 kB | 33/56 kB
Progress (5): 1.7/2.6 MB | 403/502 kB | 154/291 kB | 85 kB | 33/56 kB
Progress (5): 1.7/2.6 MB | 403/502 kB | 158/291 kB | 85 kB | 33/56 kB
Progress (5): 1.7/2.6 MB | 403/502 kB | 158/291 kB | 85 kB | 33/56 kB
Progress (5): 1.7/2.6 MB | 403/502 kB | 158/291 kB | 85 kB | 37/56 kB
Progress (5): 1.7/2.6 MB | 407/502 kB | 158/291 kB | 85 kB | 37/56 kB
Progress (5): 1.7/2.6 MB | 407/502 kB | 158/291 kB | 85 kB | 37/56 kB
Progress (5): 1.7/2.6 MB | 407/502 kB | 162/291 kB | 85 kB | 37/56 kB
Progress (5): 1.7/2.6 MB | 407/502 kB | 162/291 kB | 85 kB | 37/56 kB
Progress (5): 1.7/2.6 MB | 411/502 kB | 162/291 kB | 85 kB | 37/56 kB
Progress (5): 1.7/2.6 MB | 411/502 kB | 162/291 kB | 85 kB | 41/56 kB
Progress (5): 1.7/2.6 MB | 415/502 kB | 162/291 kB | 85 kB | 41/56 kB
Progress (5): 1.7/2.6 MB | 415/502 kB | 162/291 kB | 85 kB | 41/56 kB
Progress (5): 1.7/2.6 MB | 415/502 kB | 166/291 kB | 85 kB | 41/56 kB
Progress (5): 1.7/2.6 MB | 415/502 kB | 166/291 kB | 85 kB | 41/56 kB
Progress (5): 1.7/2.6 MB | 415/502 kB | 166/291 kB | 85 kB | 45/56 kB
Progress (5): 1.7/2.6 MB | 419/502 kB | 166/291 kB | 85 kB | 45/56 kB
Progress (5): 1.7/2.6 MB | 419/502 kB | 166/291 kB | 85 kB | 49/56 kB
Progress (5): 1.7/2.6 MB | 419/502 kB | 166/291 kB | 85 kB | 49/56 kB
Progress (5): 1.7/2.6 MB | 419/502 kB | 170/291 kB | 85 kB | 49/56 kB
Progress (5): 1.7/2.6 MB | 419/502 kB | 170/291 kB | 85 kB | 49/56 kB
Progress (5): 1.7/2.6 MB | 419/502 kB | 170/291 kB | 85 kB | 53/56 kB
Progress (5): 1.7/2.6 MB | 423/502 kB | 170/291 kB | 85 kB | 53/56 kB
Progress (5): 1.7/2.6 MB | 423/502 kB | 170/291 kB | 85 kB | 56 kB   
Progress (5): 1.7/2.6 MB | 423/502 kB | 170/291 kB | 85 kB | 56 kB
Progress (5): 1.7/2.6 MB | 423/502 kB | 174/291 kB | 85 kB | 56 kB
Progress (5): 1.7/2.6 MB | 423/502 kB | 174/291 kB | 85 kB | 56 kB
Progress (5): 1.7/2.6 MB | 427/502 kB | 174/291 kB | 85 kB | 56 kB
Progress (5): 1.7/2.6 MB | 427/502 kB | 174/291 kB | 85 kB | 56 kB
Progress (5): 1.7/2.6 MB | 427/502 kB | 178/291 kB | 85 kB | 56 kB
Progress (5): 1.8/2.6 MB | 427/502 kB | 178/291 kB | 85 kB | 56 kB
Progress (5): 1.8/2.6 MB | 431/502 kB | 178/291 kB | 85 kB | 56 kB
Progress (5): 1.8/2.6 MB | 431/502 kB | 178/291 kB | 85 kB | 56 kB
Progress (5): 1.8/2.6 MB | 431/502 kB | 182/291 kB | 85 kB | 56 kB
                                                                  
Downloaded from eclipse.maven.central.mirror: https://repo.eclipse.org/content/repositories/maven_central/org/codehaus/plexus/plexus-interpolation/1.25/plexus-interpolation-1.25.jar (85 kB at 110 kB/s)
Progress (4): 1.8/2.6 MB | 431/502 kB | 186/291 kB | 56 kB
Progress (4): 1.8/2.6 MB | 431/502 kB | 186/291 kB | 56 kB
Progress (4): 1.8/2.6 MB | 435/502 kB | 186/291 kB | 56 kB
Progress (4): 1.8/2.6 MB | 435/502 kB | 190/291 kB | 56 kB
                                                          
Downloading from eclipse.maven.central.mirror: https://repo.eclipse.org/content/repositories/maven_central/org/eclipse/sisu/org.eclipse.sisu.plexus/0.3.3/org.eclipse.sisu.plexus-0.3.3.jar
Progress (4): 1.8/2.6 MB | 435/502 kB | 194/291 kB | 56 kB
Progress (4): 1.8/2.6 MB | 439/502 kB | 194/291 kB | 56 kB
Progress (4): 1.8/2.6 MB | 439/502 kB | 194/291 kB | 56 kB
Progress (4): 1.8/2.6 MB | 443/502 kB | 194/291 kB | 56 kB
Progress (4): 1.8/2.6 MB | 443/502 kB | 198/291 kB | 56 kB
Progress (4): 1.8/2.6 MB | 447/502 kB | 198/291 kB | 56 kB
Progress (4): 1.8/2.6 MB | 447/502 kB | 198/291 kB | 56 kB
Progress (4): 1.8/2.6 MB | 451/502 kB | 198/291 kB | 56 kB
Progress (4): 1.8/2.6 MB | 451/502 kB | 202/291 kB | 56 kB
Progress (4): 1.8/2.6 MB | 455/502 kB | 202/291 kB | 56 kB
Progress (4): 1.8/2.6 MB | 455/502 kB | 202/291 kB | 56 kB
Progress (4): 1.8/2.6 MB | 455/502 kB | 206/291 kB | 56 kB
Progress (4): 1.8/2.6 MB | 459/502 kB | 206/291 kB | 56 kB
                                                          
Downloaded from eclipse.maven.central.mirror: https://repo.eclipse.org/content/repositories/maven_central/org/apache/maven/wagon/wagon-provider-api/3.3.3/wagon-provider-api-3.3.3.jar (56 kB at 72 kB/s)
Progress (3): 1.8/2.6 MB | 463/502 kB | 206/291 kB
Progress (3): 1.8/2.6 MB | 463/502 kB | 210/291 kB
Progress (3): 1.8/2.6 MB | 463/502 kB | 210/291 kB
Progress (3): 1.8/2.6 MB | 467/502 kB | 210/291 kB
                                                  
Downloading from eclipse.maven.central.mirror: https://repo.eclipse.org/content/repositories/maven_central/io/takari/aether/aether-connector-okhttp/0.17.6/aether-connector-okhttp-0.17.6.jar
Progress (3): 1.8/2.6 MB | 471/502 kB | 210/291 kB
Progress (3): 1.8/2.6 MB | 471/502 kB | 210/291 kB
Progress (3): 1.8/2.6 MB | 471/502 kB | 214/291 kB
Progress (3): 1.8/2.6 MB | 471/502 kB | 214/291 kB
Progress (3): 1.8/2.6 MB | 475/502 kB | 214/291 kB
Progress (3): 1.8/2.6 MB | 475/502 kB | 218/291 kB
Progress (3): 1.8/2.6 MB | 479/502 kB | 218/291 kB
Progress (3): 1.8/2.6 MB | 479/502 kB | 218/291 kB
Progress (3): 1.8/2.6 MB | 483/502 kB | 218/291 kB
Progress (3): 1.8/2.6 MB | 483/502 kB | 218/291 kB
Progress (3): 1.8/2.6 MB | 487/502 kB | 218/291 kB
Progress (3): 1.8/2.6 MB | 487/502 kB | 222/291 kB
Progress (3): 1.8/2.6 MB | 491/502 kB | 222/291 kB
Progress (3): 1.8/2.6 MB | 491/502 kB | 222/291 kB
Progress (3): 1.8/2.6 MB | 491/502 kB | 226/291 kB
Progress (3): 1.8/2.6 MB | 491/502 kB | 226/291 kB
Progress (3): 1.8/2.6 MB | 495/502 kB | 226/291 kB
Progress (3): 1.8/2.6 MB | 495/502 kB | 230/291 kB
Progress (3): 1.8/2.6 MB | 495/502 kB | 230/291 kB
Progress (3): 1.8/2.6 MB | 495/502 kB | 234/291 kB
Progress (3): 1.8/2.6 MB | 499/502 kB | 234/291 kB
Progress (3): 1.8/2.6 MB | 499/502 kB | 234/291 kB
Progress (3): 1.8/2.6 MB | 502 kB | 234/291 kB    
Progress (3): 1.8/2.6 MB | 502 kB | 238/291 kB
Progress (3): 1.8/2.6 MB | 502 kB | 238/291 kB
Progress (3): 1.8/2.6 MB | 502 kB | 242/291 kB
Progress (3): 1.8/2.6 MB | 502 kB | 242/291 kB
Progress (3): 1.8/2.6 MB | 502 kB | 246/291 kB
Progress (3): 1.8/2.6 MB | 502 kB | 246/291 kB
Progress (3): 1.8/2.6 MB | 502 kB | 250/291 kB
Progress (3): 1.8/2.6 MB | 502 kB | 250/291 kB
Progress (3): 1.8/2.6 MB | 502 kB | 254/291 kB
Progress (4): 1.8/2.6 MB | 502 kB | 254/291 kB | 4.1/205 kB
Progress (4): 1.8/2.6 MB | 502 kB | 254/291 kB | 4.1/205 kB
Progress (4): 1.8/2.6 MB | 502 kB | 254/291 kB | 7.7/205 kB
Progress (4): 1.8/2.6 MB | 502 kB | 258/291 kB | 7.7/205 kB
Progress (4): 1.8/2.6 MB | 502 kB | 258/291 kB | 12/205 kB 
Progress (4): 1.8/2.6 MB | 502 kB | 258/291 kB | 12/205 kB
Progress (4): 1.8/2.6 MB | 502 kB | 258/291 kB | 16/205 kB
Progress (4): 1.8/2.6 MB | 502 kB | 262/291 kB | 16/205 kB
Progress (4): 1.8/2.6 MB | 502 kB | 262/291 kB | 20/205 kB
Progress (4): 1.8/2.6 MB | 502 kB | 262/291 kB | 20/205 kB
Progress (4): 1.8/2.6 MB | 502 kB | 262/291 kB | 24/205 kB
Progress (4): 1.8/2.6 MB | 502 kB | 266/291 kB | 24/205 kB
Progress (4): 1.8/2.6 MB | 502 kB | 266/291 kB | 28/205 kB
Progress (4): 1.8/2.6 MB | 502 kB | 266/291 kB | 28/205 kB
Progress (4): 1.8/2.6 MB | 502 kB | 266/291 kB | 32/205 kB
Progress (4): 1.8/2.6 MB | 502 kB | 270/291 kB | 32/205 kB
Progress (4): 1.8/2.6 MB | 502 kB | 270/291 kB | 33/205 kB
Progress (4): 1.8/2.6 MB | 502 kB | 274/291 kB | 33/205 kB
Progress (4): 1.8/2.6 MB | 502 kB | 274/291 kB | 33/205 kB
Progress (4): 1.8/2.6 MB | 502 kB | 274/291 kB | 37/205 kB
Progress (4): 1.8/2.6 MB | 502 kB | 274/291 kB | 37/205 kB
Progress (4): 1.8/2.6 MB | 502 kB | 278/291 kB | 37/205 kB
Progress (4): 1.9/2.6 MB | 502 kB | 278/291 kB | 37/205 kB
Progress (4): 1.9/2.6 MB | 502 kB | 278/291 kB | 41/205 kB
Progress (4): 1.9/2.6 MB | 502 kB | 278/291 kB | 41/205 kB
Progress (4): 1.9/2.6 MB | 502 kB | 282/291 kB | 41/205 kB
Progress (4): 1.9/2.6 MB | 502 kB | 282/291 kB | 45/205 kB
Progress (4): 1.9/2.6 MB | 502 kB | 282/291 kB | 45/205 kB
Progress (4): 1.9/2.6 MB | 502 kB | 282/291 kB | 49/205 kB
Progress (4): 1.9/2.6 MB | 502 kB | 286/291 kB | 49/205 kB
Progress (4): 1.9/2.6 MB | 502 kB | 286/291 kB | 53/205 kB
Progress (4): 1.9/2.6 MB | 502 kB | 286/291 kB | 53/205 kB
Progress (4): 1.9/2.6 MB | 502 kB | 286/291 kB | 57/205 kB
Progress (4): 1.9/2.6 MB | 502 kB | 290/291 kB | 57/205 kB
Progress (4): 1.9/2.6 MB | 502 kB | 290/291 kB | 61/205 kB
Progress (4): 1.9/2.6 MB | 502 kB | 290/291 kB | 61/205 kB
Progress (4): 1.9/2.6 MB | 502 kB | 290/291 kB | 65/205 kB
Progress (4): 1.9/2.6 MB | 502 kB | 291 kB | 65/205 kB    
Progress (4): 1.9/2.6 MB | 502 kB | 291 kB | 66/205 kB
Progress (4): 1.9/2.6 MB | 502 kB | 291 kB | 66/205 kB
Progress (4): 1.9/2.6 MB | 502 kB | 291 kB | 70/205 kB
Progress (4): 1.9/2.6 MB | 502 kB | 291 kB | 70/205 kB
Progress (4): 1.9/2.6 MB | 502 kB | 291 kB | 74/205 kB
Progress (4): 1.9/2.6 MB | 502 kB | 291 kB | 74/205 kB
Progress (4): 1.9/2.6 MB | 502 kB | 291 kB | 78/205 kB
Progress (4): 1.9/2.6 MB | 502 kB | 291 kB | 78/205 kB
Progress (4): 1.9/2.6 MB | 502 kB | 291 kB | 82/205 kB
Progress (4): 1.9/2.6 MB | 502 kB | 291 kB | 82/205 kB
Progress (4): 1.9/2.6 MB | 502 kB | 291 kB | 86/205 kB
Progress (4): 1.9/2.6 MB | 502 kB | 291 kB | 86/205 kB
Progress (5): 1.9/2.6 MB | 502 kB | 291 kB | 86/205 kB | 4.1/51 kB
Progress (5): 1.9/2.6 MB | 502 kB | 291 kB | 86/205 kB | 4.1/51 kB
Progress (5): 1.9/2.6 MB | 502 kB | 291 kB | 86/205 kB | 7.7/51 kB
                                                                  
Downloaded from eclipse.maven.central.mirror: https://repo.eclipse.org/content/repositories/maven_central/org/apache/commons/commons-lang3/3.8.1/commons-lang3-3.8.1.jar (502 kB at 626 kB/s)
Progress (4): 1.9/2.6 MB | 291 kB | 90/205 kB | 7.7/51 kB
                                                         
Downloading from eclipse.maven.central.mirror: https://repo.eclipse.org/content/repositories/maven_central/com/squareup/okhttp3/okhttp/3.14.1/okhttp-3.14.1.jar
Progress (4): 1.9/2.6 MB | 291 kB | 90/205 kB | 12/51 kB
Progress (4): 1.9/2.6 MB | 291 kB | 90/205 kB | 12/51 kB
Progress (4): 1.9/2.6 MB | 291 kB | 90/205 kB | 16/51 kB
Progress (4): 1.9/2.6 MB | 291 kB | 90/205 kB | 16/51 kB
Progress (4): 1.9/2.6 MB | 291 kB | 90/205 kB | 20/51 kB
Progress (4): 1.9/2.6 MB | 291 kB | 90/205 kB | 20/51 kB
Progress (4): 1.9/2.6 MB | 291 kB | 90/205 kB | 24/51 kB
Progress (4): 1.9/2.6 MB | 291 kB | 90/205 kB | 28/51 kB
Progress (4): 1.9/2.6 MB | 291 kB | 90/205 kB | 32/51 kB
Progress (4): 1.9/2.6 MB | 291 kB | 90/205 kB | 32/51 kB
Progress (4): 1.9/2.6 MB | 291 kB | 90/205 kB | 36/51 kB
Progress (4): 1.9/2.6 MB | 291 kB | 94/205 kB | 36/51 kB
Progress (5): 1.9/2.6 MB | 291 kB | 94/205 kB | 36/51 kB | 4.1/426 kB
Progress (5): 1.9/2.6 MB | 291 kB | 94/205 kB | 40/51 kB | 4.1/426 kB
Progress (5): 1.9/2.6 MB | 291 kB | 94/205 kB | 40/51 kB | 4.1/426 kB
                                                                     
Downloaded from eclipse.maven.central.mirror: https://repo.eclipse.org/content/repositories/maven_central/org/apache/maven/maven-compat/3.6.2/maven-compat-3.6.2.jar (291 kB at 334 kB/s)
Progress (4): 1.9/2.6 MB | 94/205 kB | 40/51 kB | 7.7/426 kB
Progress (4): 1.9/2.6 MB | 98/205 kB | 40/51 kB | 7.7/426 kB
                                                            
Downloading from eclipse.maven.central.mirror: https://repo.eclipse.org/content/repositories/maven_central/com/squareup/okio/okio/1.17.3/okio-1.17.3.jar
Progress (4): 1.9/2.6 MB | 98/205 kB | 40/51 kB | 7.7/426 kB
Progress (4): 1.9/2.6 MB | 98/205 kB | 44/51 kB | 7.7/426 kB
Progress (4): 1.9/2.6 MB | 98/205 kB | 44/51 kB | 7.7/426 kB
Progress (4): 1.9/2.6 MB | 98/205 kB | 44/51 kB | 7.7/426 kB
Progress (4): 1.9/2.6 MB | 98/205 kB | 44/51 kB | 12/426 kB 
Progress (4): 1.9/2.6 MB | 102/205 kB | 44/51 kB | 12/426 kB
Progress (4): 1.9/2.6 MB | 102/205 kB | 44/51 kB | 12/426 kB
Progress (4): 1.9/2.6 MB | 102/205 kB | 48/51 kB | 12/426 kB
Progress (4): 1.9/2.6 MB | 102/205 kB | 48/51 kB | 12/426 kB
Progress (4): 1.9/2.6 MB | 102/205 kB | 51 kB | 12/426 kB   
Progress (4): 1.9/2.6 MB | 106/205 kB | 51 kB | 12/426 kB
Progress (4): 1.9/2.6 MB | 106/205 kB | 51 kB | 16/426 kB
Progress (4): 1.9/2.6 MB | 110/205 kB | 51 kB | 16/426 kB
Progress (4): 1.9/2.6 MB | 110/205 kB | 51 kB | 16/426 kB
Progress (4): 1.9/2.6 MB | 110/205 kB | 51 kB | 20/426 kB
Progress (4): 1.9/2.6 MB | 114/205 kB | 51 kB | 20/426 kB
Progress (4): 1.9/2.6 MB | 114/205 kB | 51 kB | 24/426 kB
Progress (4): 1.9/2.6 MB | 118/205 kB | 51 kB | 24/426 kB
Progress (4): 1.9/2.6 MB | 118/205 kB | 51 kB | 24/426 kB
Progress (4): 1.9/2.6 MB | 122/205 kB | 51 kB | 24/426 kB
Progress (4): 1.9/2.6 MB | 122/205 kB | 51 kB | 28/426 kB
Progress (4): 1.9/2.6 MB | 122/205 kB | 51 kB | 28/426 kB
Progress (4): 1.9/2.6 MB | 122/205 kB | 51 kB | 32/426 kB
Progress (4): 1.9/2.6 MB | 126/205 kB | 51 kB | 32/426 kB
Progress (4): 1.9/2.6 MB | 126/205 kB | 51 kB | 33/426 kB
Progress (4): 1.9/2.6 MB | 126/205 kB | 51 kB | 33/426 kB
Progress (4): 1.9/2.6 MB | 130/205 kB | 51 kB | 33/426 kB
Progress (4): 2.0/2.6 MB | 130/205 kB | 51 kB | 33/426 kB
Progress (4): 2.0/2.6 MB | 130/205 kB | 51 kB | 37/426 kB
Progress (4): 2.0/2.6 MB | 130/205 kB | 51 kB | 37/426 kB
Progress (4): 2.0/2.6 MB | 131/205 kB | 51 kB | 37/426 kB
Progress (4): 2.0/2.6 MB | 131/205 kB | 51 kB | 37/426 kB
Progress (4): 2.0/2.6 MB | 131/205 kB | 51 kB | 41/426 kB
Progress (4): 2.0/2.6 MB | 135/205 kB | 51 kB | 41/426 kB
Progress (4): 2.0/2.6 MB | 135/205 kB | 51 kB | 41/426 kB
Progress (4): 2.0/2.6 MB | 139/205 kB | 51 kB | 41/426 kB
Progress (4): 2.0/2.6 MB | 139/205 kB | 51 kB | 45/426 kB
Progress (4): 2.0/2.6 MB | 143/205 kB | 51 kB | 45/426 kB
Progress (4): 2.0/2.6 MB | 143/205 kB | 51 kB | 45/426 kB
Progress (4): 2.0/2.6 MB | 147/205 kB | 51 kB | 45/426 kB
Progress (4): 2.0/2.6 MB | 147/205 kB | 51 kB | 49/426 kB
Progress (4): 2.0/2.6 MB | 151/205 kB | 51 kB | 49/426 kB
Progress (4): 2.0/2.6 MB | 151/205 kB | 51 kB | 49/426 kB
Progress (4): 2.0/2.6 MB | 151/205 kB | 51 kB | 53/426 kB
Progress (4): 2.0/2.6 MB | 155/205 kB | 51 kB | 53/426 kB
Progress (4): 2.0/2.6 MB | 155/205 kB | 51 kB | 57/426 kB
Progress (4): 2.0/2.6 MB | 155/205 kB | 51 kB | 57/426 kB
                                                         
Downloaded from eclipse.maven.central.mirror: https://repo.eclipse.org/content/repositories/maven_central/io/takari/aether/aether-connector-okhttp/0.17.6/aether-connector-okhttp-0.17.6.jar (51 kB at 58 kB/s)
Progress (3): 2.0/2.6 MB | 159/205 kB | 57/426 kB
                                                 
Downloading from eclipse.maven.central.mirror: https://repo.eclipse.org/content/repositories/maven_central/org/apache/maven/resolver/maven-resolver-impl/1.4.1/maven-resolver-impl-1.4.1.jar
Progress (3): 2.0/2.6 MB | 159/205 kB | 57/426 kB
Progress (3): 2.0/2.6 MB | 159/205 kB | 61/426 kB
Progress (3): 2.0/2.6 MB | 159/205 kB | 61/426 kB
Progress (4): 2.0/2.6 MB | 159/205 kB | 61/426 kB | 4.1/92 kB
Progress (4): 2.0/2.6 MB | 163/205 kB | 61/426 kB | 4.1/92 kB
Progress (4): 2.0/2.6 MB | 163/205 kB | 61/426 kB | 7.7/92 kB
Progress (4): 2.0/2.6 MB | 163/205 kB | 61/426 kB | 7.7/92 kB
Progress (4): 2.0/2.6 MB | 163/205 kB | 65/426 kB | 7.7/92 kB
Progress (4): 2.0/2.6 MB | 163/205 kB | 65/426 kB | 7.7/92 kB
Progress (4): 2.0/2.6 MB | 163/205 kB | 65/426 kB | 12/92 kB 
Progress (4): 2.0/2.6 MB | 167/205 kB | 65/426 kB | 12/92 kB
Progress (4): 2.0/2.6 MB | 167/205 kB | 65/426 kB | 16/92 kB
Progress (4): 2.0/2.6 MB | 167/205 kB | 65/426 kB | 16/92 kB
Progress (4): 2.0/2.6 MB | 167/205 kB | 66/426 kB | 16/92 kB
Progress (4): 2.0/2.6 MB | 167/205 kB | 66/426 kB | 16/92 kB
Progress (4): 2.0/2.6 MB | 167/205 kB | 66/426 kB | 20/92 kB
Progress (4): 2.0/2.6 MB | 171/205 kB | 66/426 kB | 20/92 kB
Progress (4): 2.0/2.6 MB | 171/205 kB | 66/426 kB | 24/92 kB
Progress (4): 2.0/2.6 MB | 171/205 kB | 66/426 kB | 24/92 kB
Progress (4): 2.0/2.6 MB | 171/205 kB | 70/426 kB | 24/92 kB
Progress (4): 2.0/2.6 MB | 171/205 kB | 70/426 kB | 24/92 kB
Progress (4): 2.0/2.6 MB | 171/205 kB | 70/426 kB | 28/92 kB
Progress (4): 2.0/2.6 MB | 175/205 kB | 70/426 kB | 28/92 kB
Progress (4): 2.0/2.6 MB | 175/205 kB | 70/426 kB | 32/92 kB
Progress (4): 2.0/2.6 MB | 175/205 kB | 70/426 kB | 32/92 kB
Progress (4): 2.0/2.6 MB | 175/205 kB | 74/426 kB | 32/92 kB
Progress (4): 2.0/2.6 MB | 175/205 kB | 74/426 kB | 32/92 kB
Progress (4): 2.0/2.6 MB | 175/205 kB | 74/426 kB | 33/92 kB
Progress (4): 2.0/2.6 MB | 179/205 kB | 74/426 kB | 33/92 kB
Progress (4): 2.0/2.6 MB | 179/205 kB | 74/426 kB | 37/92 kB
Progress (4): 2.0/2.6 MB | 179/205 kB | 74/426 kB | 37/92 kB
Progress (4): 2.0/2.6 MB | 179/205 kB | 78/426 kB | 37/92 kB
Progress (4): 2.0/2.6 MB | 179/205 kB | 78/426 kB | 37/92 kB
Progress (4): 2.0/2.6 MB | 179/205 kB | 78/426 kB | 41/92 kB
Progress (4): 2.0/2.6 MB | 183/205 kB | 78/426 kB | 41/92 kB
Progress (4): 2.0/2.6 MB | 183/205 kB | 78/426 kB | 41/92 kB
Progress (4): 2.0/2.6 MB | 183/205 kB | 82/426 kB | 41/92 kB
Progress (4): 2.0/2.6 MB | 183/205 kB | 82/426 kB | 41/92 kB
Progress (4): 2.0/2.6 MB | 187/205 kB | 82/426 kB | 41/92 kB
Progress (4): 2.0/2.6 MB | 187/205 kB | 82/426 kB | 45/92 kB
Progress (4): 2.0/2.6 MB | 187/205 kB | 82/426 kB | 45/92 kB
Progress (4): 2.0/2.6 MB | 187/205 kB | 86/426 kB | 45/92 kB
Progress (4): 2.0/2.6 MB | 187/205 kB | 86/426 kB | 45/92 kB
Progress (4): 2.0/2.6 MB | 187/205 kB | 86/426 kB | 49/92 kB
Progress (4): 2.0/2.6 MB | 191/205 kB | 86/426 kB | 49/92 kB
Progress (4): 2.0/2.6 MB | 191/205 kB | 86/426 kB | 49/92 kB
Progress (4): 2.0/2.6 MB | 191/205 kB | 90/426 kB | 49/92 kB
Progress (4): 2.0/2.6 MB | 191/205 kB | 90/426 kB | 49/92 kB
Progress (4): 2.0/2.6 MB | 195/205 kB | 90/426 kB | 49/92 kB
Progress (4): 2.0/2.6 MB | 195/205 kB | 90/426 kB | 53/92 kB
Progress (4): 2.0/2.6 MB | 199/205 kB | 90/426 kB | 53/92 kB
Progress (4): 2.0/2.6 MB | 199/205 kB | 94/426 kB | 53/92 kB
Progress (4): 2.1/2.6 MB | 199/205 kB | 94/426 kB | 53/92 kB
Progress (4): 2.1/2.6 MB | 203/205 kB | 94/426 kB | 53/92 kB
Progress (4): 2.1/2.6 MB | 203/205 kB | 94/426 kB | 57/92 kB
Progress (4): 2.1/2.6 MB | 205 kB | 94/426 kB | 57/92 kB    
Progress (4): 2.1/2.6 MB | 205 kB | 94/426 kB | 57/92 kB
Progress (4): 2.1/2.6 MB | 205 kB | 98/426 kB | 57/92 kB
Progress (4): 2.1/2.6 MB | 205 kB | 98/426 kB | 57/92 kB
Progress (4): 2.1/2.6 MB | 205 kB | 98/426 kB | 61/92 kB
Progress (4): 2.1/2.6 MB | 205 kB | 98/426 kB | 61/92 kB
Progress (5): 2.1/2.6 MB | 205 kB | 98/426 kB | 61/92 kB | 4.1/181 kB
Progress (5): 2.1/2.6 MB | 205 kB | 98/426 kB | 61/92 kB | 4.1/181 kB
Progress (5): 2.1/2.6 MB | 205 kB | 98/426 kB | 61/92 kB | 7.7/181 kB
Progress (5): 2.1/2.6 MB | 205 kB | 98/426 kB | 61/92 kB | 7.7/181 kB
Progress (5): 2.1/2.6 MB | 205 kB | 98/426 kB | 65/92 kB | 7.7/181 kB
Progress (5): 2.1/2.6 MB | 205 kB | 98/426 kB | 65/92 kB | 12/181 kB 
Progress (5): 2.1/2.6 MB | 205 kB | 98/426 kB | 65/92 kB | 12/181 kB
Progress (5): 2.1/2.6 MB | 205 kB | 102/426 kB | 65/92 kB | 12/181 kB
Progress (5): 2.1/2.6 MB | 205 kB | 102/426 kB | 65/92 kB | 12/181 kB
Progress (5): 2.1/2.6 MB | 205 kB | 106/426 kB | 65/92 kB | 12/181 kB
Progress (5): 2.1/2.6 MB | 205 kB | 106/426 kB | 65/92 kB | 16/181 kB
Progress (5): 2.1/2.6 MB | 205 kB | 106/426 kB | 66/92 kB | 16/181 kB
                                                                     
Downloaded from eclipse.maven.central.mirror: https://repo.eclipse.org/content/repositories/maven_central/org/eclipse/sisu/org.eclipse.sisu.plexus/0.3.3/org.eclipse.sisu.plexus-0.3.3.jar (205 kB at 212 kB/s)
Progress (4): 2.1/2.6 MB | 110/426 kB | 66/92 kB | 16/181 kB
Progress (4): 2.1/2.6 MB | 110/426 kB | 66/92 kB | 16/181 kB
Progress (4): 2.1/2.6 MB | 114/426 kB | 66/92 kB | 16/181 kB
                                                            
Downloading from eclipse.maven.central.mirror: https://repo.eclipse.org/content/repositories/maven_central/org/apache/maven/resolver/maven-resolver-connector-basic/1.4.1/maven-resolver-connector-basic-1.4.1.jar
Progress (4): 2.1/2.6 MB | 114/426 kB | 70/92 kB | 16/181 kB
Progress (4): 2.1/2.6 MB | 114/426 kB | 70/92 kB | 20/181 kB
Progress (4): 2.1/2.6 MB | 114/426 kB | 74/92 kB | 20/181 kB
Progress (4): 2.1/2.6 MB | 118/426 kB | 74/92 kB | 20/181 kB
Progress (4): 2.1/2.6 MB | 118/426 kB | 74/92 kB | 20/181 kB
Progress (4): 2.1/2.6 MB | 118/426 kB | 78/92 kB | 20/181 kB
Progress (4): 2.1/2.6 MB | 118/426 kB | 78/92 kB | 24/181 kB
Progress (4): 2.1/2.6 MB | 118/426 kB | 82/92 kB | 24/181 kB
Progress (4): 2.1/2.6 MB | 118/426 kB | 82/92 kB | 24/181 kB
Progress (4): 2.1/2.6 MB | 122/426 kB | 82/92 kB | 24/181 kB
Progress (4): 2.1/2.6 MB | 122/426 kB | 82/92 kB | 24/181 kB
Progress (4): 2.1/2.6 MB | 122/426 kB | 86/92 kB | 24/181 kB
Progress (4): 2.1/2.6 MB | 122/426 kB | 86/92 kB | 28/181 kB
Progress (4): 2.1/2.6 MB | 122/426 kB | 90/92 kB | 28/181 kB
Progress (4): 2.1/2.6 MB | 126/426 kB | 90/92 kB | 28/181 kB
Progress (4): 2.1/2.6 MB | 126/426 kB | 90/92 kB | 28/181 kB
Progress (4): 2.1/2.6 MB | 130/426 kB | 90/92 kB | 28/181 kB
Progress (4): 2.1/2.6 MB | 130/426 kB | 92 kB | 28/181 kB   
Progress (4): 2.1/2.6 MB | 130/426 kB | 92 kB | 32/181 kB
Progress (4): 2.1/2.6 MB | 131/426 kB | 92 kB | 32/181 kB
Progress (4): 2.1/2.6 MB | 131/426 kB | 92 kB | 32/181 kB
Progress (4): 2.1/2.6 MB | 135/426 kB | 92 kB | 32/181 kB
Progress (4): 2.1/2.6 MB | 135/426 kB | 92 kB | 33/181 kB
Progress (4): 2.1/2.6 MB | 139/426 kB | 92 kB | 33/181 kB
Progress (4): 2.1/2.6 MB | 139/426 kB | 92 kB | 33/181 kB
Progress (4): 2.1/2.6 MB | 139/426 kB | 92 kB | 37/181 kB
Progress (4): 2.1/2.6 MB | 143/426 kB | 92 kB | 37/181 kB
Progress (4): 2.1/2.6 MB | 143/426 kB | 92 kB | 37/181 kB
Progress (4): 2.1/2.6 MB | 143/426 kB | 92 kB | 41/181 kB
Progress (4): 2.1/2.6 MB | 143/426 kB | 92 kB | 41/181 kB
Progress (4): 2.1/2.6 MB | 147/426 kB | 92 kB | 41/181 kB
Progress (4): 2.1/2.6 MB | 147/426 kB | 92 kB | 45/181 kB
Progress (4): 2.1/2.6 MB | 151/426 kB | 92 kB | 45/181 kB
Progress (4): 2.1/2.6 MB | 151/426 kB | 92 kB | 45/181 kB
Progress (4): 2.1/2.6 MB | 155/426 kB | 92 kB | 45/181 kB
Progress (4): 2.1/2.6 MB | 155/426 kB | 92 kB | 49/181 kB
Progress (4): 2.1/2.6 MB | 159/426 kB | 92 kB | 49/181 kB
Progress (4): 2.1/2.6 MB | 159/426 kB | 92 kB | 49/181 kB
Progress (4): 2.1/2.6 MB | 163/426 kB | 92 kB | 49/181 kB
Progress (4): 2.1/2.6 MB | 163/426 kB | 92 kB | 53/181 kB
Progress (4): 2.1/2.6 MB | 163/426 kB | 92 kB | 53/181 kB
Progress (4): 2.1/2.6 MB | 163/426 kB | 92 kB | 57/181 kB
Progress (4): 2.1/2.6 MB | 167/426 kB | 92 kB | 57/181 kB
Progress (4): 2.1/2.6 MB | 167/426 kB | 92 kB | 57/181 kB
Progress (4): 2.1/2.6 MB | 171/426 kB | 92 kB | 57/181 kB
Progress (4): 2.1/2.6 MB | 171/426 kB | 92 kB | 61/181 kB
Progress (4): 2.1/2.6 MB | 171/426 kB | 92 kB | 61/181 kB
Progress (4): 2.1/2.6 MB | 171/426 kB | 92 kB | 65/181 kB
Progress (4): 2.1/2.6 MB | 175/426 kB | 92 kB | 65/181 kB
Progress (4): 2.1/2.6 MB | 175/426 kB | 92 kB | 66/181 kB
Progress (4): 2.1/2.6 MB | 175/426 kB | 92 kB | 66/181 kB
Progress (4): 2.1/2.6 MB | 179/426 kB | 92 kB | 66/181 kB
Progress (4): 2.1/2.6 MB | 179/426 kB | 92 kB | 66/181 kB
Progress (4): 2.1/2.6 MB | 179/426 kB | 92 kB | 70/181 kB
Progress (4): 2.1/2.6 MB | 183/426 kB | 92 kB | 70/181 kB
Progress (4): 2.1/2.6 MB | 183/426 kB | 92 kB | 70/181 kB
Progress (4): 2.1/2.6 MB | 187/426 kB | 92 kB | 70/181 kB
Progress (4): 2.1/2.6 MB | 187/426 kB | 92 kB | 74/181 kB
Progress (4): 2.1/2.6 MB | 191/426 kB | 92 kB | 74/181 kB
Progress (5): 2.1/2.6 MB | 191/426 kB | 92 kB | 74/181 kB | 4.1/44 kB
Progress (5): 2.1/2.6 MB | 191/426 kB | 92 kB | 74/181 kB | 4.1/44 kB
Progress (5): 2.1/2.6 MB | 191/426 kB | 92 kB | 74/181 kB | 7.7/44 kB
Progress (5): 2.1/2.6 MB | 195/426 kB | 92 kB | 74/181 kB | 7.7/44 kB
Progress (5): 2.1/2.6 MB | 195/426 kB | 92 kB | 78/181 kB | 7.7/44 kB
Progress (5): 2.1/2.6 MB | 199/426 kB | 92 kB | 78/181 kB | 7.7/44 kB
Progress (5): 2.1/2.6 MB | 199/426 kB | 92 kB | 78/181 kB | 12/44 kB 
Progress (5): 2.2/2.6 MB | 199/426 kB | 92 kB | 78/181 kB | 12/44 kB
Progress (5): 2.2/2.6 MB | 199/426 kB | 92 kB | 78/181 kB | 16/44 kB
Progress (5): 2.2/2.6 MB | 203/426 kB | 92 kB | 78/181 kB | 16/44 kB
Progress (5): 2.2/2.6 MB | 203/426 kB | 92 kB | 82/181 kB | 16/44 kB
Progress (5): 2.2/2.6 MB | 207/426 kB | 92 kB | 82/181 kB | 16/44 kB
Progress (5): 2.2/2.6 MB | 207/426 kB | 92 kB | 82/181 kB | 20/44 kB
Progress (5): 2.2/2.6 MB | 207/426 kB | 92 kB | 82/181 kB | 20/44 kB
Progress (5): 2.2/2.6 MB | 207/426 kB | 92 kB | 82/181 kB | 24/44 kB
Progress (5): 2.2/2.6 MB | 211/426 kB | 92 kB | 82/181 kB | 24/44 kB
Progress (5): 2.2/2.6 MB | 211/426 kB | 92 kB | 86/181 kB | 24/44 kB
Progress (5): 2.2/2.6 MB | 215/426 kB | 92 kB | 86/181 kB | 24/44 kB
Progress (5): 2.2/2.6 MB | 215/426 kB | 92 kB | 86/181 kB | 28/44 kB
Progress (5): 2.2/2.6 MB | 215/426 kB | 92 kB | 86/181 kB | 28/44 kB
Progress (5): 2.2/2.6 MB | 215/426 kB | 92 kB | 86/181 kB | 32/44 kB
Progress (5): 2.2/2.6 MB | 219/426 kB | 92 kB | 86/181 kB | 32/44 kB
Progress (5): 2.2/2.6 MB | 219/426 kB | 92 kB | 90/181 kB | 32/44 kB
Progress (5): 2.2/2.6 MB | 223/426 kB | 92 kB | 90/181 kB | 32/44 kB
Progress (5): 2.2/2.6 MB | 223/426 kB | 92 kB | 90/181 kB | 36/44 kB
Progress (5): 2.2/2.6 MB | 223/426 kB | 92 kB | 90/181 kB | 36/44 kB
Progress (5): 2.2/2.6 MB | 223/426 kB | 92 kB | 90/181 kB | 40/44 kB
Progress (5): 2.2/2.6 MB | 227/426 kB | 92 kB | 90/181 kB | 40/44 kB
Progress (5): 2.2/2.6 MB | 227/426 kB | 92 kB | 94/181 kB | 40/44 kB
Progress (5): 2.2/2.6 MB | 231/426 kB | 92 kB | 94/181 kB | 40/44 kB
Progress (5): 2.2/2.6 MB | 231/426 kB | 92 kB | 94/181 kB | 44/44 kB
Progress (5): 2.2/2.6 MB | 231/426 kB | 92 kB | 94/181 kB | 44/44 kB
Progress (5): 2.2/2.6 MB | 231/426 kB | 92 kB | 94/181 kB | 44 kB   
Progress (5): 2.2/2.6 MB | 235/426 kB | 92 kB | 94/181 kB | 44 kB
Progress (5): 2.2/2.6 MB | 235/426 kB | 92 kB | 98/181 kB | 44 kB
Progress (5): 2.2/2.6 MB | 239/426 kB | 92 kB | 98/181 kB | 44 kB
Progress (5): 2.2/2.6 MB | 239/426 kB | 92 kB | 98/181 kB | 44 kB
Progress (5): 2.2/2.6 MB | 243/426 kB | 92 kB | 98/181 kB | 44 kB
Progress (5): 2.2/2.6 MB | 243/426 kB | 92 kB | 98/181 kB | 44 kB
Progress (5): 2.2/2.6 MB | 247/426 kB | 92 kB | 98/181 kB | 44 kB
Progress (5): 2.2/2.6 MB | 247/426 kB | 92 kB | 98/181 kB | 44 kB
Progress (5): 2.2/2.6 MB | 251/426 kB | 92 kB | 98/181 kB | 44 kB
Progress (5): 2.2/2.6 MB | 251/426 kB | 92 kB | 102/181 kB | 44 kB
Progress (5): 2.2/2.6 MB | 255/426 kB | 92 kB | 102/181 kB | 44 kB
Progress (5): 2.2/2.6 MB | 255/426 kB | 92 kB | 102/181 kB | 44 kB
Progress (5): 2.2/2.6 MB | 259/426 kB | 92 kB | 102/181 kB | 44 kB
Progress (5): 2.2/2.6 MB | 259/426 kB | 92 kB | 106/181 kB | 44 kB
Progress (5): 2.2/2.6 MB | 263/426 kB | 92 kB | 106/181 kB | 44 kB
Progress (5): 2.2/2.6 MB | 263/426 kB | 92 kB | 106/181 kB | 44 kB
Progress (5): 2.2/2.6 MB | 267/426 kB | 92 kB | 106/181 kB | 44 kB
Progress (5): 2.2/2.6 MB | 267/426 kB | 92 kB | 110/181 kB | 44 kB
Progress (5): 2.2/2.6 MB | 271/426 kB | 92 kB | 110/181 kB | 44 kB
Progress (5): 2.2/2.6 MB | 271/426 kB | 92 kB | 110/181 kB | 44 kB
Progress (5): 2.2/2.6 MB | 275/426 kB | 92 kB | 110/181 kB | 44 kB
Progress (5): 2.2/2.6 MB | 275/426 kB | 92 kB | 114/181 kB | 44 kB
Progress (5): 2.2/2.6 MB | 279/426 kB | 92 kB | 114/181 kB | 44 kB
Progress (5): 2.2/2.6 MB | 279/426 kB | 92 kB | 114/181 kB | 44 kB
Progress (5): 2.2/2.6 MB | 283/426 kB | 92 kB | 114/181 kB | 44 kB
Progress (5): 2.2/2.6 MB | 283/426 kB | 92 kB | 118/181 kB | 44 kB
Progress (5): 2.2/2.6 MB | 287/426 kB | 92 kB | 118/181 kB | 44 kB
Progress (5): 2.2/2.6 MB | 287/426 kB | 92 kB | 118/181 kB | 44 kB
Progress (5): 2.2/2.6 MB | 291/426 kB | 92 kB | 118/181 kB | 44 kB
Progress (5): 2.2/2.6 MB | 291/426 kB | 92 kB | 122/181 kB | 44 kB
Progress (5): 2.2/2.6 MB | 295/426 kB | 92 kB | 122/181 kB | 44 kB
Progress (5): 2.2/2.6 MB | 295/426 kB | 92 kB | 122/181 kB | 44 kB
Progress (5): 2.2/2.6 MB | 299/426 kB | 92 kB | 122/181 kB | 44 kB
                                                                  
Downloaded from eclipse.maven.central.mirror: https://repo.eclipse.org/content/repositories/maven_central/com/squareup/okio/okio/1.17.3/okio-1.17.3.jar (92 kB at 86 kB/s)
Downloaded from eclipse.maven.central.mirror: https://repo.eclipse.org/content/repositories/maven_central/org/apache/maven/resolver/maven-resolver-connector-basic/1.4.1/maven-resolver-connector-basic-1.4.1.jar (44 kB at 41 kB/s)
Progress (3): 2.2/2.6 MB | 299/426 kB | 126/181 kB
                                                  
Downloading from eclipse.maven.central.mirror: https://repo.eclipse.org/content/repositories/maven_central/org/apache/maven/wagon/wagon-file/3.3.3/wagon-file-3.3.3.jar
Downloading from eclipse.maven.central.mirror: https://repo.eclipse.org/content/repositories/maven_central/org/apache/maven/resolver/maven-resolver-transport-wagon/1.4.1/maven-resolver-transport-wagon-1.4.1.jar
Progress (3): 2.2/2.6 MB | 303/426 kB | 126/181 kB
Progress (3): 2.2/2.6 MB | 303/426 kB | 126/181 kB
Progress (3): 2.2/2.6 MB | 307/426 kB | 126/181 kB
Progress (3): 2.2/2.6 MB | 307/426 kB | 130/181 kB
Progress (3): 2.2/2.6 MB | 311/426 kB | 130/181 kB
Progress (3): 2.2/2.6 MB | 311/426 kB | 130/181 kB
Progress (3): 2.2/2.6 MB | 315/426 kB | 130/181 kB
Progress (3): 2.2/2.6 MB | 315/426 kB | 131/181 kB
Progress (3): 2.2/2.6 MB | 319/426 kB | 131/181 kB
Progress (3): 2.2/2.6 MB | 319/426 kB | 131/181 kB
Progress (3): 2.2/2.6 MB | 323/426 kB | 131/181 kB
Progress (3): 2.2/2.6 MB | 323/426 kB | 135/181 kB
Progress (3): 2.2/2.6 MB | 323/426 kB | 135/181 kB
Progress (3): 2.2/2.6 MB | 323/426 kB | 139/181 kB
Progress (3): 2.2/2.6 MB | 323/426 kB | 139/181 kB
Progress (3): 2.2/2.6 MB | 327/426 kB | 139/181 kB
Progress (3): 2.2/2.6 MB | 327/426 kB | 143/181 kB
Progress (3): 2.2/2.6 MB | 327/426 kB | 143/181 kB
Progress (3): 2.2/2.6 MB | 327/426 kB | 147/181 kB
Progress (3): 2.2/2.6 MB | 331/426 kB | 147/181 kB
Progress (3): 2.2/2.6 MB | 331/426 kB | 147/181 kB
Progress (3): 2.2/2.6 MB | 331/426 kB | 151/181 kB
Progress (3): 2.2/2.6 MB | 335/426 kB | 151/181 kB
Progress (3): 2.2/2.6 MB | 335/426 kB | 151/181 kB
Progress (3): 2.2/2.6 MB | 339/426 kB | 151/181 kB
Progress (3): 2.2/2.6 MB | 339/426 kB | 155/181 kB
Progress (3): 2.2/2.6 MB | 339/426 kB | 155/181 kB
Progress (3): 2.2/2.6 MB | 343/426 kB | 155/181 kB
Progress (3): 2.2/2.6 MB | 343/426 kB | 159/181 kB
Progress (3): 2.2/2.6 MB | 343/426 kB | 159/181 kB
Progress (3): 2.2/2.6 MB | 343/426 kB | 163/181 kB
Progress (3): 2.2/2.6 MB | 347/426 kB | 163/181 kB
Progress (3): 2.2/2.6 MB | 347/426 kB | 163/181 kB
Progress (3): 2.2/2.6 MB | 347/426 kB | 167/181 kB
Progress (3): 2.2/2.6 MB | 351/426 kB | 167/181 kB
Progress (3): 2.2/2.6 MB | 351/426 kB | 167/181 kB
Progress (3): 2.2/2.6 MB | 355/426 kB | 167/181 kB
Progress (3): 2.2/2.6 MB | 355/426 kB | 171/181 kB
Progress (3): 2.3/2.6 MB | 355/426 kB | 171/181 kB
Progress (3): 2.3/2.6 MB | 359/426 kB | 171/181 kB
Progress (3): 2.3/2.6 MB | 359/426 kB | 171/181 kB
Progress (3): 2.3/2.6 MB | 359/426 kB | 175/181 kB
Progress (3): 2.3/2.6 MB | 359/426 kB | 175/181 kB
Progress (3): 2.3/2.6 MB | 363/426 kB | 175/181 kB
Progress (3): 2.3/2.6 MB | 363/426 kB | 175/181 kB
Progress (3): 2.3/2.6 MB | 363/426 kB | 179/181 kB
Progress (3): 2.3/2.6 MB | 367/426 kB | 179/181 kB
Progress (3): 2.3/2.6 MB | 367/426 kB | 181 kB    
Progress (3): 2.3/2.6 MB | 367/426 kB | 181 kB
Progress (3): 2.3/2.6 MB | 371/426 kB | 181 kB
Progress (3): 2.3/2.6 MB | 371/426 kB | 181 kB
Progress (4): 2.3/2.6 MB | 371/426 kB | 181 kB | 4.1/12 kB
Progress (4): 2.3/2.6 MB | 375/426 kB | 181 kB | 4.1/12 kB
Progress (4): 2.3/2.6 MB | 375/426 kB | 181 kB | 7.7/12 kB
Progress (4): 2.3/2.6 MB | 375/426 kB | 181 kB | 7.7/12 kB
Progress (4): 2.3/2.6 MB | 375/426 kB | 181 kB | 12 kB    
Progress (4): 2.3/2.6 MB | 379/426 kB | 181 kB | 12 kB
Progress (4): 2.3/2.6 MB | 379/426 kB | 181 kB | 12 kB
Progress (4): 2.3/2.6 MB | 383/426 kB | 181 kB | 12 kB
Progress (4): 2.3/2.6 MB | 383/426 kB | 181 kB | 12 kB
Progress (4): 2.3/2.6 MB | 387/426 kB | 181 kB | 12 kB
Progress (4): 2.3/2.6 MB | 387/426 kB | 181 kB | 12 kB
Progress (4): 2.3/2.6 MB | 391/426 kB | 181 kB | 12 kB
Progress (4): 2.3/2.6 MB | 391/426 kB | 181 kB | 12 kB
Progress (4): 2.3/2.6 MB | 395/426 kB | 181 kB | 12 kB
Progress (4): 2.3/2.6 MB | 395/426 kB | 181 kB | 12 kB
Progress (4): 2.3/2.6 MB | 399/426 kB | 181 kB | 12 kB
Progress (5): 2.3/2.6 MB | 399/426 kB | 181 kB | 12 kB | 4.1/31 kB
Progress (5): 2.3/2.6 MB | 399/426 kB | 181 kB | 12 kB | 4.1/31 kB
Progress (5): 2.3/2.6 MB | 399/426 kB | 181 kB | 12 kB | 7.7/31 kB
Progress (5): 2.3/2.6 MB | 403/426 kB | 181 kB | 12 kB | 7.7/31 kB
Progress (5): 2.3/2.6 MB | 403/426 kB | 181 kB | 12 kB | 12/31 kB 
Progress (5): 2.3/2.6 MB | 403/426 kB | 181 kB | 12 kB | 12/31 kB
Progress (5): 2.3/2.6 MB | 403/426 kB | 181 kB | 12 kB | 16/31 kB
Progress (5): 2.3/2.6 MB | 407/426 kB | 181 kB | 12 kB | 16/31 kB
Progress (5): 2.3/2.6 MB | 407/426 kB | 181 kB | 12 kB | 20/31 kB
Progress (5): 2.3/2.6 MB | 411/426 kB | 181 kB | 12 kB | 20/31 kB
Progress (5): 2.3/2.6 MB | 411/426 kB | 181 kB | 12 kB | 20/31 kB
Progress (5): 2.3/2.6 MB | 411/426 kB | 181 kB | 12 kB | 24/31 kB
Progress (5): 2.3/2.6 MB | 411/426 kB | 181 kB | 12 kB | 24/31 kB
Progress (5): 2.3/2.6 MB | 415/426 kB | 181 kB | 12 kB | 24/31 kB
Progress (5): 2.3/2.6 MB | 415/426 kB | 181 kB | 12 kB | 24/31 kB
Progress (5): 2.3/2.6 MB | 415/426 kB | 181 kB | 12 kB | 28/31 kB
Progress (5): 2.3/2.6 MB | 415/426 kB | 181 kB | 12 kB | 28/31 kB
Progress (5): 2.3/2.6 MB | 419/426 kB | 181 kB | 12 kB | 28/31 kB
Progress (5): 2.3/2.6 MB | 419/426 kB | 181 kB | 12 kB | 28/31 kB
Progress (5): 2.3/2.6 MB | 419/426 kB | 181 kB | 12 kB | 31 kB   
Progress (5): 2.3/2.6 MB | 419/426 kB | 181 kB | 12 kB | 31 kB
Progress (5): 2.3/2.6 MB | 423/426 kB | 181 kB | 12 kB | 31 kB
Progress (5): 2.3/2.6 MB | 423/426 kB | 181 kB | 12 kB | 31 kB
Progress (5): 2.3/2.6 MB | 426 kB | 181 kB | 12 kB | 31 kB    
Progress (5): 2.3/2.6 MB | 426 kB | 181 kB | 12 kB | 31 kB
                                                          
Downloaded from eclipse.maven.central.mirror: https://repo.eclipse.org/content/repositories/maven_central/org/apache/maven/wagon/wagon-file/3.3.3/wagon-file-3.3.3.jar (12 kB at 11 kB/s)
Progress (4): 2.3/2.6 MB | 426 kB | 181 kB | 31 kB
                                                  
Downloading from eclipse.maven.central.mirror: https://repo.eclipse.org/content/repositories/maven_central/org/fusesource/jansi/jansi/1.17.1/jansi-1.17.1.jar
Downloaded from eclipse.maven.central.mirror: https://repo.eclipse.org/content/repositories/maven_central/org/apache/maven/resolver/maven-resolver-impl/1.4.1/maven-resolver-impl-1.4.1.jar (181 kB at 165 kB/s)
Progress (3): 2.3/2.6 MB | 426 kB | 31 kB
Progress (3): 2.3/2.6 MB | 426 kB | 31 kB
Progress (3): 2.4/2.6 MB | 426 kB | 31 kB
Progress (3): 2.4/2.6 MB | 426 kB | 31 kB
Progress (3): 2.4/2.6 MB | 426 kB | 31 kB
Progress (3): 2.4/2.6 MB | 426 kB | 31 kB
Progress (3): 2.4/2.6 MB | 426 kB | 31 kB
Progress (3): 2.4/2.6 MB | 426 kB | 31 kB
Progress (3): 2.4/2.6 MB | 426 kB | 31 kB
Progress (3): 2.4/2.6 MB | 426 kB | 31 kB
Progress (3): 2.4/2.6 MB | 426 kB | 31 kB
Progress (3): 2.4/2.6 MB | 426 kB | 31 kB
Progress (3): 2.4/2.6 MB | 426 kB | 31 kB
Progress (3): 2.4/2.6 MB | 426 kB | 31 kB
Progress (3): 2.4/2.6 MB | 426 kB | 31 kB
Progress (3): 2.4/2.6 MB | 426 kB | 31 kB
Progress (3): 2.4/2.6 MB | 426 kB | 31 kB
Progress (3): 2.4/2.6 MB | 426 kB | 31 kB
Progress (3): 2.4/2.6 MB | 426 kB | 31 kB
Progress (3): 2.4/2.6 MB | 426 kB | 31 kB
Progress (3): 2.4/2.6 MB | 426 kB | 31 kB
Progress (3): 2.4/2.6 MB | 426 kB | 31 kB
Progress (3): 2.4/2.6 MB | 426 kB | 31 kB
Progress (3): 2.4/2.6 MB | 426 kB | 31 kB
Progress (3): 2.4/2.6 MB | 426 kB | 31 kB
Progress (3): 2.4/2.6 MB | 426 kB | 31 kB
Progress (3): 2.4/2.6 MB | 426 kB | 31 kB
Progress (3): 2.5/2.6 MB | 426 kB | 31 kB
Progress (3): 2.5/2.6 MB | 426 kB | 31 kB
Progress (3): 2.5/2.6 MB | 426 kB | 31 kB
Progress (3): 2.5/2.6 MB | 426 kB | 31 kB
                                         
Downloaded from eclipse.maven.central.mirror: https://repo.eclipse.org/content/repositories/maven_central/org/apache/maven/resolver/maven-resolver-transport-wagon/1.4.1/maven-resolver-transport-wagon-1.4.1.jar (31 kB at 28 kB/s)
Progress (2): 2.5/2.6 MB | 426 kB
                                 
Downloaded from eclipse.maven.central.mirror: https://repo.eclipse.org/content/repositories/maven_central/com/squareup/okhttp3/okhttp/3.14.1/okhttp-3.14.1.jar (426 kB at 386 kB/s)
Progress (1): 2.5/2.6 MB
Progress (1): 2.5/2.6 MB
Progress (1): 2.5/2.6 MB
Progress (1): 2.5/2.6 MB
Progress (1): 2.5/2.6 MB
Progress (1): 2.5/2.6 MB
Progress (2): 2.5/2.6 MB | 4.1/284 kB
Progress (2): 2.5/2.6 MB | 4.1/284 kB
Progress (2): 2.5/2.6 MB | 7.7/284 kB
Progress (2): 2.5/2.6 MB | 7.7/284 kB
Progress (2): 2.5/2.6 MB | 7.7/284 kB
Progress (2): 2.5/2.6 MB | 12/284 kB 
Progress (2): 2.5/2.6 MB | 12/284 kB
Progress (2): 2.5/2.6 MB | 16/284 kB
Progress (2): 2.5/2.6 MB | 16/284 kB
Progress (2): 2.5/2.6 MB | 20/284 kB
Progress (2): 2.5/2.6 MB | 20/284 kB
Progress (2): 2.5/2.6 MB | 24/284 kB
Progress (2): 2.5/2.6 MB | 24/284 kB
Progress (2): 2.5/2.6 MB | 24/284 kB
Progress (2): 2.5/2.6 MB | 24/284 kB
Progress (2): 2.5/2.6 MB | 24/284 kB
Progress (2): 2.5/2.6 MB | 24/284 kB
Progress (2): 2.5/2.6 MB | 24/284 kB
Progress (2): 2.5/2.6 MB | 24/284 kB
Progress (2): 2.5/2.6 MB | 24/284 kB
Progress (2): 2.6/2.6 MB | 24/284 kB
Progress (2): 2.6/2.6 MB | 24/284 kB
Progress (2): 2.6/2.6 MB | 24/284 kB
Progress (2): 2.6/2.6 MB | 24/284 kB
Progress (2): 2.6/2.6 MB | 24/284 kB
Progress (2): 2.6/2.6 MB | 24/284 kB
Progress (2): 2.6/2.6 MB | 24/284 kB
Progress (2): 2.6/2.6 MB | 28/284 kB
Progress (2): 2.6/2.6 MB | 28/284 kB
Progress (2): 2.6/2.6 MB | 32/284 kB
Progress (2): 2.6/2.6 MB | 32/284 kB
Progress (2): 2.6/2.6 MB | 33/284 kB
Progress (2): 2.6/2.6 MB | 33/284 kB
Progress (2): 2.6/2.6 MB | 37/284 kB
Progress (2): 2.6 MB | 37/284 kB    
Progress (2): 2.6 MB | 41/284 kB
Progress (2): 2.6 MB | 45/284 kB
Progress (2): 2.6 MB | 49/284 kB
Progress (2): 2.6 MB | 53/284 kB
Progress (2): 2.6 MB | 57/284 kB
Progress (2): 2.6 MB | 61/284 kB
Progress (2): 2.6 MB | 65/284 kB
Progress (2): 2.6 MB | 66/284 kB
Progress (2): 2.6 MB | 70/284 kB
Progress (2): 2.6 MB | 74/284 kB
Progress (2): 2.6 MB | 78/284 kB
Progress (2): 2.6 MB | 82/284 kB
Progress (2): 2.6 MB | 86/284 kB
Progress (2): 2.6 MB | 90/284 kB
Progress (2): 2.6 MB | 94/284 kB
Progress (2): 2.6 MB | 98/284 kB
Progress (2): 2.6 MB | 98/284 kB
Progress (2): 2.6 MB | 102/284 kB
Progress (2): 2.6 MB | 106/284 kB
Progress (2): 2.6 MB | 110/284 kB
Progress (2): 2.6 MB | 114/284 kB
Progress (2): 2.6 MB | 118/284 kB
Progress (2): 2.6 MB | 122/284 kB
Progress (2): 2.6 MB | 126/284 kB
Progress (2): 2.6 MB | 130/284 kB
Progress (2): 2.6 MB | 131/284 kB
                                 
Downloaded from eclipse.maven.central.mirror: https://repo.eclipse.org/content/repositories/maven_central/com/google/guava/guava/25.1-android/guava-25.1-android.jar (2.6 MB at 2.2 MB/s)
Progress (1): 135/284 kB
Progress (1): 139/284 kB
Progress (1): 143/284 kB
Progress (1): 147/284 kB
Progress (1): 151/284 kB
Progress (1): 155/284 kB
Progress (1): 159/284 kB
Progress (1): 163/284 kB
Progress (1): 164/284 kB
Progress (1): 168/284 kB
Progress (1): 172/284 kB
Progress (1): 176/284 kB
Progress (1): 180/284 kB
Progress (1): 184/284 kB
Progress (1): 188/284 kB
Progress (1): 192/284 kB
Progress (1): 196/284 kB
Progress (1): 197/284 kB
Progress (1): 201/284 kB
Progress (1): 205/284 kB
Progress (1): 209/284 kB
Progress (1): 213/284 kB
Progress (1): 217/284 kB
Progress (1): 221/284 kB
Progress (1): 225/284 kB
Progress (1): 229/284 kB
Progress (1): 229/284 kB
Progress (1): 233/284 kB
Progress (1): 237/284 kB
Progress (1): 241/284 kB
Progress (1): 245/284 kB
Progress (1): 249/284 kB
Progress (1): 253/284 kB
Progress (1): 257/284 kB
Progress (1): 261/284 kB
Progress (1): 265/284 kB
Progress (1): 269/284 kB
Progress (1): 273/284 kB
Progress (1): 277/284 kB
Progress (1): 281/284 kB
Progress (1): 284 kB    
                    
Downloaded from eclipse.maven.central.mirror: https://repo.eclipse.org/content/repositories/maven_central/org/fusesource/jansi/jansi/1.17.1/jansi-1.17.1.jar (284 kB at 237 kB/s)
[INFO] 
[INFO] --- maven-clean-plugin:2.4.1:clean (default-clean) @ org.eclipse.m2e.maven.runtime ---
[INFO] 
[INFO] --- maven-resources-plugin:2.5:resources (default-resources) @ org.eclipse.m2e.maven.runtime ---
[debug] execute contextualize
[INFO] Using 'UTF-8' encoding to copy filtered resources.
[INFO] Copying 3 resources
[INFO] 
[INFO] --- maven-compiler-plugin:3.8.1:compile (default-compile) @ org.eclipse.m2e.maven.runtime ---
[INFO] No sources to compile
[INFO] 
[INFO] --- maven-resources-plugin:2.5:testResources (default-testResources) @ org.eclipse.m2e.maven.runtime ---
[debug] execute contextualize
[INFO] Using 'UTF-8' encoding to copy filtered resources.
[INFO] skip non existing resourceDirectory /home/jenkins/agent/workspace/m2e-gerrit/m2e-maven-runtime/org.eclipse.m2e.maven.runtime/src/test/resources
[INFO] 
[INFO] --- maven-compiler-plugin:3.8.1:testCompile (default-testCompile) @ org.eclipse.m2e.maven.runtime ---
[INFO] No sources to compile
[INFO] 
[INFO] --- maven-surefire-plugin:2.8:test (default-test) @ org.eclipse.m2e.maven.runtime ---
[INFO] No tests to run.
[INFO] Surefire report directory: /home/jenkins/agent/workspace/m2e-gerrit/m2e-maven-runtime/org.eclipse.m2e.maven.runtime/target/surefire-reports

-------------------------------------------------------
 T E S T S
-------------------------------------------------------
There are no tests to run.

Results :

Tests run: 0, Failures: 0, Errors: 0, Skipped: 0

[INFO] 
[INFO] --- maven-bundle-plugin:4.2.0:bundle (default-bundle) @ org.eclipse.m2e.maven.runtime ---
[WARNING] Bundle org.eclipse.m2e:org.eclipse.m2e.maven.runtime:bundle:1.14.0-SNAPSHOT : Version for package org.eclipse.aether is set to different values in the source (1.1.1) and in the manifest (1.4.1). The version in the manifest is not picked up by an other sibling bundles in this project or projects that directly depend on this project
[WARNING] Bundle org.eclipse.m2e:org.eclipse.m2e.maven.runtime:bundle:1.14.0-SNAPSHOT : Version for package org.eclipse.aether.artifact is set to different values in the source (1.1.1) and in the manifest (1.4.1). The version in the manifest is not picked up by an other sibling bundles in this project or projects that directly depend on this project
[WARNING] Bundle org.eclipse.m2e:org.eclipse.m2e.maven.runtime:bundle:1.14.0-SNAPSHOT : Version for package org.eclipse.aether.collection is set to different values in the source (1.1.1) and in the manifest (1.4.1). The version in the manifest is not picked up by an other sibling bundles in this project or projects that directly depend on this project
[WARNING] Bundle org.eclipse.m2e:org.eclipse.m2e.maven.runtime:bundle:1.14.0-SNAPSHOT : Version for package org.eclipse.aether.connector.basic is set to different values in the source (1.1.1) and in the manifest (1.4.1). The version in the manifest is not picked up by an other sibling bundles in this project or projects that directly depend on this project
[WARNING] Bundle org.eclipse.m2e:org.eclipse.m2e.maven.runtime:bundle:1.14.0-SNAPSHOT : Version for package org.eclipse.aether.deployment is set to different values in the source (1.1.1) and in the manifest (1.4.1). The version in the manifest is not picked up by an other sibling bundles in this project or projects that directly depend on this project
[WARNING] Bundle org.eclipse.m2e:org.eclipse.m2e.maven.runtime:bundle:1.14.0-SNAPSHOT : Version for package org.eclipse.aether.graph is set to different values in the source (1.1.1) and in the manifest (1.4.1). The version in the manifest is not picked up by an other sibling bundles in this project or projects that directly depend on this project
[WARNING] Bundle org.eclipse.m2e:org.eclipse.m2e.maven.runtime:bundle:1.14.0-SNAPSHOT : Version for package org.eclipse.aether.impl is set to different values in the source (1.1.1) and in the manifest (1.4.1). The version in the manifest is not picked up by an other sibling bundles in this project or projects that directly depend on this project
[WARNING] Bundle org.eclipse.m2e:org.eclipse.m2e.maven.runtime:bundle:1.14.0-SNAPSHOT : Version for package org.eclipse.aether.impl.guice is set to different values in the source (1.1.1) and in the manifest (1.4.1). The version in the manifest is not picked up by an other sibling bundles in this project or projects that directly depend on this project
[WARNING] Bundle org.eclipse.m2e:org.eclipse.m2e.maven.runtime:bundle:1.14.0-SNAPSHOT : Version for package org.eclipse.aether.installation is set to different values in the source (1.1.1) and in the manifest (1.4.1). The version in the manifest is not picked up by an other sibling bundles in this project or projects that directly depend on this project
[WARNING] Bundle org.eclipse.m2e:org.eclipse.m2e.maven.runtime:bundle:1.14.0-SNAPSHOT : Version for package org.eclipse.aether.metadata is set to different values in the source (1.1.1) and in the manifest (1.4.1). The version in the manifest is not picked up by an other sibling bundles in this project or projects that directly depend on this project
[WARNING] Bundle org.eclipse.m2e:org.eclipse.m2e.maven.runtime:bundle:1.14.0-SNAPSHOT : Version for package org.eclipse.aether.repository is set to different values in the source (1.1.1) and in the manifest (1.4.1). The version in the manifest is not picked up by an other sibling bundles in this project or projects that directly depend on this project
[WARNING] Bundle org.eclipse.m2e:org.eclipse.m2e.maven.runtime:bundle:1.14.0-SNAPSHOT : Version for package org.eclipse.aether.resolution is set to different values in the source (1.1.1) and in the manifest (1.4.1). The version in the manifest is not picked up by an other sibling bundles in this project or projects that directly depend on this project
[WARNING] Bundle org.eclipse.m2e:org.eclipse.m2e.maven.runtime:bundle:1.14.0-SNAPSHOT : Version for package org.eclipse.aether.spi.connector is set to different values in the source (1.1.1) and in the manifest (1.4.1). The version in the manifest is not picked up by an other sibling bundles in this project or projects that directly depend on this project
[WARNING] Bundle org.eclipse.m2e:org.eclipse.m2e.maven.runtime:bundle:1.14.0-SNAPSHOT : Version for package org.eclipse.aether.spi.connector.checksum is set to different values in the source (1.1.1) and in the manifest (1.4.1). The version in the manifest is not picked up by an other sibling bundles in this project or projects that directly depend on this project
[WARNING] Bundle org.eclipse.m2e:org.eclipse.m2e.maven.runtime:bundle:1.14.0-SNAPSHOT : Version for package org.eclipse.aether.spi.connector.layout is set to different values in the source (1.1.1) and in the manifest (1.4.1). The version in the manifest is not picked up by an other sibling bundles in this project or projects that directly depend on this project
[WARNING] Bundle org.eclipse.m2e:org.eclipse.m2e.maven.runtime:bundle:1.14.0-SNAPSHOT : Version for package org.eclipse.aether.spi.connector.transport is set to different values in the source (1.1.1) and in the manifest (1.4.1). The version in the manifest is not picked up by an other sibling bundles in this project or projects that directly depend on this project
[WARNING] Bundle org.eclipse.m2e:org.eclipse.m2e.maven.runtime:bundle:1.14.0-SNAPSHOT : Version for package org.eclipse.aether.spi.io is set to different values in the source (1.1.1) and in the manifest (1.4.1). The version in the manifest is not picked up by an other sibling bundles in this project or projects that directly depend on this project
[WARNING] Bundle org.eclipse.m2e:org.eclipse.m2e.maven.runtime:bundle:1.14.0-SNAPSHOT : Version for package org.eclipse.aether.spi.localrepo is set to different values in the source (1.1.1) and in the manifest (1.4.1). The version in the manifest is not picked up by an other sibling bundles in this project or projects that directly depend on this project
[WARNING] Bundle org.eclipse.m2e:org.eclipse.m2e.maven.runtime:bundle:1.14.0-SNAPSHOT : Version for package org.eclipse.aether.spi.locator is set to different values in the source (1.1.1) and in the manifest (1.4.1). The version in the manifest is not picked up by an other sibling bundles in this project or projects that directly depend on this project
[WARNING] Bundle org.eclipse.m2e:org.eclipse.m2e.maven.runtime:bundle:1.14.0-SNAPSHOT : Version for package org.eclipse.aether.spi.log is set to different values in the source (1.1.1) and in the manifest (1.4.1). The version in the manifest is not picked up by an other sibling bundles in this project or projects that directly depend on this project
[WARNING] Bundle org.eclipse.m2e:org.eclipse.m2e.maven.runtime:bundle:1.14.0-SNAPSHOT : Version for package org.eclipse.aether.transfer is set to different values in the source (1.1.1) and in the manifest (1.4.1). The version in the manifest is not picked up by an other sibling bundles in this project or projects that directly depend on this project
[WARNING] Bundle org.eclipse.m2e:org.eclipse.m2e.maven.runtime:bundle:1.14.0-SNAPSHOT : Version for package org.eclipse.aether.transform is set to different values in the source (1.1.1) and in the manifest (1.4.1). The version in the manifest is not picked up by an other sibling bundles in this project or projects that directly depend on this project
[WARNING] Bundle org.eclipse.m2e:org.eclipse.m2e.maven.runtime:bundle:1.14.0-SNAPSHOT : Version for package org.eclipse.aether.transport.wagon is set to different values in the source (1.1.1) and in the manifest (1.4.1). The version in the manifest is not picked up by an other sibling bundles in this project or projects that directly depend on this project
[WARNING] Bundle org.eclipse.m2e:org.eclipse.m2e.maven.runtime:bundle:1.14.0-SNAPSHOT : Version for package org.eclipse.aether.util is set to different values in the source (1.1.1) and in the manifest (1.4.1). The version in the manifest is not picked up by an other sibling bundles in this project or projects that directly depend on this project
[WARNING] Bundle org.eclipse.m2e:org.eclipse.m2e.maven.runtime:bundle:1.14.0-SNAPSHOT : Version for package org.eclipse.aether.util.artifact is set to different values in the source (1.1.1) and in the manifest (1.4.1). The version in the manifest is not picked up by an other sibling bundles in this project or projects that directly depend on this project
[WARNING] Bundle org.eclipse.m2e:org.eclipse.m2e.maven.runtime:bundle:1.14.0-SNAPSHOT : Version for package org.eclipse.aether.util.concurrency is set to different values in the source (1.1.1) and in the manifest (1.4.1). The version in the manifest is not picked up by an other sibling bundles in this project or projects that directly depend on this project
[WARNING] Bundle org.eclipse.m2e:org.eclipse.m2e.maven.runtime:bundle:1.14.0-SNAPSHOT : Version for package org.eclipse.aether.util.filter is set to different values in the source (1.1.1) and in the manifest (1.4.1). The version in the manifest is not picked up by an other sibling bundles in this project or projects that directly depend on this project
[WARNING] Bundle org.eclipse.m2e:org.eclipse.m2e.maven.runtime:bundle:1.14.0-SNAPSHOT : Version for package org.eclipse.aether.util.graph.manager is set to different values in the source (1.1.1) and in the manifest (1.4.1). The version in the manifest is not picked up by an other sibling bundles in this project or projects that directly depend on this project
[WARNING] Bundle org.eclipse.m2e:org.eclipse.m2e.maven.runtime:bundle:1.14.0-SNAPSHOT : Version for package org.eclipse.aether.util.graph.selector is set to different values in the source (1.1.1) and in the manifest (1.4.1). The version in the manifest is not picked up by an other sibling bundles in this project or projects that directly depend on this project
[WARNING] Bundle org.eclipse.m2e:org.eclipse.m2e.maven.runtime:bundle:1.14.0-SNAPSHOT : Version for package org.eclipse.aether.util.graph.transformer is set to different values in the source (1.1.1) and in the manifest (1.4.1). The version in the manifest is not picked up by an other sibling bundles in this project or projects that directly depend on this project
[WARNING] Bundle org.eclipse.m2e:org.eclipse.m2e.maven.runtime:bundle:1.14.0-SNAPSHOT : Version for package org.eclipse.aether.util.graph.traverser is set to different values in the source (1.1.1) and in the manifest (1.4.1). The version in the manifest is not picked up by an other sibling bundles in this project or projects that directly depend on this project
[WARNING] Bundle org.eclipse.m2e:org.eclipse.m2e.maven.runtime:bundle:1.14.0-SNAPSHOT : Version for package org.eclipse.aether.util.graph.version is set to different values in the source (1.1.1) and in the manifest (1.4.1). The version in the manifest is not picked up by an other sibling bundles in this project or projects that directly depend on this project
[WARNING] Bundle org.eclipse.m2e:org.eclipse.m2e.maven.runtime:bundle:1.14.0-SNAPSHOT : Version for package org.eclipse.aether.util.graph.visitor is set to different values in the source (1.1.1) and in the manifest (1.4.1). The version in the manifest is not picked up by an other sibling bundles in this project or projects that directly depend on this project
[WARNING] Bundle org.eclipse.m2e:org.eclipse.m2e.maven.runtime:bundle:1.14.0-SNAPSHOT : Version for package org.eclipse.aether.util.listener is set to different values in the source (1.1.1) and in the manifest (1.4.1). The version in the manifest is not picked up by an other sibling bundles in this project or projects that directly depend on this project
[WARNING] Bundle org.eclipse.m2e:org.eclipse.m2e.maven.runtime:bundle:1.14.0-SNAPSHOT : Version for package org.eclipse.aether.util.repository is set to different values in the source (1.1.1) and in the manifest (1.4.1). The version in the manifest is not picked up by an other sibling bundles in this project or projects that directly depend on this project
[WARNING] Bundle org.eclipse.m2e:org.eclipse.m2e.maven.runtime:bundle:1.14.0-SNAPSHOT : Version for package org.eclipse.aether.util.version is set to different values in the source (1.1.1) and in the manifest (1.4.1). The version in the manifest is not picked up by an other sibling bundles in this project or projects that directly depend on this project
[WARNING] Bundle org.eclipse.m2e:org.eclipse.m2e.maven.runtime:bundle:1.14.0-SNAPSHOT : Version for package org.eclipse.aether.version is set to different values in the source (1.1.1) and in the manifest (1.4.1). The version in the manifest is not picked up by an other sibling bundles in this project or projects that directly depend on this project
[WARNING] Bundle org.eclipse.m2e:org.eclipse.m2e.maven.runtime:bundle:1.14.0-SNAPSHOT : Host org.eclipse.m2e.maven.runtime.slf4j.simple=bundle-version="[1.14.0,1.15.0)" for this fragment/require bundle cannot be found on the classpath
[WARNING] Bundle org.eclipse.m2e:org.eclipse.m2e.maven.runtime:bundle:1.14.0-SNAPSHOT : Host javax.inject=bundle-version="1.0.0";visibility:=reexport for this fragment/require bundle cannot be found on the classpath
[WARNING] Bundle org.eclipse.m2e:org.eclipse.m2e.maven.runtime:bundle:1.14.0-SNAPSHOT : Export org.apache.maven.cli,  has 1,  private references [org.apache.commons.cli]
[WARNING] Bundle org.eclipse.m2e:org.eclipse.m2e.maven.runtime:bundle:1.14.0-SNAPSHOT : Export org.apache.maven.extension.internal,  has 1,  private references [org.eclipse.sisu]
[WARNING] Bundle org.eclipse.m2e:org.eclipse.m2e.maven.runtime:bundle:1.14.0-SNAPSHOT : Export org.apache.maven.model.building,  has 1,  private references [org.eclipse.sisu]
[WARNING] Bundle org.eclipse.m2e:org.eclipse.m2e.maven.runtime:bundle:1.14.0-SNAPSHOT : Export org.apache.maven.shared.utils,  has 1,  private references [javax.annotation]
[WARNING] Bundle org.eclipse.m2e:org.eclipse.m2e.maven.runtime:bundle:1.14.0-SNAPSHOT : Export org.apache.maven.shared.utils.cli,  has 1,  private references [javax.annotation]
[WARNING] Bundle org.eclipse.m2e:org.eclipse.m2e.maven.runtime:bundle:1.14.0-SNAPSHOT : Export org.apache.maven.shared.utils.introspection,  has 1,  private references [javax.annotation]
[WARNING] Bundle org.eclipse.m2e:org.eclipse.m2e.maven.runtime:bundle:1.14.0-SNAPSHOT : Export org.apache.maven.shared.utils.io,  has 1,  private references [javax.annotation]
[WARNING] Bundle org.eclipse.m2e:org.eclipse.m2e.maven.runtime:bundle:1.14.0-SNAPSHOT : Export org.apache.maven.shared.utils.xml,  has 2,  private references [javax.annotation, org.apache.commons.io.output]
[WARNING] Bundle org.eclipse.m2e:org.eclipse.m2e.maven.runtime:bundle:1.14.0-SNAPSHOT : Export org.codehaus.plexus,  has 1,  private references [org.eclipse.sisu.plexus]
[WARNING] Bundle org.eclipse.m2e:org.eclipse.m2e.maven.runtime:bundle:1.14.0-SNAPSHOT : Export org.codehaus.plexus.component.configurator.converters.special,  has 1,  private references [org.codehaus.classworlds]
[WARNING] Bundle org.eclipse.m2e:org.eclipse.m2e.maven.runtime:bundle:1.14.0-SNAPSHOT : Export org.codehaus.plexus.component.factory,  has 1,  private references [org.codehaus.classworlds]
[WARNING] Bundle org.eclipse.m2e:org.eclipse.m2e.maven.runtime:bundle:1.14.0-SNAPSHOT : Export org.codehaus.plexus.logging,  has 1,  private references [org.eclipse.sisu.bean]
[WARNING] Bundle org.eclipse.m2e:org.eclipse.m2e.maven.runtime:bundle:1.14.0-SNAPSHOT : Export org.sonatype.plexus.components.cipher,  has 1,  private references [javax.enterprise.inject]
[WARNING] Bundle org.eclipse.m2e:org.eclipse.m2e.maven.runtime:bundle:1.14.0-SNAPSHOT : Export io.takari.aether.connector,  has 1,  private references [org.eclipse.sisu]
[WARNING] Bundle org.eclipse.m2e:org.eclipse.m2e.maven.runtime:bundle:1.14.0-SNAPSHOT : Invalid package name: 'META-INF.plexus' in Export-Package
[WARNING] Bundle org.eclipse.m2e:org.eclipse.m2e.maven.runtime:bundle:1.14.0-SNAPSHOT : Invalid package name: 'META-INF.sisu' in Export-Package
[INFO] 
[INFO] --- tycho-p2-plugin:1.4.0:p2-metadata (p2-metadata) @ org.eclipse.m2e.maven.runtime ---
[INFO] 
[INFO] --- tycho-p2-plugin:1.4.0:update-local-index (p2-metadata) @ org.eclipse.m2e.maven.runtime ---
[INFO] 
[INFO] --- tycho-pack200a-plugin:1.4.0:normalize (pack200-normalize) @ org.eclipse.m2e.maven.runtime ---
[INFO] Pack200 normalizing jar /home/jenkins/agent/workspace/m2e-gerrit/m2e-maven-runtime/org.eclipse.m2e.maven.runtime/target/org.eclipse.m2e.maven.runtime-1.14.0-SNAPSHOT.jar
[INFO] 
[INFO] --- eclipse-jarsigner-plugin:1.1.5:sign (sign) @ org.eclipse.m2e.maven.runtime ---
[INFO] Signing of nested jars of '/home/jenkins/agent/workspace/m2e-gerrit/m2e-maven-runtime/org.eclipse.m2e.maven.runtime/target/org.eclipse.m2e.maven.runtime-1.14.0-SNAPSHOT.jar' is disabled.
[INFO] Signing jar: /home/jenkins/agent/workspace/m2e-gerrit/m2e-maven-runtime/org.eclipse.m2e.maven.runtime/target/org.eclipse.m2e.maven.runtime-1.14.0-SNAPSHOT.jar
[INFO] 
[INFO] --- tycho-pack200b-plugin:1.4.0:pack (pack200-pack) @ org.eclipse.m2e.maven.runtime ---
[INFO] Pack200 packing jar /home/jenkins/agent/workspace/m2e-gerrit/m2e-maven-runtime/org.eclipse.m2e.maven.runtime/target/org.eclipse.m2e.maven.runtime-1.14.0-SNAPSHOT.jar
[INFO] 
[INFO] --- maven-install-plugin:2.3.1:install (default-install) @ org.eclipse.m2e.maven.runtime ---
[INFO] Installing /home/jenkins/agent/workspace/m2e-gerrit/m2e-maven-runtime/org.eclipse.m2e.maven.runtime/target/org.eclipse.m2e.maven.runtime-1.14.0-SNAPSHOT.jar to /home/jenkins/agent/workspace/m2e-gerrit/.repository/org/eclipse/m2e/org.eclipse.m2e.maven.runtime/1.14.0-SNAPSHOT/org.eclipse.m2e.maven.runtime-1.14.0-SNAPSHOT.jar
[INFO] Installing /home/jenkins/agent/workspace/m2e-gerrit/m2e-maven-runtime/org.eclipse.m2e.maven.runtime/pom.xml to /home/jenkins/agent/workspace/m2e-gerrit/.repository/org/eclipse/m2e/org.eclipse.m2e.maven.runtime/1.14.0-SNAPSHOT/org.eclipse.m2e.maven.runtime-1.14.0-SNAPSHOT.pom
[INFO] Installing /home/jenkins/agent/workspace/m2e-gerrit/m2e-maven-runtime/org.eclipse.m2e.maven.runtime/target/org.eclipse.m2e.maven.runtime-1.14.0-SNAPSHOT.jar.pack.gz to /home/jenkins/agent/workspace/m2e-gerrit/.repository/org/eclipse/m2e/org.eclipse.m2e.maven.runtime/1.14.0-SNAPSHOT/org.eclipse.m2e.maven.runtime-1.14.0-SNAPSHOT-pack200.jar.pack.gz
[INFO] 
[INFO] --- maven-bundle-plugin:4.2.0:install (default-install) @ org.eclipse.m2e.maven.runtime ---
[INFO] Installing org/eclipse/m2e/org.eclipse.m2e.maven.runtime/1.14.0-SNAPSHOT/org.eclipse.m2e.maven.runtime-1.14.0-SNAPSHOT.jar
[INFO] Writing OBR metadata
[INFO] 
[INFO] -----< org.eclipse.m2e:org.eclipse.m2e.maven.runtime.slf4j.simple >-----
[INFO] Building org.eclipse.m2e.maven.runtime.slf4j.simple 1.14.0-SNAPSHOT [5/5]
[INFO] -------------------------------[ bundle ]-------------------------------
Downloading from maven-3.6.2-staging: https://repository.apache.org/content/repositories/maven-1529/org/slf4j/slf4j-simple/1.7.5/slf4j-simple-1.7.5.pom
Downloading from eclipse.maven.central.mirror: https://repo.eclipse.org/content/repositories/maven_central/org/slf4j/slf4j-simple/1.7.5/slf4j-simple-1.7.5.pom
Progress (1): 1.5 kB
                    
Downloaded from eclipse.maven.central.mirror: https://repo.eclipse.org/content/repositories/maven_central/org/slf4j/slf4j-simple/1.7.5/slf4j-simple-1.7.5.pom (1.5 kB at 67 kB/s)
Downloading from maven-3.6.2-staging: https://repository.apache.org/content/repositories/maven-1529/org/slf4j/slf4j-parent/1.7.5/slf4j-parent-1.7.5.pom
Downloading from eclipse.maven.central.mirror: https://repo.eclipse.org/content/repositories/maven_central/org/slf4j/slf4j-parent/1.7.5/slf4j-parent-1.7.5.pom
Progress (1): 4.1/12 kB
Progress (1): 7.7/12 kB
Progress (1): 12/12 kB 
Progress (1): 12 kB   
                   
Downloaded from eclipse.maven.central.mirror: https://repo.eclipse.org/content/repositories/maven_central/org/slf4j/slf4j-parent/1.7.5/slf4j-parent-1.7.5.pom (12 kB at 656 kB/s)
Downloading from maven-3.6.2-staging: https://repository.apache.org/content/repositories/maven-1529/org/slf4j/slf4j-api/1.7.5/slf4j-api-1.7.5.pom
Downloading from eclipse.maven.central.mirror: https://repo.eclipse.org/content/repositories/maven_central/org/slf4j/slf4j-api/1.7.5/slf4j-api-1.7.5.pom
Progress (1): 2.7 kB
                    
Downloaded from eclipse.maven.central.mirror: https://repo.eclipse.org/content/repositories/maven_central/org/slf4j/slf4j-api/1.7.5/slf4j-api-1.7.5.pom (2.7 kB at 142 kB/s)
Downloading from maven-3.6.2-staging: https://repository.apache.org/content/repositories/maven-1529/org/slf4j/slf4j-simple/1.7.5/slf4j-simple-1.7.5.jar
Downloading from maven-3.6.2-staging: https://repository.apache.org/content/repositories/maven-1529/org/slf4j/slf4j-api/1.7.5/slf4j-api-1.7.5.jar
Downloading from eclipse.maven.central.mirror: https://repo.eclipse.org/content/repositories/maven_central/org/slf4j/slf4j-simple/1.7.5/slf4j-simple-1.7.5.jar
Downloading from eclipse.maven.central.mirror: https://repo.eclipse.org/content/repositories/maven_central/org/slf4j/slf4j-api/1.7.5/slf4j-api-1.7.5.jar
Progress (1): 4.1/11 kB
Progress (1): 7.7/11 kB
Progress (1): 11 kB    
Progress (2): 11 kB | 4.1/26 kB
Progress (2): 11 kB | 7.7/26 kB
Progress (2): 11 kB | 12/26 kB 
Progress (2): 11 kB | 16/26 kB
Progress (2): 11 kB | 20/26 kB
Progress (2): 11 kB | 24/26 kB
Progress (2): 11 kB | 26 kB   
                           
Downloaded from eclipse.maven.central.mirror: https://repo.eclipse.org/content/repositories/maven_central/org/slf4j/slf4j-simple/1.7.5/slf4j-simple-1.7.5.jar (11 kB at 509 kB/s)
Downloaded from eclipse.maven.central.mirror: https://repo.eclipse.org/content/repositories/maven_central/org/slf4j/slf4j-api/1.7.5/slf4j-api-1.7.5.jar (26 kB at 1.2 MB/s)
[INFO] 
[INFO] --- maven-clean-plugin:2.4.1:clean (default-clean) @ org.eclipse.m2e.maven.runtime.slf4j.simple ---
[INFO] 
[INFO] --- maven-resources-plugin:2.5:resources (default-resources) @ org.eclipse.m2e.maven.runtime.slf4j.simple ---
[debug] execute contextualize
[INFO] Using 'UTF-8' encoding to copy filtered resources.
[INFO] Copying 4 resources
[INFO] 
[INFO] --- maven-compiler-plugin:3.8.1:compile (default-compile) @ org.eclipse.m2e.maven.runtime.slf4j.simple ---
[INFO] No sources to compile
[INFO] 
[INFO] --- maven-resources-plugin:2.5:testResources (default-testResources) @ org.eclipse.m2e.maven.runtime.slf4j.simple ---
[debug] execute contextualize
[INFO] Using 'UTF-8' encoding to copy filtered resources.
[INFO] skip non existing resourceDirectory /home/jenkins/agent/workspace/m2e-gerrit/m2e-maven-runtime/org.eclipse.m2e.maven.runtime.slf4j.simple/src/test/resources
[INFO] 
[INFO] --- maven-compiler-plugin:3.8.1:testCompile (default-testCompile) @ org.eclipse.m2e.maven.runtime.slf4j.simple ---
[INFO] No sources to compile
[INFO] 
[INFO] --- maven-surefire-plugin:2.8:test (default-test) @ org.eclipse.m2e.maven.runtime.slf4j.simple ---
[INFO] No tests to run.
[INFO] Surefire report directory: /home/jenkins/agent/workspace/m2e-gerrit/m2e-maven-runtime/org.eclipse.m2e.maven.runtime.slf4j.simple/target/surefire-reports

-------------------------------------------------------
 T E S T S
-------------------------------------------------------
There are no tests to run.

Results :

Tests run: 0, Failures: 0, Errors: 0, Skipped: 0

[INFO] 
[INFO] --- maven-bundle-plugin:4.2.0:bundle (default-bundle) @ org.eclipse.m2e.maven.runtime.slf4j.simple ---
[INFO] 
[INFO] --- tycho-p2-plugin:1.4.0:p2-metadata (p2-metadata) @ org.eclipse.m2e.maven.runtime.slf4j.simple ---
[INFO] 
[INFO] --- tycho-p2-plugin:1.4.0:update-local-index (p2-metadata) @ org.eclipse.m2e.maven.runtime.slf4j.simple ---
[INFO] 
[INFO] --- tycho-pack200a-plugin:1.4.0:normalize (pack200-normalize) @ org.eclipse.m2e.maven.runtime.slf4j.simple ---
[INFO] Pack200 normalizing jar /home/jenkins/agent/workspace/m2e-gerrit/m2e-maven-runtime/org.eclipse.m2e.maven.runtime.slf4j.simple/target/org.eclipse.m2e.maven.runtime.slf4j.simple-1.14.0-SNAPSHOT.jar
[INFO] 
[INFO] --- eclipse-jarsigner-plugin:1.1.5:sign (sign) @ org.eclipse.m2e.maven.runtime.slf4j.simple ---
[INFO] Signing of nested jars of '/home/jenkins/agent/workspace/m2e-gerrit/m2e-maven-runtime/org.eclipse.m2e.maven.runtime.slf4j.simple/target/org.eclipse.m2e.maven.runtime.slf4j.simple-1.14.0-SNAPSHOT.jar' is disabled.
[INFO] Signing jar: /home/jenkins/agent/workspace/m2e-gerrit/m2e-maven-runtime/org.eclipse.m2e.maven.runtime.slf4j.simple/target/org.eclipse.m2e.maven.runtime.slf4j.simple-1.14.0-SNAPSHOT.jar
[INFO] 
[INFO] --- tycho-pack200b-plugin:1.4.0:pack (pack200-pack) @ org.eclipse.m2e.maven.runtime.slf4j.simple ---
[INFO] Pack200 packing jar /home/jenkins/agent/workspace/m2e-gerrit/m2e-maven-runtime/org.eclipse.m2e.maven.runtime.slf4j.simple/target/org.eclipse.m2e.maven.runtime.slf4j.simple-1.14.0-SNAPSHOT.jar
[INFO] 
[INFO] --- maven-install-plugin:2.3.1:install (default-install) @ org.eclipse.m2e.maven.runtime.slf4j.simple ---
[INFO] Installing /home/jenkins/agent/workspace/m2e-gerrit/m2e-maven-runtime/org.eclipse.m2e.maven.runtime.slf4j.simple/target/org.eclipse.m2e.maven.runtime.slf4j.simple-1.14.0-SNAPSHOT.jar to /home/jenkins/agent/workspace/m2e-gerrit/.repository/org/eclipse/m2e/org.eclipse.m2e.maven.runtime.slf4j.simple/1.14.0-SNAPSHOT/org.eclipse.m2e.maven.runtime.slf4j.simple-1.14.0-SNAPSHOT.jar
[INFO] Installing /home/jenkins/agent/workspace/m2e-gerrit/m2e-maven-runtime/org.eclipse.m2e.maven.runtime.slf4j.simple/pom.xml to /home/jenkins/agent/workspace/m2e-gerrit/.repository/org/eclipse/m2e/org.eclipse.m2e.maven.runtime.slf4j.simple/1.14.0-SNAPSHOT/org.eclipse.m2e.maven.runtime.slf4j.simple-1.14.0-SNAPSHOT.pom
[INFO] Installing /home/jenkins/agent/workspace/m2e-gerrit/m2e-maven-runtime/org.eclipse.m2e.maven.runtime.slf4j.simple/target/org.eclipse.m2e.maven.runtime.slf4j.simple-1.14.0-SNAPSHOT.jar.pack.gz to /home/jenkins/agent/workspace/m2e-gerrit/.repository/org/eclipse/m2e/org.eclipse.m2e.maven.runtime.slf4j.simple/1.14.0-SNAPSHOT/org.eclipse.m2e.maven.runtime.slf4j.simple-1.14.0-SNAPSHOT-pack200.jar.pack.gz
[INFO] 
[INFO] --- maven-bundle-plugin:4.2.0:install (default-install) @ org.eclipse.m2e.maven.runtime.slf4j.simple ---
[INFO] Installing org/eclipse/m2e/org.eclipse.m2e.maven.runtime.slf4j.simple/1.14.0-SNAPSHOT/org.eclipse.m2e.maven.runtime.slf4j.simple-1.14.0-SNAPSHOT.jar
[INFO] Writing OBR metadata
[INFO] ------------------------------------------------------------------------
[INFO] Reactor Summary for m2e-maven-runtime 1.14.0-SNAPSHOT:
[INFO] 
[INFO] m2e-maven-runtime .................................. SUCCESS [  7.948 s]
[INFO] Maven Archetype Common Bundle ...................... SUCCESS [ 25.626 s]
[INFO] Nexus Indexer Bundle ............................... SUCCESS [  7.350 s]
[INFO] Embedded Maven Runtime Bundle ...................... SUCCESS [ 24.994 s]
[INFO] org.eclipse.m2e.maven.runtime.slf4j.simple ......... SUCCESS [  2.259 s]
[INFO] ------------------------------------------------------------------------
[INFO] BUILD SUCCESS
[INFO] ------------------------------------------------------------------------
[INFO] Total time:  01:43 min
[INFO] Finished at: 2019-10-25T15:44:11Z
[INFO] ------------------------------------------------------------------------
[m2e-gerrit] $ /opt/tools/apache-maven/3.5.4/bin/mvn -f pom.xml -DGERRIT_BRANCH=master -DGERRIT_PATCHSET_REVISION=b1ab72fdbb59621d1d5a22bcde973fedbefedbd9 -DGERRIT_HOST=gerrit-local -DGERRIT_CHANGE_OWNER_EMAIL=akurtako@redhat.com "-DGERRIT_EVENT_ACCOUNT_NAME=Fred Bricon" -DGERRIT_CHANGE_URL=https://git.eclipse.org/r/151641 -DGERRIT_PATCHSET_UPLOADER_EMAIL=fbricon@gmail.com -DGERRIT_EVENT_TYPE=patchset-created -DGERRIT_PROJECT=m2e/m2e-core -DGERRIT_CHANGE_NUMBER=151641 -DGERRIT_SCHEME=ssh '-DGERRIT_PATCHSET_UPLOADER=\"Fred Bricon\" <fbricon@gmail.com>' -DGERRIT_PORT=29418 -DGERRIT_CHANGE_PRIVATE_STATE=false -DGERRIT_REFSPEC=refs/changes/41/151641/2 "-DGERRIT_PATCHSET_UPLOADER_NAME=Fred Bricon" '-DGERRIT_CHANGE_OWNER=\"Alexander Kurtakov\" <akurtako@redhat.com>' -DGERRIT_CHANGE_COMMIT_MESSAGE=QnVpbGQgYWdhaW5zdCAyMDE5LTA5CgpDaGFuZ2UtSWQ6IEk4ZTdlY2IyNjFmMGNiMzk1YzM0OTg4MDhiZTE2ZDgyMjAwN2QzNzllClNpZ25lZC1vZmYtYnk6IEFsZXhhbmRlciBLdXJ0YWtvdiA8YWt1cnRha29AcmVkaGF0LmNvbT4= "-DGERRIT_NAME=Eclipse Gerrit" -DGERRIT_TOPIC= "-DGERRIT_CHANGE_SUBJECT=Build against 2019-09" '-DGERRIT_EVENT_ACCOUNT=\"Fred Bricon\" <fbricon@gmail.com>' -DGERRIT_CHANGE_WIP_STATE=false -DGERRIT_CHANGE_ID=I8e7ecb261f0cb395c3498808be16d822007d379e -DGERRIT_EVENT_HASH=194993710 -DGERRIT_VERSION=2.14.6 -DGERRIT_EVENT_ACCOUNT_EMAIL=fbricon@gmail.com -DGERRIT_PATCHSET_NUMBER=2 "-DGERRIT_CHANGE_OWNER_NAME=Alexander Kurtakov" -Dmaven.test.failure.ignore=true -Dmaven.test.error.ignore=true -Dtycho.disableP2Mirrors=true -Dtycho.surefire.timeout=7200 -Dmaven.repo.local=/home/jenkins/agent/workspace/m2e-gerrit/.repository clean install -Peclipse-sign,uts,its
Picked up JAVA_TOOL_OPTIONS: -XX:+IgnoreUnrecognizedVMOptions -XX:+UseContainerSupport -XX:+UnlockExperimentalVMOptions -XX:+UseCGroupMemoryLimitForHeap
Picked up _JAVA_OPTIONS: -XX:MaxRAMPercentage=64.0
[INFO] Scanning for projects...
[ERROR] [ERROR] Some problems were encountered while processing the POMs:
[FATAL] Non-resolvable parent POM for org.eclipse.m2e:m2e-core-tests:[unknown-version]: Could not find artifact org.eclipse.m2e:m2e-core:pom:1.13.0-SNAPSHOT and 'parent.relativePath' points at wrong local POM @ line 7, column 10
 @ 
[ERROR] The build could not read 1 project -> [Help 1]
[ERROR]   
[ERROR]   The project org.eclipse.m2e:m2e-core-tests:[unknown-version] (/home/jenkins/agent/workspace/m2e-gerrit/m2e-core-tests/pom.xml) has 1 error
[ERROR]     Non-resolvable parent POM for org.eclipse.m2e:m2e-core-tests:[unknown-version]: Could not find artifact org.eclipse.m2e:m2e-core:pom:1.13.0-SNAPSHOT and 'parent.relativePath' points at wrong local POM @ line 7, column 10 -> [Help 2]
[ERROR] 
[ERROR] To see the full stack trace of the errors, re-run Maven with the -e switch.
[ERROR] Re-run Maven using the -X switch to enable full debug logging.
[ERROR] 
[ERROR] For more information about the errors and possible solutions, please read the following articles:
[ERROR] [Help 1] http://cwiki.apache.org/confluence/display/MAVEN/ProjectBuildingException
[ERROR] [Help 2] http://cwiki.apache.org/confluence/display/MAVEN/UnresolvableModelException
Build step 'Invoke top-level Maven targets' marked build as failure
Terminating xvnc.
Recording test results
ERROR: Step ‘Publish JUnit test result report’ failed: No test report files were found. Configuration error?
Archiving artifacts
Finished: FAILURE