FailedConsole Output

Skipping 1,177 KB.. Full Log
------------------------------
Downloading from maven-3.6.2-staging: https://repository.apache.org/content/repositories/maven-1529/org/slf4j/slf4j-simple/1.7.5/slf4j-simple-1.7.5.pom
Downloading from eclipse.maven.central.mirror: https://repo.eclipse.org/content/repositories/maven_central/org/slf4j/slf4j-simple/1.7.5/slf4j-simple-1.7.5.pom
Progress (1): 1.5 kB
                    
Downloaded from eclipse.maven.central.mirror: https://repo.eclipse.org/content/repositories/maven_central/org/slf4j/slf4j-simple/1.7.5/slf4j-simple-1.7.5.pom (1.5 kB at 87 kB/s)
Downloading from maven-3.6.2-staging: https://repository.apache.org/content/repositories/maven-1529/org/slf4j/slf4j-parent/1.7.5/slf4j-parent-1.7.5.pom
Downloading from eclipse.maven.central.mirror: https://repo.eclipse.org/content/repositories/maven_central/org/slf4j/slf4j-parent/1.7.5/slf4j-parent-1.7.5.pom
Progress (1): 4.1/12 kB
Progress (1): 7.7/12 kB
Progress (1): 12/12 kB 
Progress (1): 12 kB   
                   
Downloaded from eclipse.maven.central.mirror: https://repo.eclipse.org/content/repositories/maven_central/org/slf4j/slf4j-parent/1.7.5/slf4j-parent-1.7.5.pom (12 kB at 843 kB/s)
Downloading from maven-3.6.2-staging: https://repository.apache.org/content/repositories/maven-1529/org/slf4j/slf4j-api/1.7.5/slf4j-api-1.7.5.pom
Downloading from eclipse.maven.central.mirror: https://repo.eclipse.org/content/repositories/maven_central/org/slf4j/slf4j-api/1.7.5/slf4j-api-1.7.5.pom
Progress (1): 2.7 kB
                    
Downloaded from eclipse.maven.central.mirror: https://repo.eclipse.org/content/repositories/maven_central/org/slf4j/slf4j-api/1.7.5/slf4j-api-1.7.5.pom (2.7 kB at 149 kB/s)
Downloading from maven-3.6.2-staging: https://repository.apache.org/content/repositories/maven-1529/org/slf4j/slf4j-simple/1.7.5/slf4j-simple-1.7.5.jar
Downloading from maven-3.6.2-staging: https://repository.apache.org/content/repositories/maven-1529/org/slf4j/slf4j-api/1.7.5/slf4j-api-1.7.5.jar
Downloading from eclipse.maven.central.mirror: https://repo.eclipse.org/content/repositories/maven_central/org/slf4j/slf4j-simple/1.7.5/slf4j-simple-1.7.5.jar
Downloading from eclipse.maven.central.mirror: https://repo.eclipse.org/content/repositories/maven_central/org/slf4j/slf4j-api/1.7.5/slf4j-api-1.7.5.jar
Progress (1): 4.1/11 kB
Progress (1): 7.7/11 kB
Progress (1): 11 kB    
Progress (2): 11 kB | 4.1/26 kB
Progress (2): 11 kB | 7.7/26 kB
Progress (2): 11 kB | 12/26 kB 
Progress (2): 11 kB | 16/26 kB
Progress (2): 11 kB | 20/26 kB
Progress (2): 11 kB | 24/26 kB
Progress (2): 11 kB | 26 kB   
                           
Downloaded from eclipse.maven.central.mirror: https://repo.eclipse.org/content/repositories/maven_central/org/slf4j/slf4j-simple/1.7.5/slf4j-simple-1.7.5.jar (11 kB at 628 kB/s)
Downloaded from eclipse.maven.central.mirror: https://repo.eclipse.org/content/repositories/maven_central/org/slf4j/slf4j-api/1.7.5/slf4j-api-1.7.5.jar (26 kB at 1.4 MB/s)
[INFO] 
[INFO] --- maven-clean-plugin:2.4.1:clean (default-clean) @ org.eclipse.m2e.maven.runtime.slf4j.simple ---
[INFO] 
[INFO] --- maven-resources-plugin:2.5:resources (default-resources) @ org.eclipse.m2e.maven.runtime.slf4j.simple ---
[debug] execute contextualize
[INFO] Using 'UTF-8' encoding to copy filtered resources.
[INFO] Copying 4 resources
[INFO] 
[INFO] --- maven-compiler-plugin:3.8.1:compile (default-compile) @ org.eclipse.m2e.maven.runtime.slf4j.simple ---
[INFO] No sources to compile
[INFO] 
[INFO] --- maven-resources-plugin:2.5:testResources (default-testResources) @ org.eclipse.m2e.maven.runtime.slf4j.simple ---
[debug] execute contextualize
[INFO] Using 'UTF-8' encoding to copy filtered resources.
[INFO] skip non existing resourceDirectory /home/jenkins/agent/workspace/m2e-gerrit/m2e-maven-runtime/org.eclipse.m2e.maven.runtime.slf4j.simple/src/test/resources
[INFO] 
[INFO] --- maven-compiler-plugin:3.8.1:testCompile (default-testCompile) @ org.eclipse.m2e.maven.runtime.slf4j.simple ---
[INFO] No sources to compile
[INFO] 
[INFO] --- maven-surefire-plugin:2.8:test (default-test) @ org.eclipse.m2e.maven.runtime.slf4j.simple ---
[INFO] No tests to run.
[INFO] Surefire report directory: /home/jenkins/agent/workspace/m2e-gerrit/m2e-maven-runtime/org.eclipse.m2e.maven.runtime.slf4j.simple/target/surefire-reports

-------------------------------------------------------
 T E S T S
-------------------------------------------------------
There are no tests to run.

Results :

Tests run: 0, Failures: 0, Errors: 0, Skipped: 0

[INFO] 
[INFO] --- maven-bundle-plugin:4.2.0:bundle (default-bundle) @ org.eclipse.m2e.maven.runtime.slf4j.simple ---
[INFO] 
[INFO] --- tycho-p2-plugin:1.4.0:p2-metadata (p2-metadata) @ org.eclipse.m2e.maven.runtime.slf4j.simple ---
[INFO] 
[INFO] --- tycho-p2-plugin:1.4.0:update-local-index (p2-metadata) @ org.eclipse.m2e.maven.runtime.slf4j.simple ---
[INFO] 
[INFO] --- tycho-pack200a-plugin:1.4.0:normalize (pack200-normalize) @ org.eclipse.m2e.maven.runtime.slf4j.simple ---
[INFO] Pack200 normalizing jar /home/jenkins/agent/workspace/m2e-gerrit/m2e-maven-runtime/org.eclipse.m2e.maven.runtime.slf4j.simple/target/org.eclipse.m2e.maven.runtime.slf4j.simple-1.13.0-SNAPSHOT.jar
[INFO] 
[INFO] --- eclipse-jarsigner-plugin:1.1.5:sign (sign) @ org.eclipse.m2e.maven.runtime.slf4j.simple ---
[INFO] Signing of nested jars of '/home/jenkins/agent/workspace/m2e-gerrit/m2e-maven-runtime/org.eclipse.m2e.maven.runtime.slf4j.simple/target/org.eclipse.m2e.maven.runtime.slf4j.simple-1.13.0-SNAPSHOT.jar' is disabled.
[INFO] Signing jar: /home/jenkins/agent/workspace/m2e-gerrit/m2e-maven-runtime/org.eclipse.m2e.maven.runtime.slf4j.simple/target/org.eclipse.m2e.maven.runtime.slf4j.simple-1.13.0-SNAPSHOT.jar
[INFO] 
[INFO] --- tycho-pack200b-plugin:1.4.0:pack (pack200-pack) @ org.eclipse.m2e.maven.runtime.slf4j.simple ---
[INFO] Pack200 packing jar /home/jenkins/agent/workspace/m2e-gerrit/m2e-maven-runtime/org.eclipse.m2e.maven.runtime.slf4j.simple/target/org.eclipse.m2e.maven.runtime.slf4j.simple-1.13.0-SNAPSHOT.jar
[INFO] 
[INFO] --- maven-install-plugin:2.3.1:install (default-install) @ org.eclipse.m2e.maven.runtime.slf4j.simple ---
[INFO] Installing /home/jenkins/agent/workspace/m2e-gerrit/m2e-maven-runtime/org.eclipse.m2e.maven.runtime.slf4j.simple/target/org.eclipse.m2e.maven.runtime.slf4j.simple-1.13.0-SNAPSHOT.jar to /home/jenkins/agent/workspace/m2e-gerrit/.repository/org/eclipse/m2e/org.eclipse.m2e.maven.runtime.slf4j.simple/1.13.0-SNAPSHOT/org.eclipse.m2e.maven.runtime.slf4j.simple-1.13.0-SNAPSHOT.jar
[INFO] Installing /home/jenkins/agent/workspace/m2e-gerrit/m2e-maven-runtime/org.eclipse.m2e.maven.runtime.slf4j.simple/pom.xml to /home/jenkins/agent/workspace/m2e-gerrit/.repository/org/eclipse/m2e/org.eclipse.m2e.maven.runtime.slf4j.simple/1.13.0-SNAPSHOT/org.eclipse.m2e.maven.runtime.slf4j.simple-1.13.0-SNAPSHOT.pom
[INFO] Installing /home/jenkins/agent/workspace/m2e-gerrit/m2e-maven-runtime/org.eclipse.m2e.maven.runtime.slf4j.simple/target/org.eclipse.m2e.maven.runtime.slf4j.simple-1.13.0-SNAPSHOT.jar.pack.gz to /home/jenkins/agent/workspace/m2e-gerrit/.repository/org/eclipse/m2e/org.eclipse.m2e.maven.runtime.slf4j.simple/1.13.0-SNAPSHOT/org.eclipse.m2e.maven.runtime.slf4j.simple-1.13.0-SNAPSHOT-pack200.jar.pack.gz
[INFO] 
[INFO] --- maven-bundle-plugin:4.2.0:install (default-install) @ org.eclipse.m2e.maven.runtime.slf4j.simple ---
[INFO] Installing org/eclipse/m2e/org.eclipse.m2e.maven.runtime.slf4j.simple/1.13.0-SNAPSHOT/org.eclipse.m2e.maven.runtime.slf4j.simple-1.13.0-SNAPSHOT.jar
[INFO] Writing OBR metadata
[INFO] ------------------------------------------------------------------------
[INFO] Reactor Summary for m2e-maven-runtime 1.13.0-SNAPSHOT:
[INFO] 
[INFO] m2e-maven-runtime .................................. SUCCESS [  5.157 s]
[INFO] Maven Archetype Common Bundle ...................... SUCCESS [ 21.974 s]
[INFO] Nexus Indexer Bundle ............................... SUCCESS [  5.706 s]
[INFO] Embedded Maven Runtime Bundle ...................... SUCCESS [ 23.199 s]
[INFO] org.eclipse.m2e.maven.runtime.slf4j.simple ......... SUCCESS [  7.048 s]
[INFO] ------------------------------------------------------------------------
[INFO] BUILD SUCCESS
[INFO] ------------------------------------------------------------------------
[INFO] Total time:  01:21 min
[INFO] Finished at: 2019-10-25T15:02:20Z
[INFO] ------------------------------------------------------------------------
[m2e-gerrit] $ /opt/tools/apache-maven/3.5.4/bin/mvn -f pom.xml -DGERRIT_BRANCH=master -DGERRIT_PATCHSET_REVISION=46d8ec6e5538d789e86206d3bc9b4c268ab492a4 -DGERRIT_HOST=gerrit-local -DGERRIT_CHANGE_OWNER_EMAIL=akurtako@redhat.com "-DGERRIT_EVENT_ACCOUNT_NAME=Alexander Kurtakov" -DGERRIT_CHANGE_URL=https://git.eclipse.org/r/151639 -DGERRIT_PATCHSET_UPLOADER_EMAIL=akurtako@redhat.com -DGERRIT_EVENT_TYPE=patchset-created -DGERRIT_PROJECT=m2e/m2e-core -DGERRIT_CHANGE_NUMBER=151639 -DGERRIT_SCHEME=ssh '-DGERRIT_PATCHSET_UPLOADER=\"Alexander Kurtakov\" <akurtako@redhat.com>' -DGERRIT_PORT=29418 -DGERRIT_CHANGE_PRIVATE_STATE=false -DGERRIT_REFSPEC=refs/changes/39/151639/1 "-DGERRIT_PATCHSET_UPLOADER_NAME=Alexander Kurtakov" '-DGERRIT_CHANGE_OWNER=\"Alexander Kurtakov\" <akurtako@redhat.com>' -DGERRIT_CHANGE_COMMIT_MESSAGE=TW92ZSBhd2F5IG9mIGRlcHJlY2F0ZWQgQWJzdHJhY3RVSVBsdWdpbi5pbWFnZURlc2NyaXB0b3JGcm9tUGx1Z2luCgpDaGFuZ2UtSWQ6IElmZmRiNTRhODUwODdiZTJjMmMyZGMxMTBhODNiYzcwOGVlN2RlYzdiClNpZ25lZC1vZmYtYnk6IEFsZXhhbmRlciBLdXJ0YWtvdiA8YWt1cnRha29AcmVkaGF0LmNvbT4= "-DGERRIT_NAME=Eclipse Gerrit" -DGERRIT_TOPIC= "-DGERRIT_CHANGE_SUBJECT=Move away of deprecated AbstractUIPlugin.imageDescriptorFromPlugin" '-DGERRIT_EVENT_ACCOUNT=\"Alexander Kurtakov\" <akurtako@redhat.com>' -DGERRIT_CHANGE_WIP_STATE=false -DGERRIT_CHANGE_ID=Iffdb54a85087be2c2c2dc110a83bc708ee7dec7b -DGERRIT_EVENT_HASH=-2050141477 -DGERRIT_VERSION=2.14.6 -DGERRIT_EVENT_ACCOUNT_EMAIL=akurtako@redhat.com -DGERRIT_PATCHSET_NUMBER=1 "-DGERRIT_CHANGE_OWNER_NAME=Alexander Kurtakov" -Dmaven.test.failure.ignore=true -Dmaven.test.error.ignore=true -Dtycho.disableP2Mirrors=true -Dtycho.surefire.timeout=7200 -Dmaven.repo.local=/home/jenkins/agent/workspace/m2e-gerrit/.repository clean install -Peclipse-sign,uts,its
Picked up JAVA_TOOL_OPTIONS: -XX:+IgnoreUnrecognizedVMOptions -XX:+UseContainerSupport -XX:+UnlockExperimentalVMOptions -XX:+UseCGroupMemoryLimitForHeap
Picked up _JAVA_OPTIONS: -XX:MaxRAMPercentage=64.0
[INFO] Scanning for projects...
[WARNING] No explicit target runtime environment configuration. Build is platform dependent.
Downloading from cbi-releases: https://repo.eclipse.org/content/repositories/cbi-releases/org/eclipse/tycho/target-platform-configuration/1.4.0/target-platform-configuration-1.4.0.pom
Downloading from tycho-snapshots: https://oss.sonatype.org/content/groups/staging/org/eclipse/tycho/target-platform-configuration/1.4.0/target-platform-configuration-1.4.0.pom
Downloading from eclipse.maven.central.mirror: https://repo.eclipse.org/content/repositories/maven_central/org/eclipse/tycho/target-platform-configuration/1.4.0/target-platform-configuration-1.4.0.pom
Progress (1): 1.7 kB
                    
Downloaded from eclipse.maven.central.mirror: https://repo.eclipse.org/content/repositories/maven_central/org/eclipse/tycho/target-platform-configuration/1.4.0/target-platform-configuration-1.4.0.pom (1.7 kB at 34 kB/s)
Downloading from cbi-releases: https://repo.eclipse.org/content/repositories/cbi-releases/org/eclipse/tycho/target-platform-configuration/1.4.0/target-platform-configuration-1.4.0.jar
Downloading from tycho-snapshots: https://oss.sonatype.org/content/groups/staging/org/eclipse/tycho/target-platform-configuration/1.4.0/target-platform-configuration-1.4.0.jar
Downloading from eclipse.maven.central.mirror: https://repo.eclipse.org/content/repositories/maven_central/org/eclipse/tycho/target-platform-configuration/1.4.0/target-platform-configuration-1.4.0.jar
Progress (1): 4.1/7.6 kB
Progress (1): 7.6 kB    
                    
Downloaded from eclipse.maven.central.mirror: https://repo.eclipse.org/content/repositories/maven_central/org/eclipse/tycho/target-platform-configuration/1.4.0/target-platform-configuration-1.4.0.jar (7.6 kB at 16 kB/s)
Downloading from cbi-releases: https://repo.eclipse.org/content/repositories/cbi-releases/org/eclipse/tycho/tycho-source-plugin/1.4.0/tycho-source-plugin-1.4.0.pom
Downloading from tycho-snapshots: https://oss.sonatype.org/content/groups/staging/org/eclipse/tycho/tycho-source-plugin/1.4.0/tycho-source-plugin-1.4.0.pom
Downloading from eclipse.maven.central.mirror: https://repo.eclipse.org/content/repositories/maven_central/org/eclipse/tycho/tycho-source-plugin/1.4.0/tycho-source-plugin-1.4.0.pom
Progress (1): 2.9 kB
                    
Downloaded from eclipse.maven.central.mirror: https://repo.eclipse.org/content/repositories/maven_central/org/eclipse/tycho/tycho-source-plugin/1.4.0/tycho-source-plugin-1.4.0.pom (2.9 kB at 70 kB/s)
Downloading from cbi-releases: https://repo.eclipse.org/content/repositories/cbi-releases/org/eclipse/tycho/tycho-source-plugin/1.4.0/tycho-source-plugin-1.4.0.jar
Downloading from tycho-snapshots: https://oss.sonatype.org/content/groups/staging/org/eclipse/tycho/tycho-source-plugin/1.4.0/tycho-source-plugin-1.4.0.jar
Downloading from eclipse.maven.central.mirror: https://repo.eclipse.org/content/repositories/maven_central/org/eclipse/tycho/tycho-source-plugin/1.4.0/tycho-source-plugin-1.4.0.jar
Progress (1): 4.1/23 kB
Progress (1): 7.7/23 kB
Progress (1): 12/23 kB 
Progress (1): 16/23 kB
Progress (1): 20/23 kB
Progress (1): 23 kB   
                   
Downloaded from eclipse.maven.central.mirror: https://repo.eclipse.org/content/repositories/maven_central/org/eclipse/tycho/tycho-source-plugin/1.4.0/tycho-source-plugin-1.4.0.jar (23 kB at 628 kB/s)
Downloading from cbi-releases: https://repo.eclipse.org/content/repositories/cbi-releases/org/apache/maven/plugins/maven-source-plugin/2.1/maven-source-plugin-2.1.pom
Downloading from tycho-snapshots: https://oss.sonatype.org/content/groups/staging/org/apache/maven/plugins/maven-source-plugin/2.1/maven-source-plugin-2.1.pom
Downloading from eclipse.maven.central.mirror: https://repo.eclipse.org/content/repositories/maven_central/org/apache/maven/plugins/maven-source-plugin/2.1/maven-source-plugin-2.1.pom
Progress (1): 4.1/5.0 kB
Progress (1): 5.0 kB    
                    
Downloaded from eclipse.maven.central.mirror: https://repo.eclipse.org/content/repositories/maven_central/org/apache/maven/plugins/maven-source-plugin/2.1/maven-source-plugin-2.1.pom (5.0 kB at 143 kB/s)
Downloading from cbi-releases: https://repo.eclipse.org/content/repositories/cbi-releases/org/apache/maven/plugins/maven-plugins/13/maven-plugins-13.pom
Downloading from tycho-snapshots: https://oss.sonatype.org/content/groups/staging/org/apache/maven/plugins/maven-plugins/13/maven-plugins-13.pom
Downloading from eclipse.maven.central.mirror: https://repo.eclipse.org/content/repositories/maven_central/org/apache/maven/plugins/maven-plugins/13/maven-plugins-13.pom
Progress (1): 4.1/12 kB
Progress (1): 7.7/12 kB
Progress (1): 12/12 kB 
Progress (1): 12 kB   
                   
Downloaded from eclipse.maven.central.mirror: https://repo.eclipse.org/content/repositories/maven_central/org/apache/maven/plugins/maven-plugins/13/maven-plugins-13.pom (12 kB at 327 kB/s)
Downloading from cbi-releases: https://repo.eclipse.org/content/repositories/cbi-releases/org/apache/maven/maven-archiver/2.5/maven-archiver-2.5.pom
Downloading from tycho-snapshots: https://oss.sonatype.org/content/groups/staging/org/apache/maven/maven-archiver/2.5/maven-archiver-2.5.pom
Downloading from eclipse.maven.central.mirror: https://repo.eclipse.org/content/repositories/maven_central/org/apache/maven/maven-archiver/2.5/maven-archiver-2.5.pom
Progress (1): 4.1/4.5 kB
Progress (1): 4.5 kB    
                    
Downloaded from eclipse.maven.central.mirror: https://repo.eclipse.org/content/repositories/maven_central/org/apache/maven/maven-archiver/2.5/maven-archiver-2.5.pom (4.5 kB at 123 kB/s)
Downloading from cbi-releases: https://repo.eclipse.org/content/repositories/cbi-releases/org/apache/maven/shared/maven-shared-components/17/maven-shared-components-17.pom
Downloading from tycho-snapshots: https://oss.sonatype.org/content/groups/staging/org/apache/maven/shared/maven-shared-components/17/maven-shared-components-17.pom
Downloading from eclipse.maven.central.mirror: https://repo.eclipse.org/content/repositories/maven_central/org/apache/maven/shared/maven-shared-components/17/maven-shared-components-17.pom
Progress (1): 4.1/8.7 kB
Progress (1): 7.7/8.7 kB
Progress (1): 8.7 kB    
                    
Downloaded from eclipse.maven.central.mirror: https://repo.eclipse.org/content/repositories/maven_central/org/apache/maven/shared/maven-shared-components/17/maven-shared-components-17.pom (8.7 kB at 223 kB/s)
Downloading from cbi-releases: https://repo.eclipse.org/content/repositories/cbi-releases/org/apache/maven/maven-parent/21/maven-parent-21.pom
Downloading from tycho-snapshots: https://oss.sonatype.org/content/groups/staging/org/apache/maven/maven-parent/21/maven-parent-21.pom
Downloading from eclipse.maven.central.mirror: https://repo.eclipse.org/content/repositories/maven_central/org/apache/maven/maven-parent/21/maven-parent-21.pom
Progress (1): 4.1/26 kB
Progress (1): 7.7/26 kB
Progress (1): 12/26 kB 
Progress (1): 16/26 kB
Progress (1): 20/26 kB
Progress (1): 24/26 kB
Progress (1): 26 kB   
                   
Downloaded from eclipse.maven.central.mirror: https://repo.eclipse.org/content/repositories/maven_central/org/apache/maven/maven-parent/21/maven-parent-21.pom (26 kB at 775 kB/s)
Downloading from cbi-releases: https://repo.eclipse.org/content/repositories/cbi-releases/org/apache/apache/10/apache-10.pom
Downloading from tycho-snapshots: https://oss.sonatype.org/content/groups/staging/org/apache/apache/10/apache-10.pom
Downloading from eclipse.maven.central.mirror: https://repo.eclipse.org/content/repositories/maven_central/org/apache/apache/10/apache-10.pom
Progress (1): 4.1/15 kB
Progress (1): 7.7/15 kB
Progress (1): 12/15 kB 
Progress (1): 15 kB   
                   
Downloaded from eclipse.maven.central.mirror: https://repo.eclipse.org/content/repositories/maven_central/org/apache/apache/10/apache-10.pom (15 kB at 389 kB/s)
Downloading from cbi-releases: https://repo.eclipse.org/content/repositories/cbi-releases/org/codehaus/plexus/plexus-interpolation/1.15/plexus-interpolation-1.15.pom
Downloading from tycho-snapshots: https://oss.sonatype.org/content/groups/staging/org/codehaus/plexus/plexus-interpolation/1.15/plexus-interpolation-1.15.pom
Downloading from eclipse.maven.central.mirror: https://repo.eclipse.org/content/repositories/maven_central/org/codehaus/plexus/plexus-interpolation/1.15/plexus-interpolation-1.15.pom
Progress (1): 1.0 kB
                    
Downloaded from eclipse.maven.central.mirror: https://repo.eclipse.org/content/repositories/maven_central/org/codehaus/plexus/plexus-interpolation/1.15/plexus-interpolation-1.15.pom (1.0 kB at 31 kB/s)
Downloading from cbi-releases: https://repo.eclipse.org/content/repositories/cbi-releases/org/eclipse/tycho/tycho-packaging-plugin/1.4.0/tycho-packaging-plugin-1.4.0.pom
Downloading from tycho-snapshots: https://oss.sonatype.org/content/groups/staging/org/eclipse/tycho/tycho-packaging-plugin/1.4.0/tycho-packaging-plugin-1.4.0.pom
Downloading from eclipse.maven.central.mirror: https://repo.eclipse.org/content/repositories/maven_central/org/eclipse/tycho/tycho-packaging-plugin/1.4.0/tycho-packaging-plugin-1.4.0.pom
Progress (1): 2.7 kB
                    
Downloaded from eclipse.maven.central.mirror: https://repo.eclipse.org/content/repositories/maven_central/org/eclipse/tycho/tycho-packaging-plugin/1.4.0/tycho-packaging-plugin-1.4.0.pom (2.7 kB at 86 kB/s)
Downloading from cbi-releases: https://repo.eclipse.org/content/repositories/cbi-releases/org/apache/maven/plugins/maven-source-plugin/2.1/maven-source-plugin-2.1.jar
Downloading from cbi-releases: https://repo.eclipse.org/content/repositories/cbi-releases/org/apache/maven/maven-archiver/2.5/maven-archiver-2.5.jar
Downloading from cbi-releases: https://repo.eclipse.org/content/repositories/cbi-releases/org/eclipse/tycho/tycho-packaging-plugin/1.4.0/tycho-packaging-plugin-1.4.0.jar
Downloading from tycho-snapshots: https://oss.sonatype.org/content/groups/staging/org/apache/maven/plugins/maven-source-plugin/2.1/maven-source-plugin-2.1.jar
Downloading from tycho-snapshots: https://oss.sonatype.org/content/groups/staging/org/apache/maven/maven-archiver/2.5/maven-archiver-2.5.jar
Downloading from tycho-snapshots: https://oss.sonatype.org/content/groups/staging/org/eclipse/tycho/tycho-packaging-plugin/1.4.0/tycho-packaging-plugin-1.4.0.jar
Downloading from eclipse.maven.central.mirror: https://repo.eclipse.org/content/repositories/maven_central/org/apache/maven/plugins/maven-source-plugin/2.1/maven-source-plugin-2.1.jar
Downloading from eclipse.maven.central.mirror: https://repo.eclipse.org/content/repositories/maven_central/org/apache/maven/maven-archiver/2.5/maven-archiver-2.5.jar
Downloading from eclipse.maven.central.mirror: https://repo.eclipse.org/content/repositories/maven_central/org/eclipse/tycho/tycho-packaging-plugin/1.4.0/tycho-packaging-plugin-1.4.0.jar
Progress (1): 4.1/22 kB
Progress (1): 7.7/22 kB
Progress (1): 12/22 kB 
Progress (1): 16/22 kB
Progress (1): 20/22 kB
Progress (1): 22 kB   
Progress (2): 22 kB | 4.1/128 kB
Progress (2): 22 kB | 7.7/128 kB
Progress (2): 22 kB | 12/128 kB 
Progress (2): 22 kB | 16/128 kB
Progress (2): 22 kB | 20/128 kB
Progress (2): 22 kB | 24/128 kB
Progress (2): 22 kB | 28/128 kB
Progress (2): 22 kB | 32/128 kB
Progress (2): 22 kB | 36/128 kB
Progress (2): 22 kB | 40/128 kB
Progress (3): 22 kB | 40/128 kB | 4.1/24 kB
Progress (3): 22 kB | 44/128 kB | 4.1/24 kB
Progress (3): 22 kB | 44/128 kB | 7.7/24 kB
Progress (3): 22 kB | 48/128 kB | 7.7/24 kB
Progress (3): 22 kB | 48/128 kB | 12/24 kB 
Progress (3): 22 kB | 52/128 kB | 12/24 kB
Progress (3): 22 kB | 52/128 kB | 16/24 kB
Progress (3): 22 kB | 56/128 kB | 16/24 kB
Progress (3): 22 kB | 56/128 kB | 20/24 kB
Progress (3): 22 kB | 60/128 kB | 20/24 kB
Progress (3): 22 kB | 60/128 kB | 24/24 kB
Progress (3): 22 kB | 64/128 kB | 24/24 kB
Progress (3): 22 kB | 64/128 kB | 24 kB   
Progress (3): 22 kB | 68/128 kB | 24 kB
Progress (3): 22 kB | 72/128 kB | 24 kB
Progress (3): 22 kB | 76/128 kB | 24 kB
Progress (3): 22 kB | 80/128 kB | 24 kB
                                       
Downloaded from eclipse.maven.central.mirror: https://repo.eclipse.org/content/repositories/maven_central/org/apache/maven/maven-archiver/2.5/maven-archiver-2.5.jar (22 kB at 590 kB/s)
Progress (2): 84/128 kB | 24 kB
Progress (2): 88/128 kB | 24 kB
Progress (2): 92/128 kB | 24 kB
Progress (2): 96/128 kB | 24 kB
Progress (2): 100/128 kB | 24 kB
Progress (2): 104/128 kB | 24 kB
Progress (2): 108/128 kB | 24 kB
Progress (2): 112/128 kB | 24 kB
Progress (2): 116/128 kB | 24 kB
Progress (2): 120/128 kB | 24 kB
Progress (2): 124/128 kB | 24 kB
Progress (2): 128/128 kB | 24 kB
                                
Downloaded from eclipse.maven.central.mirror: https://repo.eclipse.org/content/repositories/maven_central/org/apache/maven/plugins/maven-source-plugin/2.1/maven-source-plugin-2.1.jar (24 kB at 581 kB/s)
Progress (1): 128 kB
                    
Downloaded from eclipse.maven.central.mirror: https://repo.eclipse.org/content/repositories/maven_central/org/eclipse/tycho/tycho-packaging-plugin/1.4.0/tycho-packaging-plugin-1.4.0.jar (128 kB at 2.7 MB/s)
Downloading from cbi-releases: https://repo.eclipse.org/content/repositories/cbi-releases/org/jacoco/jacoco-maven-plugin/0.8.4/jacoco-maven-plugin-0.8.4.pom
Downloading from tycho-snapshots: https://oss.sonatype.org/content/groups/staging/org/jacoco/jacoco-maven-plugin/0.8.4/jacoco-maven-plugin-0.8.4.pom
Downloading from eclipse.maven.central.mirror: https://repo.eclipse.org/content/repositories/maven_central/org/jacoco/jacoco-maven-plugin/0.8.4/jacoco-maven-plugin-0.8.4.pom
Progress (1): 4.1/4.4 kB
Progress (1): 4.4 kB    
                    
Downloaded from eclipse.maven.central.mirror: https://repo.eclipse.org/content/repositories/maven_central/org/jacoco/jacoco-maven-plugin/0.8.4/jacoco-maven-plugin-0.8.4.pom (4.4 kB at 244 kB/s)
Downloading from cbi-releases: https://repo.eclipse.org/content/repositories/cbi-releases/org/jacoco/org.jacoco.build/0.8.4/org.jacoco.build-0.8.4.pom
Downloading from tycho-snapshots: https://oss.sonatype.org/content/groups/staging/org/jacoco/org.jacoco.build/0.8.4/org.jacoco.build-0.8.4.pom
Downloading from eclipse.maven.central.mirror: https://repo.eclipse.org/content/repositories/maven_central/org/jacoco/org.jacoco.build/0.8.4/org.jacoco.build-0.8.4.pom
Progress (1): 4.1/39 kB
Progress (1): 7.7/39 kB
Progress (1): 12/39 kB 
Progress (1): 16/39 kB
Progress (1): 20/39 kB
Progress (1): 24/39 kB
Progress (1): 28/39 kB
Progress (1): 32/39 kB
Progress (1): 36/39 kB
Progress (1): 39 kB   
                   
Downloaded from eclipse.maven.central.mirror: https://repo.eclipse.org/content/repositories/maven_central/org/jacoco/org.jacoco.build/0.8.4/org.jacoco.build-0.8.4.pom (39 kB at 1.5 MB/s)
Downloading from cbi-releases: https://repo.eclipse.org/content/repositories/cbi-releases/org/jacoco/jacoco-maven-plugin/0.8.4/jacoco-maven-plugin-0.8.4.jar
Downloading from tycho-snapshots: https://oss.sonatype.org/content/groups/staging/org/jacoco/jacoco-maven-plugin/0.8.4/jacoco-maven-plugin-0.8.4.jar
Downloading from eclipse.maven.central.mirror: https://repo.eclipse.org/content/repositories/maven_central/org/jacoco/jacoco-maven-plugin/0.8.4/jacoco-maven-plugin-0.8.4.jar
Progress (1): 4.1/53 kB
Progress (1): 7.7/53 kB
Progress (1): 12/53 kB 
Progress (1): 16/53 kB
Progress (1): 20/53 kB
Progress (1): 24/53 kB
Progress (1): 28/53 kB
Progress (1): 32/53 kB
Progress (1): 36/53 kB
Progress (1): 40/53 kB
Progress (1): 44/53 kB
Progress (1): 48/53 kB
Progress (1): 52/53 kB
Progress (1): 53 kB   
                   
Downloaded from eclipse.maven.central.mirror: https://repo.eclipse.org/content/repositories/maven_central/org/jacoco/jacoco-maven-plugin/0.8.4/jacoco-maven-plugin-0.8.4.jar (53 kB at 1.5 MB/s)
Downloading from cbi-releases: https://repo.eclipse.org/content/repositories/cbi-releases/org/eclipse/tycho/tycho-compiler-plugin/1.4.0/tycho-compiler-plugin-1.4.0.pom
Downloading from tycho-snapshots: https://oss.sonatype.org/content/groups/staging/org/eclipse/tycho/tycho-compiler-plugin/1.4.0/tycho-compiler-plugin-1.4.0.pom
Downloading from eclipse.maven.central.mirror: https://repo.eclipse.org/content/repositories/maven_central/org/eclipse/tycho/tycho-compiler-plugin/1.4.0/tycho-compiler-plugin-1.4.0.pom
Progress (1): 2.5 kB
                    
Downloaded from eclipse.maven.central.mirror: https://repo.eclipse.org/content/repositories/maven_central/org/eclipse/tycho/tycho-compiler-plugin/1.4.0/tycho-compiler-plugin-1.4.0.pom (2.5 kB at 70 kB/s)
Downloading from cbi-releases: https://repo.eclipse.org/content/repositories/cbi-releases/org/eclipse/tycho/tycho-compiler-plugin/1.4.0/tycho-compiler-plugin-1.4.0.jar
Downloading from tycho-snapshots: https://oss.sonatype.org/content/groups/staging/org/eclipse/tycho/tycho-compiler-plugin/1.4.0/tycho-compiler-plugin-1.4.0.jar
Downloading from eclipse.maven.central.mirror: https://repo.eclipse.org/content/repositories/maven_central/org/eclipse/tycho/tycho-compiler-plugin/1.4.0/tycho-compiler-plugin-1.4.0.jar
Progress (1): 4.1/33 kB
Progress (1): 7.7/33 kB
Progress (1): 12/33 kB 
Progress (1): 16/33 kB
Progress (1): 20/33 kB
Progress (1): 24/33 kB
Progress (1): 28/33 kB
Progress (1): 32/33 kB
Progress (1): 33 kB   
                   
Downloaded from eclipse.maven.central.mirror: https://repo.eclipse.org/content/repositories/maven_central/org/eclipse/tycho/tycho-compiler-plugin/1.4.0/tycho-compiler-plugin-1.4.0.jar (33 kB at 117 kB/s)
Downloading from cbi-releases: https://repo.eclipse.org/content/repositories/cbi-releases/org/apache/maven/plugins/maven-deploy-plugin/2.5/maven-deploy-plugin-2.5.pom
Downloading from tycho-snapshots: https://oss.sonatype.org/content/groups/staging/org/apache/maven/plugins/maven-deploy-plugin/2.5/maven-deploy-plugin-2.5.pom
Downloading from eclipse.maven.central.mirror: https://repo.eclipse.org/content/repositories/maven_central/org/apache/maven/plugins/maven-deploy-plugin/2.5/maven-deploy-plugin-2.5.pom
Progress (1): 4.1/5.7 kB
Progress (1): 5.7 kB    
                    
Downloaded from eclipse.maven.central.mirror: https://repo.eclipse.org/content/repositories/maven_central/org/apache/maven/plugins/maven-deploy-plugin/2.5/maven-deploy-plugin-2.5.pom (5.7 kB at 173 kB/s)
Downloading from cbi-releases: https://repo.eclipse.org/content/repositories/cbi-releases/org/apache/maven/plugins/maven-plugins/16/maven-plugins-16.pom
Downloading from tycho-snapshots: https://oss.sonatype.org/content/groups/staging/org/apache/maven/plugins/maven-plugins/16/maven-plugins-16.pom
Downloading from eclipse.maven.central.mirror: https://repo.eclipse.org/content/repositories/maven_central/org/apache/maven/plugins/maven-plugins/16/maven-plugins-16.pom
Progress (1): 4.1/13 kB
Progress (1): 7.7/13 kB
Progress (1): 12/13 kB 
Progress (1): 13 kB   
                   
Downloaded from eclipse.maven.central.mirror: https://repo.eclipse.org/content/repositories/maven_central/org/apache/maven/plugins/maven-plugins/16/maven-plugins-16.pom (13 kB at 50 kB/s)
Downloading from cbi-releases: https://repo.eclipse.org/content/repositories/cbi-releases/org/apache/maven/plugins/maven-deploy-plugin/2.5/maven-deploy-plugin-2.5.jar
Downloading from tycho-snapshots: https://oss.sonatype.org/content/groups/staging/org/apache/maven/plugins/maven-deploy-plugin/2.5/maven-deploy-plugin-2.5.jar
Downloading from eclipse.maven.central.mirror: https://repo.eclipse.org/content/repositories/maven_central/org/apache/maven/plugins/maven-deploy-plugin/2.5/maven-deploy-plugin-2.5.jar
Progress (1): 4.1/23 kB
Progress (1): 7.7/23 kB
Progress (1): 12/23 kB 
Progress (1): 16/23 kB
Progress (1): 20/23 kB
Progress (1): 23 kB   
                   
Downloaded from eclipse.maven.central.mirror: https://repo.eclipse.org/content/repositories/maven_central/org/apache/maven/plugins/maven-deploy-plugin/2.5/maven-deploy-plugin-2.5.jar (23 kB at 722 kB/s)
Downloading from cbi-releases: https://repo.eclipse.org/content/repositories/cbi-releases/org/apache/maven/plugins/maven-site-plugin/2.2/maven-site-plugin-2.2.pom
Downloading from tycho-snapshots: https://oss.sonatype.org/content/groups/staging/org/apache/maven/plugins/maven-site-plugin/2.2/maven-site-plugin-2.2.pom
Downloading from eclipse.maven.central.mirror: https://repo.eclipse.org/content/repositories/maven_central/org/apache/maven/plugins/maven-site-plugin/2.2/maven-site-plugin-2.2.pom
Progress (1): 4.1/15 kB
Progress (1): 7.7/15 kB
Progress (1): 12/15 kB 
Progress (1): 15 kB   
                   
Downloaded from eclipse.maven.central.mirror: https://repo.eclipse.org/content/repositories/maven_central/org/apache/maven/plugins/maven-site-plugin/2.2/maven-site-plugin-2.2.pom (15 kB at 547 kB/s)
Downloading from cbi-releases: https://repo.eclipse.org/content/repositories/cbi-releases/org/apache/maven/plugins/maven-site-plugin/2.2/maven-site-plugin-2.2.jar
Downloading from tycho-snapshots: https://oss.sonatype.org/content/groups/staging/org/apache/maven/plugins/maven-site-plugin/2.2/maven-site-plugin-2.2.jar
Downloading from eclipse.maven.central.mirror: https://repo.eclipse.org/content/repositories/maven_central/org/apache/maven/plugins/maven-site-plugin/2.2/maven-site-plugin-2.2.jar
Progress (1): 4.1/98 kB
Progress (1): 7.7/98 kB
Progress (1): 12/98 kB 
Progress (1): 16/98 kB
Progress (1): 20/98 kB
Progress (1): 24/98 kB
Progress (1): 28/98 kB
Progress (1): 32/98 kB
Progress (1): 36/98 kB
Progress (1): 40/98 kB
Progress (1): 44/98 kB
Progress (1): 48/98 kB
Progress (1): 52/98 kB
Progress (1): 56/98 kB
Progress (1): 60/98 kB
Progress (1): 64/98 kB
Progress (1): 68/98 kB
Progress (1): 72/98 kB
Progress (1): 76/98 kB
Progress (1): 80/98 kB
Progress (1): 84/98 kB
Progress (1): 88/98 kB
Progress (1): 92/98 kB
Progress (1): 96/98 kB
Progress (1): 98 kB   
                   
Downloaded from eclipse.maven.central.mirror: https://repo.eclipse.org/content/repositories/maven_central/org/apache/maven/plugins/maven-site-plugin/2.2/maven-site-plugin-2.2.jar (98 kB at 2.8 MB/s)
[WARNING] No explicit target runtime environment configuration. Build is platform dependent.
Downloading from cbi-releases: https://repo.eclipse.org/content/repositories/cbi-releases/org/codehaus/modello/modello-maven-plugin/1.4.1/modello-maven-plugin-1.4.1.pom
Downloading from tycho-snapshots: https://oss.sonatype.org/content/groups/staging/org/codehaus/modello/modello-maven-plugin/1.4.1/modello-maven-plugin-1.4.1.pom
Downloading from eclipse.maven.central.mirror: https://repo.eclipse.org/content/repositories/maven_central/org/codehaus/modello/modello-maven-plugin/1.4.1/modello-maven-plugin-1.4.1.pom
Progress (1): 4.1/5.2 kB
Progress (1): 5.2 kB    
                    
Downloaded from eclipse.maven.central.mirror: https://repo.eclipse.org/content/repositories/maven_central/org/codehaus/modello/modello-maven-plugin/1.4.1/modello-maven-plugin-1.4.1.pom (5.2 kB at 113 kB/s)
Downloading from cbi-releases: https://repo.eclipse.org/content/repositories/cbi-releases/org/codehaus/modello/modello/1.4.1/modello-1.4.1.pom
Downloading from tycho-snapshots: https://oss.sonatype.org/content/groups/staging/org/codehaus/modello/modello/1.4.1/modello-1.4.1.pom
Downloading from eclipse.maven.central.mirror: https://repo.eclipse.org/content/repositories/maven_central/org/codehaus/modello/modello/1.4.1/modello-1.4.1.pom
Progress (1): 4.1/24 kB
Progress (1): 7.7/24 kB
Progress (1): 12/24 kB 
Progress (1): 16/24 kB
Progress (1): 20/24 kB
Progress (1): 24/24 kB
Progress (1): 24 kB   
                   
Downloaded from eclipse.maven.central.mirror: https://repo.eclipse.org/content/repositories/maven_central/org/codehaus/modello/modello/1.4.1/modello-1.4.1.pom (24 kB at 737 kB/s)
Downloading from cbi-releases: https://repo.eclipse.org/content/repositories/cbi-releases/org/codehaus/modello/modello-maven-plugin/1.4.1/modello-maven-plugin-1.4.1.jar
Downloading from tycho-snapshots: https://oss.sonatype.org/content/groups/staging/org/codehaus/modello/modello-maven-plugin/1.4.1/modello-maven-plugin-1.4.1.jar
Downloading from eclipse.maven.central.mirror: https://repo.eclipse.org/content/repositories/maven_central/org/codehaus/modello/modello-maven-plugin/1.4.1/modello-maven-plugin-1.4.1.jar
Progress (1): 4.1/24 kB
Progress (1): 7.7/24 kB
Progress (1): 12/24 kB 
Progress (1): 16/24 kB
Progress (1): 20/24 kB
Progress (1): 24/24 kB
Progress (1): 24 kB   
                   
Downloaded from eclipse.maven.central.mirror: https://repo.eclipse.org/content/repositories/maven_central/org/codehaus/modello/modello-maven-plugin/1.4.1/modello-maven-plugin-1.4.1.jar (24 kB at 703 kB/s)
[WARNING] No explicit target runtime environment configuration. Build is platform dependent.
[WARNING] No explicit target runtime environment configuration. Build is platform dependent.
[WARNING] No explicit target runtime environment configuration. Build is platform dependent.
[WARNING] No explicit target runtime environment configuration. Build is platform dependent.
[WARNING] No explicit target runtime environment configuration. Build is platform dependent.
[WARNING] No explicit target runtime environment configuration. Build is platform dependent.
[WARNING] No explicit target runtime environment configuration. Build is platform dependent.
[WARNING] No explicit target runtime environment configuration. Build is platform dependent.
Downloading from cbi-releases: https://repo.eclipse.org/content/repositories/cbi-releases/org/codehaus/mojo/build-helper-maven-plugin/3.0.0/build-helper-maven-plugin-3.0.0.pom
Downloading from tycho-snapshots: https://oss.sonatype.org/content/groups/staging/org/codehaus/mojo/build-helper-maven-plugin/3.0.0/build-helper-maven-plugin-3.0.0.pom
Downloading from eclipse.maven.central.mirror: https://repo.eclipse.org/content/repositories/maven_central/org/codehaus/mojo/build-helper-maven-plugin/3.0.0/build-helper-maven-plugin-3.0.0.pom
Progress (1): 4.1/5.8 kB
Progress (1): 5.8 kB    
                    
Downloaded from eclipse.maven.central.mirror: https://repo.eclipse.org/content/repositories/maven_central/org/codehaus/mojo/build-helper-maven-plugin/3.0.0/build-helper-maven-plugin-3.0.0.pom (5.8 kB at 193 kB/s)
Downloading from cbi-releases: https://repo.eclipse.org/content/repositories/cbi-releases/org/codehaus/mojo/mojo-parent/40/mojo-parent-40.pom
Downloading from tycho-snapshots: https://oss.sonatype.org/content/groups/staging/org/codehaus/mojo/mojo-parent/40/mojo-parent-40.pom
Downloading from eclipse.maven.central.mirror: https://repo.eclipse.org/content/repositories/maven_central/org/codehaus/mojo/mojo-parent/40/mojo-parent-40.pom
Progress (1): 4.1/34 kB
Progress (1): 7.7/34 kB
Progress (1): 12/34 kB 
Progress (1): 16/34 kB
Progress (1): 20/34 kB
Progress (1): 24/34 kB
Progress (1): 28/34 kB
Progress (1): 32/34 kB
Progress (1): 34 kB   
                   
Downloaded from eclipse.maven.central.mirror: https://repo.eclipse.org/content/repositories/maven_central/org/codehaus/mojo/mojo-parent/40/mojo-parent-40.pom (34 kB at 961 kB/s)
Downloading from cbi-releases: https://repo.eclipse.org/content/repositories/cbi-releases/org/codehaus/mojo/build-helper-maven-plugin/3.0.0/build-helper-maven-plugin-3.0.0.jar
Downloading from tycho-snapshots: https://oss.sonatype.org/content/groups/staging/org/codehaus/mojo/build-helper-maven-plugin/3.0.0/build-helper-maven-plugin-3.0.0.jar
Downloading from eclipse.maven.central.mirror: https://repo.eclipse.org/content/repositories/maven_central/org/codehaus/mojo/build-helper-maven-plugin/3.0.0/build-helper-maven-plugin-3.0.0.jar
Progress (1): 4.1/64 kB
Progress (1): 7.7/64 kB
Progress (1): 12/64 kB 
Progress (1): 16/64 kB
Progress (1): 20/64 kB
Progress (1): 24/64 kB
Progress (1): 28/64 kB
Progress (1): 32/64 kB
Progress (1): 36/64 kB
Progress (1): 40/64 kB
Progress (1): 44/64 kB
Progress (1): 48/64 kB
Progress (1): 52/64 kB
Progress (1): 56/64 kB
Progress (1): 60/64 kB
Progress (1): 64/64 kB
Progress (1): 64 kB   
                   
Downloaded from eclipse.maven.central.mirror: https://repo.eclipse.org/content/repositories/maven_central/org/codehaus/mojo/build-helper-maven-plugin/3.0.0/build-helper-maven-plugin-3.0.0.jar (64 kB at 1.5 MB/s)
[WARNING] No explicit target runtime environment configuration. Build is platform dependent.
[WARNING] No explicit target runtime environment configuration. Build is platform dependent.
[WARNING] No explicit target runtime environment configuration. Build is platform dependent.
[WARNING] No explicit target runtime environment configuration. Build is platform dependent.
[WARNING] No explicit target runtime environment configuration. Build is platform dependent.
[WARNING] No explicit target runtime environment configuration. Build is platform dependent.
[WARNING] No explicit target runtime environment configuration. Build is platform dependent.
[WARNING] No explicit target runtime environment configuration. Build is platform dependent.
[WARNING] No explicit target runtime environment configuration. Build is platform dependent.
[WARNING] No explicit target runtime environment configuration. Build is platform dependent.
[WARNING] No explicit target runtime environment configuration. Build is platform dependent.
[WARNING] No explicit target runtime environment configuration. Build is platform dependent.
[WARNING] No explicit target runtime environment configuration. Build is platform dependent.
[WARNING] No explicit target runtime environment configuration. Build is platform dependent.
[WARNING] No explicit target runtime environment configuration. Build is platform dependent.
[WARNING] No explicit target runtime environment configuration. Build is platform dependent.
Downloading from cbi-releases: https://repo.eclipse.org/content/repositories/cbi-releases/org/eclipse/tycho/tycho-p2-publisher-plugin/1.4.0/tycho-p2-publisher-plugin-1.4.0.pom
Downloading from tycho-snapshots: https://oss.sonatype.org/content/groups/staging/org/eclipse/tycho/tycho-p2-publisher-plugin/1.4.0/tycho-p2-publisher-plugin-1.4.0.pom
Downloading from eclipse.maven.central.mirror: https://repo.eclipse.org/content/repositories/maven_central/org/eclipse/tycho/tycho-p2-publisher-plugin/1.4.0/tycho-p2-publisher-plugin-1.4.0.pom
Progress (1): 2.0 kB
                    
Downloaded from eclipse.maven.central.mirror: https://repo.eclipse.org/content/repositories/maven_central/org/eclipse/tycho/tycho-p2-publisher-plugin/1.4.0/tycho-p2-publisher-plugin-1.4.0.pom (2.0 kB at 66 kB/s)
Downloading from cbi-releases: https://repo.eclipse.org/content/repositories/cbi-releases/org/eclipse/tycho/tycho-p2-publisher-plugin/1.4.0/tycho-p2-publisher-plugin-1.4.0.jar
Downloading from tycho-snapshots: https://oss.sonatype.org/content/groups/staging/org/eclipse/tycho/tycho-p2-publisher-plugin/1.4.0/tycho-p2-publisher-plugin-1.4.0.jar
Downloading from eclipse.maven.central.mirror: https://repo.eclipse.org/content/repositories/maven_central/org/eclipse/tycho/tycho-p2-publisher-plugin/1.4.0/tycho-p2-publisher-plugin-1.4.0.jar
Progress (1): 4.1/22 kB
Progress (1): 7.7/22 kB
Progress (1): 12/22 kB 
Progress (1): 16/22 kB
Progress (1): 20/22 kB
Progress (1): 22 kB   
                   
Downloaded from eclipse.maven.central.mirror: https://repo.eclipse.org/content/repositories/maven_central/org/eclipse/tycho/tycho-p2-publisher-plugin/1.4.0/tycho-p2-publisher-plugin-1.4.0.jar (22 kB at 733 kB/s)
Downloading from cbi-releases: https://repo.eclipse.org/content/repositories/cbi-releases/org/apache/commons/commons-lang3/3.1/commons-lang3-3.1.pom
Downloading from tycho-snapshots: https://oss.sonatype.org/content/groups/staging/org/apache/commons/commons-lang3/3.1/commons-lang3-3.1.pom
Downloading from eclipse.maven.central.mirror: https://repo.eclipse.org/content/repositories/maven_central/org/apache/commons/commons-lang3/3.1/commons-lang3-3.1.pom
Progress (1): 4.1/17 kB
Progress (1): 7.7/17 kB
Progress (1): 12/17 kB 
Progress (1): 16/17 kB
Progress (1): 17 kB   
                   
Downloaded from eclipse.maven.central.mirror: https://repo.eclipse.org/content/repositories/maven_central/org/apache/commons/commons-lang3/3.1/commons-lang3-3.1.pom (17 kB at 477 kB/s)
Downloading from cbi-releases: https://repo.eclipse.org/content/repositories/cbi-releases/org/apache/commons/commons-parent/22/commons-parent-22.pom
Downloading from tycho-snapshots: https://oss.sonatype.org/content/groups/staging/org/apache/commons/commons-parent/22/commons-parent-22.pom
Downloading from eclipse.maven.central.mirror: https://repo.eclipse.org/content/repositories/maven_central/org/apache/commons/commons-parent/22/commons-parent-22.pom
Progress (1): 4.1/42 kB
Progress (1): 7.7/42 kB
Progress (1): 12/42 kB 
Progress (1): 16/42 kB
Progress (1): 20/42 kB
Progress (1): 24/42 kB
Progress (1): 28/42 kB
Progress (1): 32/42 kB
Progress (1): 36/42 kB
Progress (1): 40/42 kB
Progress (1): 42 kB   
                   
Downloaded from eclipse.maven.central.mirror: https://repo.eclipse.org/content/repositories/maven_central/org/apache/commons/commons-parent/22/commons-parent-22.pom (42 kB at 1.2 MB/s)
Downloading from cbi-releases: https://repo.eclipse.org/content/repositories/cbi-releases/org/apache/commons/commons-lang3/3.1/commons-lang3-3.1.jar
Downloading from tycho-snapshots: https://oss.sonatype.org/content/groups/staging/org/apache/commons/commons-lang3/3.1/commons-lang3-3.1.jar
Downloading from eclipse.maven.central.mirror: https://repo.eclipse.org/content/repositories/maven_central/org/apache/commons/commons-lang3/3.1/commons-lang3-3.1.jar
Progress (1): 4.1/316 kB
Progress (1): 7.7/316 kB
Progress (1): 12/316 kB 
Progress (1): 16/316 kB
Progress (1): 20/316 kB
Progress (1): 24/316 kB
Progress (1): 28/316 kB
Progress (1): 32/316 kB
Progress (1): 36/316 kB
Progress (1): 40/316 kB
Progress (1): 44/316 kB
Progress (1): 48/316 kB
Progress (1): 52/316 kB
Progress (1): 56/316 kB
Progress (1): 60/316 kB
Progress (1): 64/316 kB
Progress (1): 68/316 kB
Progress (1): 72/316 kB
Progress (1): 76/316 kB
Progress (1): 80/316 kB
Progress (1): 84/316 kB
Progress (1): 88/316 kB
Progress (1): 92/316 kB
Progress (1): 96/316 kB
Progress (1): 100/316 kB
Progress (1): 104/316 kB
Progress (1): 108/316 kB
Progress (1): 112/316 kB
Progress (1): 116/316 kB
Progress (1): 120/316 kB
Progress (1): 124/316 kB
Progress (1): 128/316 kB
Progress (1): 132/316 kB
Progress (1): 136/316 kB
Progress (1): 140/316 kB
Progress (1): 144/316 kB
Progress (1): 148/316 kB
Progress (1): 152/316 kB
Progress (1): 156/316 kB
Progress (1): 160/316 kB
Progress (1): 164/316 kB
Progress (1): 168/316 kB
Progress (1): 172/316 kB
Progress (1): 176/316 kB
Progress (1): 180/316 kB
Progress (1): 184/316 kB
Progress (1): 188/316 kB
Progress (1): 192/316 kB
Progress (1): 196/316 kB
Progress (1): 200/316 kB
Progress (1): 204/316 kB
Progress (1): 208/316 kB
Progress (1): 212/316 kB
Progress (1): 216/316 kB
Progress (1): 220/316 kB
Progress (1): 224/316 kB
Progress (1): 228/316 kB
Progress (1): 232/316 kB
Progress (1): 236/316 kB
Progress (1): 240/316 kB
Progress (1): 244/316 kB
Progress (1): 248/316 kB
Progress (1): 252/316 kB
Progress (1): 256/316 kB
Progress (1): 260/316 kB
Progress (1): 264/316 kB
Progress (1): 268/316 kB
Progress (1): 272/316 kB
Progress (1): 276/316 kB
Progress (1): 280/316 kB
Progress (1): 284/316 kB
Progress (1): 288/316 kB
Progress (1): 292/316 kB
Progress (1): 296/316 kB
Progress (1): 300/316 kB
Progress (1): 304/316 kB
Progress (1): 308/316 kB
Progress (1): 312/316 kB
Progress (1): 316/316 kB
Progress (1): 316 kB    
                    
Downloaded from eclipse.maven.central.mirror: https://repo.eclipse.org/content/repositories/maven_central/org/apache/commons/commons-lang3/3.1/commons-lang3-3.1.jar (316 kB at 5.5 MB/s)
Downloading from cbi-releases: https://repo.eclipse.org/content/repositories/cbi-releases/org/eclipse/tycho/tycho-p2-repository-plugin/1.4.0/tycho-p2-repository-plugin-1.4.0.pom
Downloading from tycho-snapshots: https://oss.sonatype.org/content/groups/staging/org/eclipse/tycho/tycho-p2-repository-plugin/1.4.0/tycho-p2-repository-plugin-1.4.0.pom
Downloading from eclipse.maven.central.mirror: https://repo.eclipse.org/content/repositories/maven_central/org/eclipse/tycho/tycho-p2-repository-plugin/1.4.0/tycho-p2-repository-plugin-1.4.0.pom
Progress (1): 1.4 kB
                    
Downloaded from eclipse.maven.central.mirror: https://repo.eclipse.org/content/repositories/maven_central/org/eclipse/tycho/tycho-p2-repository-plugin/1.4.0/tycho-p2-repository-plugin-1.4.0.pom (1.4 kB at 46 kB/s)
Downloading from cbi-releases: https://repo.eclipse.org/content/repositories/cbi-releases/org/eclipse/tycho/tycho-p2-repository-plugin/1.4.0/tycho-p2-repository-plugin-1.4.0.jar
Downloading from tycho-snapshots: https://oss.sonatype.org/content/groups/staging/org/eclipse/tycho/tycho-p2-repository-plugin/1.4.0/tycho-p2-repository-plugin-1.4.0.jar
Downloading from eclipse.maven.central.mirror: https://repo.eclipse.org/content/repositories/maven_central/org/eclipse/tycho/tycho-p2-repository-plugin/1.4.0/tycho-p2-repository-plugin-1.4.0.jar
Progress (1): 4.1/14 kB
Progress (1): 7.7/14 kB
Progress (1): 12/14 kB 
Progress (1): 14 kB   
                   
Downloaded from eclipse.maven.central.mirror: https://repo.eclipse.org/content/repositories/maven_central/org/eclipse/tycho/tycho-p2-repository-plugin/1.4.0/tycho-p2-repository-plugin-1.4.0.jar (14 kB at 457 kB/s)
[WARNING] No explicit target runtime environment configuration. Build is platform dependent.
Downloading from cbi-releases: https://repo.eclipse.org/content/repositories/cbi-releases/org/eclipse/tycho/tycho-surefire-plugin/1.4.0/tycho-surefire-plugin-1.4.0.pom
Downloading from tycho-snapshots: https://oss.sonatype.org/content/groups/staging/org/eclipse/tycho/tycho-surefire-plugin/1.4.0/tycho-surefire-plugin-1.4.0.pom
Downloading from eclipse.maven.central.mirror: https://repo.eclipse.org/content/repositories/maven_central/org/eclipse/tycho/tycho-surefire-plugin/1.4.0/tycho-surefire-plugin-1.4.0.pom
Progress (1): 4.1/4.8 kB
Progress (1): 4.8 kB    
                    
Downloaded from eclipse.maven.central.mirror: https://repo.eclipse.org/content/repositories/maven_central/org/eclipse/tycho/tycho-surefire-plugin/1.4.0/tycho-surefire-plugin-1.4.0.pom (4.8 kB at 144 kB/s)
Downloading from cbi-releases: https://repo.eclipse.org/content/repositories/cbi-releases/org/eclipse/tycho/tycho-surefire-plugin/1.4.0/tycho-surefire-plugin-1.4.0.jar
Downloading from tycho-snapshots: https://oss.sonatype.org/content/groups/staging/org/eclipse/tycho/tycho-surefire-plugin/1.4.0/tycho-surefire-plugin-1.4.0.jar
Downloading from eclipse.maven.central.mirror: https://repo.eclipse.org/content/repositories/maven_central/org/eclipse/tycho/tycho-surefire-plugin/1.4.0/tycho-surefire-plugin-1.4.0.jar
Progress (1): 4.1/57 kB
Progress (1): 7.7/57 kB
Progress (1): 12/57 kB 
Progress (1): 16/57 kB
Progress (1): 20/57 kB
Progress (1): 24/57 kB
Progress (1): 28/57 kB
Progress (1): 32/57 kB
Progress (1): 36/57 kB
Progress (1): 40/57 kB
Progress (1): 44/57 kB
Progress (1): 48/57 kB
Progress (1): 52/57 kB
Progress (1): 56/57 kB
Progress (1): 57 kB   
                   
Downloaded from eclipse.maven.central.mirror: https://repo.eclipse.org/content/repositories/maven_central/org/eclipse/tycho/tycho-surefire-plugin/1.4.0/tycho-surefire-plugin-1.4.0.jar (57 kB at 1.7 MB/s)
Downloading from cbi-releases: https://repo.eclipse.org/content/repositories/cbi-releases/org/eclipse/tycho/org.eclipse.tycho.surefire.osgibooter/1.4.0/org.eclipse.tycho.surefire.osgibooter-1.4.0.pom
Downloading from tycho-snapshots: https://oss.sonatype.org/content/groups/staging/org/eclipse/tycho/org.eclipse.tycho.surefire.osgibooter/1.4.0/org.eclipse.tycho.surefire.osgibooter-1.4.0.pom
Downloading from eclipse.maven.central.mirror: https://repo.eclipse.org/content/repositories/maven_central/org/eclipse/tycho/org.eclipse.tycho.surefire.osgibooter/1.4.0/org.eclipse.tycho.surefire.osgibooter-1.4.0.pom
Progress (1): 3.3 kB
                    
Downloaded from eclipse.maven.central.mirror: https://repo.eclipse.org/content/repositories/maven_central/org/eclipse/tycho/org.eclipse.tycho.surefire.osgibooter/1.4.0/org.eclipse.tycho.surefire.osgibooter-1.4.0.pom (3.3 kB at 103 kB/s)
Downloading from cbi-releases: https://repo.eclipse.org/content/repositories/cbi-releases/org/eclipse/tycho/org.eclipse.tycho.surefire.junit/1.4.0/org.eclipse.tycho.surefire.junit-1.4.0.pom
Downloading from tycho-snapshots: https://oss.sonatype.org/content/groups/staging/org/eclipse/tycho/org.eclipse.tycho.surefire.junit/1.4.0/org.eclipse.tycho.surefire.junit-1.4.0.pom
Downloading from eclipse.maven.central.mirror: https://repo.eclipse.org/content/repositories/maven_central/org/eclipse/tycho/org.eclipse.tycho.surefire.junit/1.4.0/org.eclipse.tycho.surefire.junit-1.4.0.pom
Progress (1): 1.5 kB
                    
Downloaded from eclipse.maven.central.mirror: https://repo.eclipse.org/content/repositories/maven_central/org/eclipse/tycho/org.eclipse.tycho.surefire.junit/1.4.0/org.eclipse.tycho.surefire.junit-1.4.0.pom (1.5 kB at 44 kB/s)
Downloading from cbi-releases: https://repo.eclipse.org/content/repositories/cbi-releases/org/eclipse/tycho/tycho-surefire/1.4.0/tycho-surefire-1.4.0.pom
Downloading from tycho-snapshots: https://oss.sonatype.org/content/groups/staging/org/eclipse/tycho/tycho-surefire/1.4.0/tycho-surefire-1.4.0.pom
Downloading from eclipse.maven.central.mirror: https://repo.eclipse.org/content/repositories/maven_central/org/eclipse/tycho/tycho-surefire/1.4.0/tycho-surefire-1.4.0.pom
Progress (1): 3.0 kB
                    
Downloaded from eclipse.maven.central.mirror: https://repo.eclipse.org/content/repositories/maven_central/org/eclipse/tycho/tycho-surefire/1.4.0/tycho-surefire-1.4.0.pom (3.0 kB at 88 kB/s)
Downloading from cbi-releases: https://repo.eclipse.org/content/repositories/cbi-releases/org/eclipse/tycho/org.eclipse.tycho.surefire.junit4/1.4.0/org.eclipse.tycho.surefire.junit4-1.4.0.pom
Downloading from tycho-snapshots: https://oss.sonatype.org/content/groups/staging/org/eclipse/tycho/org.eclipse.tycho.surefire.junit4/1.4.0/org.eclipse.tycho.surefire.junit4-1.4.0.pom
Downloading from eclipse.maven.central.mirror: https://repo.eclipse.org/content/repositories/maven_central/org/eclipse/tycho/org.eclipse.tycho.surefire.junit4/1.4.0/org.eclipse.tycho.surefire.junit4-1.4.0.pom
Progress (1): 1.5 kB
                    
Downloaded from eclipse.maven.central.mirror: https://repo.eclipse.org/content/repositories/maven_central/org/eclipse/tycho/org.eclipse.tycho.surefire.junit4/1.4.0/org.eclipse.tycho.surefire.junit4-1.4.0.pom (1.5 kB at 50 kB/s)
Downloading from cbi-releases: https://repo.eclipse.org/content/repositories/cbi-releases/org/eclipse/tycho/org.eclipse.tycho.surefire.junit47/1.4.0/org.eclipse.tycho.surefire.junit47-1.4.0.pom
Downloading from tycho-snapshots: https://oss.sonatype.org/content/groups/staging/org/eclipse/tycho/org.eclipse.tycho.surefire.junit47/1.4.0/org.eclipse.tycho.surefire.junit47-1.4.0.pom
Downloading from eclipse.maven.central.mirror: https://repo.eclipse.org/content/repositories/maven_central/org/eclipse/tycho/org.eclipse.tycho.surefire.junit47/1.4.0/org.eclipse.tycho.surefire.junit47-1.4.0.pom
Progress (1): 1.9 kB
                    
Downloaded from eclipse.maven.central.mirror: https://repo.eclipse.org/content/repositories/maven_central/org/eclipse/tycho/org.eclipse.tycho.surefire.junit47/1.4.0/org.eclipse.tycho.surefire.junit47-1.4.0.pom (1.9 kB at 62 kB/s)
Downloading from cbi-releases: https://repo.eclipse.org/content/repositories/cbi-releases/org/eclipse/tycho/org.eclipse.tycho.surefire.junit5/1.4.0/org.eclipse.tycho.surefire.junit5-1.4.0.pom
Downloading from tycho-snapshots: https://oss.sonatype.org/content/groups/staging/org/eclipse/tycho/org.eclipse.tycho.surefire.junit5/1.4.0/org.eclipse.tycho.surefire.junit5-1.4.0.pom
Downloading from eclipse.maven.central.mirror: https://repo.eclipse.org/content/repositories/maven_central/org/eclipse/tycho/org.eclipse.tycho.surefire.junit5/1.4.0/org.eclipse.tycho.surefire.junit5-1.4.0.pom
Progress (1): 3.3 kB
                    
Downloaded from eclipse.maven.central.mirror: https://repo.eclipse.org/content/repositories/maven_central/org/eclipse/tycho/org.eclipse.tycho.surefire.junit5/1.4.0/org.eclipse.tycho.surefire.junit5-1.4.0.pom (3.3 kB at 109 kB/s)
Downloading from cbi-releases: https://repo.eclipse.org/content/repositories/cbi-releases/org/eclipse/tycho/org.eclipse.tycho.surefire.testng/1.4.0/org.eclipse.tycho.surefire.testng-1.4.0.pom
Downloading from tycho-snapshots: https://oss.sonatype.org/content/groups/staging/org/eclipse/tycho/org.eclipse.tycho.surefire.testng/1.4.0/org.eclipse.tycho.surefire.testng-1.4.0.pom
Downloading from eclipse.maven.central.mirror: https://repo.eclipse.org/content/repositories/maven_central/org/eclipse/tycho/org.eclipse.tycho.surefire.testng/1.4.0/org.eclipse.tycho.surefire.testng-1.4.0.pom
Progress (1): 2.1 kB
                    
Downloaded from eclipse.maven.central.mirror: https://repo.eclipse.org/content/repositories/maven_central/org/eclipse/tycho/org.eclipse.tycho.surefire.testng/1.4.0/org.eclipse.tycho.surefire.testng-1.4.0.pom (2.1 kB at 67 kB/s)
Downloading from cbi-releases: https://repo.eclipse.org/content/repositories/cbi-releases/org/apache/maven/surefire/surefire-api/2.22.0/surefire-api-2.22.0.pom
Downloading from tycho-snapshots: https://oss.sonatype.org/content/groups/staging/org/apache/maven/surefire/surefire-api/2.22.0/surefire-api-2.22.0.pom
Downloading from eclipse.maven.central.mirror: https://repo.eclipse.org/content/repositories/maven_central/org/apache/maven/surefire/surefire-api/2.22.0/surefire-api-2.22.0.pom
Progress (1): 3.5 kB
                    
Downloaded from eclipse.maven.central.mirror: https://repo.eclipse.org/content/repositories/maven_central/org/apache/maven/surefire/surefire-api/2.22.0/surefire-api-2.22.0.pom (3.5 kB at 136 kB/s)
Downloading from cbi-releases: https://repo.eclipse.org/content/repositories/cbi-releases/org/apache/maven/surefire/surefire/2.22.0/surefire-2.22.0.pom
Downloading from tycho-snapshots: https://oss.sonatype.org/content/groups/staging/org/apache/maven/surefire/surefire/2.22.0/surefire-2.22.0.pom
Downloading from eclipse.maven.central.mirror: https://repo.eclipse.org/content/repositories/maven_central/org/apache/maven/surefire/surefire/2.22.0/surefire-2.22.0.pom
Progress (1): 4.1/27 kB
Progress (1): 7.7/27 kB
Progress (1): 12/27 kB 
Progress (1): 16/27 kB
Progress (1): 20/27 kB
Progress (1): 24/27 kB
Progress (1): 27 kB   
                   
Downloaded from eclipse.maven.central.mirror: https://repo.eclipse.org/content/repositories/maven_central/org/apache/maven/surefire/surefire/2.22.0/surefire-2.22.0.pom (27 kB at 739 kB/s)
Downloading from cbi-releases: https://repo.eclipse.org/content/repositories/cbi-releases/org/apache/maven/maven-parent/31/maven-parent-31.pom
Downloading from tycho-snapshots: https://oss.sonatype.org/content/groups/staging/org/apache/maven/maven-parent/31/maven-parent-31.pom
Downloading from eclipse.maven.central.mirror: https://repo.eclipse.org/content/repositories/maven_central/org/apache/maven/maven-parent/31/maven-parent-31.pom
Progress (1): 4.1/43 kB
Progress (1): 7.7/43 kB
Progress (1): 12/43 kB 
Progress (1): 16/43 kB
Progress (1): 20/43 kB
Progress (1): 24/43 kB
Progress (1): 28/43 kB
Progress (1): 32/43 kB
Progress (1): 36/43 kB
Progress (1): 40/43 kB
Progress (1): 43 kB   
                   
Downloaded from eclipse.maven.central.mirror: https://repo.eclipse.org/content/repositories/maven_central/org/apache/maven/maven-parent/31/maven-parent-31.pom (43 kB at 1.4 MB/s)
Downloading from cbi-releases: https://repo.eclipse.org/content/repositories/cbi-releases/org/apache/maven/surefire/surefire-logger-api/2.22.0/surefire-logger-api-2.22.0.pom
Downloading from tycho-snapshots: https://oss.sonatype.org/content/groups/staging/org/apache/maven/surefire/surefire-logger-api/2.22.0/surefire-logger-api-2.22.0.pom
Downloading from eclipse.maven.central.mirror: https://repo.eclipse.org/content/repositories/maven_central/org/apache/maven/surefire/surefire-logger-api/2.22.0/surefire-logger-api-2.22.0.pom
Progress (1): 2.0 kB
                    
Downloaded from eclipse.maven.central.mirror: https://repo.eclipse.org/content/repositories/maven_central/org/apache/maven/surefire/surefire-logger-api/2.22.0/surefire-logger-api-2.22.0.pom (2.0 kB at 68 kB/s)
Downloading from cbi-releases: https://repo.eclipse.org/content/repositories/cbi-releases/org/apache/maven/surefire/maven-surefire-common/2.22.0/maven-surefire-common-2.22.0.pom
Downloading from tycho-snapshots: https://oss.sonatype.org/content/groups/staging/org/apache/maven/surefire/maven-surefire-common/2.22.0/maven-surefire-common-2.22.0.pom
Downloading from eclipse.maven.central.mirror: https://repo.eclipse.org/content/repositories/maven_central/org/apache/maven/surefire/maven-surefire-common/2.22.0/maven-surefire-common-2.22.0.pom
Progress (1): 4.1/11 kB
Progress (1): 7.7/11 kB
Progress (1): 11 kB    
                   
Downloaded from eclipse.maven.central.mirror: https://repo.eclipse.org/content/repositories/maven_central/org/apache/maven/surefire/maven-surefire-common/2.22.0/maven-surefire-common-2.22.0.pom (11 kB at 379 kB/s)
Downloading from cbi-releases: https://repo.eclipse.org/content/repositories/cbi-releases/org/apache/maven/plugin-tools/maven-plugin-annotations/3.5.2/maven-plugin-annotations-3.5.2.pom
Downloading from tycho-snapshots: https://oss.sonatype.org/content/groups/staging/org/apache/maven/plugin-tools/maven-plugin-annotations/3.5.2/maven-plugin-annotations-3.5.2.pom
Downloading from eclipse.maven.central.mirror: https://repo.eclipse.org/content/repositories/maven_central/org/apache/maven/plugin-tools/maven-plugin-annotations/3.5.2/maven-plugin-annotations-3.5.2.pom
Progress (1): 1.6 kB
                    
Downloaded from eclipse.maven.central.mirror: https://repo.eclipse.org/content/repositories/maven_central/org/apache/maven/plugin-tools/maven-plugin-annotations/3.5.2/maven-plugin-annotations-3.5.2.pom (1.6 kB at 45 kB/s)
Downloading from cbi-releases: https://repo.eclipse.org/content/repositories/cbi-releases/org/apache/maven/plugin-tools/maven-plugin-tools/3.5.2/maven-plugin-tools-3.5.2.pom
Downloading from tycho-snapshots: https://oss.sonatype.org/content/groups/staging/org/apache/maven/plugin-tools/maven-plugin-tools/3.5.2/maven-plugin-tools-3.5.2.pom
Downloading from eclipse.maven.central.mirror: https://repo.eclipse.org/content/repositories/maven_central/org/apache/maven/plugin-tools/maven-plugin-tools/3.5.2/maven-plugin-tools-3.5.2.pom
Progress (1): 4.1/15 kB
Progress (1): 7.7/15 kB
Progress (1): 12/15 kB 
Progress (1): 15 kB   
                   
Downloaded from eclipse.maven.central.mirror: https://repo.eclipse.org/content/repositories/maven_central/org/apache/maven/plugin-tools/maven-plugin-tools/3.5.2/maven-plugin-tools-3.5.2.pom (15 kB at 327 kB/s)
Downloading from cbi-releases: https://repo.eclipse.org/content/repositories/cbi-releases/org/apache/maven/surefire/surefire-booter/2.22.0/surefire-booter-2.22.0.pom
Downloading from tycho-snapshots: https://oss.sonatype.org/content/groups/staging/org/apache/maven/surefire/surefire-booter/2.22.0/surefire-booter-2.22.0.pom
Downloading from eclipse.maven.central.mirror: https://repo.eclipse.org/content/repositories/maven_central/org/apache/maven/surefire/surefire-booter/2.22.0/surefire-booter-2.22.0.pom
Progress (1): 4.1/7.4 kB
Progress (1): 7.4 kB    
                    
Downloaded from eclipse.maven.central.mirror: https://repo.eclipse.org/content/repositories/maven_central/org/apache/maven/surefire/surefire-booter/2.22.0/surefire-booter-2.22.0.pom (7.4 kB at 210 kB/s)
Downloading from cbi-releases: https://repo.eclipse.org/content/repositories/cbi-releases/org/codehaus/plexus/plexus-container-default/1.7.1/plexus-container-default-1.7.1.pom
Downloading from tycho-snapshots: https://oss.sonatype.org/content/groups/staging/org/codehaus/plexus/plexus-container-default/1.7.1/plexus-container-default-1.7.1.pom
Downloading from eclipse.maven.central.mirror: https://repo.eclipse.org/content/repositories/maven_central/org/codehaus/plexus/plexus-container-default/1.7.1/plexus-container-default-1.7.1.pom
Progress (1): 2.8 kB
                    
Downloaded from eclipse.maven.central.mirror: https://repo.eclipse.org/content/repositories/maven_central/org/codehaus/plexus/plexus-container-default/1.7.1/plexus-container-default-1.7.1.pom (2.8 kB at 92 kB/s)
Downloading from cbi-releases: https://repo.eclipse.org/content/repositories/cbi-releases/org/codehaus/plexus/plexus-classworlds/2.5.1/plexus-classworlds-2.5.1.pom
Downloading from tycho-snapshots: https://oss.sonatype.org/content/groups/staging/org/codehaus/plexus/plexus-classworlds/2.5.1/plexus-classworlds-2.5.1.pom
Downloading from eclipse.maven.central.mirror: https://repo.eclipse.org/content/repositories/maven_central/org/codehaus/plexus/plexus-classworlds/2.5.1/plexus-classworlds-2.5.1.pom
Progress (1): 4.1/5.0 kB
Progress (1): 5.0 kB    
                    
Downloaded from eclipse.maven.central.mirror: https://repo.eclipse.org/content/repositories/maven_central/org/codehaus/plexus/plexus-classworlds/2.5.1/plexus-classworlds-2.5.1.pom (5.0 kB at 152 kB/s)
Downloading from cbi-releases: https://repo.eclipse.org/content/repositories/cbi-releases/org/apache/xbean/xbean-reflect/3.7/xbean-reflect-3.7.pom
Downloading from tycho-snapshots: https://oss.sonatype.org/content/groups/staging/org/apache/xbean/xbean-reflect/3.7/xbean-reflect-3.7.pom
Downloading from eclipse.maven.central.mirror: https://repo.eclipse.org/content/repositories/maven_central/org/apache/xbean/xbean-reflect/3.7/xbean-reflect-3.7.pom
Progress (1): 4.1/5.1 kB
Progress (1): 5.1 kB    
                    
Downloaded from eclipse.maven.central.mirror: https://repo.eclipse.org/content/repositories/maven_central/org/apache/xbean/xbean-reflect/3.7/xbean-reflect-3.7.pom (5.1 kB at 159 kB/s)
Downloading from cbi-releases: https://repo.eclipse.org/content/repositories/cbi-releases/org/apache/xbean/xbean/3.7/xbean-3.7.pom
Downloading from tycho-snapshots: https://oss.sonatype.org/content/groups/staging/org/apache/xbean/xbean/3.7/xbean-3.7.pom
Downloading from eclipse.maven.central.mirror: https://repo.eclipse.org/content/repositories/maven_central/org/apache/xbean/xbean/3.7/xbean-3.7.pom
Progress (1): 4.1/15 kB
Progress (1): 7.7/15 kB
Progress (1): 12/15 kB 
Progress (1): 15 kB   
                   
Downloaded from eclipse.maven.central.mirror: https://repo.eclipse.org/content/repositories/maven_central/org/apache/xbean/xbean/3.7/xbean-3.7.pom (15 kB at 429 kB/s)
Downloading from cbi-releases: https://repo.eclipse.org/content/repositories/cbi-releases/org/apache/geronimo/genesis/genesis-java5-flava/2.0/genesis-java5-flava-2.0.pom
Downloading from tycho-snapshots: https://oss.sonatype.org/content/groups/staging/org/apache/geronimo/genesis/genesis-java5-flava/2.0/genesis-java5-flava-2.0.pom
Downloading from eclipse.maven.central.mirror: https://repo.eclipse.org/content/repositories/maven_central/org/apache/geronimo/genesis/genesis-java5-flava/2.0/genesis-java5-flava-2.0.pom
Progress (1): 4.1/5.5 kB
Progress (1): 5.5 kB    
                    
Downloaded from eclipse.maven.central.mirror: https://repo.eclipse.org/content/repositories/maven_central/org/apache/geronimo/genesis/genesis-java5-flava/2.0/genesis-java5-flava-2.0.pom (5.5 kB at 141 kB/s)
Downloading from cbi-releases: https://repo.eclipse.org/content/repositories/cbi-releases/org/apache/geronimo/genesis/genesis-default-flava/2.0/genesis-default-flava-2.0.pom
Downloading from tycho-snapshots: https://oss.sonatype.org/content/groups/staging/org/apache/geronimo/genesis/genesis-default-flava/2.0/genesis-default-flava-2.0.pom
Downloading from eclipse.maven.central.mirror: https://repo.eclipse.org/content/repositories/maven_central/org/apache/geronimo/genesis/genesis-default-flava/2.0/genesis-default-flava-2.0.pom
Progress (1): 4.1/18 kB
Progress (1): 7.7/18 kB
Progress (1): 12/18 kB 
Progress (1): 16/18 kB
Progress (1): 18 kB   
                   
Downloaded from eclipse.maven.central.mirror: https://repo.eclipse.org/content/repositories/maven_central/org/apache/geronimo/genesis/genesis-default-flava/2.0/genesis-default-flava-2.0.pom (18 kB at 594 kB/s)
Downloading from cbi-releases: https://repo.eclipse.org/content/repositories/cbi-releases/org/apache/geronimo/genesis/genesis/2.0/genesis-2.0.pom
Downloading from tycho-snapshots: https://oss.sonatype.org/content/groups/staging/org/apache/geronimo/genesis/genesis/2.0/genesis-2.0.pom
Downloading from eclipse.maven.central.mirror: https://repo.eclipse.org/content/repositories/maven_central/org/apache/geronimo/genesis/genesis/2.0/genesis-2.0.pom
Progress (1): 4.1/18 kB
Progress (1): 7.7/18 kB
Progress (1): 12/18 kB 
Progress (1): 16/18 kB
Progress (1): 18 kB   
                   
Downloaded from eclipse.maven.central.mirror: https://repo.eclipse.org/content/repositories/maven_central/org/apache/geronimo/genesis/genesis/2.0/genesis-2.0.pom (18 kB at 614 kB/s)
Downloading from cbi-releases: https://repo.eclipse.org/content/repositories/cbi-releases/com/google/collections/google-collections/1.0/google-collections-1.0.pom
Downloading from tycho-snapshots: https://oss.sonatype.org/content/groups/staging/com/google/collections/google-collections/1.0/google-collections-1.0.pom
Downloading from eclipse.maven.central.mirror: https://repo.eclipse.org/content/repositories/maven_central/com/google/collections/google-collections/1.0/google-collections-1.0.pom
Progress (1): 2.5 kB
                    
Downloaded from eclipse.maven.central.mirror: https://repo.eclipse.org/content/repositories/maven_central/com/google/collections/google-collections/1.0/google-collections-1.0.pom (2.5 kB at 62 kB/s)
Downloading from cbi-releases: https://repo.eclipse.org/content/repositories/cbi-releases/com/google/google/1/google-1.pom
Downloading from tycho-snapshots: https://oss.sonatype.org/content/groups/staging/com/google/google/1/google-1.pom
Downloading from eclipse.maven.central.mirror: https://repo.eclipse.org/content/repositories/maven_central/com/google/google/1/google-1.pom
Progress (1): 1.6 kB
                    
Downloaded from eclipse.maven.central.mirror: https://repo.eclipse.org/content/repositories/maven_central/com/google/google/1/google-1.pom (1.6 kB at 42 kB/s)
Downloading from cbi-releases: https://repo.eclipse.org/content/repositories/cbi-releases/org/apache/maven/maven-toolchain/2.2.1/maven-toolchain-2.2.1.pom
Downloading from tycho-snapshots: https://oss.sonatype.org/content/groups/staging/org/apache/maven/maven-toolchain/2.2.1/maven-toolchain-2.2.1.pom
Downloading from eclipse.maven.central.mirror: https://repo.eclipse.org/content/repositories/maven_central/org/apache/maven/maven-toolchain/2.2.1/maven-toolchain-2.2.1.pom
Progress (1): 3.3 kB
                    
Downloaded from eclipse.maven.central.mirror: https://repo.eclipse.org/content/repositories/maven_central/org/apache/maven/maven-toolchain/2.2.1/maven-toolchain-2.2.1.pom (3.3 kB at 124 kB/s)
Downloading from cbi-releases: https://repo.eclipse.org/content/repositories/cbi-releases/org/codehaus/plexus/plexus-java/0.9.8/plexus-java-0.9.8.pom
Downloading from tycho-snapshots: https://oss.sonatype.org/content/groups/staging/org/codehaus/plexus/plexus-java/0.9.8/plexus-java-0.9.8.pom
Downloading from eclipse.maven.central.mirror: https://repo.eclipse.org/content/repositories/maven_central/org/codehaus/plexus/plexus-java/0.9.8/plexus-java-0.9.8.pom
Progress (1): 2.4 kB
                    
Downloaded from eclipse.maven.central.mirror: https://repo.eclipse.org/content/repositories/maven_central/org/codehaus/plexus/plexus-java/0.9.8/plexus-java-0.9.8.pom (2.4 kB at 74 kB/s)
Downloading from cbi-releases: https://repo.eclipse.org/content/repositories/cbi-releases/org/codehaus/plexus/plexus-languages/0.9.8/plexus-languages-0.9.8.pom
Downloading from tycho-snapshots: https://oss.sonatype.org/content/groups/staging/org/codehaus/plexus/plexus-languages/0.9.8/plexus-languages-0.9.8.pom
Downloading from eclipse.maven.central.mirror: https://repo.eclipse.org/content/repositories/maven_central/org/codehaus/plexus/plexus-languages/0.9.8/plexus-languages-0.9.8.pom
Progress (1): 2.2 kB
                    
Downloaded from eclipse.maven.central.mirror: https://repo.eclipse.org/content/repositories/maven_central/org/codehaus/plexus/plexus-languages/0.9.8/plexus-languages-0.9.8.pom (2.2 kB at 76 kB/s)
Downloading from cbi-releases: https://repo.eclipse.org/content/repositories/cbi-releases/org/ow2/asm/asm/6.1.1/asm-6.1.1.pom
Downloading from tycho-snapshots: https://oss.sonatype.org/content/groups/staging/org/ow2/asm/asm/6.1.1/asm-6.1.1.pom
Downloading from eclipse.maven.central.mirror: https://repo.eclipse.org/content/repositories/maven_central/org/ow2/asm/asm/6.1.1/asm-6.1.1.pom
Progress (1): 2.9 kB
                    
Downloaded from eclipse.maven.central.mirror: https://repo.eclipse.org/content/repositories/maven_central/org/ow2/asm/asm/6.1.1/asm-6.1.1.pom (2.9 kB at 89 kB/s)
Downloading from cbi-releases: https://repo.eclipse.org/content/repositories/cbi-releases/com/thoughtworks/qdox/qdox/2.0-M7/qdox-2.0-M7.pom
Downloading from tycho-snapshots: https://oss.sonatype.org/content/groups/staging/com/thoughtworks/qdox/qdox/2.0-M7/qdox-2.0-M7.pom
Downloading from eclipse.maven.central.mirror: https://repo.eclipse.org/content/repositories/maven_central/com/thoughtworks/qdox/qdox/2.0-M7/qdox-2.0-M7.pom
Progress (1): 4.1/16 kB
Progress (1): 7.7/16 kB
Progress (1): 12/16 kB 
Progress (1): 16/16 kB
Progress (1): 16 kB   
                   
Downloaded from eclipse.maven.central.mirror: https://repo.eclipse.org/content/repositories/maven_central/com/thoughtworks/qdox/qdox/2.0-M7/qdox-2.0-M7.pom (16 kB at 511 kB/s)
Downloading from cbi-releases: https://repo.eclipse.org/content/repositories/cbi-releases/org/eclipse/tycho/org.eclipse.tycho.surefire.osgibooter/1.4.0/org.eclipse.tycho.surefire.osgibooter-1.4.0.jar
Downloading from cbi-releases: https://repo.eclipse.org/content/repositories/cbi-releases/org/eclipse/tycho/org.eclipse.tycho.surefire.junit4/1.4.0/org.eclipse.tycho.surefire.junit4-1.4.0.jar
Downloading from cbi-releases: https://repo.eclipse.org/content/repositories/cbi-releases/org/eclipse/tycho/org.eclipse.tycho.surefire.junit/1.4.0/org.eclipse.tycho.surefire.junit-1.4.0.jar
Downloading from cbi-releases: https://repo.eclipse.org/content/repositories/cbi-releases/org/eclipse/tycho/org.eclipse.tycho.surefire.junit5/1.4.0/org.eclipse.tycho.surefire.junit5-1.4.0.jar
Downloading from cbi-releases: https://repo.eclipse.org/content/repositories/cbi-releases/org/eclipse/tycho/org.eclipse.tycho.surefire.junit47/1.4.0/org.eclipse.tycho.surefire.junit47-1.4.0.jar
Downloading from cbi-releases: https://repo.eclipse.org/content/repositories/cbi-releases/org/eclipse/tycho/org.eclipse.tycho.surefire.testng/1.4.0/org.eclipse.tycho.surefire.testng-1.4.0.jar
Downloading from cbi-releases: https://repo.eclipse.org/content/repositories/cbi-releases/org/apache/maven/surefire/surefire-api/2.22.0/surefire-api-2.22.0.jar
Downloading from cbi-releases: https://repo.eclipse.org/content/repositories/cbi-releases/org/apache/maven/surefire/surefire-logger-api/2.22.0/surefire-logger-api-2.22.0.jar
Downloading from cbi-releases: https://repo.eclipse.org/content/repositories/cbi-releases/org/apache/maven/surefire/maven-surefire-common/2.22.0/maven-surefire-common-2.22.0.jar
Downloading from cbi-releases: https://repo.eclipse.org/content/repositories/cbi-releases/org/apache/maven/surefire/surefire-booter/2.22.0/surefire-booter-2.22.0.jar
Downloading from cbi-releases: https://repo.eclipse.org/content/repositories/cbi-releases/org/apache/maven/maven-plugin-descriptor/2.2.1/maven-plugin-descriptor-2.2.1.jar
Downloading from cbi-releases: https://repo.eclipse.org/content/repositories/cbi-releases/org/apache/maven/maven-toolchain/2.2.1/maven-toolchain-2.2.1.jar
Downloading from cbi-releases: https://repo.eclipse.org/content/repositories/cbi-releases/org/codehaus/plexus/plexus-java/0.9.8/plexus-java-0.9.8.jar
Downloading from cbi-releases: https://repo.eclipse.org/content/repositories/cbi-releases/org/ow2/asm/asm/6.1.1/asm-6.1.1.jar
Downloading from cbi-releases: https://repo.eclipse.org/content/repositories/cbi-releases/com/thoughtworks/qdox/qdox/2.0-M7/qdox-2.0-M7.jar
Downloading from tycho-snapshots: https://oss.sonatype.org/content/groups/staging/org/eclipse/tycho/org.eclipse.tycho.surefire.osgibooter/1.4.0/org.eclipse.tycho.surefire.osgibooter-1.4.0.jar
Downloading from tycho-snapshots: https://oss.sonatype.org/content/groups/staging/org/eclipse/tycho/org.eclipse.tycho.surefire.junit4/1.4.0/org.eclipse.tycho.surefire.junit4-1.4.0.jar
Downloading from tycho-snapshots: https://oss.sonatype.org/content/groups/staging/org/eclipse/tycho/org.eclipse.tycho.surefire.junit/1.4.0/org.eclipse.tycho.surefire.junit-1.4.0.jar
Downloading from tycho-snapshots: https://oss.sonatype.org/content/groups/staging/org/eclipse/tycho/org.eclipse.tycho.surefire.junit5/1.4.0/org.eclipse.tycho.surefire.junit5-1.4.0.jar
Downloading from tycho-snapshots: https://oss.sonatype.org/content/groups/staging/org/eclipse/tycho/org.eclipse.tycho.surefire.junit47/1.4.0/org.eclipse.tycho.surefire.junit47-1.4.0.jar
Downloading from tycho-snapshots: https://oss.sonatype.org/content/groups/staging/org/eclipse/tycho/org.eclipse.tycho.surefire.testng/1.4.0/org.eclipse.tycho.surefire.testng-1.4.0.jar
Downloading from tycho-snapshots: https://oss.sonatype.org/content/groups/staging/org/apache/maven/surefire/surefire-api/2.22.0/surefire-api-2.22.0.jar
Downloading from tycho-snapshots: https://oss.sonatype.org/content/groups/staging/org/apache/maven/surefire/surefire-logger-api/2.22.0/surefire-logger-api-2.22.0.jar
Downloading from tycho-snapshots: https://oss.sonatype.org/content/groups/staging/org/apache/maven/surefire/maven-surefire-common/2.22.0/maven-surefire-common-2.22.0.jar
Downloading from tycho-snapshots: https://oss.sonatype.org/content/groups/staging/org/apache/maven/surefire/surefire-booter/2.22.0/surefire-booter-2.22.0.jar
Downloading from tycho-snapshots: https://oss.sonatype.org/content/groups/staging/org/apache/maven/maven-plugin-descriptor/2.2.1/maven-plugin-descriptor-2.2.1.jar
Downloading from tycho-snapshots: https://oss.sonatype.org/content/groups/staging/org/apache/maven/maven-toolchain/2.2.1/maven-toolchain-2.2.1.jar
Downloading from tycho-snapshots: https://oss.sonatype.org/content/groups/staging/org/codehaus/plexus/plexus-java/0.9.8/plexus-java-0.9.8.jar
Downloading from tycho-snapshots: https://oss.sonatype.org/content/groups/staging/org/ow2/asm/asm/6.1.1/asm-6.1.1.jar
Downloading from tycho-snapshots: https://oss.sonatype.org/content/groups/staging/com/thoughtworks/qdox/qdox/2.0-M7/qdox-2.0-M7.jar
Downloading from eclipse.maven.central.mirror: https://repo.eclipse.org/content/repositories/maven_central/org/eclipse/tycho/org.eclipse.tycho.surefire.osgibooter/1.4.0/org.eclipse.tycho.surefire.osgibooter-1.4.0.jar
Downloading from eclipse.maven.central.mirror: https://repo.eclipse.org/content/repositories/maven_central/org/eclipse/tycho/org.eclipse.tycho.surefire.junit4/1.4.0/org.eclipse.tycho.surefire.junit4-1.4.0.jar
Downloading from eclipse.maven.central.mirror: https://repo.eclipse.org/content/repositories/maven_central/org/eclipse/tycho/org.eclipse.tycho.surefire.junit/1.4.0/org.eclipse.tycho.surefire.junit-1.4.0.jar
Downloading from eclipse.maven.central.mirror: https://repo.eclipse.org/content/repositories/maven_central/org/eclipse/tycho/org.eclipse.tycho.surefire.junit5/1.4.0/org.eclipse.tycho.surefire.junit5-1.4.0.jar
Downloading from eclipse.maven.central.mirror: https://repo.eclipse.org/content/repositories/maven_central/org/eclipse/tycho/org.eclipse.tycho.surefire.junit47/1.4.0/org.eclipse.tycho.surefire.junit47-1.4.0.jar
Progress (1): 4.1/25 kB
Progress (1): 7.7/25 kB
Progress (2): 7.7/25 kB | 4.1/924 kB
Progress (2): 12/25 kB | 4.1/924 kB 
Progress (2): 12/25 kB | 7.7/924 kB
Progress (2): 16/25 kB | 7.7/924 kB
Progress (2): 16/25 kB | 12/924 kB 
Progress (2): 20/25 kB | 12/924 kB
Progress (2): 20/25 kB | 16/924 kB
Progress (2): 24/25 kB | 16/924 kB
Progress (2): 25 kB | 16/924 kB   
Progress (2): 25 kB | 20/924 kB
Progress (2): 25 kB | 24/924 kB
Progress (2): 25 kB | 28/924 kB
Progress (2): 25 kB | 32/924 kB
Progress (2): 25 kB | 36/924 kB
Progress (3): 25 kB | 36/924 kB | 4.1/424 kB
Progress (3): 25 kB | 40/924 kB | 4.1/424 kB
Progress (3): 25 kB | 40/924 kB | 7.7/424 kB
Progress (3): 25 kB | 44/924 kB | 7.7/424 kB
Progress (4): 25 kB | 44/924 kB | 7.7/424 kB | 4.1/65 kB
Progress (4): 25 kB | 48/924 kB | 7.7/424 kB | 4.1/65 kB
Progress (5): 25 kB | 48/924 kB | 7.7/424 kB | 4.1/65 kB | 4.1/185 kB
Progress (5): 25 kB | 48/924 kB | 12/424 kB | 4.1/65 kB | 4.1/185 kB 
Progress (5): 25 kB | 48/924 kB | 12/424 kB | 4.1/65 kB | 7.7/185 kB
Progress (5): 25 kB | 52/924 kB | 12/424 kB | 4.1/65 kB | 7.7/185 kB
Progress (5): 25 kB | 52/924 kB | 12/424 kB | 7.7/65 kB | 7.7/185 kB
Progress (5): 25 kB | 56/924 kB | 12/424 kB | 7.7/65 kB | 7.7/185 kB
Progress (5): 25 kB | 56/924 kB | 12/424 kB | 7.7/65 kB | 12/185 kB 
Progress (5): 25 kB | 60/924 kB | 12/424 kB | 7.7/65 kB | 12/185 kB
Progress (5): 25 kB | 60/924 kB | 16/424 kB | 7.7/65 kB | 12/185 kB
Progress (5): 25 kB | 64/924 kB | 16/424 kB | 7.7/65 kB | 12/185 kB
Progress (5): 25 kB | 64/924 kB | 16/424 kB | 7.7/65 kB | 16/185 kB
Progress (5): 25 kB | 64/924 kB | 16/424 kB | 12/65 kB | 16/185 kB 
Progress (5): 25 kB | 64/924 kB | 16/424 kB | 12/65 kB | 20/185 kB
Progress (5): 25 kB | 68/924 kB | 16/424 kB | 12/65 kB | 20/185 kB
Progress (5): 25 kB | 68/924 kB | 20/424 kB | 12/65 kB | 20/185 kB
Progress (5): 25 kB | 72/924 kB | 20/424 kB | 12/65 kB | 20/185 kB
Progress (5): 25 kB | 72/924 kB | 20/424 kB | 12/65 kB | 24/185 kB
Progress (5): 25 kB | 76/924 kB | 20/424 kB | 12/65 kB | 24/185 kB
Progress (5): 25 kB | 76/924 kB | 20/424 kB | 16/65 kB | 24/185 kB
Progress (5): 25 kB | 80/924 kB | 20/424 kB | 16/65 kB | 24/185 kB
Progress (5): 25 kB | 80/924 kB | 20/424 kB | 16/65 kB | 28/185 kB
Progress (5): 25 kB | 84/924 kB | 20/424 kB | 16/65 kB | 28/185 kB
                                                                  
Downloaded from eclipse.maven.central.mirror: https://repo.eclipse.org/content/repositories/maven_central/org/eclipse/tycho/org.eclipse.tycho.surefire.junit/1.4.0/org.eclipse.tycho.surefire.junit-1.4.0.jar (25 kB at 651 kB/s)
Progress (4): 84/924 kB | 24/424 kB | 16/65 kB | 28/185 kB
                                                          
Downloading from eclipse.maven.central.mirror: https://repo.eclipse.org/content/repositories/maven_central/org/eclipse/tycho/org.eclipse.tycho.surefire.testng/1.4.0/org.eclipse.tycho.surefire.testng-1.4.0.jar
Progress (4): 88/924 kB | 24/424 kB | 16/65 kB | 28/185 kB
Progress (4): 88/924 kB | 24/424 kB | 16/65 kB | 32/185 kB
Progress (4): 88/924 kB | 24/424 kB | 20/65 kB | 32/185 kB
Progress (4): 88/924 kB | 24/424 kB | 20/65 kB | 36/185 kB
Progress (4): 92/924 kB | 24/424 kB | 20/65 kB | 36/185 kB
Progress (4): 92/924 kB | 28/424 kB | 20/65 kB | 36/185 kB
Progress (4): 96/924 kB | 28/424 kB | 20/65 kB | 36/185 kB
Progress (4): 96/924 kB | 28/424 kB | 20/65 kB | 40/185 kB
Progress (4): 100/924 kB | 28/424 kB | 20/65 kB | 40/185 kB
Progress (4): 100/924 kB | 28/424 kB | 24/65 kB | 40/185 kB
Progress (4): 104/924 kB | 28/424 kB | 24/65 kB | 40/185 kB
Progress (4): 104/924 kB | 28/424 kB | 24/65 kB | 44/185 kB
Progress (4): 104/924 kB | 32/424 kB | 24/65 kB | 44/185 kB
Progress (4): 104/924 kB | 32/424 kB | 24/65 kB | 48/185 kB
Progress (4): 108/924 kB | 32/424 kB | 24/65 kB | 48/185 kB
Progress (4): 108/924 kB | 32/424 kB | 28/65 kB | 48/185 kB
Progress (4): 112/924 kB | 32/424 kB | 28/65 kB | 48/185 kB
Progress (4): 112/924 kB | 32/424 kB | 28/65 kB | 52/185 kB
Progress (4): 112/924 kB | 36/424 kB | 28/65 kB | 52/185 kB
Progress (4): 112/924 kB | 36/424 kB | 28/65 kB | 56/185 kB
Progress (4): 116/924 kB | 36/424 kB | 28/65 kB | 56/185 kB
Progress (4): 116/924 kB | 36/424 kB | 32/65 kB | 56/185 kB
Progress (4): 120/924 kB | 36/424 kB | 32/65 kB | 56/185 kB
Progress (4): 120/924 kB | 36/424 kB | 36/65 kB | 56/185 kB
Progress (4): 120/924 kB | 36/424 kB | 36/65 kB | 60/185 kB
Progress (4): 120/924 kB | 40/424 kB | 36/65 kB | 60/185 kB
Progress (4): 120/924 kB | 40/424 kB | 36/65 kB | 64/185 kB
Progress (4): 120/924 kB | 40/424 kB | 40/65 kB | 64/185 kB
Progress (4): 120/924 kB | 40/424 kB | 40/65 kB | 68/185 kB
Progress (4): 124/924 kB | 40/424 kB | 40/65 kB | 68/185 kB
Progress (4): 124/924 kB | 40/424 kB | 40/65 kB | 72/185 kB
Progress (4): 124/924 kB | 40/424 kB | 44/65 kB | 72/185 kB
Progress (4): 124/924 kB | 44/424 kB | 44/65 kB | 72/185 kB
Progress (4): 124/924 kB | 44/424 kB | 48/65 kB | 72/185 kB
Progress (4): 124/924 kB | 44/424 kB | 48/65 kB | 76/185 kB
Progress (4): 128/924 kB | 44/424 kB | 48/65 kB | 76/185 kB
Progress (4): 128/924 kB | 44/424 kB | 48/65 kB | 80/185 kB
Progress (4): 128/924 kB | 44/424 kB | 52/65 kB | 80/185 kB
Progress (4): 128/924 kB | 44/424 kB | 52/65 kB | 84/185 kB
Progress (4): 128/924 kB | 48/424 kB | 52/65 kB | 84/185 kB
Progress (4): 128/924 kB | 48/424 kB | 52/65 kB | 88/185 kB
Progress (4): 128/924 kB | 48/424 kB | 56/65 kB | 88/185 kB
Progress (4): 132/924 kB | 48/424 kB | 56/65 kB | 88/185 kB
Progress (4): 132/924 kB | 48/424 kB | 60/65 kB | 88/185 kB
Progress (5): 132/924 kB | 48/424 kB | 60/65 kB | 88/185 kB | 4.1/110 kB
Progress (5): 132/924 kB | 48/424 kB | 64/65 kB | 88/185 kB | 4.1/110 kB
Progress (5): 136/924 kB | 48/424 kB | 64/65 kB | 88/185 kB | 4.1/110 kB
Progress (5): 136/924 kB | 48/424 kB | 64/65 kB | 92/185 kB | 4.1/110 kB
Progress (5): 136/924 kB | 52/424 kB | 64/65 kB | 92/185 kB | 4.1/110 kB
Progress (5): 136/924 kB | 52/424 kB | 64/65 kB | 96/185 kB | 4.1/110 kB
Progress (5): 140/924 kB | 52/424 kB | 64/65 kB | 96/185 kB | 4.1/110 kB
Progress (5): 140/924 kB | 52/424 kB | 65 kB | 96/185 kB | 4.1/110 kB   
Progress (5): 140/924 kB | 52/424 kB | 65 kB | 96/185 kB | 7.7/110 kB
Progress (5): 144/924 kB | 52/424 kB | 65 kB | 96/185 kB | 7.7/110 kB
Progress (5): 144/924 kB | 52/424 kB | 65 kB | 100/185 kB | 7.7/110 kB
Progress (5): 144/924 kB | 56/424 kB | 65 kB | 100/185 kB | 7.7/110 kB
Progress (5): 144/924 kB | 56/424 kB | 65 kB | 104/185 kB | 7.7/110 kB
Progress (5): 148/924 kB | 56/424 kB | 65 kB | 104/185 kB | 7.7/110 kB
Progress (5): 148/924 kB | 56/424 kB | 65 kB | 104/185 kB | 12/110 kB 
Progress (5): 152/924 kB | 56/424 kB | 65 kB | 104/185 kB | 12/110 kB
Progress (5): 152/924 kB | 56/424 kB | 65 kB | 108/185 kB | 12/110 kB
Progress (5): 152/924 kB | 60/424 kB | 65 kB | 108/185 kB | 12/110 kB
Progress (5): 152/924 kB | 60/424 kB | 65 kB | 112/185 kB | 12/110 kB
Progress (5): 156/924 kB | 60/424 kB | 65 kB | 112/185 kB | 12/110 kB
Progress (5): 156/924 kB | 60/424 kB | 65 kB | 112/185 kB | 16/110 kB
Progress (5): 160/924 kB | 60/424 kB | 65 kB | 112/185 kB | 16/110 kB
Progress (5): 160/924 kB | 60/424 kB | 65 kB | 116/185 kB | 16/110 kB
Progress (5): 160/924 kB | 64/424 kB | 65 kB | 116/185 kB | 16/110 kB
Progress (5): 160/924 kB | 64/424 kB | 65 kB | 120/185 kB | 16/110 kB
Progress (5): 164/924 kB | 64/424 kB | 65 kB | 120/185 kB | 16/110 kB
Progress (5): 164/924 kB | 64/424 kB | 65 kB | 120/185 kB | 20/110 kB
Progress (5): 168/924 kB | 64/424 kB | 65 kB | 120/185 kB | 20/110 kB
Progress (5): 168/924 kB | 64/424 kB | 65 kB | 124/185 kB | 20/110 kB
Progress (5): 168/924 kB | 68/424 kB | 65 kB | 124/185 kB | 20/110 kB
Progress (5): 168/924 kB | 68/424 kB | 65 kB | 128/185 kB | 20/110 kB
Progress (5): 172/924 kB | 68/424 kB | 65 kB | 128/185 kB | 20/110 kB
Progress (5): 172/924 kB | 68/424 kB | 65 kB | 128/185 kB | 24/110 kB
Progress (5): 176/924 kB | 68/424 kB | 65 kB | 128/185 kB | 24/110 kB
Progress (5): 176/924 kB | 68/424 kB | 65 kB | 132/185 kB | 24/110 kB
Progress (5): 176/924 kB | 72/424 kB | 65 kB | 132/185 kB | 24/110 kB
Progress (5): 176/924 kB | 72/424 kB | 65 kB | 136/185 kB | 24/110 kB
Progress (5): 176/924 kB | 76/424 kB | 65 kB | 136/185 kB | 24/110 kB
                                                                     
Downloaded from eclipse.maven.central.mirror: https://repo.eclipse.org/content/repositories/maven_central/org/eclipse/tycho/org.eclipse.tycho.surefire.junit4/1.4.0/org.eclipse.tycho.surefire.junit4-1.4.0.jar (65 kB at 1.2 MB/s)
Progress (4): 180/924 kB | 76/424 kB | 136/185 kB | 24/110 kB
Progress (4): 180/924 kB | 76/424 kB | 136/185 kB | 28/110 kB
Progress (4): 184/924 kB | 76/424 kB | 136/185 kB | 28/110 kB
                                                             
Downloading from eclipse.maven.central.mirror: https://repo.eclipse.org/content/repositories/maven_central/org/apache/maven/surefire/surefire-api/2.22.0/surefire-api-2.22.0.jar
Progress (4): 184/924 kB | 80/424 kB | 136/185 kB | 28/110 kB
Progress (4): 184/924 kB | 80/424 kB | 140/185 kB | 28/110 kB
Progress (4): 188/924 kB | 80/424 kB | 140/185 kB | 28/110 kB
Progress (4): 188/924 kB | 80/424 kB | 140/185 kB | 32/110 kB
Progress (4): 192/924 kB | 80/424 kB | 140/185 kB | 32/110 kB
Progress (4): 192/924 kB | 80/424 kB | 140/185 kB | 33/110 kB
Progress (4): 192/924 kB | 80/424 kB | 144/185 kB | 33/110 kB
Progress (4): 192/924 kB | 84/424 kB | 144/185 kB | 33/110 kB
Progress (4): 192/924 kB | 84/424 kB | 144/185 kB | 37/110 kB
Progress (4): 196/924 kB | 84/424 kB | 144/185 kB | 37/110 kB
Progress (4): 196/924 kB | 84/424 kB | 144/185 kB | 41/110 kB
Progress (4): 196/924 kB | 88/424 kB | 144/185 kB | 41/110 kB
Progress (4): 196/924 kB | 88/424 kB | 148/185 kB | 41/110 kB
Progress (4): 196/924 kB | 88/424 kB | 148/185 kB | 45/110 kB
Progress (4): 200/924 kB | 88/424 kB | 148/185 kB | 45/110 kB
Progress (4): 200/924 kB | 88/424 kB | 148/185 kB | 49/110 kB
Progress (4): 200/924 kB | 88/424 kB | 152/185 kB | 49/110 kB
Progress (4): 204/924 kB | 88/424 kB | 152/185 kB | 49/110 kB
Progress (4): 204/924 kB | 88/424 kB | 156/185 kB | 49/110 kB
Progress (4): 204/924 kB | 92/424 kB | 156/185 kB | 49/110 kB
Progress (4): 204/924 kB | 92/424 kB | 156/185 kB | 53/110 kB
Progress (4): 204/924 kB | 96/424 kB | 156/185 kB | 53/110 kB
Progress (4): 204/924 kB | 96/424 kB | 160/185 kB | 53/110 kB
Progress (5): 204/924 kB | 96/424 kB | 160/185 kB | 53/110 kB | 4.1/186 kB
Progress (5): 208/924 kB | 96/424 kB | 160/185 kB | 53/110 kB | 4.1/186 kB
Progress (5): 208/924 kB | 96/424 kB | 160/185 kB | 53/110 kB | 7.7/186 kB
Progress (5): 208/924 kB | 96/424 kB | 164/185 kB | 53/110 kB | 7.7/186 kB
Progress (5): 208/924 kB | 96/424 kB | 164/185 kB | 53/110 kB | 12/186 kB 
Progress (5): 208/924 kB | 100/424 kB | 164/185 kB | 53/110 kB | 12/186 kB
Progress (5): 208/924 kB | 100/424 kB | 164/185 kB | 57/110 kB | 12/186 kB
Progress (5): 208/924 kB | 104/424 kB | 164/185 kB | 57/110 kB | 12/186 kB
Progress (5): 208/924 kB | 104/424 kB | 164/185 kB | 57/110 kB | 16/186 kB
Progress (5): 208/924 kB | 104/424 kB | 168/185 kB | 57/110 kB | 16/186 kB
Progress (5): 212/924 kB | 104/424 kB | 168/185 kB | 57/110 kB | 16/186 kB
Progress (5): 212/924 kB | 104/424 kB | 172/185 kB | 57/110 kB | 16/186 kB
Progress (5): 212/924 kB | 104/424 kB | 172/185 kB | 57/110 kB | 20/186 kB
Progress (5): 212/924 kB | 108/424 kB | 172/185 kB | 57/110 kB | 20/186 kB
Progress (5): 212/924 kB | 108/424 kB | 172/185 kB | 61/110 kB | 20/186 kB
Progress (5): 212/924 kB | 112/424 kB | 172/185 kB | 61/110 kB | 20/186 kB
Progress (5): 212/924 kB | 112/424 kB | 172/185 kB | 61/110 kB | 24/186 kB
Progress (5): 212/924 kB | 112/424 kB | 176/185 kB | 61/110 kB | 24/186 kB
Progress (5): 216/924 kB | 112/424 kB | 176/185 kB | 61/110 kB | 24/186 kB
Progress (5): 216/924 kB | 112/424 kB | 180/185 kB | 61/110 kB | 24/186 kB
Progress (5): 216/924 kB | 112/424 kB | 180/185 kB | 61/110 kB | 28/186 kB
Progress (5): 216/924 kB | 116/424 kB | 180/185 kB | 61/110 kB | 28/186 kB
Progress (5): 216/924 kB | 116/424 kB | 180/185 kB | 65/110 kB | 28/186 kB
Progress (5): 216/924 kB | 120/424 kB | 180/185 kB | 65/110 kB | 28/186 kB
Progress (5): 216/924 kB | 120/424 kB | 180/185 kB | 65/110 kB | 32/186 kB
Progress (5): 216/924 kB | 120/424 kB | 184/185 kB | 65/110 kB | 32/186 kB
Progress (5): 220/924 kB | 120/424 kB | 184/185 kB | 65/110 kB | 32/186 kB
Progress (5): 220/924 kB | 120/424 kB | 185 kB | 65/110 kB | 32/186 kB    
Progress (5): 220/924 kB | 120/424 kB | 185 kB | 65/110 kB | 33/186 kB
Progress (5): 220/924 kB | 124/424 kB | 185 kB | 65/110 kB | 33/186 kB
Progress (5): 220/924 kB | 124/424 kB | 185 kB | 66/110 kB | 33/186 kB
Progress (5): 220/924 kB | 128/424 kB | 185 kB | 66/110 kB | 33/186 kB
Progress (5): 220/924 kB | 128/424 kB | 185 kB | 66/110 kB | 37/186 kB
Progress (5): 224/924 kB | 128/424 kB | 185 kB | 66/110 kB | 37/186 kB
Progress (5): 224/924 kB | 128/424 kB | 185 kB | 66/110 kB | 41/186 kB
Progress (5): 228/924 kB | 128/424 kB | 185 kB | 66/110 kB | 41/186 kB
Progress (5): 228/924 kB | 132/424 kB | 185 kB | 66/110 kB | 41/186 kB
Progress (5): 228/924 kB | 132/424 kB | 185 kB | 70/110 kB | 41/186 kB
Progress (5): 228/924 kB | 136/424 kB | 185 kB | 70/110 kB | 41/186 kB
Progress (5): 232/924 kB | 136/424 kB | 185 kB | 70/110 kB | 41/186 kB
Progress (5): 232/924 kB | 136/424 kB | 185 kB | 70/110 kB | 45/186 kB
Progress (5): 236/924 kB | 136/424 kB | 185 kB | 70/110 kB | 45/186 kB
Progress (5): 236/924 kB | 140/424 kB | 185 kB | 70/110 kB | 45/186 kB
Progress (5): 236/924 kB | 140/424 kB | 185 kB | 74/110 kB | 45/186 kB
Progress (5): 236/924 kB | 144/424 kB | 185 kB | 74/110 kB | 45/186 kB
Progress (5): 240/924 kB | 144/424 kB | 185 kB | 74/110 kB | 45/186 kB
Progress (5): 240/924 kB | 144/424 kB | 185 kB | 74/110 kB | 49/186 kB
Progress (5): 244/924 kB | 144/424 kB | 185 kB | 74/110 kB | 49/186 kB
Progress (5): 244/924 kB | 148/424 kB | 185 kB | 74/110 kB | 49/186 kB
Progress (5): 244/924 kB | 148/424 kB | 185 kB | 78/110 kB | 49/186 kB
Progress (5): 244/924 kB | 152/424 kB | 185 kB | 78/110 kB | 49/186 kB
Progress (5): 248/924 kB | 152/424 kB | 185 kB | 78/110 kB | 49/186 kB
Progress (5): 248/924 kB | 152/424 kB | 185 kB | 78/110 kB | 53/186 kB
Progress (5): 252/924 kB | 152/424 kB | 185 kB | 78/110 kB | 53/186 kB
Progress (5): 252/924 kB | 156/424 kB | 185 kB | 78/110 kB | 53/186 kB
Progress (5): 252/924 kB | 156/424 kB | 185 kB | 82/110 kB | 53/186 kB
Progress (5): 252/924 kB | 160/424 kB | 185 kB | 82/110 kB | 53/186 kB
Progress (5): 256/924 kB | 160/424 kB | 185 kB | 82/110 kB | 53/186 kB
Progress (5): 256/924 kB | 160/424 kB | 185 kB | 82/110 kB | 57/186 kB
Progress (5): 260/924 kB | 160/424 kB | 185 kB | 82/110 kB | 57/186 kB
Progress (5): 260/924 kB | 164/424 kB | 185 kB | 82/110 kB | 57/186 kB
Progress (5): 260/924 kB | 164/424 kB | 185 kB | 86/110 kB | 57/186 kB
Progress (5): 260/924 kB | 168/424 kB | 185 kB | 86/110 kB | 57/186 kB
Progress (5): 264/924 kB | 168/424 kB | 185 kB | 86/110 kB | 57/186 kB
Progress (5): 264/924 kB | 168/424 kB | 185 kB | 86/110 kB | 61/186 kB
Progress (5): 268/924 kB | 168/424 kB | 185 kB | 86/110 kB | 61/186 kB
                                                                      
Downloaded from eclipse.maven.central.mirror: https://repo.eclipse.org/content/repositories/maven_central/org/eclipse/tycho/org.eclipse.tycho.surefire.junit47/1.4.0/org.eclipse.tycho.surefire.junit47-1.4.0.jar (185 kB at 1.6 MB/s)
Progress (4): 268/924 kB | 172/424 kB | 86/110 kB | 61/186 kB
Progress (4): 268/924 kB | 172/424 kB | 90/110 kB | 61/186 kB
Progress (4): 268/924 kB | 176/424 kB | 90/110 kB | 61/186 kB
Progress (4): 268/924 kB | 176/424 kB | 94/110 kB | 61/186 kB
                                                             
Downloading from eclipse.maven.central.mirror: https://repo.eclipse.org/content/repositories/maven_central/org/apache/maven/surefire/surefire-logger-api/2.22.0/surefire-logger-api-2.22.0.jar
Progress (4): 272/924 kB | 176/424 kB | 94/110 kB | 61/186 kB
Progress (4): 272/924 kB | 176/424 kB | 94/110 kB | 65/186 kB
Progress (4): 272/924 kB | 176/424 kB | 98/110 kB | 65/186 kB
Progress (4): 272/924 kB | 180/424 kB | 98/110 kB | 65/186 kB
Progress (4): 272/924 kB | 180/424 kB | 98/110 kB | 66/186 kB
Progress (4): 276/924 kB | 180/424 kB | 98/110 kB | 66/186 kB
Progress (4): 276/924 kB | 184/424 kB | 98/110 kB | 66/186 kB
Progress (4): 276/924 kB | 184/424 kB | 102/110 kB | 66/186 kB
Progress (4): 276/924 kB | 188/424 kB | 102/110 kB | 66/186 kB
Progress (4): 280/924 kB | 188/424 kB | 102/110 kB | 66/186 kB
Progress (4): 280/924 kB | 188/424 kB | 102/110 kB | 70/186 kB
Progress (4): 280/924 kB | 192/424 kB | 102/110 kB | 70/186 kB
Progress (4): 280/924 kB | 192/424 kB | 106/110 kB | 70/186 kB
Progress (4): 280/924 kB | 196/424 kB | 106/110 kB | 70/186 kB
Progress (4): 280/924 kB | 196/424 kB | 106/110 kB | 74/186 kB
Progress (4): 284/924 kB | 196/424 kB | 106/110 kB | 74/186 kB
Progress (4): 284/924 kB | 200/424 kB | 106/110 kB | 74/186 kB
Progress (4): 284/924 kB | 200/424 kB | 110/110 kB | 74/186 kB
Progress (4): 288/924 kB | 200/424 kB | 110/110 kB | 74/186 kB
Progress (4): 288/924 kB | 200/424 kB | 110/110 kB | 78/186 kB
Progress (4): 288/924 kB | 204/424 kB | 110/110 kB | 78/186 kB
Progress (4): 288/924 kB | 204/424 kB | 110 kB | 78/186 kB    
Progress (4): 288/924 kB | 208/424 kB | 110 kB | 78/186 kB
Progress (4): 288/924 kB | 208/424 kB | 110 kB | 82/186 kB
Progress (4): 292/924 kB | 208/424 kB | 110 kB | 82/186 kB
Progress (4): 292/924 kB | 212/424 kB | 110 kB | 82/186 kB
Progress (4): 296/924 kB | 212/424 kB | 110 kB | 82/186 kB
Progress (4): 296/924 kB | 212/424 kB | 110 kB | 86/186 kB
Progress (4): 296/924 kB | 216/424 kB | 110 kB | 86/186 kB
Progress (4): 296/924 kB | 216/424 kB | 110 kB | 90/186 kB
Progress (4): 300/924 kB | 216/424 kB | 110 kB | 90/186 kB
Progress (4): 300/924 kB | 220/424 kB | 110 kB | 90/186 kB
Progress (4): 304/924 kB | 220/424 kB | 110 kB | 90/186 kB
Progress (4): 304/924 kB | 220/424 kB | 110 kB | 94/186 kB
Progress (4): 308/924 kB | 220/424 kB | 110 kB | 94/186 kB
Progress (4): 308/924 kB | 224/424 kB | 110 kB | 94/186 kB
Progress (4): 312/924 kB | 224/424 kB | 110 kB | 94/186 kB
Progress (4): 312/924 kB | 224/424 kB | 110 kB | 98/186 kB
Progress (4): 312/924 kB | 228/424 kB | 110 kB | 98/186 kB
Progress (4): 316/924 kB | 228/424 kB | 110 kB | 98/186 kB
Progress (4): 316/924 kB | 232/424 kB | 110 kB | 98/186 kB
Progress (4): 316/924 kB | 232/424 kB | 110 kB | 102/186 kB
Progress (4): 316/924 kB | 236/424 kB | 110 kB | 102/186 kB
Progress (4): 320/924 kB | 236/424 kB | 110 kB | 102/186 kB
Progress (4): 320/924 kB | 240/424 kB | 110 kB | 102/186 kB
Progress (4): 324/924 kB | 240/424 kB | 110 kB | 102/186 kB
Progress (4): 324/924 kB | 240/424 kB | 110 kB | 106/186 kB
Progress (4): 324/924 kB | 244/424 kB | 110 kB | 106/186 kB
Progress (4): 328/924 kB | 244/424 kB | 110 kB | 106/186 kB
Progress (4): 328/924 kB | 248/424 kB | 110 kB | 106/186 kB
Progress (4): 328/924 kB | 248/424 kB | 110 kB | 110/186 kB
Progress (4): 332/924 kB | 248/424 kB | 110 kB | 110/186 kB
Progress (4): 332/924 kB | 248/424 kB | 110 kB | 114/186 kB
Progress (4): 332/924 kB | 252/424 kB | 110 kB | 114/186 kB
Progress (4): 336/924 kB | 252/424 kB | 110 kB | 114/186 kB
Progress (4): 336/924 kB | 256/424 kB | 110 kB | 114/186 kB
Progress (4): 336/924 kB | 256/424 kB | 110 kB | 118/186 kB
Progress (4): 340/924 kB | 256/424 kB | 110 kB | 118/186 kB
Progress (4): 340/924 kB | 256/424 kB | 110 kB | 122/186 kB
Progress (4): 340/924 kB | 260/424 kB | 110 kB | 122/186 kB
Progress (4): 344/924 kB | 260/424 kB | 110 kB | 122/186 kB
Progress (4): 344/924 kB | 264/424 kB | 110 kB | 122/186 kB
Progress (4): 344/924 kB | 264/424 kB | 110 kB | 126/186 kB
Progress (4): 348/924 kB | 264/424 kB | 110 kB | 126/186 kB
Progress (4): 348/924 kB | 264/424 kB | 110 kB | 130/186 kB
Progress (4): 348/924 kB | 268/424 kB | 110 kB | 130/186 kB
Progress (4): 348/924 kB | 268/424 kB | 110 kB | 131/186 kB
Progress (4): 352/924 kB | 268/424 kB | 110 kB | 131/186 kB
Progress (4): 352/924 kB | 272/424 kB | 110 kB | 131/186 kB
Progress (4): 352/924 kB | 272/424 kB | 110 kB | 135/186 kB
                                                           
Downloaded from eclipse.maven.central.mirror: https://repo.eclipse.org/content/repositories/maven_central/org/eclipse/tycho/org.eclipse.tycho.surefire.testng/1.4.0/org.eclipse.tycho.surefire.testng-1.4.0.jar (110 kB at 843 kB/s)
Progress (3): 356/924 kB | 272/424 kB | 135/186 kB
                                                  
Downloading from eclipse.maven.central.mirror: https://repo.eclipse.org/content/repositories/maven_central/org/apache/maven/surefire/maven-surefire-common/2.22.0/maven-surefire-common-2.22.0.jar
Progress (3): 356/924 kB | 272/424 kB | 139/186 kB
Progress (3): 356/924 kB | 276/424 kB | 139/186 kB
Progress (3): 360/924 kB | 276/424 kB | 139/186 kB
Progress (3): 360/924 kB | 280/424 kB | 139/186 kB
Progress (3): 360/924 kB | 280/424 kB | 143/186 kB
Progress (3): 364/924 kB | 280/424 kB | 143/186 kB
Progress (3): 364/924 kB | 280/424 kB | 147/186 kB
Progress (3): 364/924 kB | 284/424 kB | 147/186 kB
Progress (3): 368/924 kB | 284/424 kB | 147/186 kB
Progress (3): 368/924 kB | 288/424 kB | 147/186 kB
Progress (3): 368/924 kB | 288/424 kB | 151/186 kB
Progress (3): 372/924 kB | 288/424 kB | 151/186 kB
Progress (3): 372/924 kB | 288/424 kB | 155/186 kB
Progress (3): 372/924 kB | 292/424 kB | 155/186 kB
Progress (4): 372/924 kB | 292/424 kB | 155/186 kB | 4.1/13 kB
Progress (4): 376/924 kB | 292/424 kB | 155/186 kB | 4.1/13 kB
Progress (4): 376/924 kB | 292/424 kB | 155/186 kB | 7.7/13 kB
Progress (4): 376/924 kB | 296/424 kB | 155/186 kB | 7.7/13 kB
Progress (4): 376/924 kB | 296/424 kB | 159/186 kB | 7.7/13 kB
Progress (4): 376/924 kB | 296/424 kB | 159/186 kB | 12/13 kB 
Progress (4): 380/924 kB | 296/424 kB | 159/186 kB | 12/13 kB
Progress (4): 380/924 kB | 296/424 kB | 159/186 kB | 13 kB   
Progress (4): 380/924 kB | 296/424 kB | 163/186 kB | 13 kB
Progress (4): 380/924 kB | 300/424 kB | 163/186 kB | 13 kB
Progress (4): 380/924 kB | 300/424 kB | 167/186 kB | 13 kB
Progress (4): 384/924 kB | 300/424 kB | 167/186 kB | 13 kB
Progress (4): 384/924 kB | 300/424 kB | 171/186 kB | 13 kB
Progress (4): 384/924 kB | 304/424 kB | 171/186 kB | 13 kB
Progress (4): 388/924 kB | 304/424 kB | 171/186 kB | 13 kB
Progress (4): 388/924 kB | 304/424 kB | 175/186 kB | 13 kB
Progress (4): 392/924 kB | 304/424 kB | 175/186 kB | 13 kB
Progress (4): 392/924 kB | 308/424 kB | 175/186 kB | 13 kB
Progress (4): 396/924 kB | 308/424 kB | 175/186 kB | 13 kB
Progress (4): 396/924 kB | 308/424 kB | 179/186 kB | 13 kB
Progress (4): 400/924 kB | 308/424 kB | 179/186 kB | 13 kB
Progress (4): 400/924 kB | 312/424 kB | 179/186 kB | 13 kB
Progress (4): 400/924 kB | 312/424 kB | 183/186 kB | 13 kB
Progress (4): 400/924 kB | 316/424 kB | 183/186 kB | 13 kB
Progress (4): 404/924 kB | 316/424 kB | 183/186 kB | 13 kB
Progress (4): 404/924 kB | 320/424 kB | 183/186 kB | 13 kB
Progress (4): 404/924 kB | 320/424 kB | 186 kB | 13 kB    
Progress (4): 408/924 kB | 320/424 kB | 186 kB | 13 kB
Progress (4): 408/924 kB | 324/424 kB | 186 kB | 13 kB
Progress (4): 412/924 kB | 324/424 kB | 186 kB | 13 kB
Progress (4): 412/924 kB | 328/424 kB | 186 kB | 13 kB
Progress (4): 416/924 kB | 328/424 kB | 186 kB | 13 kB
Progress (4): 416/924 kB | 332/424 kB | 186 kB | 13 kB
Progress (4): 420/924 kB | 332/424 kB | 186 kB | 13 kB
Progress (4): 420/924 kB | 336/424 kB | 186 kB | 13 kB
Progress (4): 424/924 kB | 336/424 kB | 186 kB | 13 kB
Progress (4): 424/924 kB | 340/424 kB | 186 kB | 13 kB
Progress (4): 428/924 kB | 340/424 kB | 186 kB | 13 kB
Progress (4): 428/924 kB | 344/424 kB | 186 kB | 13 kB
Progress (4): 428/924 kB | 348/424 kB | 186 kB | 13 kB
Progress (4): 428/924 kB | 352/424 kB | 186 kB | 13 kB
Progress (4): 428/924 kB | 356/424 kB | 186 kB | 13 kB
Progress (4): 428/924 kB | 360/424 kB | 186 kB | 13 kB
Progress (4): 428/924 kB | 364/424 kB | 186 kB | 13 kB
                                                      
Downloaded from eclipse.maven.central.mirror: https://repo.eclipse.org/content/repositories/maven_central/org/apache/maven/surefire/surefire-logger-api/2.22.0/surefire-logger-api-2.22.0.jar (13 kB at 92 kB/s)
Progress (3): 432/924 kB | 364/424 kB | 186 kB
                                              
Downloading from eclipse.maven.central.mirror: https://repo.eclipse.org/content/repositories/maven_central/org/apache/maven/surefire/surefire-booter/2.22.0/surefire-booter-2.22.0.jar
Progress (3): 432/924 kB | 368/424 kB | 186 kB
                                              
Downloaded from eclipse.maven.central.mirror: https://repo.eclipse.org/content/repositories/maven_central/org/apache/maven/surefire/surefire-api/2.22.0/surefire-api-2.22.0.jar (186 kB at 906 kB/s)
Progress (2): 436/924 kB | 368/424 kB
                                     
Downloading from eclipse.maven.central.mirror: https://repo.eclipse.org/content/repositories/maven_central/org/apache/maven/maven-plugin-descriptor/2.2.1/maven-plugin-descriptor-2.2.1.jar
Progress (2): 436/924 kB | 372/424 kB
Progress (2): 440/924 kB | 372/424 kB
Progress (2): 440/924 kB | 376/424 kB
Progress (2): 444/924 kB | 376/424 kB
Progress (2): 444/924 kB | 380/424 kB
Progress (2): 448/924 kB | 380/424 kB
Progress (2): 448/924 kB | 384/424 kB
Progress (2): 448/924 kB | 388/424 kB
Progress (2): 448/924 kB | 392/424 kB
Progress (2): 448/924 kB | 396/424 kB
Progress (2): 448/924 kB | 400/424 kB
Progress (2): 448/924 kB | 404/424 kB
Progress (2): 448/924 kB | 408/424 kB
Progress (2): 448/924 kB | 412/424 kB
Progress (2): 448/924 kB | 416/424 kB
Progress (2): 448/924 kB | 420/424 kB
Progress (2): 448/924 kB | 424/424 kB
Progress (2): 448/924 kB | 424 kB    
Progress (3): 448/924 kB | 424 kB | 4.1/39 kB
Progress (3): 448/924 kB | 424 kB | 7.7/39 kB
Progress (3): 448/924 kB | 424 kB | 12/39 kB 
Progress (3): 448/924 kB | 424 kB | 16/39 kB
                                            
Downloaded from eclipse.maven.central.mirror: https://repo.eclipse.org/content/repositories/maven_central/org/eclipse/tycho/org.eclipse.tycho.surefire.junit5/1.4.0/org.eclipse.tycho.surefire.junit5-1.4.0.jar (424 kB at 1.9 MB/s)
Progress (3): 448/924 kB | 16/39 kB | 4.1/273 kB
Progress (3): 448/924 kB | 20/39 kB | 4.1/273 kB
Progress (3): 448/924 kB | 20/39 kB | 7.7/273 kB
                                                
Downloading from eclipse.maven.central.mirror: https://repo.eclipse.org/content/repositories/maven_central/org/apache/maven/maven-toolchain/2.2.1/maven-toolchain-2.2.1.jar
Progress (3): 448/924 kB | 20/39 kB | 12/273 kB
Progress (3): 448/924 kB | 24/39 kB | 12/273 kB
Progress (3): 448/924 kB | 24/39 kB | 16/273 kB
Progress (3): 448/924 kB | 28/39 kB | 16/273 kB
Progress (3): 448/924 kB | 32/39 kB | 16/273 kB
Progress (3): 448/924 kB | 32/39 kB | 20/273 kB
Progress (3): 448/924 kB | 36/39 kB | 20/273 kB
Progress (3): 448/924 kB | 36/39 kB | 24/273 kB
Progress (3): 448/924 kB | 39 kB | 24/273 kB   
Progress (3): 448/924 kB | 39 kB | 28/273 kB
Progress (3): 448/924 kB | 39 kB | 32/273 kB
Progress (3): 448/924 kB | 39 kB | 36/273 kB
Progress (3): 448/924 kB | 39 kB | 40/273 kB
Progress (3): 448/924 kB | 39 kB | 44/273 kB
Progress (3): 448/924 kB | 39 kB | 48/273 kB
Progress (3): 448/924 kB | 39 kB | 52/273 kB
Progress (3): 448/924 kB | 39 kB | 56/273 kB
Progress (3): 448/924 kB | 39 kB | 60/273 kB
Progress (3): 448/924 kB | 39 kB | 64/273 kB
Progress (3): 448/924 kB | 39 kB | 68/273 kB
Progress (3): 448/924 kB | 39 kB | 72/273 kB
Progress (3): 448/924 kB | 39 kB | 76/273 kB
Progress (3): 448/924 kB | 39 kB | 80/273 kB
Progress (3): 448/924 kB | 39 kB | 84/273 kB
Progress (3): 448/924 kB | 39 kB | 88/273 kB
Progress (3): 448/924 kB | 39 kB | 92/273 kB
Progress (3): 448/924 kB | 39 kB | 96/273 kB
                                            
Downloaded from eclipse.maven.central.mirror: https://repo.eclipse.org/content/repositories/maven_central/org/apache/maven/maven-plugin-descriptor/2.2.1/maven-plugin-descriptor-2.2.1.jar (39 kB at 172 kB/s)
Progress (2): 448/924 kB | 100/273 kB
                                     
Downloading from eclipse.maven.central.mirror: https://repo.eclipse.org/content/repositories/maven_central/org/codehaus/plexus/plexus-java/0.9.8/plexus-java-0.9.8.jar
Progress (2): 448/924 kB | 104/273 kB
Progress (2): 448/924 kB | 108/273 kB
Progress (2): 448/924 kB | 112/273 kB
Progress (2): 448/924 kB | 116/273 kB
Progress (2): 448/924 kB | 120/273 kB
Progress (2): 448/924 kB | 124/273 kB
Progress (2): 448/924 kB | 128/273 kB
Progress (2): 448/924 kB | 132/273 kB
Progress (2): 448/924 kB | 136/273 kB
Progress (2): 448/924 kB | 140/273 kB
Progress (2): 448/924 kB | 144/273 kB
Progress (3): 448/924 kB | 144/273 kB | 4.1/38 kB
Progress (3): 448/924 kB | 144/273 kB | 7.7/38 kB
Progress (3): 448/924 kB | 148/273 kB | 7.7/38 kB
Progress (3): 448/924 kB | 148/273 kB | 12/38 kB 
Progress (3): 448/924 kB | 152/273 kB | 12/38 kB
Progress (3): 448/924 kB | 152/273 kB | 16/38 kB
Progress (3): 448/924 kB | 156/273 kB | 16/38 kB
Progress (3): 448/924 kB | 156/273 kB | 20/38 kB
Progress (3): 448/924 kB | 160/273 kB | 20/38 kB
Progress (3): 448/924 kB | 160/273 kB | 24/38 kB
Progress (3): 448/924 kB | 164/273 kB | 24/38 kB
Progress (3): 448/924 kB | 168/273 kB | 24/38 kB
Progress (3): 448/924 kB | 168/273 kB | 28/38 kB
Progress (3): 448/924 kB | 168/273 kB | 32/38 kB
Progress (3): 448/924 kB | 172/273 kB | 32/38 kB
Progress (3): 448/924 kB | 172/273 kB | 36/38 kB
Progress (3): 448/924 kB | 176/273 kB | 36/38 kB
Progress (3): 448/924 kB | 176/273 kB | 38 kB   
Progress (3): 448/924 kB | 180/273 kB | 38 kB
Progress (4): 448/924 kB | 180/273 kB | 38 kB | 4.1/35 kB
Progress (4): 448/924 kB | 184/273 kB | 38 kB | 4.1/35 kB
Progress (4): 448/924 kB | 184/273 kB | 38 kB | 7.7/35 kB
Progress (4): 448/924 kB | 188/273 kB | 38 kB | 7.7/35 kB
Progress (4): 448/924 kB | 188/273 kB | 38 kB | 12/35 kB 
Progress (4): 448/924 kB | 192/273 kB | 38 kB | 12/35 kB
Progress (4): 448/924 kB | 192/273 kB | 38 kB | 16/35 kB
Progress (4): 448/924 kB | 196/273 kB | 38 kB | 16/35 kB
Progress (4): 448/924 kB | 196/273 kB | 38 kB | 20/35 kB
Progress (4): 448/924 kB | 200/273 kB | 38 kB | 20/35 kB
Progress (4): 448/924 kB | 200/273 kB | 38 kB | 24/35 kB
Progress (4): 448/924 kB | 204/273 kB | 38 kB | 24/35 kB
Progress (4): 448/924 kB | 204/273 kB | 38 kB | 28/35 kB
Progress (4): 448/924 kB | 208/273 kB | 38 kB | 28/35 kB
Progress (4): 448/924 kB | 208/273 kB | 38 kB | 32/35 kB
Progress (4): 448/924 kB | 212/273 kB | 38 kB | 32/35 kB
Progress (4): 448/924 kB | 212/273 kB | 38 kB | 35 kB   
Progress (4): 448/924 kB | 216/273 kB | 38 kB | 35 kB
                                                     
Downloaded from eclipse.maven.central.mirror: https://repo.eclipse.org/content/repositories/maven_central/org/apache/maven/maven-toolchain/2.2.1/maven-toolchain-2.2.1.jar (38 kB at 156 kB/s)
Progress (3): 448/924 kB | 220/273 kB | 35 kB
                                             
Downloading from eclipse.maven.central.mirror: https://repo.eclipse.org/content/repositories/maven_central/org/ow2/asm/asm/6.1.1/asm-6.1.1.jar
Progress (3): 448/924 kB | 224/273 kB | 35 kB
Progress (3): 448/924 kB | 228/273 kB | 35 kB
Progress (3): 448/924 kB | 232/273 kB | 35 kB
Progress (3): 448/924 kB | 236/273 kB | 35 kB
Progress (3): 448/924 kB | 240/273 kB | 35 kB
Progress (3): 448/924 kB | 244/273 kB | 35 kB
Progress (3): 448/924 kB | 248/273 kB | 35 kB
Progress (3): 448/924 kB | 252/273 kB | 35 kB
Progress (3): 448/924 kB | 256/273 kB | 35 kB
Progress (3): 448/924 kB | 260/273 kB | 35 kB
Progress (3): 448/924 kB | 264/273 kB | 35 kB
Progress (3): 448/924 kB | 268/273 kB | 35 kB
Progress (3): 448/924 kB | 272/273 kB | 35 kB
Progress (3): 448/924 kB | 273 kB | 35 kB    
                                         
Downloaded from eclipse.maven.central.mirror: https://repo.eclipse.org/content/repositories/maven_central/org/codehaus/plexus/plexus-java/0.9.8/plexus-java-0.9.8.jar (35 kB at 142 kB/s)
Downloading from eclipse.maven.central.mirror: https://repo.eclipse.org/content/repositories/maven_central/com/thoughtworks/qdox/qdox/2.0-M7/qdox-2.0-M7.jar
Downloaded from eclipse.maven.central.mirror: https://repo.eclipse.org/content/repositories/maven_central/org/apache/maven/surefire/surefire-booter/2.22.0/surefire-booter-2.22.0.jar (273 kB at 1.1 MB/s)
Progress (2): 448/924 kB | 4.1/108 kB
Progress (2): 448/924 kB | 7.7/108 kB
Progress (3): 448/924 kB | 7.7/108 kB | 4.1/315 kB
Progress (3): 448/924 kB | 7.7/108 kB | 7.7/315 kB
Progress (3): 448/924 kB | 12/108 kB | 7.7/315 kB 
Progress (3): 448/924 kB | 12/108 kB | 12/315 kB 
Progress (3): 448/924 kB | 16/108 kB | 12/315 kB
Progress (3): 448/924 kB | 16/108 kB | 16/315 kB
Progress (3): 448/924 kB | 20/108 kB | 16/315 kB
Progress (3): 448/924 kB | 24/108 kB | 16/315 kB
Progress (3): 448/924 kB | 24/108 kB | 20/315 kB
Progress (3): 448/924 kB | 28/108 kB | 20/315 kB
Progress (3): 448/924 kB | 28/108 kB | 24/315 kB
Progress (3): 448/924 kB | 32/108 kB | 24/315 kB
Progress (3): 448/924 kB | 32/108 kB | 28/315 kB
Progress (3): 448/924 kB | 36/108 kB | 28/315 kB
Progress (3): 448/924 kB | 36/108 kB | 32/315 kB
Progress (3): 448/924 kB | 40/108 kB | 32/315 kB
Progress (3): 448/924 kB | 40/108 kB | 36/315 kB
Progress (3): 448/924 kB | 44/108 kB | 36/315 kB
Progress (3): 448/924 kB | 44/108 kB | 40/315 kB
Progress (3): 448/924 kB | 48/108 kB | 40/315 kB
Progress (3): 448/924 kB | 48/108 kB | 44/315 kB
Progress (3): 448/924 kB | 52/108 kB | 44/315 kB
Progress (3): 448/924 kB | 52/108 kB | 48/315 kB
Progress (3): 448/924 kB | 56/108 kB | 48/315 kB
Progress (3): 448/924 kB | 56/108 kB | 52/315 kB
Progress (3): 448/924 kB | 60/108 kB | 52/315 kB
Progress (3): 448/924 kB | 60/108 kB | 56/315 kB
Progress (3): 448/924 kB | 64/108 kB | 56/315 kB
Progress (3): 448/924 kB | 64/108 kB | 60/315 kB
Progress (3): 448/924 kB | 68/108 kB | 60/315 kB
Progress (3): 448/924 kB | 68/108 kB | 64/315 kB
Progress (3): 448/924 kB | 72/108 kB | 64/315 kB
Progress (3): 448/924 kB | 76/108 kB | 64/315 kB
Progress (3): 448/924 kB | 76/108 kB | 68/315 kB
Progress (3): 448/924 kB | 80/108 kB | 68/315 kB
Progress (3): 448/924 kB | 80/108 kB | 72/315 kB
Progress (3): 448/924 kB | 84/108 kB | 72/315 kB
Progress (3): 448/924 kB | 88/108 kB | 72/315 kB
Progress (3): 448/924 kB | 88/108 kB | 76/315 kB
Progress (3): 448/924 kB | 92/108 kB | 76/315 kB
Progress (3): 448/924 kB | 92/108 kB | 80/315 kB
Progress (3): 448/924 kB | 96/108 kB | 80/315 kB
Progress (3): 448/924 kB | 96/108 kB | 84/315 kB
Progress (3): 448/924 kB | 100/108 kB | 84/315 kB
Progress (3): 448/924 kB | 100/108 kB | 88/315 kB
Progress (3): 448/924 kB | 104/108 kB | 88/315 kB
Progress (3): 448/924 kB | 104/108 kB | 92/315 kB
Progress (3): 448/924 kB | 108/108 kB | 92/315 kB
Progress (3): 448/924 kB | 108/108 kB | 96/315 kB
Progress (3): 448/924 kB | 108 kB | 96/315 kB    
Progress (3): 448/924 kB | 108 kB | 100/315 kB
Progress (3): 448/924 kB | 108 kB | 104/315 kB
Progress (3): 448/924 kB | 108 kB | 108/315 kB
Progress (3): 448/924 kB | 108 kB | 112/315 kB
Progress (3): 448/924 kB | 108 kB | 116/315 kB
Progress (3): 448/924 kB | 108 kB | 120/315 kB
Progress (3): 448/924 kB | 108 kB | 124/315 kB
Progress (3): 448/924 kB | 108 kB | 128/315 kB
Progress (3): 448/924 kB | 108 kB | 132/315 kB
Progress (3): 448/924 kB | 108 kB | 136/315 kB
Progress (3): 448/924 kB | 108 kB | 140/315 kB
Progress (3): 448/924 kB | 108 kB | 144/315 kB
Progress (3): 448/924 kB | 108 kB | 148/315 kB
Progress (3): 448/924 kB | 108 kB | 152/315 kB
Progress (3): 448/924 kB | 108 kB | 156/315 kB
Progress (3): 448/924 kB | 108 kB | 160/315 kB
Progress (3): 448/924 kB | 108 kB | 164/315 kB
Progress (3): 448/924 kB | 108 kB | 168/315 kB
Progress (3): 448/924 kB | 108 kB | 172/315 kB
Progress (3): 448/924 kB | 108 kB | 176/315 kB
Progress (3): 448/924 kB | 108 kB | 180/315 kB
Progress (3): 448/924 kB | 108 kB | 184/315 kB
                                              
Downloaded from eclipse.maven.central.mirror: https://repo.eclipse.org/content/repositories/maven_central/org/ow2/asm/asm/6.1.1/asm-6.1.1.jar (108 kB at 339 kB/s)
Progress (2): 448/924 kB | 188/315 kB
Progress (2): 448/924 kB | 192/315 kB
Progress (2): 448/924 kB | 196/315 kB
Progress (2): 448/924 kB | 200/315 kB
Progress (2): 448/924 kB | 204/315 kB
Progress (2): 448/924 kB | 208/315 kB
Progress (2): 448/924 kB | 212/315 kB
Progress (2): 448/924 kB | 216/315 kB
Progress (2): 448/924 kB | 220/315 kB
Progress (2): 448/924 kB | 224/315 kB
Progress (2): 448/924 kB | 228/315 kB
Progress (2): 448/924 kB | 232/315 kB
Progress (2): 448/924 kB | 236/315 kB
Progress (2): 448/924 kB | 240/315 kB
Progress (2): 448/924 kB | 244/315 kB
Progress (2): 448/924 kB | 248/315 kB
Progress (2): 448/924 kB | 252/315 kB
Progress (2): 448/924 kB | 256/315 kB
Progress (2): 448/924 kB | 260/315 kB
Progress (2): 448/924 kB | 264/315 kB
Progress (2): 448/924 kB | 268/315 kB
Progress (2): 448/924 kB | 272/315 kB
Progress (2): 448/924 kB | 276/315 kB
Progress (2): 448/924 kB | 280/315 kB
Progress (2): 448/924 kB | 284/315 kB
Progress (2): 448/924 kB | 288/315 kB
Progress (2): 448/924 kB | 292/315 kB
Progress (2): 448/924 kB | 296/315 kB
Progress (2): 448/924 kB | 300/315 kB
Progress (2): 448/924 kB | 304/315 kB
Progress (2): 448/924 kB | 308/315 kB
Progress (2): 448/924 kB | 312/315 kB
Progress (2): 448/924 kB | 315 kB    
Progress (2): 452/924 kB | 315 kB
                                 
Downloaded from eclipse.maven.central.mirror: https://repo.eclipse.org/content/repositories/maven_central/com/thoughtworks/qdox/qdox/2.0-M7/qdox-2.0-M7.jar (315 kB at 932 kB/s)
Progress (1): 456/924 kB
Progress (1): 460/924 kB
Progress (1): 464/924 kB
Progress (1): 468/924 kB
Progress (1): 472/924 kB
Progress (1): 476/924 kB
Progress (1): 480/924 kB
Progress (1): 484/924 kB
Progress (1): 488/924 kB
Progress (1): 492/924 kB
Progress (1): 496/924 kB
Progress (1): 500/924 kB
Progress (1): 504/924 kB
Progress (1): 508/924 kB
Progress (1): 512/924 kB
Progress (1): 516/924 kB
Progress (1): 520/924 kB
Progress (1): 524/924 kB
Progress (1): 528/924 kB
Progress (1): 532/924 kB
Progress (1): 536/924 kB
Progress (1): 540/924 kB
Progress (1): 544/924 kB
Progress (1): 548/924 kB
Progress (1): 552/924 kB
Progress (1): 556/924 kB
Progress (1): 560/924 kB
Progress (1): 564/924 kB
Progress (1): 568/924 kB
Progress (1): 572/924 kB
Progress (1): 576/924 kB
Progress (1): 580/924 kB
Progress (1): 584/924 kB
Progress (1): 588/924 kB
Progress (1): 592/924 kB
Progress (1): 596/924 kB
Progress (1): 600/924 kB
Progress (1): 604/924 kB
Progress (1): 608/924 kB
Progress (1): 612/924 kB
Progress (1): 616/924 kB
Progress (1): 620/924 kB
Progress (1): 624/924 kB
Progress (1): 628/924 kB
Progress (1): 632/924 kB
Progress (1): 636/924 kB
Progress (1): 640/924 kB
Progress (1): 644/924 kB
Progress (1): 648/924 kB
Progress (1): 652/924 kB
Progress (1): 656/924 kB
Progress (1): 660/924 kB
Progress (1): 664/924 kB
Progress (1): 668/924 kB
Progress (1): 672/924 kB
Progress (1): 676/924 kB
Progress (1): 680/924 kB
Progress (1): 684/924 kB
Progress (1): 688/924 kB
Progress (1): 692/924 kB
Progress (1): 696/924 kB
Progress (1): 700/924 kB
Progress (1): 704/924 kB
Progress (1): 708/924 kB
Progress (1): 712/924 kB
Progress (1): 716/924 kB
Progress (1): 720/924 kB
Progress (1): 724/924 kB
Progress (1): 728/924 kB
Progress (1): 732/924 kB
Progress (1): 736/924 kB
Progress (2): 736/924 kB | 4.1/524 kB
Progress (2): 736/924 kB | 7.7/524 kB
Progress (2): 740/924 kB | 7.7/524 kB
Progress (2): 744/924 kB | 7.7/524 kB
Progress (2): 744/924 kB | 12/524 kB 
Progress (2): 744/924 kB | 16/524 kB
Progress (2): 748/924 kB | 16/524 kB
Progress (2): 748/924 kB | 20/524 kB
Progress (2): 752/924 kB | 20/524 kB
Progress (2): 752/924 kB | 24/524 kB
Progress (2): 756/924 kB | 24/524 kB
Progress (2): 756/924 kB | 28/524 kB
Progress (2): 760/924 kB | 28/524 kB
Progress (2): 760/924 kB | 32/524 kB
Progress (2): 760/924 kB | 33/524 kB
Progress (2): 760/924 kB | 37/524 kB
Progress (2): 764/924 kB | 37/524 kB
Progress (2): 764/924 kB | 41/524 kB
Progress (2): 768/924 kB | 41/524 kB
Progress (2): 768/924 kB | 45/524 kB
Progress (2): 768/924 kB | 49/524 kB
Progress (2): 768/924 kB | 53/524 kB
Progress (2): 768/924 kB | 57/524 kB
Progress (2): 768/924 kB | 61/524 kB
Progress (2): 772/924 kB | 61/524 kB
Progress (2): 772/924 kB | 65/524 kB
Progress (2): 776/924 kB | 65/524 kB
Progress (2): 776/924 kB | 69/524 kB
Progress (2): 776/924 kB | 73/524 kB
Progress (2): 776/924 kB | 77/524 kB
Progress (2): 776/924 kB | 81/524 kB
Progress (2): 776/924 kB | 85/524 kB
Progress (2): 776/924 kB | 89/524 kB
Progress (2): 780/924 kB | 89/524 kB
Progress (2): 780/924 kB | 93/524 kB
Progress (2): 784/924 kB | 93/524 kB
Progress (2): 784/924 kB | 97/524 kB
Progress (2): 788/924 kB | 97/524 kB
Progress (2): 792/924 kB | 97/524 kB
Progress (2): 792/924 kB | 101/524 kB
Progress (2): 792/924 kB | 105/524 kB
Progress (2): 796/924 kB | 105/524 kB
Progress (2): 800/924 kB | 105/524 kB
Progress (2): 800/924 kB | 109/524 kB
Progress (2): 804/924 kB | 109/524 kB
Progress (2): 804/924 kB | 113/524 kB
Progress (2): 808/924 kB | 113/524 kB
Progress (2): 808/924 kB | 117/524 kB
Progress (2): 812/924 kB | 117/524 kB
Progress (2): 812/924 kB | 121/524 kB
Progress (2): 816/924 kB | 121/524 kB
Progress (2): 816/924 kB | 125/524 kB
Progress (2): 820/924 kB | 125/524 kB
Progress (2): 820/924 kB | 129/524 kB
Progress (2): 824/924 kB | 129/524 kB
Progress (2): 824/924 kB | 133/524 kB
Progress (2): 828/924 kB | 133/524 kB
Progress (2): 828/924 kB | 137/524 kB
Progress (2): 832/924 kB | 137/524 kB
Progress (2): 832/924 kB | 141/524 kB
Progress (2): 836/924 kB | 141/524 kB
Progress (2): 836/924 kB | 145/524 kB
Progress (2): 840/924 kB | 145/524 kB
Progress (2): 840/924 kB | 149/524 kB
Progress (2): 844/924 kB | 149/524 kB
Progress (2): 844/924 kB | 153/524 kB
Progress (2): 848/924 kB | 153/524 kB
Progress (2): 848/924 kB | 157/524 kB
Progress (2): 852/924 kB | 157/524 kB
Progress (2): 852/924 kB | 161/524 kB
Progress (2): 856/924 kB | 161/524 kB
Progress (2): 856/924 kB | 165/524 kB
Progress (2): 860/924 kB | 165/524 kB
Progress (2): 860/924 kB | 169/524 kB
Progress (2): 864/924 kB | 169/524 kB
Progress (2): 864/924 kB | 173/524 kB
Progress (2): 868/924 kB | 173/524 kB
Progress (2): 868/924 kB | 177/524 kB
Progress (2): 872/924 kB | 177/524 kB
Progress (2): 872/924 kB | 181/524 kB
Progress (2): 876/924 kB | 181/524 kB
Progress (2): 876/924 kB | 185/524 kB
Progress (2): 880/924 kB | 185/524 kB
Progress (2): 880/924 kB | 189/524 kB
Progress (2): 884/924 kB | 189/524 kB
Progress (2): 884/924 kB | 193/524 kB
Progress (2): 888/924 kB | 193/524 kB
Progress (2): 888/924 kB | 197/524 kB
Progress (2): 892/924 kB | 197/524 kB
Progress (2): 892/924 kB | 201/524 kB
Progress (2): 896/924 kB | 201/524 kB
Progress (2): 896/924 kB | 205/524 kB
Progress (2): 900/924 kB | 205/524 kB
Progress (2): 900/924 kB | 209/524 kB
Progress (2): 904/924 kB | 209/524 kB
Progress (2): 904/924 kB | 213/524 kB
Progress (2): 908/924 kB | 213/524 kB
Progress (2): 908/924 kB | 217/524 kB
Progress (2): 912/924 kB | 217/524 kB
Progress (2): 912/924 kB | 221/524 kB
Progress (2): 916/924 kB | 221/524 kB
Progress (2): 916/924 kB | 225/524 kB
Progress (2): 920/924 kB | 225/524 kB
Progress (2): 924/924 kB | 225/524 kB
Progress (2): 924/924 kB | 229/524 kB
Progress (2): 924 kB | 229/524 kB    
Progress (2): 924 kB | 233/524 kB
Progress (2): 924 kB | 237/524 kB
Progress (2): 924 kB | 241/524 kB
Progress (2): 924 kB | 245/524 kB
Progress (2): 924 kB | 249/524 kB
Progress (2): 924 kB | 253/524 kB
Progress (2): 924 kB | 257/524 kB
Progress (2): 924 kB | 261/524 kB
Progress (2): 924 kB | 265/524 kB
Progress (2): 924 kB | 269/524 kB
Progress (2): 924 kB | 273/524 kB
Progress (2): 924 kB | 277/524 kB
Progress (2): 924 kB | 281/524 kB
Progress (2): 924 kB | 285/524 kB
Progress (2): 924 kB | 289/524 kB
Progress (2): 924 kB | 293/524 kB
Progress (2): 924 kB | 297/524 kB
Progress (2): 924 kB | 301/524 kB
Progress (2): 924 kB | 305/524 kB
Progress (2): 924 kB | 309/524 kB
Progress (2): 924 kB | 313/524 kB
Progress (2): 924 kB | 317/524 kB
Progress (2): 924 kB | 321/524 kB
Progress (2): 924 kB | 325/524 kB
Progress (2): 924 kB | 329/524 kB
Progress (2): 924 kB | 333/524 kB
Progress (2): 924 kB | 337/524 kB
Progress (2): 924 kB | 341/524 kB
Progress (2): 924 kB | 345/524 kB
Progress (2): 924 kB | 349/524 kB
Progress (2): 924 kB | 353/524 kB
Progress (2): 924 kB | 357/524 kB
Progress (2): 924 kB | 361/524 kB
Progress (2): 924 kB | 365/524 kB
Progress (2): 924 kB | 369/524 kB
Progress (2): 924 kB | 373/524 kB
Progress (2): 924 kB | 377/524 kB
                                 
Downloaded from eclipse.maven.central.mirror: https://repo.eclipse.org/content/repositories/maven_central/org/eclipse/tycho/org.eclipse.tycho.surefire.osgibooter/1.4.0/org.eclipse.tycho.surefire.osgibooter-1.4.0.jar (924 kB at 2.2 MB/s)
Progress (1): 381/524 kB
Progress (1): 385/524 kB
Progress (1): 389/524 kB
Progress (1): 393/524 kB
Progress (1): 397/524 kB
Progress (1): 401/524 kB
Progress (1): 405/524 kB
Progress (1): 409/524 kB
Progress (1): 413/524 kB
Progress (1): 417/524 kB
Progress (1): 421/524 kB
Progress (1): 425/524 kB
Progress (1): 429/524 kB
Progress (1): 433/524 kB
Progress (1): 437/524 kB
Progress (1): 441/524 kB
Progress (1): 445/524 kB
Progress (1): 449/524 kB
Progress (1): 453/524 kB
Progress (1): 457/524 kB
Progress (1): 461/524 kB
Progress (1): 465/524 kB
Progress (1): 469/524 kB
Progress (1): 473/524 kB
Progress (1): 477/524 kB
Progress (1): 481/524 kB
Progress (1): 485/524 kB
Progress (1): 489/524 kB
Progress (1): 493/524 kB
Progress (1): 497/524 kB
Progress (1): 501/524 kB
Progress (1): 505/524 kB
Progress (1): 509/524 kB
Progress (1): 513/524 kB
Progress (1): 517/524 kB
Progress (1): 521/524 kB
Progress (1): 524 kB    
                    
Downloaded from eclipse.maven.central.mirror: https://repo.eclipse.org/content/repositories/maven_central/org/apache/maven/surefire/maven-surefire-common/2.22.0/maven-surefire-common-2.22.0.jar (524 kB at 1.2 MB/s)
[WARNING] No explicit target runtime environment configuration. Build is platform dependent.
[WARNING] No explicit target runtime environment configuration. Build is platform dependent.
[WARNING] No explicit target runtime environment configuration. Build is platform dependent.
Downloading from cbi-releases: https://repo.eclipse.org/content/repositories/cbi-releases/org/jacoco/jacoco-maven-plugin/0.8.2/jacoco-maven-plugin-0.8.2.pom
Downloading from tycho-snapshots: https://oss.sonatype.org/content/groups/staging/org/jacoco/jacoco-maven-plugin/0.8.2/jacoco-maven-plugin-0.8.2.pom
Downloading from eclipse.maven.central.mirror: https://repo.eclipse.org/content/repositories/maven_central/org/jacoco/jacoco-maven-plugin/0.8.2/jacoco-maven-plugin-0.8.2.pom
Progress (1): 4.1/4.9 kB
Progress (1): 4.9 kB    
                    
Downloaded from eclipse.maven.central.mirror: https://repo.eclipse.org/content/repositories/maven_central/org/jacoco/jacoco-maven-plugin/0.8.2/jacoco-maven-plugin-0.8.2.pom (4.9 kB at 304 kB/s)
Downloading from cbi-releases: https://repo.eclipse.org/content/repositories/cbi-releases/org/jacoco/org.jacoco.build/0.8.2/org.jacoco.build-0.8.2.pom
Downloading from tycho-snapshots: https://oss.sonatype.org/content/groups/staging/org/jacoco/org.jacoco.build/0.8.2/org.jacoco.build-0.8.2.pom
Downloading from eclipse.maven.central.mirror: https://repo.eclipse.org/content/repositories/maven_central/org/jacoco/org.jacoco.build/0.8.2/org.jacoco.build-0.8.2.pom
Progress (1): 4.1/40 kB
Progress (1): 7.7/40 kB
Progress (1): 12/40 kB 
Progress (1): 16/40 kB
Progress (1): 20/40 kB
Progress (1): 24/40 kB
Progress (1): 28/40 kB
Progress (1): 32/40 kB
Progress (1): 36/40 kB
Progress (1): 40 kB   
                   
Downloaded from eclipse.maven.central.mirror: https://repo.eclipse.org/content/repositories/maven_central/org/jacoco/org.jacoco.build/0.8.2/org.jacoco.build-0.8.2.pom (40 kB at 2.3 MB/s)
Downloading from cbi-releases: https://repo.eclipse.org/content/repositories/cbi-releases/org/jacoco/jacoco-maven-plugin/0.8.2/jacoco-maven-plugin-0.8.2.jar
Downloading from tycho-snapshots: https://oss.sonatype.org/content/groups/staging/org/jacoco/jacoco-maven-plugin/0.8.2/jacoco-maven-plugin-0.8.2.jar
Downloading from eclipse.maven.central.mirror: https://repo.eclipse.org/content/repositories/maven_central/org/jacoco/jacoco-maven-plugin/0.8.2/jacoco-maven-plugin-0.8.2.jar
Progress (1): 4.1/54 kB
Progress (1): 7.7/54 kB
Progress (1): 12/54 kB 
Progress (1): 16/54 kB
Progress (1): 20/54 kB
Progress (1): 24/54 kB
Progress (1): 28/54 kB
Progress (1): 32/54 kB
Progress (1): 36/54 kB
Progress (1): 40/54 kB
Progress (1): 44/54 kB
Progress (1): 48/54 kB
Progress (1): 52/54 kB
Progress (1): 54 kB   
                   
Downloaded from eclipse.maven.central.mirror: https://repo.eclipse.org/content/repositories/maven_central/org/jacoco/jacoco-maven-plugin/0.8.2/jacoco-maven-plugin-0.8.2.jar (54 kB at 2.8 MB/s)
[WARNING] No explicit target runtime environment configuration. Build is platform dependent.
[WARNING] No explicit target runtime environment configuration. Build is platform dependent.
[INFO] Computing target platform for MavenProject: org.eclipse.m2e:org.eclipse.m2e.model.edit:1.13.0-SNAPSHOT @ /home/jenkins/agent/workspace/m2e-gerrit/org.eclipse.m2e.model.edit/pom.xml
Downloading from eclipse.maven.central.mirror: https://repo.eclipse.org/content/repositories/maven_central/org/codehaus/plexus/plexus-utils/3.2.0/plexus-utils-3.2.0.pom
Progress (1): 4.1/4.8 kB
Progress (1): 4.8 kB    
                    
Downloaded from eclipse.maven.central.mirror: https://repo.eclipse.org/content/repositories/maven_central/org/codehaus/plexus/plexus-utils/3.2.0/plexus-utils-3.2.0.pom (4.8 kB at 284 kB/s)
Downloading from eclipse.maven.central.mirror: https://repo.eclipse.org/content/repositories/maven_central/io/takari/m2e/workspace/org.eclipse.m2e.workspace.cli/0.3.1/org.eclipse.m2e.workspace.cli-0.3.1.pom
Progress (1): 4.1/9.4 kB
Progress (1): 7.7/9.4 kB
Progress (1): 9.4 kB    
                    
Downloaded from eclipse.maven.central.mirror: https://repo.eclipse.org/content/repositories/maven_central/io/takari/m2e/workspace/org.eclipse.m2e.workspace.cli/0.3.1/org.eclipse.m2e.workspace.cli-0.3.1.pom (9.4 kB at 493 kB/s)
Downloading from eclipse.maven.central.mirror: https://repo.eclipse.org/content/repositories/maven_central/org/codehaus/plexus/plexus-utils/3.2.0/plexus-utils-3.2.0.jar
Downloading from eclipse.maven.central.mirror: https://repo.eclipse.org/content/repositories/maven_central/io/takari/m2e/workspace/org.eclipse.m2e.workspace.cli/0.3.1/org.eclipse.m2e.workspace.cli-0.3.1.jar
Progress (1): 4.1/263 kB
Progress (1): 7.7/263 kB
Progress (1): 12/263 kB 
Progress (1): 16/263 kB
Progress (1): 20/263 kB
Progress (1): 24/263 kB
Progress (1): 28/263 kB
Progress (1): 32/263 kB
Progress (1): 36/263 kB
Progress (1): 40/263 kB
Progress (1): 44/263 kB
Progress (1): 48/263 kB
Progress (1): 52/263 kB
Progress (1): 56/263 kB
Progress (1): 60/263 kB
Progress (1): 64/263 kB
Progress (1): 68/263 kB
Progress (1): 72/263 kB
Progress (1): 76/263 kB
Progress (1): 80/263 kB
Progress (1): 84/263 kB
Progress (1): 88/263 kB
Progress (1): 92/263 kB
Progress (2): 92/263 kB | 4.1/16 kB
Progress (2): 96/263 kB | 4.1/16 kB
Progress (2): 96/263 kB | 7.7/16 kB
Progress (2): 96/263 kB | 12/16 kB 
Progress (2): 100/263 kB | 12/16 kB
Progress (2): 100/263 kB | 16/16 kB
Progress (2): 104/263 kB | 16/16 kB
Progress (2): 104/263 kB | 16 kB   
Progress (2): 108/263 kB | 16 kB
Progress (2): 112/263 kB | 16 kB
Progress (2): 116/263 kB | 16 kB
Progress (2): 120/263 kB | 16 kB
Progress (2): 124/263 kB | 16 kB
Progress (2): 128/263 kB | 16 kB
Progress (2): 132/263 kB | 16 kB
Progress (2): 136/263 kB | 16 kB
Progress (2): 140/263 kB | 16 kB
Progress (2): 144/263 kB | 16 kB
Progress (2): 148/263 kB | 16 kB
Progress (2): 152/263 kB | 16 kB
Progress (2): 156/263 kB | 16 kB
Progress (2): 160/263 kB | 16 kB
Progress (2): 164/263 kB | 16 kB
Progress (2): 168/263 kB | 16 kB
Progress (2): 172/263 kB | 16 kB
Progress (2): 176/263 kB | 16 kB
Progress (2): 180/263 kB | 16 kB
Progress (2): 184/263 kB | 16 kB
Progress (2): 188/263 kB | 16 kB
Progress (2): 192/263 kB | 16 kB
Progress (2): 196/263 kB | 16 kB
Progress (2): 200/263 kB | 16 kB
Progress (2): 204/263 kB | 16 kB
Progress (2): 208/263 kB | 16 kB
Progress (2): 212/263 kB | 16 kB
                                
Downloaded from eclipse.maven.central.mirror: https://repo.eclipse.org/content/repositories/maven_central/io/takari/m2e/workspace/org.eclipse.m2e.workspace.cli/0.3.1/org.eclipse.m2e.workspace.cli-0.3.1.jar (16 kB at 724 kB/s)
Progress (1): 216/263 kB
Progress (1): 220/263 kB
Progress (1): 224/263 kB
Progress (1): 228/263 kB
Progress (1): 232/263 kB
Progress (1): 236/263 kB
Progress (1): 240/263 kB
Progress (1): 244/263 kB
Progress (1): 248/263 kB
Progress (1): 252/263 kB
Progress (1): 256/263 kB
Progress (1): 260/263 kB
Progress (1): 263 kB    
                    
Downloaded from eclipse.maven.central.mirror: https://repo.eclipse.org/content/repositories/maven_central/org/codehaus/plexus/plexus-utils/3.2.0/plexus-utils-3.2.0.jar (263 kB at 8.2 MB/s)
[INFO] Fetching p2.index from http://download.eclipse.org/eclipse/updates/4.12/
[INFO] Fetching p2.index from http://download.eclipse.org/eclipse/updates/4.12/
[INFO] Adding repository http://download.eclipse.org/eclipse/updates/4.12
[INFO] Fetching compositeContent.jar from http://download.eclipse.org/eclipse/updates/4.12/ (446B)
[INFO] Fetching compositeContent.jar from http://download.eclipse.org/eclipse/updates/4.12/ (446B)
[INFO] Fetching content.jar from http://download.eclipse.org/eclipse/updates/4.12/categories/ (1.46kB)
[INFO] Fetching content.jar from http://download.eclipse.org/eclipse/updates/4.12/categories/ (1.46kB)
[INFO] Fetching p2.index from http://download.eclipse.org/eclipse/updates/4.12/R-4.12-201906051800/
[INFO] Fetching p2.index from http://download.eclipse.org/eclipse/updates/4.12/R-4.12-201906051800/
[INFO] Fetching content.xml.xz from http://download.eclipse.org/eclipse/updates/4.12/R-4.12-201906051800/
[INFO] Fetching content.xml.xz from http://download.eclipse.org/eclipse/updates/4.12/R-4.12-201906051800/
[INFO] Fetching p2.index from http://download.eclipse.org/releases/2019-06/
[INFO] Fetching p2.index from http://download.eclipse.org/releases/2019-06/
[INFO] Adding repository http://download.eclipse.org/releases/2019-06
[INFO] Fetching compositeContent.jar from http://download.eclipse.org/releases/2019-06/ (492B)
[INFO] Fetching compositeContent.jar from http://download.eclipse.org/releases/2019-06/ (492B)
[INFO] Fetching p2.index from https://download.eclipse.org/technology/epp/packages/2019-06/
[INFO] Fetching p2.index from https://download.eclipse.org/technology/epp/packages/2019-06/
[INFO] Fetching content.xml.xz from https://download.eclipse.org/technology/epp/packages/2019-06/
[INFO] Fetching content.xml.xz from https://download.eclipse.org/technology/epp/packages/2019-06/
[INFO] Fetching p2.index from http://download.eclipse.org/releases/2019-06/201906191000/
[INFO] Fetching p2.index from http://download.eclipse.org/releases/2019-06/201906191000/
[INFO] Fetching content.xml.xz from http://download.eclipse.org/releases/2019-06/201906191000/
[INFO] Fetching content.xml.xz from http://download.eclipse.org/releases/2019-06/201906191000/
[INFO] Fetching p2.index from http://download.eclipse.org/cbi/updates/license/
[INFO] Fetching p2.index from http://download.eclipse.org/cbi/updates/license/
[INFO] Adding repository http://download.eclipse.org/cbi/updates/license
[INFO] Fetching compositeContent.jar from http://download.eclipse.org/cbi/updates/license/ (423B)
[INFO] Fetching compositeContent.jar from http://download.eclipse.org/cbi/updates/license/ (423B)
[INFO] Fetching content.jar from http://download.eclipse.org/cbi/updates/license/1.0.0.v20131003-1638/ (3.87kB)
[INFO] Fetching content.jar from http://download.eclipse.org/cbi/updates/license/1.0.0.v20131003-1638/ (3.87kB)
[INFO] Fetching content.jar from http://download.eclipse.org/cbi/updates/license/1.0.1.v20140414-1359/ (3.83kB)
[INFO] Fetching content.jar from http://download.eclipse.org/cbi/updates/license/1.0.1.v20140414-1359/ (3.83kB)
[INFO] Fetching p2.index from http://download.eclipse.org/cbi/updates/license/2.0.2.v20181016-2210/
[INFO] Fetching p2.index from http://download.eclipse.org/cbi/updates/license/2.0.2.v20181016-2210/
[INFO] Fetching content.xml.xz from http://download.eclipse.org/cbi/updates/license/2.0.2.v20181016-2210/
[INFO] Fetching content.xml.xz from http://download.eclipse.org/cbi/updates/license/2.0.2.v20181016-2210/
[INFO] Adding repository https://download.eclipse.org/tools/orbit/downloads/drops/S20190521195709/repository
[ERROR] Internal error: java.lang.RuntimeException: Failed to load p2 repository with ID 'Orbit 2019-06 M3' from location https://download.eclipse.org/tools/orbit/downloads/drops/S20190521195709/repository/: No repository found at https://download.eclipse.org/tools/orbit/downloads/drops/S20190521195709/repository. -> [Help 1]
org.apache.maven.InternalErrorException: Internal error: java.lang.RuntimeException: Failed to load p2 repository with ID 'Orbit 2019-06 M3' from location https://download.eclipse.org/tools/orbit/downloads/drops/S20190521195709/repository/
    at org.apache.maven.DefaultMaven.execute (DefaultMaven.java:120)
    at org.apache.maven.cli.MavenCli.execute (MavenCli.java:954)
    at org.apache.maven.cli.MavenCli.doMain (MavenCli.java:288)
    at org.apache.maven.cli.MavenCli.main (MavenCli.java:192)
    at sun.reflect.NativeMethodAccessorImpl.invoke0 (Native Method)
    at sun.reflect.NativeMethodAccessorImpl.invoke (NativeMethodAccessorImpl.java:62)
    at sun.reflect.DelegatingMethodAccessorImpl.invoke (DelegatingMethodAccessorImpl.java:43)
    at java.lang.reflect.Method.invoke (Method.java:498)
    at org.codehaus.plexus.classworlds.launcher.Launcher.launchEnhanced (Launcher.java:289)
    at org.codehaus.plexus.classworlds.launcher.Launcher.launch (Launcher.java:229)
    at org.codehaus.plexus.classworlds.launcher.Launcher.mainWithExitCode (Launcher.java:415)
    at org.codehaus.plexus.classworlds.launcher.Launcher.main (Launcher.java:356)
Caused by: java.lang.RuntimeException: Failed to load p2 repository with ID 'Orbit 2019-06 M3' from location https://download.eclipse.org/tools/orbit/downloads/drops/S20190521195709/repository/
    at org.eclipse.tycho.p2.target.TargetPlatformFactoryImpl.loadMetadataRepository (TargetPlatformFactoryImpl.java:302)
    at org.eclipse.tycho.p2.target.TargetPlatformFactoryImpl.gatherExternalInstallableUnits (TargetPlatformFactoryImpl.java:270)
    at org.eclipse.tycho.p2.target.TargetPlatformFactoryImpl.createTargetPlatform (TargetPlatformFactoryImpl.java:176)
    at org.eclipse.tycho.p2.target.TargetPlatformFactoryImpl.createTargetPlatform (TargetPlatformFactoryImpl.java:128)
    at org.eclipse.tycho.p2.target.TargetPlatformFactoryImpl.createTargetPlatform (TargetPlatformFactoryImpl.java:1)
    at org.eclipse.tycho.p2.manager.ReactorRepositoryManagerImpl.computePreliminaryTargetPlatform (ReactorRepositoryManagerImpl.java:84)
    at org.eclipse.tycho.p2.resolver.P2DependencyResolver.computePreliminaryTargetPlatform (P2DependencyResolver.java:224)
    at org.eclipse.tycho.core.resolver.DefaultTychoResolver.resolveProject (DefaultTychoResolver.java:110)
    at org.eclipse.tycho.core.maven.TychoMavenLifecycleParticipant.afterProjectsRead (TychoMavenLifecycleParticipant.java:95)
    at org.apache.maven.DefaultMaven.doExecute (DefaultMaven.java:264)
    at org.apache.maven.DefaultMaven.doExecute (DefaultMaven.java:192)
    at org.apache.maven.DefaultMaven.execute (DefaultMaven.java:105)
    at org.apache.maven.cli.MavenCli.execute (MavenCli.java:954)
    at org.apache.maven.cli.MavenCli.doMain (MavenCli.java:288)
    at org.apache.maven.cli.MavenCli.main (MavenCli.java:192)
    at sun.reflect.NativeMethodAccessorImpl.invoke0 (Native Method)
    at sun.reflect.NativeMethodAccessorImpl.invoke (NativeMethodAccessorImpl.java:62)
    at sun.reflect.DelegatingMethodAccessorImpl.invoke (DelegatingMethodAccessorImpl.java:43)
    at java.lang.reflect.Method.invoke (Method.java:498)
    at org.codehaus.plexus.classworlds.launcher.Launcher.launchEnhanced (Launcher.java:289)
    at org.codehaus.plexus.classworlds.launcher.Launcher.launch (Launcher.java:229)
    at org.codehaus.plexus.classworlds.launcher.Launcher.mainWithExitCode (Launcher.java:415)
    at org.codehaus.plexus.classworlds.launcher.Launcher.main (Launcher.java:356)
Caused by: org.eclipse.equinox.p2.core.ProvisionException: No repository found at https://download.eclipse.org/tools/orbit/downloads/drops/S20190521195709/repository.
    at org.eclipse.equinox.internal.p2.repository.helpers.AbstractRepositoryManager.fail (AbstractRepositoryManager.java:398)
    at org.eclipse.equinox.internal.p2.repository.helpers.AbstractRepositoryManager.loadRepository (AbstractRepositoryManager.java:695)
    at org.eclipse.equinox.internal.p2.metadata.repository.MetadataRepositoryManager.loadRepository (MetadataRepositoryManager.java:110)
    at org.eclipse.tycho.p2.remote.RemoteMetadataRepositoryManager.loadRepository (RemoteMetadataRepositoryManager.java:61)
    at org.eclipse.tycho.p2.remote.RemoteMetadataRepositoryManager.loadRepository (RemoteMetadataRepositoryManager.java:53)
    at org.eclipse.tycho.p2.target.TargetPlatformFactoryImpl.loadMetadataRepository (TargetPlatformFactoryImpl.java:298)
    at org.eclipse.tycho.p2.target.TargetPlatformFactoryImpl.gatherExternalInstallableUnits (TargetPlatformFactoryImpl.java:270)
    at org.eclipse.tycho.p2.target.TargetPlatformFactoryImpl.createTargetPlatform (TargetPlatformFactoryImpl.java:176)
    at org.eclipse.tycho.p2.target.TargetPlatformFactoryImpl.createTargetPlatform (TargetPlatformFactoryImpl.java:128)
    at org.eclipse.tycho.p2.target.TargetPlatformFactoryImpl.createTargetPlatform (TargetPlatformFactoryImpl.java:1)
    at org.eclipse.tycho.p2.manager.ReactorRepositoryManagerImpl.computePreliminaryTargetPlatform (ReactorRepositoryManagerImpl.java:84)
    at org.eclipse.tycho.p2.resolver.P2DependencyResolver.computePreliminaryTargetPlatform (P2DependencyResolver.java:224)
    at org.eclipse.tycho.core.resolver.DefaultTychoResolver.resolveProject (DefaultTychoResolver.java:110)
    at org.eclipse.tycho.core.maven.TychoMavenLifecycleParticipant.afterProjectsRead (TychoMavenLifecycleParticipant.java:95)
    at org.apache.maven.DefaultMaven.doExecute (DefaultMaven.java:264)
    at org.apache.maven.DefaultMaven.doExecute (DefaultMaven.java:192)
    at org.apache.maven.DefaultMaven.execute (DefaultMaven.java:105)
    at org.apache.maven.cli.MavenCli.execute (MavenCli.java:954)
    at org.apache.maven.cli.MavenCli.doMain (MavenCli.java:288)
    at org.apache.maven.cli.MavenCli.main (MavenCli.java:192)
    at sun.reflect.NativeMethodAccessorImpl.invoke0 (Native Method)
    at sun.reflect.NativeMethodAccessorImpl.invoke (NativeMethodAccessorImpl.java:62)
    at sun.reflect.DelegatingMethodAccessorImpl.invoke (DelegatingMethodAccessorImpl.java:43)
    at java.lang.reflect.Method.invoke (Method.java:498)
    at org.codehaus.plexus.classworlds.launcher.Launcher.launchEnhanced (Launcher.java:289)
    at org.codehaus.plexus.classworlds.launcher.Launcher.launch (Launcher.java:229)
    at org.codehaus.plexus.classworlds.launcher.Launcher.mainWithExitCode (Launcher.java:415)
    at org.codehaus.plexus.classworlds.launcher.Launcher.main (Launcher.java:356)
[ERROR] 
[ERROR] To see the full stack trace of the errors, re-run Maven with the -e switch.
[ERROR] Re-run Maven using the -X switch to enable full debug logging.
[ERROR] 
[ERROR] For more information about the errors and possible solutions, please read the following articles:
[ERROR] [Help 1] http://cwiki.apache.org/confluence/display/MAVEN/InternalErrorException
Build step 'Invoke top-level Maven targets' marked build as failure
Terminating xvnc.
Recording test results
ERROR: Step ‘Publish JUnit test result report’ failed: No test report files were found. Configuration error?
Archiving artifacts
Finished: FAILURE