FailedConsole Output

Started by user fbricon@gmail.com
Building in workspace /home/hudson/genie.m2e/.jenkins/jobs/m2e-1.8.x/workspace
 > /usr/local/bin/git rev-parse --is-inside-work-tree # timeout=10
Fetching changes from the remote Git repository
 > /usr/local/bin/git config remote.origin.url git://git.eclipse.org/gitroot/m2e/m2e-core.git # timeout=10
Fetching upstream changes from git://git.eclipse.org/gitroot/m2e/m2e-core.git
 > /usr/local/bin/git --version # timeout=10
 > /usr/local/bin/git fetch --tags --progress git://git.eclipse.org/gitroot/m2e/m2e-core.git +refs/heads/*:refs/remotes/origin/*
 > /usr/local/bin/git rev-parse origin/m2e-1.8.x^{commit} # timeout=10
Checking out Revision 3785c3c0a930f6bff75969fd1b84d731ec950a1c (origin/m2e-1.8.x)
 > /usr/local/bin/git config core.sparsecheckout # timeout=10
 > /usr/local/bin/git checkout -f 3785c3c0a930f6bff75969fd1b84d731ec950a1c
Commit message: "Bug 534228 - okhttp connector 0.17.4 with local repo access race fix"
 > /usr/local/bin/git rev-list --no-walk 1255fb56041f5b98af6c114ce5b03cd657303575 # timeout=10
[workspace] $ /shared/common/apache-maven-latest/bin/mvn -f m2e-maven-runtime/pom.xml -DM2E_VERSION=1.8.4 -Dtycho.disableP2Mirrors=true -Declipse.stream=oxygen -Dmaven.repo.local=/home/hudson/genie.m2e/.jenkins/jobs/m2e-1.8.x/workspace/.repository clean install -Peclipse-sign
Picked up JAVA_TOOL_OPTIONS: -Xmx2G -Djava.io.tmpdir=/tmp/genie.m2e
[INFO] Scanning for projects...
[WARNING] 
[WARNING] Some problems were encountered while building the effective model for org.eclipse.m2e:m2e-maven-runtime:pom:1.8.4-SNAPSHOT
[WARNING] 'parent.relativePath' of POM org.eclipse.m2e:m2e-maven-runtime:1.8.4-SNAPSHOT (/jobs/genie.m2e/m2e-1.8.x/workspace/m2e-maven-runtime/pom.xml) points at org.eclipse.m2e:m2e-core instead of org.sonatype.forge:forge-parent, please verify your project structure @ line 17, column 11
[WARNING] 
[WARNING] It is highly recommended to fix these problems because they threaten the stability of your build.
[WARNING] 
[WARNING] For this reason, future Maven versions might no longer support building such malformed projects.
[WARNING] 
[WARNING] The project org.eclipse.m2e:m2e-maven-runtime:pom:1.8.4-SNAPSHOT uses prerequisites which is only intended for maven-plugin projects but not for non maven-plugin projects. For such purposes you should use the maven-enforcer-plugin. See https://maven.apache.org/enforcer/enforcer-rules/requireMavenVersion.html
[INFO] ------------------------------------------------------------------------
[INFO] Reactor Build Order:
[INFO] 
[INFO] m2e-maven-runtime                                                  [pom]
[INFO] Maven Archetype Common Bundle                                   [bundle]
[INFO] Nexus Indexer Bundle                                            [bundle]
[INFO] Embedded Maven Runtime Bundle                                   [bundle]
[INFO] org.eclipse.m2e.maven.runtime.slf4j.simple                      [bundle]
[INFO] 
[INFO] -----------------< org.eclipse.m2e:m2e-maven-runtime >------------------
[INFO] Building m2e-maven-runtime 1.8.4-SNAPSHOT                          [1/5]
[INFO] --------------------------------[ pom ]---------------------------------
[INFO] 
[INFO] --- maven-clean-plugin:2.4.1:clean (default-clean) @ m2e-maven-runtime ---
[INFO] 
[INFO] --- tycho-pack200a-plugin:1.0.0:normalize (pack200-normalize) @ m2e-maven-runtime ---
[INFO] 
[INFO] --- eclipse-jarsigner-plugin:1.0.0:sign (sign) @ m2e-maven-runtime ---
[INFO] 
[INFO] --- tycho-pack200b-plugin:1.0.0:pack (pack200-pack) @ m2e-maven-runtime ---
[INFO] 
[INFO] --- maven-install-plugin:2.3.1:install (default-install) @ m2e-maven-runtime ---
[INFO] Installing /jobs/genie.m2e/m2e-1.8.x/workspace/m2e-maven-runtime/pom.xml to /home/hudson/genie.m2e/.jenkins/jobs/m2e-1.8.x/workspace/.repository/org/eclipse/m2e/m2e-maven-runtime/1.8.4-SNAPSHOT/m2e-maven-runtime-1.8.4-SNAPSHOT.pom
[INFO] 
[INFO] ----------< org.eclipse.m2e:org.eclipse.m2e.archetype.common >----------
[INFO] Building Maven Archetype Common Bundle 1.8.4-SNAPSHOT              [2/5]
[INFO] -------------------------------[ bundle ]-------------------------------
[INFO] 
[INFO] --- maven-clean-plugin:2.4.1:clean (default-clean) @ org.eclipse.m2e.archetype.common ---
[INFO] Deleting /jobs/genie.m2e/m2e-1.8.x/workspace/m2e-maven-runtime/org.eclipse.m2e.archetype.common/target
[INFO] 
[INFO] --- maven-resources-plugin:2.5:resources (default-resources) @ org.eclipse.m2e.archetype.common ---
[debug] execute contextualize
[INFO] Using 'UTF-8' encoding to copy filtered resources.
[INFO] Copying 7 resources
[INFO] 
[INFO] --- maven-compiler-plugin:3.1:compile (default-compile) @ org.eclipse.m2e.archetype.common ---
[INFO] No sources to compile
[INFO] 
[INFO] --- maven-resources-plugin:2.5:testResources (default-testResources) @ org.eclipse.m2e.archetype.common ---
[debug] execute contextualize
[INFO] Using 'UTF-8' encoding to copy filtered resources.
[INFO] skip non existing resourceDirectory /jobs/genie.m2e/m2e-1.8.x/workspace/m2e-maven-runtime/org.eclipse.m2e.archetype.common/src/test/resources
[INFO] 
[INFO] --- maven-compiler-plugin:3.1:testCompile (default-testCompile) @ org.eclipse.m2e.archetype.common ---
[INFO] No sources to compile
[INFO] 
[INFO] --- maven-surefire-plugin:2.8:test (default-test) @ org.eclipse.m2e.archetype.common ---
[INFO] No tests to run.
[INFO] Surefire report directory: /jobs/genie.m2e/m2e-1.8.x/workspace/m2e-maven-runtime/org.eclipse.m2e.archetype.common/target/surefire-reports

-------------------------------------------------------
 T E S T S
-------------------------------------------------------
There are no tests to run.

Results :

Tests run: 0, Failures: 0, Errors: 0, Skipped: 0

[INFO] 
[INFO] --- maven-bundle-plugin:2.5.0:bundle (default-bundle) @ org.eclipse.m2e.archetype.common ---
[WARNING] Bundle org.eclipse.m2e:org.eclipse.m2e.archetype.common:bundle:1.8.4-SNAPSHOT : Unused Private-Package instructions, no such package(s) on the class path: [!*]
[WARNING] Bundle org.eclipse.m2e:org.eclipse.m2e.archetype.common:bundle:1.8.4-SNAPSHOT : Export org.apache.maven.archetype.common,  has 2,  private references [org.jdom, org.dom4j], 
[WARNING] Bundle org.eclipse.m2e:org.eclipse.m2e.archetype.common:bundle:1.8.4-SNAPSHOT : Export org.apache.maven.archetype.common.util,  has 2,  private references [org.jdom, org.jdom.output], 
[WARNING] Bundle org.eclipse.m2e:org.eclipse.m2e.archetype.common:bundle:1.8.4-SNAPSHOT : Export org.apache.maven.archetype.old,  has 1,  private references [org.apache.velocity.context], 
[WARNING] Bundle org.eclipse.m2e:org.eclipse.m2e.archetype.common:bundle:1.8.4-SNAPSHOT : Export org.codehaus.plexus.velocity,  has 7,  private references [org.apache.commons.collections, org.apache.velocity.runtime.resource.loader, org.apache.velocity.app, org.apache.velocity.runtime, org.apache.velocity.runtime.resource, org.apache.velocity.runtime.log, org.apache.velocity.exception], 
[WARNING] Bundle org.eclipse.m2e:org.eclipse.m2e.archetype.common:bundle:1.8.4-SNAPSHOT : The default package '.' is not permitted by the Import-Package syntax. 
 This can be caused by compile errors in Eclipse because Eclipse creates 
valid class files regardless of compile errors.
The following package(s) import from the default package null
[WARNING] Bundle org.eclipse.m2e:org.eclipse.m2e.archetype.common:bundle:1.8.4-SNAPSHOT : Invalid package name: 'META-INF.plexus'
[INFO] 
[INFO] --- tycho-pack200a-plugin:1.0.0:normalize (pack200-normalize) @ org.eclipse.m2e.archetype.common ---
[INFO] Pack200 normalizing jar /jobs/genie.m2e/m2e-1.8.x/workspace/m2e-maven-runtime/org.eclipse.m2e.archetype.common/target/org.eclipse.m2e.archetype.common-1.8.4-SNAPSHOT.jar
[INFO] 
[INFO] --- eclipse-jarsigner-plugin:1.0.0:sign (sign) @ org.eclipse.m2e.archetype.common ---
[INFO] Signed org.eclipse.m2e:org.eclipse.m2e.archetype.common:bundle:1.8.4-SNAPSHOT in 1 seconds.
[INFO] 
[INFO] --- tycho-pack200b-plugin:1.0.0:pack (pack200-pack) @ org.eclipse.m2e.archetype.common ---
[INFO] Pack200 packing jar /jobs/genie.m2e/m2e-1.8.x/workspace/m2e-maven-runtime/org.eclipse.m2e.archetype.common/target/org.eclipse.m2e.archetype.common-1.8.4-SNAPSHOT.jar
[INFO] 
[INFO] --- tycho-p2-plugin:1.0.0:p2-metadata (p2-metadata) @ org.eclipse.m2e.archetype.common ---
[INFO] 
[INFO] --- tycho-p2-plugin:1.0.0:update-local-index (p2-metadata) @ org.eclipse.m2e.archetype.common ---
[INFO] 
[INFO] --- maven-install-plugin:2.3.1:install (default-install) @ org.eclipse.m2e.archetype.common ---
[INFO] Installing /jobs/genie.m2e/m2e-1.8.x/workspace/m2e-maven-runtime/org.eclipse.m2e.archetype.common/target/org.eclipse.m2e.archetype.common-1.8.4-SNAPSHOT.jar to /home/hudson/genie.m2e/.jenkins/jobs/m2e-1.8.x/workspace/.repository/org/eclipse/m2e/org.eclipse.m2e.archetype.common/1.8.4-SNAPSHOT/org.eclipse.m2e.archetype.common-1.8.4-SNAPSHOT.jar
[INFO] Installing /jobs/genie.m2e/m2e-1.8.x/workspace/m2e-maven-runtime/org.eclipse.m2e.archetype.common/pom.xml to /home/hudson/genie.m2e/.jenkins/jobs/m2e-1.8.x/workspace/.repository/org/eclipse/m2e/org.eclipse.m2e.archetype.common/1.8.4-SNAPSHOT/org.eclipse.m2e.archetype.common-1.8.4-SNAPSHOT.pom
[INFO] Installing /jobs/genie.m2e/m2e-1.8.x/workspace/m2e-maven-runtime/org.eclipse.m2e.archetype.common/target/org.eclipse.m2e.archetype.common-1.8.4-SNAPSHOT.jar.pack.gz to /home/hudson/genie.m2e/.jenkins/jobs/m2e-1.8.x/workspace/.repository/org/eclipse/m2e/org.eclipse.m2e.archetype.common/1.8.4-SNAPSHOT/org.eclipse.m2e.archetype.common-1.8.4-SNAPSHOT-pack200.jar.pack.gz
[INFO] 
[INFO] --- maven-bundle-plugin:2.5.0:install (default-install) @ org.eclipse.m2e.archetype.common ---
[INFO] Installing org/eclipse/m2e/org.eclipse.m2e.archetype.common/1.8.4-SNAPSHOT/org.eclipse.m2e.archetype.common-1.8.4-SNAPSHOT.jar
[INFO] Writing OBR metadata
[INFO] 
[INFO] -----------< org.eclipse.m2e:org.eclipse.m2e.maven.indexer >------------
[INFO] Building Nexus Indexer Bundle 1.8.4-SNAPSHOT                       [3/5]
[INFO] -------------------------------[ bundle ]-------------------------------
[INFO] 
[INFO] --- maven-clean-plugin:2.4.1:clean (default-clean) @ org.eclipse.m2e.maven.indexer ---
[INFO] Deleting /jobs/genie.m2e/m2e-1.8.x/workspace/m2e-maven-runtime/org.eclipse.m2e.maven.indexer/target
[INFO] 
[INFO] --- maven-resources-plugin:2.5:resources (default-resources) @ org.eclipse.m2e.maven.indexer ---
[debug] execute contextualize
[INFO] Using 'UTF-8' encoding to copy filtered resources.
[INFO] Copying 3 resources
[INFO] 
[INFO] --- maven-compiler-plugin:3.1:compile (default-compile) @ org.eclipse.m2e.maven.indexer ---
[INFO] Changes detected - recompiling the module!
[INFO] Compiling 1 source file to /jobs/genie.m2e/m2e-1.8.x/workspace/m2e-maven-runtime/org.eclipse.m2e.maven.indexer/target/classes
[INFO] 
[INFO] --- maven-resources-plugin:2.5:testResources (default-testResources) @ org.eclipse.m2e.maven.indexer ---
[debug] execute contextualize
[INFO] Using 'UTF-8' encoding to copy filtered resources.
[INFO] skip non existing resourceDirectory /jobs/genie.m2e/m2e-1.8.x/workspace/m2e-maven-runtime/org.eclipse.m2e.maven.indexer/src/test/resources
[INFO] 
[INFO] --- maven-compiler-plugin:3.1:testCompile (default-testCompile) @ org.eclipse.m2e.maven.indexer ---
[INFO] No sources to compile
[INFO] 
[INFO] --- maven-surefire-plugin:2.8:test (default-test) @ org.eclipse.m2e.maven.indexer ---
[INFO] No tests to run.
[INFO] Surefire report directory: /jobs/genie.m2e/m2e-1.8.x/workspace/m2e-maven-runtime/org.eclipse.m2e.maven.indexer/target/surefire-reports

-------------------------------------------------------
 T E S T S
-------------------------------------------------------
There are no tests to run.

Results :

Tests run: 0, Failures: 0, Errors: 0, Skipped: 0

[INFO] 
[INFO] --- maven-bundle-plugin:2.5.0:bundle (default-bundle) @ org.eclipse.m2e.maven.indexer ---
[WARNING] Bundle org.eclipse.m2e:org.eclipse.m2e.maven.indexer:bundle:1.8.4-SNAPSHOT : Split package, multiple jars provide the same package:org/apache/maven/index
Use Import/Export Package directive -split-package:=(merge-first|merge-last|error|first) to get rid of this warning
Package found in   [Jar:., Jar:indexer-core]
Class path         [Jar:., Jar:indexer-core, Jar:indexer-artifact, Jar:lucene-core, Jar:lucene-highlighter, Jar:org.eclipse.sisu.plexus, Jar:cdi-api, Jar:jsr250-api, Jar:javax.inject, Jar:guava, Jar:jsr305, Jar:sisu-guice, Jar:aopalliance, Jar:org.eclipse.sisu.inject, Jar:asm, Jar:plexus-component-annotations, Jar:plexus-classworlds, Jar:plexus-utils]
[WARNING] Bundle org.eclipse.m2e:org.eclipse.m2e.maven.indexer:bundle:1.8.4-SNAPSHOT : Invalid package name: 'META-INF.plexus'
[INFO] 
[INFO] --- tycho-pack200a-plugin:1.0.0:normalize (pack200-normalize) @ org.eclipse.m2e.maven.indexer ---
[INFO] Pack200 normalizing jar /jobs/genie.m2e/m2e-1.8.x/workspace/m2e-maven-runtime/org.eclipse.m2e.maven.indexer/target/org.eclipse.m2e.maven.indexer-1.8.4-SNAPSHOT.jar
[INFO] 
[INFO] --- eclipse-jarsigner-plugin:1.0.0:sign (sign) @ org.eclipse.m2e.maven.indexer ---
[INFO] Signed org.eclipse.m2e:org.eclipse.m2e.maven.indexer:bundle:1.8.4-SNAPSHOT in 0 seconds.
[INFO] 
[INFO] --- tycho-pack200b-plugin:1.0.0:pack (pack200-pack) @ org.eclipse.m2e.maven.indexer ---
[INFO] Pack200 packing jar /jobs/genie.m2e/m2e-1.8.x/workspace/m2e-maven-runtime/org.eclipse.m2e.maven.indexer/target/org.eclipse.m2e.maven.indexer-1.8.4-SNAPSHOT.jar
[INFO] 
[INFO] --- tycho-p2-plugin:1.0.0:p2-metadata (p2-metadata) @ org.eclipse.m2e.maven.indexer ---
[INFO] 
[INFO] --- tycho-p2-plugin:1.0.0:update-local-index (p2-metadata) @ org.eclipse.m2e.maven.indexer ---
[INFO] 
[INFO] --- maven-install-plugin:2.3.1:install (default-install) @ org.eclipse.m2e.maven.indexer ---
[INFO] Installing /jobs/genie.m2e/m2e-1.8.x/workspace/m2e-maven-runtime/org.eclipse.m2e.maven.indexer/target/org.eclipse.m2e.maven.indexer-1.8.4-SNAPSHOT.jar to /home/hudson/genie.m2e/.jenkins/jobs/m2e-1.8.x/workspace/.repository/org/eclipse/m2e/org.eclipse.m2e.maven.indexer/1.8.4-SNAPSHOT/org.eclipse.m2e.maven.indexer-1.8.4-SNAPSHOT.jar
[INFO] Installing /jobs/genie.m2e/m2e-1.8.x/workspace/m2e-maven-runtime/org.eclipse.m2e.maven.indexer/pom.xml to /home/hudson/genie.m2e/.jenkins/jobs/m2e-1.8.x/workspace/.repository/org/eclipse/m2e/org.eclipse.m2e.maven.indexer/1.8.4-SNAPSHOT/org.eclipse.m2e.maven.indexer-1.8.4-SNAPSHOT.pom
[INFO] Installing /jobs/genie.m2e/m2e-1.8.x/workspace/m2e-maven-runtime/org.eclipse.m2e.maven.indexer/target/org.eclipse.m2e.maven.indexer-1.8.4-SNAPSHOT.jar.pack.gz to /home/hudson/genie.m2e/.jenkins/jobs/m2e-1.8.x/workspace/.repository/org/eclipse/m2e/org.eclipse.m2e.maven.indexer/1.8.4-SNAPSHOT/org.eclipse.m2e.maven.indexer-1.8.4-SNAPSHOT-pack200.jar.pack.gz
[INFO] 
[INFO] --- maven-bundle-plugin:2.5.0:install (default-install) @ org.eclipse.m2e.maven.indexer ---
[INFO] Installing org/eclipse/m2e/org.eclipse.m2e.maven.indexer/1.8.4-SNAPSHOT/org.eclipse.m2e.maven.indexer-1.8.4-SNAPSHOT.jar
[INFO] Writing OBR metadata
[INFO] 
[INFO] -----------< org.eclipse.m2e:org.eclipse.m2e.maven.runtime >------------
[INFO] Building Embedded Maven Runtime Bundle 1.8.4-SNAPSHOT              [4/5]
[INFO] -------------------------------[ bundle ]-------------------------------
Downloading from eclipse.maven.central.mirror: https://repo.eclipse.org/content/repositories/maven_central/io/takari/aether/aether-connector-okhttp/0.17.4/aether-connector-okhttp-0.17.4.pom
Progress (1): 4.1/8.3 kB
Progress (1): 7.7/8.3 kB
Progress (1): 8.3 kB    
                    
Downloaded from eclipse.maven.central.mirror: https://repo.eclipse.org/content/repositories/maven_central/io/takari/aether/aether-connector-okhttp/0.17.4/aether-connector-okhttp-0.17.4.pom (8.3 kB at 37 kB/s)
Downloading from eclipse.maven.central.mirror: https://repo.eclipse.org/content/repositories/maven_central/io/takari/takari/27/takari-27.pom
Progress (1): 4.1/14 kB
Progress (1): 7.7/14 kB
Progress (1): 12/14 kB 
Progress (1): 14 kB   
                   
Downloaded from eclipse.maven.central.mirror: https://repo.eclipse.org/content/repositories/maven_central/io/takari/takari/27/takari-27.pom (14 kB at 307 kB/s)
Downloading from eclipse.maven.central.mirror: https://repo.eclipse.org/content/repositories/maven_central/com/squareup/okhttp3/okhttp/3.11.0/okhttp-3.11.0.pom
Progress (1): 2.3 kB
                    
Downloaded from eclipse.maven.central.mirror: https://repo.eclipse.org/content/repositories/maven_central/com/squareup/okhttp3/okhttp/3.11.0/okhttp-3.11.0.pom (2.3 kB at 61 kB/s)
Downloading from eclipse.maven.central.mirror: https://repo.eclipse.org/content/repositories/maven_central/com/squareup/okhttp3/parent/3.11.0/parent-3.11.0.pom
Progress (1): 4.1/20 kB
Progress (1): 7.7/20 kB
Progress (1): 12/20 kB 
Progress (1): 16/20 kB
Progress (1): 20 kB   
                   
Downloaded from eclipse.maven.central.mirror: https://repo.eclipse.org/content/repositories/maven_central/com/squareup/okhttp3/parent/3.11.0/parent-3.11.0.pom (20 kB at 456 kB/s)
Downloading from eclipse.maven.central.mirror: https://repo.eclipse.org/content/repositories/maven_central/com/squareup/okio/okio/1.14.0/okio-1.14.0.pom
Progress (1): 2.0 kB
                    
Downloaded from eclipse.maven.central.mirror: https://repo.eclipse.org/content/repositories/maven_central/com/squareup/okio/okio/1.14.0/okio-1.14.0.pom (2.0 kB at 68 kB/s)
Downloading from eclipse.maven.central.mirror: https://repo.eclipse.org/content/repositories/maven_central/com/squareup/okio/okio-parent/1.14.0/okio-parent-1.14.0.pom
Progress (1): 4.1/4.9 kB
Progress (1): 4.9 kB    
                    
Downloaded from eclipse.maven.central.mirror: https://repo.eclipse.org/content/repositories/maven_central/com/squareup/okio/okio-parent/1.14.0/okio-parent-1.14.0.pom (4.9 kB at 174 kB/s)
Downloading from eclipse.maven.central.mirror: https://repo.eclipse.org/content/repositories/maven_central/io/takari/aether/aether-connector-okhttp/0.17.4/aether-connector-okhttp-0.17.4.jar
Downloading from eclipse.maven.central.mirror: https://repo.eclipse.org/content/repositories/maven_central/com/squareup/okhttp3/okhttp/3.11.0/okhttp-3.11.0.jar
Downloading from eclipse.maven.central.mirror: https://repo.eclipse.org/content/repositories/maven_central/com/squareup/okio/okio/1.14.0/okio-1.14.0.jar
Progress (1): 4.1/51 kB
Progress (1): 7.7/51 kB
Progress (1): 12/51 kB 
Progress (1): 16/51 kB
Progress (1): 20/51 kB
Progress (1): 24/51 kB
Progress (1): 28/51 kB
Progress (1): 32/51 kB
Progress (1): 33/51 kB
Progress (1): 37/51 kB
Progress (1): 41/51 kB
Progress (1): 45/51 kB
Progress (1): 49/51 kB
Progress (1): 51 kB   
                   
Downloaded from eclipse.maven.central.mirror: https://repo.eclipse.org/content/repositories/maven_central/io/takari/aether/aether-connector-okhttp/0.17.4/aether-connector-okhttp-0.17.4.jar (51 kB at 890 kB/s)
Progress (1): 4.1/86 kB
Progress (1): 7.7/86 kB
Progress (1): 12/86 kB 
Progress (1): 16/86 kB
Progress (1): 20/86 kB
Progress (1): 24/86 kB
Progress (1): 28/86 kB
Progress (1): 32/86 kB
Progress (1): 36/86 kB
Progress (1): 40/86 kB
Progress (1): 44/86 kB
Progress (2): 44/86 kB | 4.1/414 kB
Progress (2): 48/86 kB | 4.1/414 kB
Progress (2): 48/86 kB | 7.7/414 kB
Progress (2): 52/86 kB | 7.7/414 kB
Progress (2): 52/86 kB | 12/414 kB 
Progress (2): 56/86 kB | 12/414 kB
Progress (2): 56/86 kB | 16/414 kB
Progress (2): 60/86 kB | 16/414 kB
Progress (2): 60/86 kB | 20/414 kB
Progress (2): 64/86 kB | 20/414 kB
Progress (2): 64/86 kB | 24/414 kB
Progress (2): 68/86 kB | 24/414 kB
Progress (2): 68/86 kB | 28/414 kB
Progress (2): 72/86 kB | 28/414 kB
Progress (2): 72/86 kB | 32/414 kB
Progress (2): 76/86 kB | 32/414 kB
Progress (2): 76/86 kB | 36/414 kB
Progress (2): 80/86 kB | 36/414 kB
Progress (2): 80/86 kB | 40/414 kB
Progress (2): 84/86 kB | 40/414 kB
Progress (2): 84/86 kB | 44/414 kB
Progress (2): 86 kB | 44/414 kB   
Progress (2): 86 kB | 48/414 kB
Progress (2): 86 kB | 52/414 kB
Progress (2): 86 kB | 56/414 kB
Progress (2): 86 kB | 60/414 kB
Progress (2): 86 kB | 64/414 kB
Progress (2): 86 kB | 66/414 kB
Progress (2): 86 kB | 70/414 kB
Progress (2): 86 kB | 74/414 kB
Progress (2): 86 kB | 78/414 kB
Progress (2): 86 kB | 82/414 kB
Progress (2): 86 kB | 86/414 kB
Progress (2): 86 kB | 90/414 kB
Progress (2): 86 kB | 94/414 kB
Progress (2): 86 kB | 98/414 kB
Progress (2): 86 kB | 98/414 kB
Progress (2): 86 kB | 102/414 kB
Progress (2): 86 kB | 106/414 kB
Progress (2): 86 kB | 110/414 kB
Progress (2): 86 kB | 114/414 kB
Progress (2): 86 kB | 118/414 kB
Progress (2): 86 kB | 122/414 kB
Progress (2): 86 kB | 126/414 kB
                                
Downloaded from eclipse.maven.central.mirror: https://repo.eclipse.org/content/repositories/maven_central/com/squareup/okio/okio/1.14.0/okio-1.14.0.jar (86 kB at 780 kB/s)
Progress (1): 130/414 kB
Progress (1): 131/414 kB
Progress (1): 135/414 kB
Progress (1): 139/414 kB
Progress (1): 143/414 kB
Progress (1): 147/414 kB
Progress (1): 151/414 kB
Progress (1): 155/414 kB
Progress (1): 159/414 kB
Progress (1): 163/414 kB
Progress (1): 167/414 kB
Progress (1): 171/414 kB
Progress (1): 175/414 kB
Progress (1): 179/414 kB
Progress (1): 183/414 kB
Progress (1): 187/414 kB
Progress (1): 191/414 kB
Progress (1): 195/414 kB
Progress (1): 199/414 kB
Progress (1): 203/414 kB
Progress (1): 207/414 kB
Progress (1): 211/414 kB
Progress (1): 215/414 kB
Progress (1): 219/414 kB
Progress (1): 223/414 kB
Progress (1): 227/414 kB
Progress (1): 231/414 kB
Progress (1): 235/414 kB
Progress (1): 239/414 kB
Progress (1): 243/414 kB
Progress (1): 247/414 kB
Progress (1): 251/414 kB
Progress (1): 255/414 kB
Progress (1): 259/414 kB
Progress (1): 263/414 kB
Progress (1): 267/414 kB
Progress (1): 271/414 kB
Progress (1): 275/414 kB
Progress (1): 279/414 kB
Progress (1): 283/414 kB
Progress (1): 287/414 kB
Progress (1): 291/414 kB
Progress (1): 295/414 kB
Progress (1): 299/414 kB
Progress (1): 303/414 kB
Progress (1): 307/414 kB
Progress (1): 311/414 kB
Progress (1): 315/414 kB
Progress (1): 319/414 kB
Progress (1): 323/414 kB
Progress (1): 327/414 kB
Progress (1): 331/414 kB
Progress (1): 335/414 kB
Progress (1): 339/414 kB
Progress (1): 343/414 kB
Progress (1): 347/414 kB
Progress (1): 351/414 kB
Progress (1): 355/414 kB
Progress (1): 359/414 kB
Progress (1): 363/414 kB
Progress (1): 367/414 kB
Progress (1): 371/414 kB
Progress (1): 375/414 kB
Progress (1): 379/414 kB
Progress (1): 383/414 kB
Progress (1): 387/414 kB
Progress (1): 391/414 kB
Progress (1): 395/414 kB
Progress (1): 399/414 kB
Progress (1): 403/414 kB
Progress (1): 407/414 kB
Progress (1): 411/414 kB
Progress (1): 414 kB    
                    
Downloaded from eclipse.maven.central.mirror: https://repo.eclipse.org/content/repositories/maven_central/com/squareup/okhttp3/okhttp/3.11.0/okhttp-3.11.0.jar (414 kB at 2.9 MB/s)
[INFO] 
[INFO] --- maven-clean-plugin:2.4.1:clean (default-clean) @ org.eclipse.m2e.maven.runtime ---
[INFO] Deleting /jobs/genie.m2e/m2e-1.8.x/workspace/m2e-maven-runtime/org.eclipse.m2e.maven.runtime/target
[INFO] 
[INFO] --- maven-resources-plugin:2.5:resources (default-resources) @ org.eclipse.m2e.maven.runtime ---
[debug] execute contextualize
[INFO] Using 'UTF-8' encoding to copy filtered resources.
[INFO] Copying 3 resources
[INFO] 
[INFO] --- maven-compiler-plugin:3.1:compile (default-compile) @ org.eclipse.m2e.maven.runtime ---
[INFO] No sources to compile
[INFO] 
[INFO] --- maven-resources-plugin:2.5:testResources (default-testResources) @ org.eclipse.m2e.maven.runtime ---
[debug] execute contextualize
[INFO] Using 'UTF-8' encoding to copy filtered resources.
[INFO] skip non existing resourceDirectory /jobs/genie.m2e/m2e-1.8.x/workspace/m2e-maven-runtime/org.eclipse.m2e.maven.runtime/src/test/resources
[INFO] 
[INFO] --- maven-compiler-plugin:3.1:testCompile (default-testCompile) @ org.eclipse.m2e.maven.runtime ---
[INFO] No sources to compile
[INFO] 
[INFO] --- maven-surefire-plugin:2.8:test (default-test) @ org.eclipse.m2e.maven.runtime ---
[INFO] No tests to run.
[INFO] Surefire report directory: /jobs/genie.m2e/m2e-1.8.x/workspace/m2e-maven-runtime/org.eclipse.m2e.maven.runtime/target/surefire-reports

-------------------------------------------------------
 T E S T S
-------------------------------------------------------
There are no tests to run.

Results :

Tests run: 0, Failures: 0, Errors: 0, Skipped: 0

[INFO] 
[INFO] --- maven-bundle-plugin:2.5.0:bundle (default-bundle) @ org.eclipse.m2e.maven.runtime ---
[WARNING] Bundle org.eclipse.m2e:org.eclipse.m2e.maven.runtime:bundle:1.8.4-SNAPSHOT : Unused Private-Package instructions, no such package(s) on the class path: [!*]
[WARNING] Bundle org.eclipse.m2e:org.eclipse.m2e.maven.runtime:bundle:1.8.4-SNAPSHOT : Export org.apache.maven.cli,  has 1,  private references [org.apache.commons.cli], 
[WARNING] Bundle org.eclipse.m2e:org.eclipse.m2e.maven.runtime:bundle:1.8.4-SNAPSHOT : Export org.apache.maven.extension.internal,  has 1,  private references [org.eclipse.sisu], 
[WARNING] Bundle org.eclipse.m2e:org.eclipse.m2e.maven.runtime:bundle:1.8.4-SNAPSHOT : Export org.codehaus.plexus,  has 1,  private references [org.eclipse.sisu.plexus], 
[WARNING] Bundle org.eclipse.m2e:org.eclipse.m2e.maven.runtime:bundle:1.8.4-SNAPSHOT : Export org.codehaus.plexus.component.configurator.converters.special,  has 1,  private references [org.codehaus.classworlds], 
[WARNING] Bundle org.eclipse.m2e:org.eclipse.m2e.maven.runtime:bundle:1.8.4-SNAPSHOT : Export org.codehaus.plexus.component.factory,  has 1,  private references [org.codehaus.classworlds], 
[WARNING] Bundle org.eclipse.m2e:org.eclipse.m2e.maven.runtime:bundle:1.8.4-SNAPSHOT : Export org.codehaus.plexus.logging,  has 1,  private references [org.eclipse.sisu.bean], 
[WARNING] Bundle org.eclipse.m2e:org.eclipse.m2e.maven.runtime:bundle:1.8.4-SNAPSHOT : Export org.sonatype.plexus.components.cipher,  has 1,  private references [javax.enterprise.inject], 
[WARNING] Bundle org.eclipse.m2e:org.eclipse.m2e.maven.runtime:bundle:1.8.4-SNAPSHOT : Export io.takari.aether.connector,  has 1,  private references [org.eclipse.sisu], 
[WARNING] Bundle org.eclipse.m2e:org.eclipse.m2e.maven.runtime:bundle:1.8.4-SNAPSHOT : Invalid package name: 'META-INF.sisu'
[WARNING] Bundle org.eclipse.m2e:org.eclipse.m2e.maven.runtime:bundle:1.8.4-SNAPSHOT : Invalid package name: 'META-INF.plexus'
[INFO] 
[INFO] --- tycho-pack200a-plugin:1.0.0:normalize (pack200-normalize) @ org.eclipse.m2e.maven.runtime ---
[INFO] Pack200 normalizing jar /jobs/genie.m2e/m2e-1.8.x/workspace/m2e-maven-runtime/org.eclipse.m2e.maven.runtime/target/org.eclipse.m2e.maven.runtime-1.8.4-SNAPSHOT.jar
[INFO] 
[INFO] --- eclipse-jarsigner-plugin:1.0.0:sign (sign) @ org.eclipse.m2e.maven.runtime ---
[INFO] Signed org.eclipse.m2e:org.eclipse.m2e.maven.runtime:bundle:1.8.4-SNAPSHOT in 1 seconds.
[INFO] 
[INFO] --- tycho-pack200b-plugin:1.0.0:pack (pack200-pack) @ org.eclipse.m2e.maven.runtime ---
[INFO] Pack200 packing jar /jobs/genie.m2e/m2e-1.8.x/workspace/m2e-maven-runtime/org.eclipse.m2e.maven.runtime/target/org.eclipse.m2e.maven.runtime-1.8.4-SNAPSHOT.jar
[INFO] 
[INFO] --- tycho-p2-plugin:1.0.0:p2-metadata (p2-metadata) @ org.eclipse.m2e.maven.runtime ---
[INFO] 
[INFO] --- tycho-p2-plugin:1.0.0:update-local-index (p2-metadata) @ org.eclipse.m2e.maven.runtime ---
[INFO] 
[INFO] --- maven-install-plugin:2.3.1:install (default-install) @ org.eclipse.m2e.maven.runtime ---
[INFO] Installing /jobs/genie.m2e/m2e-1.8.x/workspace/m2e-maven-runtime/org.eclipse.m2e.maven.runtime/target/org.eclipse.m2e.maven.runtime-1.8.4-SNAPSHOT.jar to /home/hudson/genie.m2e/.jenkins/jobs/m2e-1.8.x/workspace/.repository/org/eclipse/m2e/org.eclipse.m2e.maven.runtime/1.8.4-SNAPSHOT/org.eclipse.m2e.maven.runtime-1.8.4-SNAPSHOT.jar
[INFO] Installing /jobs/genie.m2e/m2e-1.8.x/workspace/m2e-maven-runtime/org.eclipse.m2e.maven.runtime/pom.xml to /home/hudson/genie.m2e/.jenkins/jobs/m2e-1.8.x/workspace/.repository/org/eclipse/m2e/org.eclipse.m2e.maven.runtime/1.8.4-SNAPSHOT/org.eclipse.m2e.maven.runtime-1.8.4-SNAPSHOT.pom
[INFO] Installing /jobs/genie.m2e/m2e-1.8.x/workspace/m2e-maven-runtime/org.eclipse.m2e.maven.runtime/target/org.eclipse.m2e.maven.runtime-1.8.4-SNAPSHOT.jar.pack.gz to /home/hudson/genie.m2e/.jenkins/jobs/m2e-1.8.x/workspace/.repository/org/eclipse/m2e/org.eclipse.m2e.maven.runtime/1.8.4-SNAPSHOT/org.eclipse.m2e.maven.runtime-1.8.4-SNAPSHOT-pack200.jar.pack.gz
[INFO] 
[INFO] --- maven-bundle-plugin:2.5.0:install (default-install) @ org.eclipse.m2e.maven.runtime ---
[INFO] Installing org/eclipse/m2e/org.eclipse.m2e.maven.runtime/1.8.4-SNAPSHOT/org.eclipse.m2e.maven.runtime-1.8.4-SNAPSHOT.jar
[INFO] Writing OBR metadata
[INFO] 
[INFO] -----< org.eclipse.m2e:org.eclipse.m2e.maven.runtime.slf4j.simple >-----
[INFO] Building org.eclipse.m2e.maven.runtime.slf4j.simple 1.8.4-SNAPSHOT [5/5]
[INFO] -------------------------------[ bundle ]-------------------------------
[INFO] 
[INFO] --- maven-clean-plugin:2.4.1:clean (default-clean) @ org.eclipse.m2e.maven.runtime.slf4j.simple ---
[INFO] Deleting /jobs/genie.m2e/m2e-1.8.x/workspace/m2e-maven-runtime/org.eclipse.m2e.maven.runtime.slf4j.simple/target
[INFO] 
[INFO] --- maven-resources-plugin:2.5:resources (default-resources) @ org.eclipse.m2e.maven.runtime.slf4j.simple ---
[debug] execute contextualize
[INFO] Using 'UTF-8' encoding to copy filtered resources.
[INFO] Copying 4 resources
[INFO] 
[INFO] --- maven-compiler-plugin:3.1:compile (default-compile) @ org.eclipse.m2e.maven.runtime.slf4j.simple ---
[INFO] No sources to compile
[INFO] 
[INFO] --- maven-resources-plugin:2.5:testResources (default-testResources) @ org.eclipse.m2e.maven.runtime.slf4j.simple ---
[debug] execute contextualize
[INFO] Using 'UTF-8' encoding to copy filtered resources.
[INFO] skip non existing resourceDirectory /jobs/genie.m2e/m2e-1.8.x/workspace/m2e-maven-runtime/org.eclipse.m2e.maven.runtime.slf4j.simple/src/test/resources
[INFO] 
[INFO] --- maven-compiler-plugin:3.1:testCompile (default-testCompile) @ org.eclipse.m2e.maven.runtime.slf4j.simple ---
[INFO] No sources to compile
[INFO] 
[INFO] --- maven-surefire-plugin:2.8:test (default-test) @ org.eclipse.m2e.maven.runtime.slf4j.simple ---
[INFO] No tests to run.
[INFO] Surefire report directory: /jobs/genie.m2e/m2e-1.8.x/workspace/m2e-maven-runtime/org.eclipse.m2e.maven.runtime.slf4j.simple/target/surefire-reports

-------------------------------------------------------
 T E S T S
-------------------------------------------------------
There are no tests to run.

Results :

Tests run: 0, Failures: 0, Errors: 0, Skipped: 0

[INFO] 
[INFO] --- maven-bundle-plugin:2.5.0:bundle (default-bundle) @ org.eclipse.m2e.maven.runtime.slf4j.simple ---
[WARNING] Bundle org.eclipse.m2e:org.eclipse.m2e.maven.runtime.slf4j.simple:bundle:1.8.4-SNAPSHOT : Unused Private-Package instructions, no such package(s) on the class path: [!*]
[INFO] 
[INFO] --- tycho-pack200a-plugin:1.0.0:normalize (pack200-normalize) @ org.eclipse.m2e.maven.runtime.slf4j.simple ---
[INFO] Pack200 normalizing jar /jobs/genie.m2e/m2e-1.8.x/workspace/m2e-maven-runtime/org.eclipse.m2e.maven.runtime.slf4j.simple/target/org.eclipse.m2e.maven.runtime.slf4j.simple-1.8.4-SNAPSHOT.jar
[INFO] 
[INFO] --- eclipse-jarsigner-plugin:1.0.0:sign (sign) @ org.eclipse.m2e.maven.runtime.slf4j.simple ---
[INFO] Signed org.eclipse.m2e:org.eclipse.m2e.maven.runtime.slf4j.simple:bundle:1.8.4-SNAPSHOT in 0 seconds.
[INFO] 
[INFO] --- tycho-pack200b-plugin:1.0.0:pack (pack200-pack) @ org.eclipse.m2e.maven.runtime.slf4j.simple ---
[INFO] Pack200 packing jar /jobs/genie.m2e/m2e-1.8.x/workspace/m2e-maven-runtime/org.eclipse.m2e.maven.runtime.slf4j.simple/target/org.eclipse.m2e.maven.runtime.slf4j.simple-1.8.4-SNAPSHOT.jar
[INFO] 
[INFO] --- tycho-p2-plugin:1.0.0:p2-metadata (p2-metadata) @ org.eclipse.m2e.maven.runtime.slf4j.simple ---
[INFO] 
[INFO] --- tycho-p2-plugin:1.0.0:update-local-index (p2-metadata) @ org.eclipse.m2e.maven.runtime.slf4j.simple ---
[INFO] 
[INFO] --- maven-install-plugin:2.3.1:install (default-install) @ org.eclipse.m2e.maven.runtime.slf4j.simple ---
[INFO] Installing /jobs/genie.m2e/m2e-1.8.x/workspace/m2e-maven-runtime/org.eclipse.m2e.maven.runtime.slf4j.simple/target/org.eclipse.m2e.maven.runtime.slf4j.simple-1.8.4-SNAPSHOT.jar to /home/hudson/genie.m2e/.jenkins/jobs/m2e-1.8.x/workspace/.repository/org/eclipse/m2e/org.eclipse.m2e.maven.runtime.slf4j.simple/1.8.4-SNAPSHOT/org.eclipse.m2e.maven.runtime.slf4j.simple-1.8.4-SNAPSHOT.jar
[INFO] Installing /jobs/genie.m2e/m2e-1.8.x/workspace/m2e-maven-runtime/org.eclipse.m2e.maven.runtime.slf4j.simple/pom.xml to /home/hudson/genie.m2e/.jenkins/jobs/m2e-1.8.x/workspace/.repository/org/eclipse/m2e/org.eclipse.m2e.maven.runtime.slf4j.simple/1.8.4-SNAPSHOT/org.eclipse.m2e.maven.runtime.slf4j.simple-1.8.4-SNAPSHOT.pom
[INFO] Installing /jobs/genie.m2e/m2e-1.8.x/workspace/m2e-maven-runtime/org.eclipse.m2e.maven.runtime.slf4j.simple/target/org.eclipse.m2e.maven.runtime.slf4j.simple-1.8.4-SNAPSHOT.jar.pack.gz to /home/hudson/genie.m2e/.jenkins/jobs/m2e-1.8.x/workspace/.repository/org/eclipse/m2e/org.eclipse.m2e.maven.runtime.slf4j.simple/1.8.4-SNAPSHOT/org.eclipse.m2e.maven.runtime.slf4j.simple-1.8.4-SNAPSHOT-pack200.jar.pack.gz
[INFO] 
[INFO] --- maven-bundle-plugin:2.5.0:install (default-install) @ org.eclipse.m2e.maven.runtime.slf4j.simple ---
[INFO] Installing org/eclipse/m2e/org.eclipse.m2e.maven.runtime.slf4j.simple/1.8.4-SNAPSHOT/org.eclipse.m2e.maven.runtime.slf4j.simple-1.8.4-SNAPSHOT.jar
[INFO] Writing OBR metadata
[INFO] ------------------------------------------------------------------------
[INFO] Reactor Summary:
[INFO] 
[INFO] m2e-maven-runtime 1.8.4-SNAPSHOT ................... SUCCESS [  0.526 s]
[INFO] Maven Archetype Common Bundle ...................... SUCCESS [  8.498 s]
[INFO] Nexus Indexer Bundle ............................... SUCCESS [  3.355 s]
[INFO] Embedded Maven Runtime Bundle ...................... SUCCESS [  6.405 s]
[INFO] org.eclipse.m2e.maven.runtime.slf4j.simple 1.8.4-SNAPSHOT SUCCESS [  1.087 s]
[INFO] ------------------------------------------------------------------------
[INFO] BUILD SUCCESS
[INFO] ------------------------------------------------------------------------
[INFO] Total time: 23.408 s
[INFO] Finished at: 2018-07-27T16:03:37-04:00
[INFO] ------------------------------------------------------------------------
[workspace] $ /shared/common/apache-maven-latest/bin/mvn -f pom.xml -DM2E_VERSION=1.8.4 -DskipTests=true -Dtycho.disableP2Mirrors=true -Declipse.stream=oxygen -Dmaven.repo.local=/home/hudson/genie.m2e/.jenkins/jobs/m2e-1.8.x/workspace/.repository clean install -Peclipse-sign
Picked up JAVA_TOOL_OPTIONS: -Xmx2G -Djava.io.tmpdir=/tmp/genie.m2e
[INFO] Scanning for projects...
[WARNING] No explicit target runtime environment configuration. Build is platform dependent.
[WARNING] No explicit target runtime environment configuration. Build is platform dependent.
[WARNING] No explicit target runtime environment configuration. Build is platform dependent.
[WARNING] No explicit target runtime environment configuration. Build is platform dependent.
[WARNING] No explicit target runtime environment configuration. Build is platform dependent.
[WARNING] No explicit target runtime environment configuration. Build is platform dependent.
[WARNING] No explicit target runtime environment configuration. Build is platform dependent.
[WARNING] No explicit target runtime environment configuration. Build is platform dependent.
[WARNING] No explicit target runtime environment configuration. Build is platform dependent.
[WARNING] No explicit target runtime environment configuration. Build is platform dependent.
[WARNING] No explicit target runtime environment configuration. Build is platform dependent.
[WARNING] No explicit target runtime environment configuration. Build is platform dependent.
[WARNING] No explicit target runtime environment configuration. Build is platform dependent.
[WARNING] No explicit target runtime environment configuration. Build is platform dependent.
[WARNING] No explicit target runtime environment configuration. Build is platform dependent.
[WARNING] No explicit target runtime environment configuration. Build is platform dependent.
[WARNING] No explicit target runtime environment configuration. Build is platform dependent.
[WARNING] No explicit target runtime environment configuration. Build is platform dependent.
[WARNING] No explicit target runtime environment configuration. Build is platform dependent.
[WARNING] No explicit target runtime environment configuration. Build is platform dependent.
[WARNING] No explicit target runtime environment configuration. Build is platform dependent.
[WARNING] No explicit target runtime environment configuration. Build is platform dependent.
[WARNING] No explicit target runtime environment configuration. Build is platform dependent.
[INFO] Computing target platform for MavenProject: org.eclipse.m2e:org.eclipse.m2e.model.edit:1.8.4-SNAPSHOT @ /jobs/genie.m2e/m2e-1.8.x/workspace/org.eclipse.m2e.model.edit/pom.xml
[INFO] Adding repository http://download.eclipse.org/eclipse/updates/4.7-M-builds
[WARNING] Failed to access p2 repository http://download.eclipse.org/eclipse/updates/4.7-M-builds, use local cache. Neither http://download.eclipse.org/eclipse/updates/4.7-M-builds/compositeContent.jar nor http://download.eclipse.org/eclipse/updates/4.7-M-builds/compositeContent.xml found.
[ERROR] Internal error: java.lang.RuntimeException: Failed to load p2 repository with ID 'jdt-beta' from location http://download.eclipse.org/eclipse/updates/4.7-M-builds/: Unable to read repository at http://download.eclipse.org/eclipse/updates/4.7-M-builds. Artifact not found: http://download.eclipse.org/eclipse/updates/4.7-M-builds/M20180214-1700/content.xml.xz. -> [Help 1]
org.apache.maven.InternalErrorException: Internal error: java.lang.RuntimeException: Failed to load p2 repository with ID 'jdt-beta' from location http://download.eclipse.org/eclipse/updates/4.7-M-builds/
    at org.apache.maven.DefaultMaven.execute (DefaultMaven.java:120)
    at org.apache.maven.cli.MavenCli.execute (MavenCli.java:954)
    at org.apache.maven.cli.MavenCli.doMain (MavenCli.java:288)
    at org.apache.maven.cli.MavenCli.main (MavenCli.java:192)
    at sun.reflect.NativeMethodAccessorImpl.invoke0 (Native Method)
    at sun.reflect.NativeMethodAccessorImpl.invoke (NativeMethodAccessorImpl.java:62)
    at sun.reflect.DelegatingMethodAccessorImpl.invoke (DelegatingMethodAccessorImpl.java:43)
    at java.lang.reflect.Method.invoke (Method.java:498)
    at org.codehaus.plexus.classworlds.launcher.Launcher.launchEnhanced (Launcher.java:289)
    at org.codehaus.plexus.classworlds.launcher.Launcher.launch (Launcher.java:229)
    at org.codehaus.plexus.classworlds.launcher.Launcher.mainWithExitCode (Launcher.java:415)
    at org.codehaus.plexus.classworlds.launcher.Launcher.main (Launcher.java:356)
Caused by: java.lang.RuntimeException: Failed to load p2 repository with ID 'jdt-beta' from location http://download.eclipse.org/eclipse/updates/4.7-M-builds/
    at org.eclipse.tycho.p2.target.TargetPlatformFactoryImpl.loadMetadataRepository (TargetPlatformFactoryImpl.java:302)
    at org.eclipse.tycho.p2.target.TargetPlatformFactoryImpl.gatherExternalInstallableUnits (TargetPlatformFactoryImpl.java:270)
    at org.eclipse.tycho.p2.target.TargetPlatformFactoryImpl.createTargetPlatform (TargetPlatformFactoryImpl.java:176)
    at org.eclipse.tycho.p2.target.TargetPlatformFactoryImpl.createTargetPlatform (TargetPlatformFactoryImpl.java:128)
    at org.eclipse.tycho.p2.target.TargetPlatformFactoryImpl.createTargetPlatform (TargetPlatformFactoryImpl.java:1)
    at org.eclipse.tycho.p2.manager.ReactorRepositoryManagerImpl.computePreliminaryTargetPlatform (ReactorRepositoryManagerImpl.java:84)
    at org.eclipse.tycho.p2.resolver.P2DependencyResolver.computePreliminaryTargetPlatform (P2DependencyResolver.java:223)
    at org.eclipse.tycho.core.resolver.DefaultTychoResolver.resolveProject (DefaultTychoResolver.java:109)
    at org.eclipse.tycho.core.maven.TychoMavenLifecycleParticipant.afterProjectsRead (TychoMavenLifecycleParticipant.java:95)
    at org.apache.maven.DefaultMaven.doExecute (DefaultMaven.java:264)
    at org.apache.maven.DefaultMaven.doExecute (DefaultMaven.java:192)
    at org.apache.maven.DefaultMaven.execute (DefaultMaven.java:105)
    at org.apache.maven.cli.MavenCli.execute (MavenCli.java:954)
    at org.apache.maven.cli.MavenCli.doMain (MavenCli.java:288)
    at org.apache.maven.cli.MavenCli.main (MavenCli.java:192)
    at sun.reflect.NativeMethodAccessorImpl.invoke0 (Native Method)
    at sun.reflect.NativeMethodAccessorImpl.invoke (NativeMethodAccessorImpl.java:62)
    at sun.reflect.DelegatingMethodAccessorImpl.invoke (DelegatingMethodAccessorImpl.java:43)
    at java.lang.reflect.Method.invoke (Method.java:498)
    at org.codehaus.plexus.classworlds.launcher.Launcher.launchEnhanced (Launcher.java:289)
    at org.codehaus.plexus.classworlds.launcher.Launcher.launch (Launcher.java:229)
    at org.codehaus.plexus.classworlds.launcher.Launcher.mainWithExitCode (Launcher.java:415)
    at org.codehaus.plexus.classworlds.launcher.Launcher.main (Launcher.java:356)
Caused by: org.eclipse.equinox.p2.core.ProvisionException: Unable to read repository at http://download.eclipse.org/eclipse/updates/4.7-M-builds.
    at org.eclipse.equinox.internal.p2.metadata.repository.CompositeMetadataRepository.addChild (CompositeMetadataRepository.java:185)
    at org.eclipse.equinox.internal.p2.metadata.repository.CompositeMetadataRepository.<init> (CompositeMetadataRepository.java:106)
    at org.eclipse.equinox.internal.p2.metadata.repository.CompositeMetadataRepositoryFactory.load (CompositeMetadataRepositoryFactory.java:122)
    at org.eclipse.equinox.internal.p2.metadata.repository.MetadataRepositoryManager.factoryLoad (MetadataRepositoryManager.java:57)
    at org.eclipse.equinox.internal.p2.repository.helpers.AbstractRepositoryManager.loadRepository (AbstractRepositoryManager.java:768)
    at org.eclipse.equinox.internal.p2.repository.helpers.AbstractRepositoryManager.loadRepository (AbstractRepositoryManager.java:668)
    at org.eclipse.equinox.internal.p2.metadata.repository.MetadataRepositoryManager.loadRepository (MetadataRepositoryManager.java:96)
    at org.eclipse.tycho.p2.remote.RemoteMetadataRepositoryManager.loadRepository (RemoteMetadataRepositoryManager.java:61)
    at org.eclipse.tycho.p2.remote.RemoteMetadataRepositoryManager.loadRepository (RemoteMetadataRepositoryManager.java:53)
    at org.eclipse.tycho.p2.target.TargetPlatformFactoryImpl.loadMetadataRepository (TargetPlatformFactoryImpl.java:298)
    at org.eclipse.tycho.p2.target.TargetPlatformFactoryImpl.gatherExternalInstallableUnits (TargetPlatformFactoryImpl.java:270)
    at org.eclipse.tycho.p2.target.TargetPlatformFactoryImpl.createTargetPlatform (TargetPlatformFactoryImpl.java:176)
    at org.eclipse.tycho.p2.target.TargetPlatformFactoryImpl.createTargetPlatform (TargetPlatformFactoryImpl.java:128)
    at org.eclipse.tycho.p2.target.TargetPlatformFactoryImpl.createTargetPlatform (TargetPlatformFactoryImpl.java:1)
    at org.eclipse.tycho.p2.manager.ReactorRepositoryManagerImpl.computePreliminaryTargetPlatform (ReactorRepositoryManagerImpl.java:84)
    at org.eclipse.tycho.p2.resolver.P2DependencyResolver.computePreliminaryTargetPlatform (P2DependencyResolver.java:223)
    at org.eclipse.tycho.core.resolver.DefaultTychoResolver.resolveProject (DefaultTychoResolver.java:109)
    at org.eclipse.tycho.core.maven.TychoMavenLifecycleParticipant.afterProjectsRead (TychoMavenLifecycleParticipant.java:95)
    at org.apache.maven.DefaultMaven.doExecute (DefaultMaven.java:264)
    at org.apache.maven.DefaultMaven.doExecute (DefaultMaven.java:192)
    at org.apache.maven.DefaultMaven.execute (DefaultMaven.java:105)
    at org.apache.maven.cli.MavenCli.execute (MavenCli.java:954)
    at org.apache.maven.cli.MavenCli.doMain (MavenCli.java:288)
    at org.apache.maven.cli.MavenCli.main (MavenCli.java:192)
    at sun.reflect.NativeMethodAccessorImpl.invoke0 (Native Method)
    at sun.reflect.NativeMethodAccessorImpl.invoke (NativeMethodAccessorImpl.java:62)
    at sun.reflect.DelegatingMethodAccessorImpl.invoke (DelegatingMethodAccessorImpl.java:43)
    at java.lang.reflect.Method.invoke (Method.java:498)
    at org.codehaus.plexus.classworlds.launcher.Launcher.launchEnhanced (Launcher.java:289)
    at org.codehaus.plexus.classworlds.launcher.Launcher.launch (Launcher.java:229)
    at org.codehaus.plexus.classworlds.launcher.Launcher.mainWithExitCode (Launcher.java:415)
    at org.codehaus.plexus.classworlds.launcher.Launcher.main (Launcher.java:356)
Caused by: org.eclipse.equinox.p2.core.ProvisionException: Artifact not found: http://download.eclipse.org/eclipse/updates/4.7-M-builds/M20180214-1700/content.xml.xz.
    at org.eclipse.equinox.internal.p2.repository.CacheManager.updateCache (CacheManager.java:428)
    at org.eclipse.equinox.internal.p2.repository.CacheManager.createCacheFromFile (CacheManager.java:132)
    at org.eclipse.tycho.p2.remote.RemoteRepositoryCacheManager.createCacheFromFile (RemoteRepositoryCacheManager.java:85)
    at org.eclipse.equinox.internal.p2.metadata.repository.XZedSimpleMetadataRepositoryFactory.getLocalFile (XZedSimpleMetadataRepositoryFactory.java:56)
    at org.eclipse.equinox.internal.p2.metadata.repository.XZedSimpleMetadataRepositoryFactory.load (XZedSimpleMetadataRepositoryFactory.java:78)
    at org.eclipse.equinox.internal.p2.metadata.repository.MetadataRepositoryManager.factoryLoad (MetadataRepositoryManager.java:57)
    at org.eclipse.equinox.internal.p2.repository.helpers.AbstractRepositoryManager.loadRepository (AbstractRepositoryManager.java:768)
    at org.eclipse.equinox.internal.p2.repository.helpers.AbstractRepositoryManager.loadRepository (AbstractRepositoryManager.java:668)
    at org.eclipse.equinox.internal.p2.metadata.repository.MetadataRepositoryManager.loadRepository (MetadataRepositoryManager.java:96)
    at org.eclipse.tycho.p2.remote.RemoteMetadataRepositoryManager.loadRepository (RemoteMetadataRepositoryManager.java:61)
    at org.eclipse.tycho.p2.remote.RemoteMetadataRepositoryManager.loadRepository (RemoteMetadataRepositoryManager.java:53)
    at org.eclipse.equinox.internal.p2.metadata.repository.CompositeMetadataRepository.addChild (CompositeMetadataRepository.java:166)
    at org.eclipse.equinox.internal.p2.metadata.repository.CompositeMetadataRepository.<init> (CompositeMetadataRepository.java:106)
    at org.eclipse.equinox.internal.p2.metadata.repository.CompositeMetadataRepositoryFactory.load (CompositeMetadataRepositoryFactory.java:122)
    at org.eclipse.equinox.internal.p2.metadata.repository.MetadataRepositoryManager.factoryLoad (MetadataRepositoryManager.java:57)
    at org.eclipse.equinox.internal.p2.repository.helpers.AbstractRepositoryManager.loadRepository (AbstractRepositoryManager.java:768)
    at org.eclipse.equinox.internal.p2.repository.helpers.AbstractRepositoryManager.loadRepository (AbstractRepositoryManager.java:668)
    at org.eclipse.equinox.internal.p2.metadata.repository.MetadataRepositoryManager.loadRepository (MetadataRepositoryManager.java:96)
    at org.eclipse.tycho.p2.remote.RemoteMetadataRepositoryManager.loadRepository (RemoteMetadataRepositoryManager.java:61)
    at org.eclipse.tycho.p2.remote.RemoteMetadataRepositoryManager.loadRepository (RemoteMetadataRepositoryManager.java:53)
    at org.eclipse.tycho.p2.target.TargetPlatformFactoryImpl.loadMetadataRepository (TargetPlatformFactoryImpl.java:298)
    at org.eclipse.tycho.p2.target.TargetPlatformFactoryImpl.gatherExternalInstallableUnits (TargetPlatformFactoryImpl.java:270)
    at org.eclipse.tycho.p2.target.TargetPlatformFactoryImpl.createTargetPlatform (TargetPlatformFactoryImpl.java:176)
    at org.eclipse.tycho.p2.target.TargetPlatformFactoryImpl.createTargetPlatform (TargetPlatformFactoryImpl.java:128)
    at org.eclipse.tycho.p2.target.TargetPlatformFactoryImpl.createTargetPlatform (TargetPlatformFactoryImpl.java:1)
    at org.eclipse.tycho.p2.manager.ReactorRepositoryManagerImpl.computePreliminaryTargetPlatform (ReactorRepositoryManagerImpl.java:84)
    at org.eclipse.tycho.p2.resolver.P2DependencyResolver.computePreliminaryTargetPlatform (P2DependencyResolver.java:223)
    at org.eclipse.tycho.core.resolver.DefaultTychoResolver.resolveProject (DefaultTychoResolver.java:109)
    at org.eclipse.tycho.core.maven.TychoMavenLifecycleParticipant.afterProjectsRead (TychoMavenLifecycleParticipant.java:95)
    at org.apache.maven.DefaultMaven.doExecute (DefaultMaven.java:264)
    at org.apache.maven.DefaultMaven.doExecute (DefaultMaven.java:192)
    at org.apache.maven.DefaultMaven.execute (DefaultMaven.java:105)
    at org.apache.maven.cli.MavenCli.execute (MavenCli.java:954)
    at org.apache.maven.cli.MavenCli.doMain (MavenCli.java:288)
    at org.apache.maven.cli.MavenCli.main (MavenCli.java:192)
    at sun.reflect.NativeMethodAccessorImpl.invoke0 (Native Method)
    at sun.reflect.NativeMethodAccessorImpl.invoke (NativeMethodAccessorImpl.java:62)
    at sun.reflect.DelegatingMethodAccessorImpl.invoke (DelegatingMethodAccessorImpl.java:43)
    at java.lang.reflect.Method.invoke (Method.java:498)
    at org.codehaus.plexus.classworlds.launcher.Launcher.launchEnhanced (Launcher.java:289)
    at org.codehaus.plexus.classworlds.launcher.Launcher.launch (Launcher.java:229)
    at org.codehaus.plexus.classworlds.launcher.Launcher.mainWithExitCode (Launcher.java:415)
    at org.codehaus.plexus.classworlds.launcher.Launcher.main (Launcher.java:356)
Caused by: java.io.FileNotFoundException: http://download.eclipse.org/eclipse/updates/4.7-M-builds/M20180214-1700/content.xml.xz
    at org.eclipse.equinox.internal.p2.transport.ecf.RepositoryStatusHelper.checkFileNotFound (RepositoryStatusHelper.java:297)
    at org.eclipse.equinox.internal.p2.transport.ecf.FileReader.checkException (FileReader.java:480)
    at org.eclipse.equinox.internal.p2.transport.ecf.FileReader.sendRetrieveRequest (FileReader.java:437)
    at org.eclipse.equinox.internal.p2.transport.ecf.FileReader.readInto (FileReader.java:360)
    at org.eclipse.equinox.internal.p2.transport.ecf.RepositoryTransport.download (RepositoryTransport.java:101)
    at org.eclipse.equinox.internal.p2.transport.ecf.RepositoryTransport.download (RepositoryTransport.java:156)
    at org.eclipse.equinox.internal.p2.repository.CacheManager.updateCache (CacheManager.java:402)
    at org.eclipse.equinox.internal.p2.repository.CacheManager.createCacheFromFile (CacheManager.java:132)
    at org.eclipse.tycho.p2.remote.RemoteRepositoryCacheManager.createCacheFromFile (RemoteRepositoryCacheManager.java:85)
    at org.eclipse.equinox.internal.p2.metadata.repository.XZedSimpleMetadataRepositoryFactory.getLocalFile (XZedSimpleMetadataRepositoryFactory.java:56)
    at org.eclipse.equinox.internal.p2.metadata.repository.XZedSimpleMetadataRepositoryFactory.load (XZedSimpleMetadataRepositoryFactory.java:78)
    at org.eclipse.equinox.internal.p2.metadata.repository.MetadataRepositoryManager.factoryLoad (MetadataRepositoryManager.java:57)
    at org.eclipse.equinox.internal.p2.repository.helpers.AbstractRepositoryManager.loadRepository (AbstractRepositoryManager.java:768)
    at org.eclipse.equinox.internal.p2.repository.helpers.AbstractRepositoryManager.loadRepository (AbstractRepositoryManager.java:668)
    at org.eclipse.equinox.internal.p2.metadata.repository.MetadataRepositoryManager.loadRepository (MetadataRepositoryManager.java:96)
    at org.eclipse.tycho.p2.remote.RemoteMetadataRepositoryManager.loadRepository (RemoteMetadataRepositoryManager.java:61)
    at org.eclipse.tycho.p2.remote.RemoteMetadataRepositoryManager.loadRepository (RemoteMetadataRepositoryManager.java:53)
    at org.eclipse.equinox.internal.p2.metadata.repository.CompositeMetadataRepository.addChild (CompositeMetadataRepository.java:166)
    at org.eclipse.equinox.internal.p2.metadata.repository.CompositeMetadataRepository.<init> (CompositeMetadataRepository.java:106)
    at org.eclipse.equinox.internal.p2.metadata.repository.CompositeMetadataRepositoryFactory.load (CompositeMetadataRepositoryFactory.java:122)
    at org.eclipse.equinox.internal.p2.metadata.repository.MetadataRepositoryManager.factoryLoad (MetadataRepositoryManager.java:57)
    at org.eclipse.equinox.internal.p2.repository.helpers.AbstractRepositoryManager.loadRepository (AbstractRepositoryManager.java:768)
    at org.eclipse.equinox.internal.p2.repository.helpers.AbstractRepositoryManager.loadRepository (AbstractRepositoryManager.java:668)
    at org.eclipse.equinox.internal.p2.metadata.repository.MetadataRepositoryManager.loadRepository (MetadataRepositoryManager.java:96)
    at org.eclipse.tycho.p2.remote.RemoteMetadataRepositoryManager.loadRepository (RemoteMetadataRepositoryManager.java:61)
    at org.eclipse.tycho.p2.remote.RemoteMetadataRepositoryManager.loadRepository (RemoteMetadataRepositoryManager.java:53)
    at org.eclipse.tycho.p2.target.TargetPlatformFactoryImpl.loadMetadataRepository (TargetPlatformFactoryImpl.java:298)
    at org.eclipse.tycho.p2.target.TargetPlatformFactoryImpl.gatherExternalInstallableUnits (TargetPlatformFactoryImpl.java:270)
    at org.eclipse.tycho.p2.target.TargetPlatformFactoryImpl.createTargetPlatform (TargetPlatformFactoryImpl.java:176)
    at org.eclipse.tycho.p2.target.TargetPlatformFactoryImpl.createTargetPlatform (TargetPlatformFactoryImpl.java:128)
    at org.eclipse.tycho.p2.target.TargetPlatformFactoryImpl.createTargetPlatform (TargetPlatformFactoryImpl.java:1)
    at org.eclipse.tycho.p2.manager.ReactorRepositoryManagerImpl.computePreliminaryTargetPlatform (ReactorRepositoryManagerImpl.java:84)
    at org.eclipse.tycho.p2.resolver.P2DependencyResolver.computePreliminaryTargetPlatform (P2DependencyResolver.java:223)
    at org.eclipse.tycho.core.resolver.DefaultTychoResolver.resolveProject (DefaultTychoResolver.java:109)
    at org.eclipse.tycho.core.maven.TychoMavenLifecycleParticipant.afterProjectsRead (TychoMavenLifecycleParticipant.java:95)
    at org.apache.maven.DefaultMaven.doExecute (DefaultMaven.java:264)
    at org.apache.maven.DefaultMaven.doExecute (DefaultMaven.java:192)
    at org.apache.maven.DefaultMaven.execute (DefaultMaven.java:105)
    at org.apache.maven.cli.MavenCli.execute (MavenCli.java:954)
    at org.apache.maven.cli.MavenCli.doMain (MavenCli.java:288)
    at org.apache.maven.cli.MavenCli.main (MavenCli.java:192)
    at sun.reflect.NativeMethodAccessorImpl.invoke0 (Native Method)
    at sun.reflect.NativeMethodAccessorImpl.invoke (NativeMethodAccessorImpl.java:62)
    at sun.reflect.DelegatingMethodAccessorImpl.invoke (DelegatingMethodAccessorImpl.java:43)
    at java.lang.reflect.Method.invoke (Method.java:498)
    at org.codehaus.plexus.classworlds.launcher.Launcher.launchEnhanced (Launcher.java:289)
    at org.codehaus.plexus.classworlds.launcher.Launcher.launch (Launcher.java:229)
    at org.codehaus.plexus.classworlds.launcher.Launcher.mainWithExitCode (Launcher.java:415)
    at org.codehaus.plexus.classworlds.launcher.Launcher.main (Launcher.java:356)
[ERROR] 
[ERROR] To see the full stack trace of the errors, re-run Maven with the -e switch.
[ERROR] Re-run Maven using the -X switch to enable full debug logging.
[ERROR] 
[ERROR] For more information about the errors and possible solutions, please read the following articles:
[ERROR] [Help 1] http://cwiki.apache.org/confluence/display/MAVEN/InternalErrorException
Build step 'Invoke top-level Maven targets' marked build as failure
Sending e-mails to: fbricon@gmail.com
Archiving artifacts
Started calculate disk usage of build
Finished Calculation of disk usage of build in 0 seconds
Started calculate disk usage of workspace
Finished Calculation of disk usage of workspace in 0 seconds
Finished: FAILURE