FailedConsole Output

Started by an SCM change
Running as SYSTEM
Agent default-agent-ft1qs is provisioned from template Kubernetes Pod Template
---
apiVersion: "v1"
kind: "Pod"
metadata:
  annotations: {}
  labels:
    jenkins: "slave"
  name: "default-agent-ft1qs"
spec:
  containers:
  - env:
    - name: "MAVEN_OPTS"
      value: "-Dorg.slf4j.simpleLogger.log.org.apache.maven.cli.transfer.Slf4jMavenTransferListener=warn"
    - name: "JENKINS_SECRET"
      value: "********"
    - name: "JENKINS_TUNNEL"
      value: "jenkins-discovery.lyo.svc.cluster.local:50000"
    - name: "JENKINS_AGENT_NAME"
      value: "default-agent-ft1qs"
    - name: "MAVEN_CONFIG"
      value: "-B -e"
    - name: "JENKINS_NAME"
      value: "default-agent-ft1qs"
    - name: "JENKINS_AGENT_WORKDIR"
      value: "/home/jenkins/agent"
    - name: "JENKINS_URL"
      value: "http://jenkins-ui.lyo.svc.cluster.local/lyo/"
    - name: "HOME"
      value: "/home/jenkins"
    image: "eclipsecbijenkins/jenkins-agent:3.29@sha256:d7df679b5f7337f1bf77922400a148b80e3c483ccba72933a18f0c87be98f8b1"
    imagePullPolicy: "IfNotPresent"
    name: "jnlp"
    resources:
      limits:
        memory: "4096Mi"
        cpu: "2000m"
      requests:
        memory: "4096Mi"
        cpu: "1000m"
    securityContext:
      privileged: false
    tty: true
    volumeMounts:
    - mountPath: "/home/jenkins/.m2/toolchains.xml"
      name: "toolchains-xml"
      readOnly: true
      subPath: "toolchains.xml"
    - mountPath: "/opt/tools"
      name: "volume-0"
      readOnly: false
    - mountPath: "/home/jenkins"
      name: "volume-2"
      readOnly: false
    - mountPath: "/home/jenkins/.m2/repository"
      name: "volume-3"
      readOnly: false
    - mountPath: "/home/jenkins/.m2/settings-security.xml"
      name: "settings-security-xml"
      readOnly: true
      subPath: "settings-security.xml"
    - mountPath: "/home/jenkins/.m2/settings.xml"
      name: "settings-xml"
      readOnly: true
      subPath: "settings.xml"
    - mountPath: "/home/jenkins/.ssh"
      name: "volume-1"
      readOnly: false
    - mountPath: "/home/jenkins/agent"
      name: "workspace-volume"
      readOnly: false
    workingDir: "/home/jenkins/agent"
  nodeSelector: {}
  restartPolicy: "Never"
  volumes:
  - name: "settings-security-xml"
    secret:
      items:
      - key: "settings-security.xml"
        path: "settings-security.xml"
      secretName: "m2-secret-dir"
  - name: "volume-0"
    persistentVolumeClaim:
      claimName: "tools-claim-jiro-lyo"
      readOnly: true
  - configMap:
      items:
      - key: "toolchains.xml"
        path: "toolchains.xml"
      name: "m2-dir"
    name: "toolchains-xml"
  - emptyDir:
      medium: ""
    name: "volume-2"
  - configMap:
      name: "known-hosts"
    name: "volume-1"
  - name: "settings-xml"
    secret:
      items:
      - key: "settings.xml"
        path: "settings.xml"
      secretName: "m2-secret-dir"
  - emptyDir:
      medium: ""
    name: "workspace-volume"
  - emptyDir:
      medium: ""
    name: "volume-3"

Building remotely on default-agent-ft1qs in workspace /home/jenkins/agent/workspace/lyo-store-master
[ssh-agent] Looking for ssh-agent implementation...
[ssh-agent]   Exec ssh-agent (binary ssh-agent on a remote machine)
$ ssh-agent
SSH_AUTH_SOCK=/tmp/ssh-JcbUD4zYiOPS/agent.60
SSH_AGENT_PID=62
[ssh-agent] Started.
Running ssh-add (command line suppressed)
Identity added: /home/jenkins/agent/workspace/lyo-store-master@tmp/private_key_1711208692090963847.key (/home/jenkins/agent/workspace/lyo-store-master@tmp/private_key_1711208692090963847.key)
[ssh-agent] Using credentials genie.lyo (ssh://genie.lyo@projects-storage.eclipse.org)
No credentials specified
Cloning the remote Git repository
Cloning repository https://github.com/eclipse/lyo.store.git
 > git init /home/jenkins/agent/workspace/lyo-store-master # timeout=10
Fetching upstream changes from https://github.com/eclipse/lyo.store.git
 > git --version # timeout=10
 > git fetch --tags --force --progress -- https://github.com/eclipse/lyo.store.git +refs/heads/*:refs/remotes/origin/*
 > git config remote.origin.url https://github.com/eclipse/lyo.store.git # timeout=10
 > git config --add remote.origin.fetch +refs/heads/*:refs/remotes/origin/* # timeout=10
 > git config remote.origin.url https://github.com/eclipse/lyo.store.git # timeout=10
Fetching upstream changes from https://github.com/eclipse/lyo.store.git
 > git fetch --tags --force --progress -- https://github.com/eclipse/lyo.store.git +refs/heads/*:refs/remotes/origin/*
 > git rev-parse refs/remotes/origin/master^{commit} # timeout=10
 > git rev-parse refs/remotes/origin/refs/heads/master^{commit} # timeout=10
Checking out Revision a4521c71416505e3721970ed00bf0422a7017757 (refs/remotes/origin/master)
 > git config core.sparsecheckout # timeout=10
 > git checkout -f a4521c71416505e3721970ed00bf0422a7017757
Commit message: "remove unnecessary IOException from StoreFactory. (#57)"
 > git rev-list --no-walk 307df58a6e9388a0ba83f1ef20f9729fa09dbbb3 # timeout=10
[lyo-store-master] $ /opt/tools/apache-maven/latest/bin/mvn -f src/pom.xml clean package javadoc:aggregate -B
Picked up JAVA_TOOL_OPTIONS: -XX:+IgnoreUnrecognizedVMOptions -XX:+UseContainerSupport -XX:+UnlockExperimentalVMOptions -XX:+UseCGroupMemoryLimitForHeap
Picked up _JAVA_OPTIONS: -XX:MaxRAMPercentage=64.0
[INFO] Scanning for projects...
[INFO] ------------------------------------------------------------------------
[INFO] Reactor Build Order:
[INFO] 
[INFO] Lyo Store Parent                                                   [pom]
[INFO] store-core                                                         [jar]
[INFO] 
[INFO] -----------------< org.eclipse.lyo.store:store-parent >-----------------
[INFO] Building Lyo Store Parent 4.0.0-SNAPSHOT                           [1/2]
[INFO] --------------------------------[ pom ]---------------------------------
[INFO] 
[INFO] --- maven-clean-plugin:2.5:clean (default-clean) @ store-parent ---
[INFO] 
[INFO] ------------------< org.eclipse.lyo.store:store-core >------------------
[INFO] Building store-core 4.0.0-SNAPSHOT                                 [2/2]
[INFO] --------------------------------[ jar ]---------------------------------
[INFO] 
[INFO] --- maven-clean-plugin:2.5:clean (default-clean) @ store-core ---
[INFO] 
[INFO] --- jacoco-maven-plugin:0.7.7.201606060606:prepare-agent (jacoco-initialize) @ store-core ---
[INFO] argLine set to -javaagent:/home/jenkins/.m2/repository/org/jacoco/org.jacoco.agent/0.7.7.201606060606/org.jacoco.agent-0.7.7.201606060606-runtime.jar=destfile=/home/jenkins/agent/workspace/lyo-store-master/src/store-core/target/jacoco.exec
[INFO] 
[INFO] --- maven-resources-plugin:2.6:resources (default-resources) @ store-core ---
[INFO] Using 'UTF-8' encoding to copy filtered resources.
[INFO] skip non existing resourceDirectory /home/jenkins/agent/workspace/lyo-store-master/src/store-core/src/main/resources
[INFO] 
[INFO] --- maven-compiler-plugin:3.1:compile (default-compile) @ store-core ---
[INFO] Changes detected - recompiling the module!
[INFO] Compiling 14 source files to /home/jenkins/agent/workspace/lyo-store-master/src/store-core/target/classes
[WARNING] /home/jenkins/agent/workspace/lyo-store-master/src/store-core/src/main/java/org/eclipse/lyo/store/internals/query/DatasetQueryExecutorImpl.java: Some input files use or override a deprecated API.
[WARNING] /home/jenkins/agent/workspace/lyo-store-master/src/store-core/src/main/java/org/eclipse/lyo/store/internals/query/DatasetQueryExecutorImpl.java: Recompile with -Xlint:deprecation for details.
[WARNING] /home/jenkins/agent/workspace/lyo-store-master/src/store-core/src/main/java/org/eclipse/lyo/store/internals/JenaTdbStoreImpl.java: Some input files use unchecked or unsafe operations.
[WARNING] /home/jenkins/agent/workspace/lyo-store-master/src/store-core/src/main/java/org/eclipse/lyo/store/internals/JenaTdbStoreImpl.java: Recompile with -Xlint:unchecked for details.
[INFO] 
[INFO] --- maven-resources-plugin:2.6:testResources (default-testResources) @ store-core ---
[INFO] Using 'UTF-8' encoding to copy filtered resources.
[INFO] Copying 3 resources
[INFO] 
[INFO] --- maven-compiler-plugin:3.1:testCompile (default-testCompile) @ store-core ---
[INFO] Changes detected - recompiling the module!
[INFO] Compiling 16 source files to /home/jenkins/agent/workspace/lyo-store-master/src/store-core/target/test-classes
[WARNING] /home/jenkins/agent/workspace/lyo-store-master/src/store-core/src/test/java/org/eclipse/lyo/store/JenaTdbStoreImplIT.java: Some input files use or override a deprecated API.
[WARNING] /home/jenkins/agent/workspace/lyo-store-master/src/store-core/src/test/java/org/eclipse/lyo/store/JenaTdbStoreImplIT.java: Recompile with -Xlint:deprecation for details.
[INFO] 
[INFO] --- maven-surefire-plugin:2.12.4:test (default-test) @ store-core ---
[INFO] Surefire report directory: /home/jenkins/agent/workspace/lyo-store-master/src/store-core/target/surefire-reports

-------------------------------------------------------
 T E S T S
-------------------------------------------------------
Picked up JAVA_TOOL_OPTIONS: -XX:+IgnoreUnrecognizedVMOptions -XX:+UseContainerSupport -XX:+UnlockExperimentalVMOptions -XX:+UseCGroupMemoryLimitForHeap
Picked up _JAVA_OPTIONS: -XX:MaxRAMPercentage=64.0
Running org.eclipse.lyo.store.SparqlStoreImplTest
SLF4J: Failed to load class "org.slf4j.impl.StaticLoggerBinder".
SLF4J: Defaulting to no-operation (NOP) logger implementation
SLF4J: See http://www.slf4j.org/codes.html#StaticLoggerBinder for further details.
Tests run: 21, Failures: 0, Errors: 0, Skipped: 0, Time elapsed: 4.431 sec
Running org.eclipse.lyo.store.DatasetBuilderTest
Tests run: 2, Failures: 0, Errors: 0, Skipped: 1, Time elapsed: 4.925 sec
Running org.eclipse.lyo.store.JenaTdbStoreImplTest
Tests run: 21, Failures: 0, Errors: 0, Skipped: 0, Time elapsed: 0.378 sec

Results :

Tests run: 44, Failures: 0, Errors: 0, Skipped: 1

[INFO] 
[INFO] --- maven-jar-plugin:2.4:jar (default-jar) @ store-core ---
[INFO] Building jar: /home/jenkins/agent/workspace/lyo-store-master/src/store-core/target/store-core-4.0.0-SNAPSHOT.jar
[INFO] 
[INFO] --- jacoco-maven-plugin:0.7.7.201606060606:report (jacoco-site) @ store-core ---
[INFO] Loading execution data file /home/jenkins/agent/workspace/lyo-store-master/src/store-core/target/jacoco.exec
[INFO] Analyzed bundle 'store-core' with 11 classes
[INFO] 
[INFO] --- maven-source-plugin:3.0.1:jar-no-fork (attach-sources) @ store-core ---
[INFO] Building jar: /home/jenkins/agent/workspace/lyo-store-master/src/store-core/target/store-core-4.0.0-SNAPSHOT-sources.jar
[INFO] 
[INFO] -----------------< org.eclipse.lyo.store:store-parent >-----------------
[INFO] Building Lyo Store Parent 4.0.0-SNAPSHOT                           [3/2]
[INFO] --------------------------------[ pom ]---------------------------------
[INFO] 
[INFO] >>> maven-javadoc-plugin:3.0.1:aggregate (default-cli) > compile @ store-parent >>>
[INFO] 
[INFO] >>>>>>>>>>>>>>>>>>>>>>>>>>>>>>>>>>>>>>>>>>>>>>>>>>>>>>>>>>>>>>>>>>>>>>>>
[INFO] Forking store-core 4.0.0-SNAPSHOT
[INFO] >>>>>>>>>>>>>>>>>>>>>>>>>>>>>>>>>>>>>>>>>>>>>>>>>>>>>>>>>>>>>>>>>>>>>>>>
[INFO] 
[INFO] --- jacoco-maven-plugin:0.7.7.201606060606:prepare-agent (jacoco-initialize) @ store-core ---
[INFO] argLine set to -javaagent:/home/jenkins/.m2/repository/org/jacoco/org.jacoco.agent/0.7.7.201606060606/org.jacoco.agent-0.7.7.201606060606-runtime.jar=destfile=/home/jenkins/agent/workspace/lyo-store-master/src/store-core/target/jacoco.exec
[INFO] 
[INFO] --- maven-resources-plugin:2.6:resources (default-resources) @ store-core ---
[INFO] Using 'UTF-8' encoding to copy filtered resources.
[INFO] skip non existing resourceDirectory /home/jenkins/agent/workspace/lyo-store-master/src/store-core/src/main/resources
[INFO] 
[INFO] --- maven-compiler-plugin:3.1:compile (default-compile) @ store-core ---
[INFO] Changes detected - recompiling the module!
[INFO] Compiling 14 source files to /home/jenkins/agent/workspace/lyo-store-master/src/store-core/target/classes
[WARNING] /home/jenkins/agent/workspace/lyo-store-master/src/store-core/src/main/java/org/eclipse/lyo/store/internals/query/DatasetQueryExecutorImpl.java: Some input files use or override a deprecated API.
[WARNING] /home/jenkins/agent/workspace/lyo-store-master/src/store-core/src/main/java/org/eclipse/lyo/store/internals/query/DatasetQueryExecutorImpl.java: Recompile with -Xlint:deprecation for details.
[WARNING] /home/jenkins/agent/workspace/lyo-store-master/src/store-core/src/main/java/org/eclipse/lyo/store/internals/JenaTdbStoreImpl.java: Some input files use unchecked or unsafe operations.
[WARNING] /home/jenkins/agent/workspace/lyo-store-master/src/store-core/src/main/java/org/eclipse/lyo/store/internals/JenaTdbStoreImpl.java: Recompile with -Xlint:unchecked for details.
[INFO] 
[INFO] <<< maven-javadoc-plugin:3.0.1:aggregate (default-cli) < compile @ store-parent <<<
[INFO] 
[INFO] 
[INFO] --- maven-javadoc-plugin:3.0.1:aggregate (default-cli) @ store-parent ---
[ERROR] no module descriptor for org.eclipse.lyo.store:store-parent
[ERROR] no module descriptor for org.eclipse.lyo.store:store-core
[INFO] 
Loading source files for package org.eclipse.lyo.store...
Loading source files for package org.eclipse.lyo.store.internals...
Loading source files for package org.eclipse.lyo.store.internals.query...
Constructing Javadoc information...
Standard Doclet version 1.8.0_202
Building tree for all the packages and classes...
Generating /home/jenkins/agent/workspace/lyo-store-master/src/target/site/apidocs/org/eclipse/lyo/store/ModelUnmarshallingException.html...
Generating /home/jenkins/agent/workspace/lyo-store-master/src/target/site/apidocs/org/eclipse/lyo/store/Store.html...
Generating /home/jenkins/agent/workspace/lyo-store-master/src/target/site/apidocs/org/eclipse/lyo/store/StoreAccessException.html...
Generating /home/jenkins/agent/workspace/lyo-store-master/src/target/site/apidocs/org/eclipse/lyo/store/StoreFactory.html...
Generating /home/jenkins/agent/workspace/lyo-store-master/src/target/site/apidocs/org/eclipse/lyo/store/internals/DatasetBuilder.html...
Generating /home/jenkins/agent/workspace/lyo-store-master/src/target/site/apidocs/org/eclipse/lyo/store/internals/JenaTdbStoreImpl.html...
Generating /home/jenkins/agent/workspace/lyo-store-master/src/target/site/apidocs/org/eclipse/lyo/store/internals/SparqlStoreImpl.html...
Generating /home/jenkins/agent/workspace/lyo-store-master/src/target/site/apidocs/org/eclipse/lyo/store/internals/query/DatasetQueryExecutorImpl.html...
Generating /home/jenkins/agent/workspace/lyo-store-master/src/target/site/apidocs/org/eclipse/lyo/store/internals/query/JenaQueryExecutor.html...
Generating /home/jenkins/agent/workspace/lyo-store-master/src/target/site/apidocs/org/eclipse/lyo/store/internals/query/SparqlQueryExecutorBasicAuthImpl.html...
Generating /home/jenkins/agent/workspace/lyo-store-master/src/target/site/apidocs/org/eclipse/lyo/store/internals/query/SparqlQueryExecutorImpl.html...
Generating /home/jenkins/agent/workspace/lyo-store-master/src/target/site/apidocs/overview-frame.html...
Generating /home/jenkins/agent/workspace/lyo-store-master/src/target/site/apidocs/org/eclipse/lyo/store/package-frame.html...
Generating /home/jenkins/agent/workspace/lyo-store-master/src/target/site/apidocs/org/eclipse/lyo/store/package-summary.html...
Generating /home/jenkins/agent/workspace/lyo-store-master/src/target/site/apidocs/org/eclipse/lyo/store/package-tree.html...
Generating /home/jenkins/agent/workspace/lyo-store-master/src/target/site/apidocs/org/eclipse/lyo/store/internals/package-frame.html...
Generating /home/jenkins/agent/workspace/lyo-store-master/src/target/site/apidocs/org/eclipse/lyo/store/internals/package-summary.html...
Generating /home/jenkins/agent/workspace/lyo-store-master/src/target/site/apidocs/org/eclipse/lyo/store/internals/package-tree.html...
Generating /home/jenkins/agent/workspace/lyo-store-master/src/target/site/apidocs/org/eclipse/lyo/store/internals/query/package-frame.html...
Generating /home/jenkins/agent/workspace/lyo-store-master/src/target/site/apidocs/org/eclipse/lyo/store/internals/query/package-summary.html...
Generating /home/jenkins/agent/workspace/lyo-store-master/src/target/site/apidocs/org/eclipse/lyo/store/internals/query/package-tree.html...
Generating /home/jenkins/agent/workspace/lyo-store-master/src/target/site/apidocs/constant-values.html...
Generating /home/jenkins/agent/workspace/lyo-store-master/src/target/site/apidocs/serialized-form.html...
Generating /home/jenkins/agent/workspace/lyo-store-master/src/target/site/apidocs/org/eclipse/lyo/store/class-use/StoreFactory.html...
Generating /home/jenkins/agent/workspace/lyo-store-master/src/target/site/apidocs/org/eclipse/lyo/store/class-use/ModelUnmarshallingException.html...
Generating /home/jenkins/agent/workspace/lyo-store-master/src/target/site/apidocs/org/eclipse/lyo/store/class-use/Store.html...
Generating /home/jenkins/agent/workspace/lyo-store-master/src/target/site/apidocs/org/eclipse/lyo/store/class-use/StoreAccessException.html...
Generating /home/jenkins/agent/workspace/lyo-store-master/src/target/site/apidocs/org/eclipse/lyo/store/internals/class-use/DatasetBuilder.html...
Generating /home/jenkins/agent/workspace/lyo-store-master/src/target/site/apidocs/org/eclipse/lyo/store/internals/class-use/SparqlStoreImpl.html...
Generating /home/jenkins/agent/workspace/lyo-store-master/src/target/site/apidocs/org/eclipse/lyo/store/internals/class-use/JenaTdbStoreImpl.html...
Generating /home/jenkins/agent/workspace/lyo-store-master/src/target/site/apidocs/org/eclipse/lyo/store/internals/query/class-use/SparqlQueryExecutorImpl.html...
Generating /home/jenkins/agent/workspace/lyo-store-master/src/target/site/apidocs/org/eclipse/lyo/store/internals/query/class-use/DatasetQueryExecutorImpl.html...
Generating /home/jenkins/agent/workspace/lyo-store-master/src/target/site/apidocs/org/eclipse/lyo/store/internals/query/class-use/JenaQueryExecutor.html...
Generating /home/jenkins/agent/workspace/lyo-store-master/src/target/site/apidocs/org/eclipse/lyo/store/internals/query/class-use/SparqlQueryExecutorBasicAuthImpl.html...
Generating /home/jenkins/agent/workspace/lyo-store-master/src/target/site/apidocs/org/eclipse/lyo/store/package-use.html...
Generating /home/jenkins/agent/workspace/lyo-store-master/src/target/site/apidocs/org/eclipse/lyo/store/internals/package-use.html...
Generating /home/jenkins/agent/workspace/lyo-store-master/src/target/site/apidocs/org/eclipse/lyo/store/internals/query/package-use.html...
Building index for all the packages and classes...
Generating /home/jenkins/agent/workspace/lyo-store-master/src/target/site/apidocs/overview-tree.html...
Generating /home/jenkins/agent/workspace/lyo-store-master/src/target/site/apidocs/index-all.html...
Generating /home/jenkins/agent/workspace/lyo-store-master/src/target/site/apidocs/deprecated-list.html...
Building index for all classes...
Generating /home/jenkins/agent/workspace/lyo-store-master/src/target/site/apidocs/allclasses-frame.html...
Generating /home/jenkins/agent/workspace/lyo-store-master/src/target/site/apidocs/allclasses-noframe.html...
Generating /home/jenkins/agent/workspace/lyo-store-master/src/target/site/apidocs/index.html...
Generating /home/jenkins/agent/workspace/lyo-store-master/src/target/site/apidocs/overview-summary.html...
Generating /home/jenkins/agent/workspace/lyo-store-master/src/target/site/apidocs/help-doc.html...
2 errors
41 warnings
[INFO] ------------------------------------------------------------------------
[INFO] Reactor Summary for Lyo Store Parent 4.0.0-SNAPSHOT:
[INFO] 
[INFO] Lyo Store Parent ................................... FAILURE [ 25.998 s]
[INFO] store-core ......................................... SUCCESS [ 57.853 s]
[INFO] ------------------------------------------------------------------------
[INFO] BUILD FAILURE
[INFO] ------------------------------------------------------------------------
[INFO] Total time:  01:28 min
[INFO] Finished at: 2020-03-04T15:30:42Z
[INFO] ------------------------------------------------------------------------
[ERROR] Failed to execute goal org.apache.maven.plugins:maven-javadoc-plugin:3.0.1:aggregate (default-cli) on project store-parent: An error has occurred in Javadoc report generation: 
[ERROR] Exit code: 1 - Picked up JAVA_TOOL_OPTIONS: -XX:+IgnoreUnrecognizedVMOptions -XX:+UseContainerSupport -XX:+UnlockExperimentalVMOptions -XX:+UseCGroupMemoryLimitForHeap
[ERROR] Picked up _JAVA_OPTIONS: -XX:MaxRAMPercentage=64.0
[ERROR] /home/jenkins/agent/workspace/lyo-store-master/src/store-core/src/main/java/org/eclipse/lyo/store/package-info.java:10: warning: empty <p> tag
[ERROR]  * <p>
[ERROR]    ^
[ERROR] /home/jenkins/agent/workspace/lyo-store-master/src/store-core/src/main/java/org/eclipse/lyo/store/package-info.java:16: warning: empty <p> tag
[ERROR]  * <p>
[ERROR]    ^
[ERROR] /home/jenkins/agent/workspace/lyo-store-master/src/store-core/src/main/java/org/eclipse/lyo/store/Store.java:70: warning: no @param for namedGraphUri
[ERROR]     void insertJenaModel(URI namedGraphUri, Model model);
[ERROR]          ^
[ERROR] /home/jenkins/agent/workspace/lyo-store-master/src/store-core/src/main/java/org/eclipse/lyo/store/Store.java:70: warning: no @param for model
[ERROR]     void insertJenaModel(URI namedGraphUri, Model model);
[ERROR]          ^
[ERROR] /home/jenkins/agent/workspace/lyo-store-master/src/store-core/src/main/java/org/eclipse/lyo/store/Store.java:77: warning: no @param for namedGraphUri
[ERROR]     boolean insertResources(URI namedGraphUri, final Object... resources)
[ERROR]             ^
[ERROR] /home/jenkins/agent/workspace/lyo-store-master/src/store-core/src/main/java/org/eclipse/lyo/store/Store.java:77: warning: no @param for resources
[ERROR]     boolean insertResources(URI namedGraphUri, final Object... resources)
[ERROR]             ^
[ERROR] /home/jenkins/agent/workspace/lyo-store-master/src/store-core/src/main/java/org/eclipse/lyo/store/Store.java:77: warning: no @return
[ERROR]     boolean insertResources(URI namedGraphUri, final Object... resources)
[ERROR]             ^
[ERROR] /home/jenkins/agent/workspace/lyo-store-master/src/store-core/src/main/java/org/eclipse/lyo/store/Store.java:77: warning: no @throws for org.eclipse.lyo.store.StoreAccessException
[ERROR]     boolean insertResources(URI namedGraphUri, final Object... resources)
[ERROR]             ^
[ERROR] /home/jenkins/agent/workspace/lyo-store-master/src/store-core/src/main/java/org/eclipse/lyo/store/Store.java:83: warning: no @param for namedGraphUri
[ERROR]     void deleteResources(URI namedGraphUri, final URI... nodeUris);
[ERROR]          ^
[ERROR] /home/jenkins/agent/workspace/lyo-store-master/src/store-core/src/main/java/org/eclipse/lyo/store/Store.java:83: warning: no @param for nodeUris
[ERROR]     void deleteResources(URI namedGraphUri, final URI... nodeUris);
[ERROR]          ^
[ERROR] /home/jenkins/agent/workspace/lyo-store-master/src/store-core/src/main/java/org/eclipse/lyo/store/Store.java:88: warning: no @param for namedGraphUri
[ERROR]     void deleteResources(URI namedGraphUri, final IResource... resources);
[ERROR]          ^
[ERROR] /home/jenkins/agent/workspace/lyo-store-master/src/store-core/src/main/java/org/eclipse/lyo/store/Store.java:88: warning: no @param for resources
[ERROR]     void deleteResources(URI namedGraphUri, final IResource... resources);
[ERROR]          ^
[ERROR] /home/jenkins/agent/workspace/lyo-store-master/src/store-core/src/main/java/org/eclipse/lyo/store/Store.java:103: warning: no @param for namedGraphUri
[ERROR]     boolean resourceExists(URI namedGraphUri, URI resourceUri);
[ERROR]             ^
[ERROR] /home/jenkins/agent/workspace/lyo-store-master/src/store-core/src/main/java/org/eclipse/lyo/store/Store.java:103: warning: no @param for resourceUri
[ERROR]     boolean resourceExists(URI namedGraphUri, URI resourceUri);
[ERROR]             ^
[ERROR] /home/jenkins/agent/workspace/lyo-store-master/src/store-core/src/main/java/org/eclipse/lyo/store/Store.java:103: warning: no @return
[ERROR]     boolean resourceExists(URI namedGraphUri, URI resourceUri);
[ERROR]             ^
[ERROR] /home/jenkins/agent/workspace/lyo-store-master/src/store-core/src/main/java/org/eclipse/lyo/store/Store.java:108: warning: no @param for namedGraphUri
[ERROR]     Model getJenaModelForSubject(URI namedGraphUri, URI subject)
[ERROR]           ^
[ERROR] /home/jenkins/agent/workspace/lyo-store-master/src/store-core/src/main/java/org/eclipse/lyo/store/Store.java:108: warning: no @param for subject
[ERROR]     Model getJenaModelForSubject(URI namedGraphUri, URI subject)
[ERROR]           ^
[ERROR] /home/jenkins/agent/workspace/lyo-store-master/src/store-core/src/main/java/org/eclipse/lyo/store/Store.java:108: warning: no @return
[ERROR]     Model getJenaModelForSubject(URI namedGraphUri, URI subject)
[ERROR]           ^
[ERROR] /home/jenkins/agent/workspace/lyo-store-master/src/store-core/src/main/java/org/eclipse/lyo/store/Store.java:131: warning: no @param for <T>
[ERROR]     <T extends IResource> List<T> getResources(URI namedGraphUri, final Class<T> clazz)
[ERROR]                                   ^
[ERROR] /home/jenkins/agent/workspace/lyo-store-master/src/store-core/src/main/java/org/eclipse/lyo/store/Store.java:131: warning: no @param for namedGraphUri
[ERROR]     <T extends IResource> List<T> getResources(URI namedGraphUri, final Class<T> clazz)
[ERROR]                                   ^
[ERROR] /home/jenkins/agent/workspace/lyo-store-master/src/store-core/src/main/java/org/eclipse/lyo/store/Store.java:149: warning: no @param for <T>
[ERROR]     <T extends IResource> List<T> getResources(URI namedGraphUri, Class<T> clazz, int limit,
[ERROR]                                   ^
[ERROR] /home/jenkins/agent/workspace/lyo-store-master/src/store-core/src/main/java/org/eclipse/lyo/store/Store.java:170: warning: no @param for <T>
[ERROR]     <T extends IResource> List<T> getResources(URI namedGraphUri, Class<T> clazz, 
[ERROR]                                   ^
[ERROR] /home/jenkins/agent/workspace/lyo-store-master/src/store-core/src/main/java/org/eclipse/lyo/store/Store.java:227: warning: no @param for <T>
[ERROR]     <T extends IResource> T getResource(URI namedGraphUri, URI uri, Class<T> clazz)
[ERROR]                             ^
[ERROR] /home/jenkins/agent/workspace/lyo-store-master/src/store-core/src/main/java/org/eclipse/lyo/store/Store.java:227: warning: no @param for uri
[ERROR]     <T extends IResource> T getResource(URI namedGraphUri, URI uri, Class<T> clazz)
[ERROR]                             ^
[ERROR] /home/jenkins/agent/workspace/lyo-store-master/src/store-core/src/main/java/org/eclipse/lyo/store/Store.java:236: warning: no @param for <T>
[ERROR]     <T extends IResource> boolean updateResources(URI namedGraphUri, final T... resources)
[ERROR]                                   ^
[ERROR] /home/jenkins/agent/workspace/lyo-store-master/src/store-core/src/main/java/org/eclipse/lyo/store/Store.java:236: warning: no @param for namedGraphUri
[ERROR]     <T extends IResource> boolean updateResources(URI namedGraphUri, final T... resources)
[ERROR]                                   ^
[ERROR] /home/jenkins/agent/workspace/lyo-store-master/src/store-core/src/main/java/org/eclipse/lyo/store/Store.java:236: warning: no @param for resources
[ERROR]     <T extends IResource> boolean updateResources(URI namedGraphUri, final T... resources)
[ERROR]                                   ^
[ERROR] /home/jenkins/agent/workspace/lyo-store-master/src/store-core/src/main/java/org/eclipse/lyo/store/Store.java:236: warning: no @return
[ERROR]     <T extends IResource> boolean updateResources(URI namedGraphUri, final T... resources)
[ERROR]                                   ^
[ERROR] /home/jenkins/agent/workspace/lyo-store-master/src/store-core/src/main/java/org/eclipse/lyo/store/Store.java:236: warning: no @throws for org.eclipse.lyo.store.StoreAccessException
[ERROR]     <T extends IResource> boolean updateResources(URI namedGraphUri, final T... resources)
[ERROR]                                   ^
[ERROR] /home/jenkins/agent/workspace/lyo-store-master/src/store-core/src/main/java/org/eclipse/lyo/store/Store.java:252: warning: no @param for <T>
[ERROR]     <T extends IResource> boolean putResources(URI namedGraphUri, final Collection<T> resources)
[ERROR]                                   ^
[ERROR] /home/jenkins/agent/workspace/lyo-store-master/src/store-core/src/main/java/org/eclipse/lyo/store/Store.java:268: warning: no @param for <T>
[ERROR]     <T extends IResource> boolean appendResources(URI namedGraphUri, final Collection<T> resources)
[ERROR]                                   ^
[ERROR] /home/jenkins/agent/workspace/lyo-store-master/src/store-core/src/main/java/org/eclipse/lyo/store/Store.java:284: warning: no @param for <T>
[ERROR]     default <T extends IResource> boolean appendResource(URI namedGraphUri, final T resource)
[ERROR]                                           ^
[ERROR] /home/jenkins/agent/workspace/lyo-store-master/src/store-core/src/main/java/org/eclipse/lyo/store/Store.java:291: warning: empty <p> tag
[ERROR]      * <p>
[ERROR]        ^
[ERROR] /home/jenkins/agent/workspace/lyo-store-master/src/store-core/src/main/java/org/eclipse/lyo/store/Store.java:296: warning: no @param for namedGraphUri
[ERROR]     void clear(URI namedGraphUri);
[ERROR]          ^
[ERROR] /home/jenkins/agent/workspace/lyo-store-master/src/store-core/src/main/java/org/eclipse/lyo/store/Store.java:300: warning: empty <p> tag
[ERROR]      * <p>
[ERROR]        ^
[ERROR] /home/jenkins/agent/workspace/lyo-store-master/src/store-core/src/main/java/org/eclipse/lyo/store/Store.java:31: warning: empty <p> tag
[ERROR]  * <p>
[ERROR]    ^
[ERROR] /home/jenkins/agent/workspace/lyo-store-master/src/store-core/src/main/java/org/eclipse/lyo/store/Store.java:34: warning: empty <p> tag
[ERROR]  * <p>
[ERROR]    ^
[ERROR] /home/jenkins/agent/workspace/lyo-store-master/src/store-core/src/main/java/org/eclipse/lyo/store/Store.java:42: warning: empty <p> tag
[ERROR]  * <p>
[ERROR]    ^
[ERROR] /home/jenkins/agent/workspace/lyo-store-master/src/store-core/src/main/java/org/eclipse/lyo/store/StoreFactory.java:38: warning: empty <p> tag
[ERROR]      * <p>
[ERROR]        ^
[ERROR] /home/jenkins/agent/workspace/lyo-store-master/src/store-core/src/main/java/org/eclipse/lyo/store/StoreFactory.java:51: warning: empty <p> tag
[ERROR]      * <p>
[ERROR]        ^
[ERROR] /home/jenkins/agent/workspace/lyo-store-master/src/store-core/src/main/java/org/eclipse/lyo/store/StoreFactory.java:77: error: exception not thrown: java.io.IOException
[ERROR]      * @throws IOException If the SPARQL endpoint cannot be accessed.
[ERROR]                ^
[ERROR] /home/jenkins/agent/workspace/lyo-store-master/src/store-core/src/main/java/org/eclipse/lyo/store/StoreFactory.java:94: error: exception not thrown: java.io.IOException
[ERROR]      * @throws IOException If the SPARQL endpoint cannot be accessed.
[ERROR]                ^
[ERROR] /home/jenkins/agent/workspace/lyo-store-master/src/store-core/src/main/java/org/eclipse/lyo/store/internals/DatasetBuilder.java:47: warning: no @param for path
[ERROR]     public static Dataset buildPersistent(final Path path) throws IOException {
[ERROR]                           ^
[ERROR] 
[ERROR] Command line was: /opt/tools/java/adoptopenjdk/hotspot-jdk-8/1.8.0_202/jre/../bin/javadoc @options @packages
[ERROR] 
[ERROR] Refer to the generated Javadoc files in '/home/jenkins/agent/workspace/lyo-store-master/src/target/site/apidocs' dir.
[ERROR] -> [Help 1]
[ERROR] 
[ERROR] To see the full stack trace of the errors, re-run Maven with the -e switch.
[ERROR] Re-run Maven using the -X switch to enable full debug logging.
[ERROR] 
[ERROR] For more information about the errors and possible solutions, please read the following articles:
[ERROR] [Help 1] http://cwiki.apache.org/confluence/display/MAVEN/MojoExecutionException
Build step 'Invoke top-level Maven targets' marked build as failure
$ ssh-agent -k
unset SSH_AUTH_SOCK;
unset SSH_AGENT_PID;
echo Agent pid 62 killed;
[ssh-agent] Stopped.
Recording test results
Sending e-mails to: andriib@kth.se jad@kth.se jamsden@us.ibm.com yash.s.khatri@gmail.com neormx@gmail.com
Finished: FAILURE