Console Output

17:27:37 Started by user Hannes Erven
17:27:37 Agent default-java-4gs8s is provisioned from template Kubernetes Pod Template
17:27:37 Agent specification [Kubernetes Pod Template] (): 
17:27:37 
17:27:37 Building remotely on default-java-4gs8s in workspace /home/jenkins/workspace/Libra WAR
17:27:45 Cloning the remote Git repository
17:27:45 Cloning repository git://git.eclipse.org/gitroot/libra/org.eclipse.libra.git
17:27:45  > git init /home/jenkins/workspace/Libra WAR # timeout=10
17:27:45 Fetching upstream changes from git://git.eclipse.org/gitroot/libra/org.eclipse.libra.git
17:27:45  > git --version # timeout=10
17:27:45  > git fetch --tags --progress git://git.eclipse.org/gitroot/libra/org.eclipse.libra.git +refs/heads/*:refs/remotes/origin/*
17:27:46  > git config remote.origin.url git://git.eclipse.org/gitroot/libra/org.eclipse.libra.git # timeout=10
17:27:46  > git config --add remote.origin.fetch +refs/heads/*:refs/remotes/origin/* # timeout=10
17:27:46  > git config remote.origin.url git://git.eclipse.org/gitroot/libra/org.eclipse.libra.git # timeout=10
17:27:46 Fetching upstream changes from git://git.eclipse.org/gitroot/libra/org.eclipse.libra.git
17:27:46  > git fetch --tags --progress git://git.eclipse.org/gitroot/libra/org.eclipse.libra.git +refs/heads/*:refs/remotes/origin/*
17:27:46  > git rev-parse refs/remotes/origin/master^{commit} # timeout=10
17:27:46  > git rev-parse refs/remotes/origin/origin/master^{commit} # timeout=10
17:27:46 Checking out Revision 8f090169ea85071c63a1cb507313f33ec2d7dd4e (refs/remotes/origin/master)
17:27:46  > git config core.sparsecheckout # timeout=10
17:27:46  > git checkout -f 8f090169ea85071c63a1cb507313f33ec2d7dd4e
17:27:48 Commit message: "even more API changes in Photon"
17:27:48 First time build. Skipping changelog.
17:27:49 [Libra WAR] $ /opt/tools/apache-maven/latest/bin/mvn
17:27:50 [INFO] Scanning for projects...
17:27:50 [INFO] ------------------------------------------------------------------------
17:27:50 [INFO] BUILD FAILURE
17:27:50 [INFO] ------------------------------------------------------------------------
17:27:50 [INFO] Total time: 0.096 s
17:27:50 [INFO] Finished at: 2018-10-16T21:27:50Z
17:27:50 [INFO] ------------------------------------------------------------------------
17:27:50 [ERROR] No goals have been specified for this build. You must specify a valid lifecycle phase or a goal in the format <plugin-prefix>:<goal> or <plugin-group-id>:<plugin-artifact-id>[:<plugin-version>]:<goal>. Available lifecycle phases are: validate, initialize, generate-sources, process-sources, generate-resources, process-resources, compile, process-classes, generate-test-sources, process-test-sources, generate-test-resources, process-test-resources, test-compile, process-test-classes, test, prepare-package, package, pre-integration-test, integration-test, post-integration-test, verify, install, deploy, pre-clean, clean, post-clean, pre-site, site, post-site, site-deploy. -> [Help 1]
17:27:50 [ERROR] 
17:27:50 [ERROR] To see the full stack trace of the errors, re-run Maven with the -e switch.
17:27:50 [ERROR] Re-run Maven using the -X switch to enable full debug logging.
17:27:50 [ERROR] 
17:27:50 [ERROR] For more information about the errors and possible solutions, please read the following articles:
17:27:50 [ERROR] [Help 1] http://cwiki.apache.org/confluence/display/MAVEN/NoGoalSpecifiedException
17:27:50 Build step 'Invoke top-level Maven targets' marked build as failure
17:27:50 Started calculate disk usage of build
17:27:50 Finished Calculation of disk usage of build in 0 seconds
17:27:50 Started calculate disk usage of workspace
17:27:50 Finished Calculation of disk usage of workspace in 0 seconds
17:27:51 Finished: FAILURE