FailedConsole Output

Started by user Simon Bernard
Running as Simon Bernard
Agent basic-v5jxf is provisioned from template basic
---
apiVersion: "v1"
kind: "Pod"
metadata:
  annotations: {}
  labels:
    jenkins: "slave"
    jenkins/label: ""
  name: "basic-v5jxf"
spec:
  containers:
  - env:
    - name: "JENKINS_SECRET"
      value: "********"
    - name: "JENKINS_TUNNEL"
      value: "jenkins-discovery.leshan.svc.cluster.local:50000"
    - name: "JENKINS_AGENT_NAME"
      value: "basic-v5jxf"
    - name: "JAVA_TOOL_OPTIONS"
      value: ""
    - name: "JNLP_PROTOCOL_OPTS"
      value: "-showversion -XshowSettings:vm -Xmx256m -Dsun.zip.disableMemoryMapping=true\
        \ -Dorg.jenkinsci.remoting.engine.JnlpProtocol3.disabled=true -Dorg.jenkinsci.plugins.gitclient.CliGitAPIImpl.useSETSID=true"
    - name: "_JAVA_OPTIONS"
      value: ""
    - name: "JAVA_OPTS"
      value: ""
    - name: "IBM_JAVA_OPTIONS"
      value: "-XX:+IgnoreUnrecognizedVMOptions -XX:+IdleTuningCompactOnIdle -XX:+IdleTuningGcOnIdle"
    - name: "OPENJ9_JAVA_OPTIONS"
      value: "-XX:+IgnoreUnrecognizedVMOptions -XX:+IdleTuningCompactOnIdle -XX:+IdleTuningGcOnIdle"
    - name: "JENKINS_NAME"
      value: "basic-v5jxf"
    - name: "JENKINS_AGENT_WORKDIR"
      value: "/home/jenkins/agent"
    - name: "JENKINS_URL"
      value: "http://jenkins-ui.leshan.svc.cluster.local/leshan/"
    image: "docker.io/eclipsecbi/jiro-agent-basic:remoting-4.2.1"
    imagePullPolicy: "Always"
    name: "jnlp"
    resources:
      limits:
        memory: "4096Mi"
        cpu: "2000m"
      requests:
        memory: "4096Mi"
        cpu: "1000m"
    securityContext:
      privileged: false
    tty: true
    volumeMounts:
    - mountPath: "/home/jenkins/.m2/toolchains.xml"
      name: "m2-dir"
      readOnly: true
      subPath: "toolchains.xml"
    - mountPath: "/home/jenkins/.mavenrc"
      name: "m2-dir"
      readOnly: true
      subPath: ".mavenrc"
    - mountPath: "/opt/tools"
      name: "volume-0"
      readOnly: false
    - mountPath: "/home/jenkins"
      name: "volume-2"
      readOnly: false
    - mountPath: "/home/jenkins/.m2/repository"
      name: "volume-3"
      readOnly: false
    - mountPath: "/home/jenkins/.m2/settings-security.xml"
      name: "m2-secret-dir"
      readOnly: true
      subPath: "settings-security.xml"
    - mountPath: "/home/jenkins/.m2/wrapper"
      name: "volume-4"
      readOnly: false
    - mountPath: "/home/jenkins/.m2/settings.xml"
      name: "m2-secret-dir"
      readOnly: true
      subPath: "settings.xml"
    - mountPath: "/home/jenkins/.ssh"
      name: "volume-1"
      readOnly: false
    - mountPath: "/home/jenkins/agent"
      name: "workspace-volume"
      readOnly: false
    workingDir: "/home/jenkins/agent"
  nodeSelector:
    beta.kubernetes.io/os: "linux"
  restartPolicy: "Never"
  securityContext: {}
  volumes:
  - name: "volume-0"
    persistentVolumeClaim:
      claimName: "tools-claim-jiro-leshan"
      readOnly: true
  - name: "m2-secret-dir"
    secret:
      secretName: "m2-secret-dir"
  - emptyDir:
      medium: ""
    name: "volume-2"
  - configMap:
      name: "m2-dir"
    name: "m2-dir"
  - configMap:
      name: "known-hosts"
    name: "volume-1"
  - emptyDir:
      medium: ""
    name: "workspace-volume"
  - emptyDir:
      medium: ""
    name: "volume-4"
  - emptyDir:
      medium: ""
    name: "volume-3"

Building remotely on basic-v5jxf in workspace /home/jenkins/agent/workspace/leshan
No credentials specified
Cloning the remote Git repository
Cloning repository https://github.com/eclipse/leshan.git
 > git init /home/jenkins/agent/workspace/leshan # timeout=10
Fetching upstream changes from https://github.com/eclipse/leshan.git
 > git --version # timeout=10
 > git fetch --tags --force --progress -- https://github.com/eclipse/leshan.git +refs/heads/*:refs/remotes/origin/* # timeout=10
 > git config remote.origin.url https://github.com/eclipse/leshan.git # timeout=10
 > git config --add remote.origin.fetch +refs/heads/*:refs/remotes/origin/* # timeout=10
 > git config remote.origin.url https://github.com/eclipse/leshan.git # timeout=10
Fetching upstream changes from https://github.com/eclipse/leshan.git
 > git fetch --tags --force --progress -- https://github.com/eclipse/leshan.git +refs/heads/*:refs/remotes/origin/* # timeout=10
 > git rev-parse origin/master^{commit} # timeout=10
Checking out Revision 9b4556c69b59c7a760d3c06e875ed1e6384e6286 (origin/master)
 > git config core.sparsecheckout # timeout=10
 > git checkout -f 9b4556c69b59c7a760d3c06e875ed1e6384e6286 # timeout=10
Commit message: "Add JUnit to validate embedded Model at build time."
 > git rev-list --no-walk 9b4556c69b59c7a760d3c06e875ed1e6384e6286 # timeout=10
[leshan] $ /opt/tools/apache-maven/latest/bin/mvn -f pom.xml clean install javadoc:javadoc -PuseToolchain -B
Apache Maven 3.6.3 (cecedd343002696d0abb50b32b541b8a6ba2883f)
Maven home: /opt/tools/apache-maven/latest
Java version: 1.8.0_202, vendor: Oracle Corporation, runtime: /opt/tools/java/oracle/jdk-8/1.8.0_202/jre
Default locale: en_US, platform encoding: UTF-8
OS name: "linux", version: "3.10.0-1127.10.1.el7.x86_64", arch: "amd64", family: "unix"
[INFO] Scanning for projects...
[INFO] ------------------------------------------------------------------------
[INFO] Reactor Build Order:
[INFO] 
[INFO] leshan                                                             [pom]
[INFO] leshan - core                                                   [bundle]
[INFO] leshan - core californium                                       [bundle]
[INFO] leshan - server core                                            [bundle]
[INFO] leshan - server californium                                     [bundle]
[INFO] leshan - server redis                                           [bundle]
[INFO] leshan - client core                                            [bundle]
[INFO] leshan - client californium                                     [bundle]
[INFO] leshan - integration tests                                         [jar]
[INFO] leshan - server demo                                               [jar]
[INFO] leshan - client demo                                               [jar]
[INFO] leshan - bootstrap server demo                                     [jar]
[INFO] 
[INFO] ---------------------< org.eclipse.leshan:leshan >----------------------
[INFO] Building leshan 1.1.0-SNAPSHOT                                    [1/12]
[INFO] --------------------------------[ pom ]---------------------------------
[INFO] 
[INFO] --- maven-clean-plugin:3.1.0:clean (default-clean) @ leshan ---
[INFO] 
[INFO] --- maven-enforcer-plugin:1.4.1:enforce (enforce-maven) @ leshan ---
[INFO] 
[INFO] --- maven-toolchains-plugin:3.0.0:toolchain (default) @ leshan ---
[INFO] Required toolchain: jdk [ version='1.7' ]
[INFO] Found matching toolchain for type jdk: JDK[/opt/tools/java/oracle/jdk-7/latest]
[INFO] 
[INFO] >>> maven-source-plugin:3.2.1:jar (attach-sources) > generate-sources @ leshan >>>
[INFO] 
[INFO] --- maven-enforcer-plugin:1.4.1:enforce (enforce-maven) @ leshan ---
[INFO] 
[INFO] --- maven-toolchains-plugin:3.0.0:toolchain (default) @ leshan ---
[INFO] Required toolchain: jdk [ version='1.7' ]
[INFO] Found matching toolchain for type jdk: JDK[/opt/tools/java/oracle/jdk-7/latest]
[INFO] 
[INFO] <<< maven-source-plugin:3.2.1:jar (attach-sources) < generate-sources @ leshan <<<
[INFO] 
[INFO] 
[INFO] --- maven-source-plugin:3.2.1:jar (attach-sources) @ leshan ---
[INFO] 
[INFO] --- revapi-maven-plugin:0.11.2:check (default) @ leshan ---
[INFO] Comparing [org.eclipse.leshan:leshan:pom:1.0.0] against [org.eclipse.leshan:leshan:pom:1.1.0-SNAPSHOT] (including their transitive dependencies).
[INFO] API checks completed without failures.
[INFO] 
[INFO] --- maven-install-plugin:2.5.2:install (default-install) @ leshan ---
[INFO] Installing /home/jenkins/agent/workspace/leshan/pom.xml to /home/jenkins/.m2/repository/org/eclipse/leshan/leshan/1.1.0-SNAPSHOT/leshan-1.1.0-SNAPSHOT.pom
[INFO] 
[INFO] >>> maven-javadoc-plugin:3.1.1:javadoc (default-cli) > generate-sources @ leshan >>>
[INFO] 
[INFO] --- maven-enforcer-plugin:1.4.1:enforce (enforce-maven) @ leshan ---
[INFO] 
[INFO] --- maven-toolchains-plugin:3.0.0:toolchain (default) @ leshan ---
[INFO] Required toolchain: jdk [ version='1.7' ]
[INFO] Found matching toolchain for type jdk: JDK[/opt/tools/java/oracle/jdk-7/latest]
[INFO] 
[INFO] <<< maven-javadoc-plugin:3.1.1:javadoc (default-cli) < generate-sources @ leshan <<<
[INFO] 
[INFO] 
[INFO] --- maven-javadoc-plugin:3.1.1:javadoc (default-cli) @ leshan ---
[INFO] 
[INFO] -------------------< org.eclipse.leshan:leshan-core >-------------------
[INFO] Building leshan - core 1.1.0-SNAPSHOT                             [2/12]
[INFO] -------------------------------[ bundle ]-------------------------------
[INFO] 
[INFO] --- maven-clean-plugin:3.1.0:clean (default-clean) @ leshan-core ---
[INFO] 
[INFO] --- maven-enforcer-plugin:1.4.1:enforce (enforce-maven) @ leshan-core ---
[INFO] 
[INFO] --- maven-toolchains-plugin:3.0.0:toolchain (default) @ leshan-core ---
[INFO] Required toolchain: jdk [ version='1.7' ]
[INFO] Found matching toolchain for type jdk: JDK[/opt/tools/java/oracle/jdk-7/latest]
[INFO] 
[INFO] --- maven-resources-plugin:3.1.0:resources (default-resources) @ leshan-core ---
[INFO] Using 'UTF-8' encoding to copy filtered resources.
[INFO] Copying 9 resources
[INFO] 
[INFO] --- maven-compiler-plugin:3.8.1:compile (default-compile) @ leshan-core ---
[INFO] Toolchain in maven-compiler-plugin: JDK[/opt/tools/java/oracle/jdk-7/latest]
[INFO] Changes detected - recompiling the module!
[INFO] Compiling 129 source files to /home/jenkins/agent/workspace/leshan/leshan-core/target/classes
[INFO] 
[INFO] --- animal-sniffer-maven-plugin:1.18:check (default) @ leshan-core ---
[INFO] Checking unresolved references to net.sf.androidscents.signature:android-api-level-19:4.4.2_r4
[INFO] 
[INFO] --- maven-resources-plugin:3.1.0:testResources (default-testResources) @ leshan-core ---
[INFO] Using 'UTF-8' encoding to copy filtered resources.
[INFO] skip non existing resourceDirectory /home/jenkins/agent/workspace/leshan/leshan-core/src/test/resources
[INFO] 
[INFO] --- maven-compiler-plugin:3.8.1:testCompile (default-testCompile) @ leshan-core ---
[INFO] Toolchain in maven-compiler-plugin: JDK[/opt/tools/java/oracle/jdk-7/latest]
[INFO] Changes detected - recompiling the module!
[INFO] Compiling 11 source files to /home/jenkins/agent/workspace/leshan/leshan-core/target/test-classes
[INFO] 
[INFO] --- maven-surefire-plugin:3.0.0-M4:test (default-test) @ leshan-core ---
[INFO] Toolchain in maven-surefire-plugin: JDK[/opt/tools/java/oracle/jdk-7/latest]
[INFO] 
[INFO] -------------------------------------------------------
[INFO]  T E S T S
[INFO] -------------------------------------------------------
SLF4J: A number (106) of logging calls during the initialization phase have been intercepted and are
SLF4J: now being replayed. These are subject to the filtering rules of the underlying logging system.
SLF4J: See also http://www.slf4j.org/codes.html#replay
[INFO] Running org.eclipse.leshan.core.model.ValidateModelsTest
[INFO] Tests run: 1, Failures: 0, Errors: 0, Skipped: 0, Time elapsed: 0.613 s - in org.eclipse.leshan.core.model.ValidateModelsTest
[INFO] Running org.eclipse.leshan.core.node.codec.LwM2mNodeEncoderTest
[INFO] Tests run: 12, Failures: 0, Errors: 0, Skipped: 0, Time elapsed: 0.01 s - in org.eclipse.leshan.core.node.codec.LwM2mNodeEncoderTest
[INFO] Running org.eclipse.leshan.core.json.JsonSerializerTest
[INFO] Tests run: 1, Failures: 0, Errors: 0, Skipped: 0, Time elapsed: 0.02 s - in org.eclipse.leshan.core.json.JsonSerializerTest
[INFO] Running org.eclipse.leshan.core.tlv.TlvEncoderTest
[INFO] Tests run: 6, Failures: 0, Errors: 0, Skipped: 0, Time elapsed: 0.013 s - in org.eclipse.leshan.core.tlv.TlvEncoderTest
[INFO] Running org.eclipse.leshan.core.node.codec.LwM2mNodeDecoderTest
[INFO] Tests run: 41, Failures: 0, Errors: 0, Skipped: 0, Time elapsed: 0.08 s - in org.eclipse.leshan.core.node.codec.LwM2mNodeDecoderTest
[INFO] Running org.eclipse.leshan.core.attributes.AttributeSetTest
[INFO] Tests run: 9, Failures: 0, Errors: 0, Skipped: 0, Time elapsed: 0.008 s - in org.eclipse.leshan.core.attributes.AttributeSetTest
[INFO] Running org.eclipse.leshan.core.LinkObjectTest
[INFO] Tests run: 10, Failures: 0, Errors: 0, Skipped: 0, Time elapsed: 0.011 s - in org.eclipse.leshan.core.LinkObjectTest
[INFO] Running org.eclipse.leshan.core.tlv.TlvDecoderTest
[INFO] Tests run: 3, Failures: 0, Errors: 0, Skipped: 0, Time elapsed: 0.01 s - in org.eclipse.leshan.core.tlv.TlvDecoderTest
[INFO] Running org.eclipse.leshan.core.node.LwM2MResourceTest
[INFO] Tests run: 16, Failures: 0, Errors: 0, Skipped: 0, Time elapsed: 0.01 s - in org.eclipse.leshan.core.node.LwM2MResourceTest
[INFO] Running org.eclipse.leshan.core.attributes.AttributeTest
[INFO] Tests run: 2, Failures: 0, Errors: 0, Skipped: 0, Time elapsed: 0.005 s - in org.eclipse.leshan.core.attributes.AttributeTest
[INFO] Running org.eclipse.leshan.core.json.JsonDeserializerTest
[INFO] Tests run: 3, Failures: 0, Errors: 0, Skipped: 0, Time elapsed: 0.028 s - in org.eclipse.leshan.core.json.JsonDeserializerTest
[INFO] 
[INFO] Results:
[INFO] 
[INFO] Tests run: 104, Failures: 0, Errors: 0, Skipped: 0
[INFO] 
[INFO] 
[INFO] --- maven-bundle-plugin:4.0.0:bundle (default-bundle) @ leshan-core ---
[INFO] 
[INFO] >>> maven-source-plugin:3.2.1:jar (attach-sources) > generate-sources @ leshan-core >>>
[INFO] 
[INFO] --- maven-enforcer-plugin:1.4.1:enforce (enforce-maven) @ leshan-core ---
[INFO] 
[INFO] --- maven-toolchains-plugin:3.0.0:toolchain (default) @ leshan-core ---
[INFO] Required toolchain: jdk [ version='1.7' ]
[INFO] Found matching toolchain for type jdk: JDK[/opt/tools/java/oracle/jdk-7/latest]
[INFO] 
[INFO] <<< maven-source-plugin:3.2.1:jar (attach-sources) < generate-sources @ leshan-core <<<
[INFO] 
[INFO] 
[INFO] --- maven-source-plugin:3.2.1:jar (attach-sources) @ leshan-core ---
[INFO] Building jar: /home/jenkins/agent/workspace/leshan/leshan-core/target/leshan-core-1.1.0-SNAPSHOT-sources.jar
[INFO] 
[INFO] --- revapi-maven-plugin:0.11.2:check (default) @ leshan-core ---
[INFO] Comparing [org.eclipse.leshan:leshan-core:jar:1.0.0] against [org.eclipse.leshan:leshan-core:jar:1.1.0-SNAPSHOT] (including their transitive dependencies).
[INFO] API checks completed without failures.
[INFO] 
[INFO] --- maven-install-plugin:2.5.2:install (default-install) @ leshan-core ---
[INFO] Installing /home/jenkins/agent/workspace/leshan/leshan-core/target/leshan-core-1.1.0-SNAPSHOT.jar to /home/jenkins/.m2/repository/org/eclipse/leshan/leshan-core/1.1.0-SNAPSHOT/leshan-core-1.1.0-SNAPSHOT.jar
[INFO] Installing /home/jenkins/agent/workspace/leshan/leshan-core/pom.xml to /home/jenkins/.m2/repository/org/eclipse/leshan/leshan-core/1.1.0-SNAPSHOT/leshan-core-1.1.0-SNAPSHOT.pom
[INFO] Installing /home/jenkins/agent/workspace/leshan/leshan-core/target/leshan-core-1.1.0-SNAPSHOT-sources.jar to /home/jenkins/.m2/repository/org/eclipse/leshan/leshan-core/1.1.0-SNAPSHOT/leshan-core-1.1.0-SNAPSHOT-sources.jar
[INFO] 
[INFO] --- maven-bundle-plugin:4.0.0:install (default-install) @ leshan-core ---
[INFO] Writing OBR metadata
[INFO] Installing org/eclipse/leshan/leshan-core/1.1.0-SNAPSHOT/leshan-core-1.1.0-SNAPSHOT.jar
[INFO] Writing OBR metadata
[INFO] 
[INFO] >>> maven-javadoc-plugin:3.1.1:javadoc (default-cli) > generate-sources @ leshan-core >>>
[INFO] 
[INFO] --- maven-enforcer-plugin:1.4.1:enforce (enforce-maven) @ leshan-core ---
[INFO] 
[INFO] --- maven-toolchains-plugin:3.0.0:toolchain (default) @ leshan-core ---
[INFO] Required toolchain: jdk [ version='1.7' ]
[INFO] Found matching toolchain for type jdk: JDK[/opt/tools/java/oracle/jdk-7/latest]
[INFO] 
[INFO] <<< maven-javadoc-plugin:3.1.1:javadoc (default-cli) < generate-sources @ leshan-core <<<
[INFO] 
[INFO] 
[INFO] --- maven-javadoc-plugin:3.1.1:javadoc (default-cli) @ leshan-core ---
[INFO] Toolchain in maven-javadoc-plugin: JDK[/opt/tools/java/oracle/jdk-7/latest]
[INFO] 
4 warnings
[WARNING] Javadoc Warnings
[WARNING] /home/jenkins/agent/workspace/leshan/leshan-core/src/main/java/org/eclipse/leshan/core/model/DDFFileParser.java:120: warning - Missing closing '}' character for inline tag: "{@link FileInputStream#FileInputStream(File) or DocumentBuilder#parse(InputStream)"
[WARNING] /home/jenkins/agent/workspace/leshan/leshan-core/src/main/java/org/eclipse/leshan/core/model/DDFFileParser.java:134: warning - Missing closing '}' character for inline tag: "{@link FileInputStream#FileInputStream(File) or DocumentBuilder#parse(InputStream)"
[WARNING] /home/jenkins/agent/workspace/leshan/leshan-core/src/main/java/org/eclipse/leshan/core/model/DefaultDDFFileValidator.java:69: warning - Tag @link: malformed: "SchemaFactory#newSchema(Source))"
[WARNING] /home/jenkins/agent/workspace/leshan/leshan-core/src/main/java/org/eclipse/leshan/core/model/DefaultDDFFileValidator.java:69: warning - Tag @link: reference not found: SchemaFactory#newSchema(Source))
[INFO] 
[INFO] -----------------< org.eclipse.leshan:leshan-core-cf >------------------
[INFO] Building leshan - core californium 1.1.0-SNAPSHOT                 [3/12]
[INFO] -------------------------------[ bundle ]-------------------------------
[INFO] 
[INFO] --- maven-clean-plugin:3.1.0:clean (default-clean) @ leshan-core-cf ---
[INFO] 
[INFO] --- maven-enforcer-plugin:1.4.1:enforce (enforce-maven) @ leshan-core-cf ---
[INFO] 
[INFO] --- maven-toolchains-plugin:3.0.0:toolchain (default) @ leshan-core-cf ---
[INFO] Required toolchain: jdk [ version='1.7' ]
[INFO] Found matching toolchain for type jdk: JDK[/opt/tools/java/oracle/jdk-7/latest]
[INFO] 
[INFO] --- maven-resources-plugin:3.1.0:resources (default-resources) @ leshan-core-cf ---
[INFO] Using 'UTF-8' encoding to copy filtered resources.
[INFO] skip non existing resourceDirectory /home/jenkins/agent/workspace/leshan/leshan-core-cf/src/main/resources
[INFO] 
[INFO] --- maven-compiler-plugin:3.8.1:compile (default-compile) @ leshan-core-cf ---
[INFO] Toolchain in maven-compiler-plugin: JDK[/opt/tools/java/oracle/jdk-7/latest]
[INFO] Changes detected - recompiling the module!
[INFO] Compiling 12 source files to /home/jenkins/agent/workspace/leshan/leshan-core-cf/target/classes
[INFO] 
[INFO] --- animal-sniffer-maven-plugin:1.18:check (default) @ leshan-core-cf ---
[INFO] Checking unresolved references to net.sf.androidscents.signature:android-api-level-19:4.4.2_r4
[INFO] 
[INFO] --- maven-resources-plugin:3.1.0:testResources (default-testResources) @ leshan-core-cf ---
[INFO] Using 'UTF-8' encoding to copy filtered resources.
[INFO] skip non existing resourceDirectory /home/jenkins/agent/workspace/leshan/leshan-core-cf/src/test/resources
[INFO] 
[INFO] --- maven-compiler-plugin:3.8.1:testCompile (default-testCompile) @ leshan-core-cf ---
[INFO] Toolchain in maven-compiler-plugin: JDK[/opt/tools/java/oracle/jdk-7/latest]
[INFO] Changes detected - recompiling the module!
[INFO] Compiling 1 source file to /home/jenkins/agent/workspace/leshan/leshan-core-cf/target/test-classes
[INFO] 
[INFO] --- maven-surefire-plugin:3.0.0-M4:test (default-test) @ leshan-core-cf ---
[INFO] Toolchain in maven-surefire-plugin: JDK[/opt/tools/java/oracle/jdk-7/latest]
[INFO] 
[INFO] -------------------------------------------------------
[INFO]  T E S T S
[INFO] -------------------------------------------------------
[INFO] Running org.eclipse.leshan.core.californium.ResponseCodeUtilTest
[INFO] Tests run: 7, Failures: 0, Errors: 0, Skipped: 0, Time elapsed: 0.144 s - in org.eclipse.leshan.core.californium.ResponseCodeUtilTest
[INFO] 
[INFO] Results:
[INFO] 
[INFO] Tests run: 7, Failures: 0, Errors: 0, Skipped: 0
[INFO] 
[INFO] 
[INFO] --- maven-bundle-plugin:4.0.0:bundle (default-bundle) @ leshan-core-cf ---
[INFO] 
[INFO] >>> maven-source-plugin:3.2.1:jar (attach-sources) > generate-sources @ leshan-core-cf >>>
[INFO] 
[INFO] --- maven-enforcer-plugin:1.4.1:enforce (enforce-maven) @ leshan-core-cf ---
[INFO] 
[INFO] --- maven-toolchains-plugin:3.0.0:toolchain (default) @ leshan-core-cf ---
[INFO] Required toolchain: jdk [ version='1.7' ]
[INFO] Found matching toolchain for type jdk: JDK[/opt/tools/java/oracle/jdk-7/latest]
[INFO] 
[INFO] <<< maven-source-plugin:3.2.1:jar (attach-sources) < generate-sources @ leshan-core-cf <<<
[INFO] 
[INFO] 
[INFO] --- maven-source-plugin:3.2.1:jar (attach-sources) @ leshan-core-cf ---
[INFO] Building jar: /home/jenkins/agent/workspace/leshan/leshan-core-cf/target/leshan-core-cf-1.1.0-SNAPSHOT-sources.jar
[INFO] 
[INFO] --- revapi-maven-plugin:0.11.2:check (default) @ leshan-core-cf ---
[INFO] Comparing [org.eclipse.leshan:leshan-core-cf:jar:1.0.0] against [org.eclipse.leshan:leshan-core-cf:jar:1.1.0-SNAPSHOT] (including their transitive dependencies).
[INFO] API checks completed without failures.
[INFO] 
[INFO] --- maven-install-plugin:2.5.2:install (default-install) @ leshan-core-cf ---
[INFO] Installing /home/jenkins/agent/workspace/leshan/leshan-core-cf/target/leshan-core-cf-1.1.0-SNAPSHOT.jar to /home/jenkins/.m2/repository/org/eclipse/leshan/leshan-core-cf/1.1.0-SNAPSHOT/leshan-core-cf-1.1.0-SNAPSHOT.jar
[INFO] Installing /home/jenkins/agent/workspace/leshan/leshan-core-cf/pom.xml to /home/jenkins/.m2/repository/org/eclipse/leshan/leshan-core-cf/1.1.0-SNAPSHOT/leshan-core-cf-1.1.0-SNAPSHOT.pom
[INFO] Installing /home/jenkins/agent/workspace/leshan/leshan-core-cf/target/leshan-core-cf-1.1.0-SNAPSHOT-sources.jar to /home/jenkins/.m2/repository/org/eclipse/leshan/leshan-core-cf/1.1.0-SNAPSHOT/leshan-core-cf-1.1.0-SNAPSHOT-sources.jar
[INFO] 
[INFO] --- maven-bundle-plugin:4.0.0:install (default-install) @ leshan-core-cf ---
[INFO] Installing org/eclipse/leshan/leshan-core-cf/1.1.0-SNAPSHOT/leshan-core-cf-1.1.0-SNAPSHOT.jar
[INFO] Writing OBR metadata
[INFO] 
[INFO] >>> maven-javadoc-plugin:3.1.1:javadoc (default-cli) > generate-sources @ leshan-core-cf >>>
[INFO] 
[INFO] --- maven-enforcer-plugin:1.4.1:enforce (enforce-maven) @ leshan-core-cf ---
[INFO] 
[INFO] --- maven-toolchains-plugin:3.0.0:toolchain (default) @ leshan-core-cf ---
[INFO] Required toolchain: jdk [ version='1.7' ]
[INFO] Found matching toolchain for type jdk: JDK[/opt/tools/java/oracle/jdk-7/latest]
[INFO] 
[INFO] <<< maven-javadoc-plugin:3.1.1:javadoc (default-cli) < generate-sources @ leshan-core-cf <<<
[INFO] 
[INFO] 
[INFO] --- maven-javadoc-plugin:3.1.1:javadoc (default-cli) @ leshan-core-cf ---
[INFO] Toolchain in maven-javadoc-plugin: JDK[/opt/tools/java/oracle/jdk-7/latest]
[INFO] 
[INFO] ---------------< org.eclipse.leshan:leshan-server-core >----------------
[INFO] Building leshan - server core 1.1.0-SNAPSHOT                      [4/12]
[INFO] -------------------------------[ bundle ]-------------------------------
[INFO] 
[INFO] --- maven-clean-plugin:3.1.0:clean (default-clean) @ leshan-server-core ---
[INFO] 
[INFO] --- maven-enforcer-plugin:1.4.1:enforce (enforce-maven) @ leshan-server-core ---
[INFO] 
[INFO] --- maven-toolchains-plugin:3.0.0:toolchain (default) @ leshan-server-core ---
[INFO] Required toolchain: jdk [ version='1.7' ]
[INFO] Found matching toolchain for type jdk: JDK[/opt/tools/java/oracle/jdk-7/latest]
[INFO] 
[INFO] --- maven-resources-plugin:3.1.0:resources (default-resources) @ leshan-server-core ---
[INFO] Using 'UTF-8' encoding to copy filtered resources.
[INFO] skip non existing resourceDirectory /home/jenkins/agent/workspace/leshan/leshan-server-core/src/main/resources
[INFO] 
[INFO] --- maven-compiler-plugin:3.8.1:compile (default-compile) @ leshan-server-core ---
[INFO] Toolchain in maven-compiler-plugin: JDK[/opt/tools/java/oracle/jdk-7/latest]
[INFO] Changes detected - recompiling the module!
[INFO] Compiling 58 source files to /home/jenkins/agent/workspace/leshan/leshan-server-core/target/classes
[INFO] 
[INFO] --- animal-sniffer-maven-plugin:1.18:check (default) @ leshan-server-core ---
[INFO] Checking unresolved references to net.sf.androidscents.signature:android-api-level-19:4.4.2_r4
[INFO] 
[INFO] --- maven-resources-plugin:3.1.0:testResources (default-testResources) @ leshan-server-core ---
[INFO] Using 'UTF-8' encoding to copy filtered resources.
[INFO] skip non existing resourceDirectory /home/jenkins/agent/workspace/leshan/leshan-server-core/src/test/resources
[INFO] 
[INFO] --- maven-compiler-plugin:3.8.1:testCompile (default-testCompile) @ leshan-server-core ---
[INFO] Toolchain in maven-compiler-plugin: JDK[/opt/tools/java/oracle/jdk-7/latest]
[INFO] Changes detected - recompiling the module!
[INFO] Compiling 7 source files to /home/jenkins/agent/workspace/leshan/leshan-server-core/target/test-classes
[INFO] 
[INFO] --- maven-surefire-plugin:3.0.0-M4:test (default-test) @ leshan-server-core ---
[INFO] Toolchain in maven-surefire-plugin: JDK[/opt/tools/java/oracle/jdk-7/latest]
[INFO] 
[INFO] -------------------------------------------------------
[INFO]  T E S T S
[INFO] -------------------------------------------------------
[INFO] Running org.eclipse.leshan.server.registration.RegistrationSortObjectLinksTest
[INFO] Tests run: 1, Failures: 0, Errors: 0, Skipped: 0, Time elapsed: 0.012 s - in org.eclipse.leshan.server.registration.RegistrationSortObjectLinksTest
[INFO] Running org.eclipse.leshan.server.queue.PresenceServiceTest
SLF4J: A number (4) of logging calls during the initialization phase have been intercepted and are
SLF4J: now being replayed. These are subject to the filtering rules of the underlying logging system.
SLF4J: See also http://www.slf4j.org/codes.html#replay
[INFO] Tests run: 2, Failures: 0, Errors: 0, Skipped: 0, Time elapsed: 0.165 s - in org.eclipse.leshan.server.queue.PresenceServiceTest
[INFO] Running org.eclipse.leshan.server.registration.RegistrationTest
[INFO] Tests run: 6, Failures: 0, Errors: 0, Skipped: 0, Time elapsed: 0.012 s - in org.eclipse.leshan.server.registration.RegistrationTest
[INFO] Running org.eclipse.leshan.server.bootstrap.BootstrapHandlerTest
[INFO] Tests run: 4, Failures: 0, Errors: 0, Skipped: 0, Time elapsed: 0.038 s - in org.eclipse.leshan.server.bootstrap.BootstrapHandlerTest
[INFO] Running org.eclipse.leshan.server.SerializationTests
[INFO] Tests run: 3, Failures: 0, Errors: 0, Skipped: 0, Time elapsed: 0.012 s - in org.eclipse.leshan.server.SerializationTests
[INFO] Running org.eclipse.leshan.server.registration.RegistrationUpdateTest
[INFO] Tests run: 1, Failures: 0, Errors: 0, Skipped: 0, Time elapsed: 0.013 s - in org.eclipse.leshan.server.registration.RegistrationUpdateTest
[INFO] 
[INFO] Results:
[INFO] 
[INFO] Tests run: 17, Failures: 0, Errors: 0, Skipped: 0
[INFO] 
[INFO] 
[INFO] --- maven-bundle-plugin:4.0.0:bundle (default-bundle) @ leshan-server-core ---
[INFO] 
[INFO] >>> maven-source-plugin:3.2.1:jar (attach-sources) > generate-sources @ leshan-server-core >>>
[INFO] 
[INFO] --- maven-enforcer-plugin:1.4.1:enforce (enforce-maven) @ leshan-server-core ---
[INFO] 
[INFO] --- maven-toolchains-plugin:3.0.0:toolchain (default) @ leshan-server-core ---
[INFO] Required toolchain: jdk [ version='1.7' ]
[INFO] Found matching toolchain for type jdk: JDK[/opt/tools/java/oracle/jdk-7/latest]
[INFO] 
[INFO] <<< maven-source-plugin:3.2.1:jar (attach-sources) < generate-sources @ leshan-server-core <<<
[INFO] 
[INFO] 
[INFO] --- maven-source-plugin:3.2.1:jar (attach-sources) @ leshan-server-core ---
[INFO] Building jar: /home/jenkins/agent/workspace/leshan/leshan-server-core/target/leshan-server-core-1.1.0-SNAPSHOT-sources.jar
[INFO] 
[INFO] --- revapi-maven-plugin:0.11.2:check (default) @ leshan-server-core ---
[INFO] Comparing [org.eclipse.leshan:leshan-server-core:jar:1.0.0] against [org.eclipse.leshan:leshan-server-core:jar:1.1.0-SNAPSHOT] (including their transitive dependencies).
[INFO] API checks completed without failures.
[INFO] 
[INFO] --- maven-install-plugin:2.5.2:install (default-install) @ leshan-server-core ---
[INFO] Installing /home/jenkins/agent/workspace/leshan/leshan-server-core/target/leshan-server-core-1.1.0-SNAPSHOT.jar to /home/jenkins/.m2/repository/org/eclipse/leshan/leshan-server-core/1.1.0-SNAPSHOT/leshan-server-core-1.1.0-SNAPSHOT.jar
[INFO] Installing /home/jenkins/agent/workspace/leshan/leshan-server-core/pom.xml to /home/jenkins/.m2/repository/org/eclipse/leshan/leshan-server-core/1.1.0-SNAPSHOT/leshan-server-core-1.1.0-SNAPSHOT.pom
[INFO] Installing /home/jenkins/agent/workspace/leshan/leshan-server-core/target/leshan-server-core-1.1.0-SNAPSHOT-sources.jar to /home/jenkins/.m2/repository/org/eclipse/leshan/leshan-server-core/1.1.0-SNAPSHOT/leshan-server-core-1.1.0-SNAPSHOT-sources.jar
[INFO] 
[INFO] --- maven-bundle-plugin:4.0.0:install (default-install) @ leshan-server-core ---
[INFO] Installing org/eclipse/leshan/leshan-server-core/1.1.0-SNAPSHOT/leshan-server-core-1.1.0-SNAPSHOT.jar
[INFO] Writing OBR metadata
[INFO] 
[INFO] >>> maven-javadoc-plugin:3.1.1:javadoc (default-cli) > generate-sources @ leshan-server-core >>>
[INFO] 
[INFO] --- maven-enforcer-plugin:1.4.1:enforce (enforce-maven) @ leshan-server-core ---
[INFO] 
[INFO] --- maven-toolchains-plugin:3.0.0:toolchain (default) @ leshan-server-core ---
[INFO] Required toolchain: jdk [ version='1.7' ]
[INFO] Found matching toolchain for type jdk: JDK[/opt/tools/java/oracle/jdk-7/latest]
[INFO] 
[INFO] <<< maven-javadoc-plugin:3.1.1:javadoc (default-cli) < generate-sources @ leshan-server-core <<<
[INFO] 
[INFO] 
[INFO] --- maven-javadoc-plugin:3.1.1:javadoc (default-cli) @ leshan-server-core ---
[INFO] Toolchain in maven-javadoc-plugin: JDK[/opt/tools/java/oracle/jdk-7/latest]
[INFO] 
[INFO] ----------------< org.eclipse.leshan:leshan-server-cf >-----------------
[INFO] Building leshan - server californium 1.1.0-SNAPSHOT               [5/12]
[INFO] -------------------------------[ bundle ]-------------------------------
[INFO] 
[INFO] --- maven-clean-plugin:3.1.0:clean (default-clean) @ leshan-server-cf ---
[INFO] 
[INFO] --- maven-enforcer-plugin:1.4.1:enforce (enforce-maven) @ leshan-server-cf ---
[INFO] 
[INFO] --- maven-toolchains-plugin:3.0.0:toolchain (default) @ leshan-server-cf ---
[INFO] Required toolchain: jdk [ version='1.7' ]
[INFO] Found matching toolchain for type jdk: JDK[/opt/tools/java/oracle/jdk-7/latest]
[INFO] 
[INFO] --- maven-resources-plugin:3.1.0:resources (default-resources) @ leshan-server-cf ---
[INFO] Using 'UTF-8' encoding to copy filtered resources.
[INFO] skip non existing resourceDirectory /home/jenkins/agent/workspace/leshan/leshan-server-cf/src/main/resources
[INFO] 
[INFO] --- maven-compiler-plugin:3.8.1:compile (default-compile) @ leshan-server-cf ---
[INFO] Toolchain in maven-compiler-plugin: JDK[/opt/tools/java/oracle/jdk-7/latest]
[INFO] Changes detected - recompiling the module!
[INFO] Compiling 21 source files to /home/jenkins/agent/workspace/leshan/leshan-server-cf/target/classes
[INFO] 
[INFO] --- animal-sniffer-maven-plugin:1.18:check (default) @ leshan-server-cf ---
[INFO] Checking unresolved references to net.sf.androidscents.signature:android-api-level-19:4.4.2_r4
[INFO] 
[INFO] --- maven-resources-plugin:3.1.0:testResources (default-testResources) @ leshan-server-cf ---
[INFO] Using 'UTF-8' encoding to copy filtered resources.
[INFO] skip non existing resourceDirectory /home/jenkins/agent/workspace/leshan/leshan-server-cf/src/test/resources
[INFO] 
[INFO] --- maven-compiler-plugin:3.8.1:testCompile (default-testCompile) @ leshan-server-cf ---
[INFO] Toolchain in maven-compiler-plugin: JDK[/opt/tools/java/oracle/jdk-7/latest]
[INFO] Changes detected - recompiling the module!
[INFO] Compiling 8 source files to /home/jenkins/agent/workspace/leshan/leshan-server-cf/target/test-classes
[INFO] 
[INFO] --- maven-surefire-plugin:3.0.0-M4:test (default-test) @ leshan-server-cf ---
[INFO] Toolchain in maven-surefire-plugin: JDK[/opt/tools/java/oracle/jdk-7/latest]
[INFO] 
[INFO] -------------------------------------------------------
[INFO]  T E S T S
[INFO] -------------------------------------------------------
[INFO] Running org.eclipse.leshan.server.californium.bootstrap.LeshanBootstrapServerBuilderTest
[INFO] Tests run: 4, Failures: 0, Errors: 0, Skipped: 0, Time elapsed: 1.061 s - in org.eclipse.leshan.server.californium.bootstrap.LeshanBootstrapServerBuilderTest
[INFO] Running org.eclipse.leshan.server.californium.bootstrap.LeshanBootstrapServerTest
[INFO] Tests run: 3, Failures: 0, Errors: 0, Skipped: 0, Time elapsed: 2.733 s - in org.eclipse.leshan.server.californium.bootstrap.LeshanBootstrapServerTest
[INFO] Running org.eclipse.leshan.server.californium.LeshanServerBuilderTest
[INFO] Tests run: 4, Failures: 0, Errors: 0, Skipped: 0, Time elapsed: 0.791 s - in org.eclipse.leshan.server.californium.LeshanServerBuilderTest
[INFO] Running org.eclipse.leshan.server.californium.observation.ObservationServiceTest
[INFO] Tests run: 4, Failures: 0, Errors: 0, Skipped: 0, Time elapsed: 0.453 s - in org.eclipse.leshan.server.californium.observation.ObservationServiceTest
[INFO] Running org.eclipse.leshan.server.californium.registration.InMemoryRegistrationStoreTest
[INFO] Tests run: 3, Failures: 0, Errors: 0, Skipped: 0, Time elapsed: 0.245 s - in org.eclipse.leshan.server.californium.registration.InMemoryRegistrationStoreTest
[INFO] Running org.eclipse.leshan.server.californium.LeshanServerTest
[INFO] Tests run: 3, Failures: 0, Errors: 0, Skipped: 0, Time elapsed: 2.76 s - in org.eclipse.leshan.server.californium.LeshanServerTest
[INFO] Running org.eclipse.leshan.server.californium.request.CoapRequestBuilderTest
[INFO] Tests run: 13, Failures: 0, Errors: 0, Skipped: 0, Time elapsed: 0.148 s - in org.eclipse.leshan.server.californium.request.CoapRequestBuilderTest
[INFO] 
[INFO] Results:
[INFO] 
[INFO] Tests run: 34, Failures: 0, Errors: 0, Skipped: 0
[INFO] 
[INFO] 
[INFO] --- maven-bundle-plugin:4.0.0:bundle (default-bundle) @ leshan-server-cf ---
[INFO] 
[INFO] >>> maven-source-plugin:3.2.1:jar (attach-sources) > generate-sources @ leshan-server-cf >>>
[INFO] 
[INFO] --- maven-enforcer-plugin:1.4.1:enforce (enforce-maven) @ leshan-server-cf ---
[INFO] 
[INFO] --- maven-toolchains-plugin:3.0.0:toolchain (default) @ leshan-server-cf ---
[INFO] Required toolchain: jdk [ version='1.7' ]
[INFO] Found matching toolchain for type jdk: JDK[/opt/tools/java/oracle/jdk-7/latest]
[INFO] 
[INFO] <<< maven-source-plugin:3.2.1:jar (attach-sources) < generate-sources @ leshan-server-cf <<<
[INFO] 
[INFO] 
[INFO] --- maven-source-plugin:3.2.1:jar (attach-sources) @ leshan-server-cf ---
[INFO] Building jar: /home/jenkins/agent/workspace/leshan/leshan-server-cf/target/leshan-server-cf-1.1.0-SNAPSHOT-sources.jar
[INFO] 
[INFO] --- revapi-maven-plugin:0.11.2:check (default) @ leshan-server-cf ---
[INFO] Comparing [org.eclipse.leshan:leshan-server-cf:jar:1.0.0] against [org.eclipse.leshan:leshan-server-cf:jar:1.1.0-SNAPSHOT] (including their transitive dependencies).
[INFO] API checks completed without failures.
[INFO] 
[INFO] --- maven-install-plugin:2.5.2:install (default-install) @ leshan-server-cf ---
[INFO] Installing /home/jenkins/agent/workspace/leshan/leshan-server-cf/target/leshan-server-cf-1.1.0-SNAPSHOT.jar to /home/jenkins/.m2/repository/org/eclipse/leshan/leshan-server-cf/1.1.0-SNAPSHOT/leshan-server-cf-1.1.0-SNAPSHOT.jar
[INFO] Installing /home/jenkins/agent/workspace/leshan/leshan-server-cf/pom.xml to /home/jenkins/.m2/repository/org/eclipse/leshan/leshan-server-cf/1.1.0-SNAPSHOT/leshan-server-cf-1.1.0-SNAPSHOT.pom
[INFO] Installing /home/jenkins/agent/workspace/leshan/leshan-server-cf/target/leshan-server-cf-1.1.0-SNAPSHOT-sources.jar to /home/jenkins/.m2/repository/org/eclipse/leshan/leshan-server-cf/1.1.0-SNAPSHOT/leshan-server-cf-1.1.0-SNAPSHOT-sources.jar
[INFO] 
[INFO] --- maven-bundle-plugin:4.0.0:install (default-install) @ leshan-server-cf ---
[INFO] Installing org/eclipse/leshan/leshan-server-cf/1.1.0-SNAPSHOT/leshan-server-cf-1.1.0-SNAPSHOT.jar
[INFO] Writing OBR metadata
[INFO] 
[INFO] >>> maven-javadoc-plugin:3.1.1:javadoc (default-cli) > generate-sources @ leshan-server-cf >>>
[INFO] 
[INFO] --- maven-enforcer-plugin:1.4.1:enforce (enforce-maven) @ leshan-server-cf ---
[INFO] 
[INFO] --- maven-toolchains-plugin:3.0.0:toolchain (default) @ leshan-server-cf ---
[INFO] Required toolchain: jdk [ version='1.7' ]
[INFO] Found matching toolchain for type jdk: JDK[/opt/tools/java/oracle/jdk-7/latest]
[INFO] 
[INFO] <<< maven-javadoc-plugin:3.1.1:javadoc (default-cli) < generate-sources @ leshan-server-cf <<<
[INFO] 
[INFO] 
[INFO] --- maven-javadoc-plugin:3.1.1:javadoc (default-cli) @ leshan-server-cf ---
[INFO] Toolchain in maven-javadoc-plugin: JDK[/opt/tools/java/oracle/jdk-7/latest]
[INFO] 
[INFO] ---------------< org.eclipse.leshan:leshan-server-redis >---------------
[INFO] Building leshan - server redis 1.1.0-SNAPSHOT                     [6/12]
[INFO] -------------------------------[ bundle ]-------------------------------
[INFO] 
[INFO] --- maven-clean-plugin:3.1.0:clean (default-clean) @ leshan-server-redis ---
[INFO] 
[INFO] --- maven-enforcer-plugin:1.4.1:enforce (enforce-maven) @ leshan-server-redis ---
[INFO] 
[INFO] --- maven-toolchains-plugin:3.0.0:toolchain (default) @ leshan-server-redis ---
[INFO] Required toolchain: jdk [ version='1.7' ]
[INFO] Found matching toolchain for type jdk: JDK[/opt/tools/java/oracle/jdk-7/latest]
[INFO] 
[INFO] --- maven-resources-plugin:3.1.0:resources (default-resources) @ leshan-server-redis ---
[INFO] Using 'UTF-8' encoding to copy filtered resources.
[INFO] skip non existing resourceDirectory /home/jenkins/agent/workspace/leshan/leshan-server-redis/src/main/resources
[INFO] 
[INFO] --- maven-compiler-plugin:3.8.1:compile (default-compile) @ leshan-server-redis ---
[INFO] Toolchain in maven-compiler-plugin: JDK[/opt/tools/java/oracle/jdk-7/latest]
[INFO] Changes detected - recompiling the module!
[INFO] Compiling 10 source files to /home/jenkins/agent/workspace/leshan/leshan-server-redis/target/classes
[INFO] 
[INFO] --- maven-resources-plugin:3.1.0:testResources (default-testResources) @ leshan-server-redis ---
[INFO] Using 'UTF-8' encoding to copy filtered resources.
[INFO] skip non existing resourceDirectory /home/jenkins/agent/workspace/leshan/leshan-server-redis/src/test/resources
[INFO] 
[INFO] --- maven-compiler-plugin:3.8.1:testCompile (default-testCompile) @ leshan-server-redis ---
[INFO] Toolchain in maven-compiler-plugin: JDK[/opt/tools/java/oracle/jdk-7/latest]
[INFO] Changes detected - recompiling the module!
[INFO] Compiling 2 source files to /home/jenkins/agent/workspace/leshan/leshan-server-redis/target/test-classes
[INFO] 
[INFO] --- maven-surefire-plugin:3.0.0-M4:test (default-test) @ leshan-server-redis ---
[INFO] Toolchain in maven-surefire-plugin: JDK[/opt/tools/java/oracle/jdk-7/latest]
[INFO] 
[INFO] -------------------------------------------------------
[INFO]  T E S T S
[INFO] -------------------------------------------------------
[INFO] Running org.eclipse.leshan.server.redis.serialization.RegistrationSerDesTest
[INFO] Tests run: 1, Failures: 0, Errors: 0, Skipped: 0, Time elapsed: 0.027 s - in org.eclipse.leshan.server.redis.serialization.RegistrationSerDesTest
[INFO] Running org.eclipse.leshan.server.redis.serialization.SecurityInfoSerDesTest
[INFO] Tests run: 2, Failures: 0, Errors: 0, Skipped: 0, Time elapsed: 0.055 s - in org.eclipse.leshan.server.redis.serialization.SecurityInfoSerDesTest
[INFO] 
[INFO] Results:
[INFO] 
[INFO] Tests run: 3, Failures: 0, Errors: 0, Skipped: 0
[INFO] 
[INFO] 
[INFO] --- maven-bundle-plugin:4.0.0:bundle (default-bundle) @ leshan-server-redis ---
[INFO] 
[INFO] >>> maven-source-plugin:3.2.1:jar (attach-sources) > generate-sources @ leshan-server-redis >>>
[INFO] 
[INFO] --- maven-enforcer-plugin:1.4.1:enforce (enforce-maven) @ leshan-server-redis ---
[INFO] 
[INFO] --- maven-toolchains-plugin:3.0.0:toolchain (default) @ leshan-server-redis ---
[INFO] Required toolchain: jdk [ version='1.7' ]
[INFO] Found matching toolchain for type jdk: JDK[/opt/tools/java/oracle/jdk-7/latest]
[INFO] 
[INFO] <<< maven-source-plugin:3.2.1:jar (attach-sources) < generate-sources @ leshan-server-redis <<<
[INFO] 
[INFO] 
[INFO] --- maven-source-plugin:3.2.1:jar (attach-sources) @ leshan-server-redis ---
[INFO] Building jar: /home/jenkins/agent/workspace/leshan/leshan-server-redis/target/leshan-server-redis-1.1.0-SNAPSHOT-sources.jar
[INFO] 
[INFO] --- revapi-maven-plugin:0.11.2:check (default) @ leshan-server-redis ---
[INFO] Comparing [org.eclipse.leshan:leshan-server-redis:jar:1.0.0] against [org.eclipse.leshan:leshan-server-redis:jar:1.1.0-SNAPSHOT] (including their transitive dependencies).
[INFO] API checks completed without failures.
[INFO] 
[INFO] --- maven-install-plugin:2.5.2:install (default-install) @ leshan-server-redis ---
[INFO] Installing /home/jenkins/agent/workspace/leshan/leshan-server-redis/target/leshan-server-redis-1.1.0-SNAPSHOT.jar to /home/jenkins/.m2/repository/org/eclipse/leshan/leshan-server-redis/1.1.0-SNAPSHOT/leshan-server-redis-1.1.0-SNAPSHOT.jar
[INFO] Installing /home/jenkins/agent/workspace/leshan/leshan-server-redis/pom.xml to /home/jenkins/.m2/repository/org/eclipse/leshan/leshan-server-redis/1.1.0-SNAPSHOT/leshan-server-redis-1.1.0-SNAPSHOT.pom
[INFO] Installing /home/jenkins/agent/workspace/leshan/leshan-server-redis/target/leshan-server-redis-1.1.0-SNAPSHOT-sources.jar to /home/jenkins/.m2/repository/org/eclipse/leshan/leshan-server-redis/1.1.0-SNAPSHOT/leshan-server-redis-1.1.0-SNAPSHOT-sources.jar
[INFO] 
[INFO] --- maven-bundle-plugin:4.0.0:install (default-install) @ leshan-server-redis ---
[INFO] Installing org/eclipse/leshan/leshan-server-redis/1.1.0-SNAPSHOT/leshan-server-redis-1.1.0-SNAPSHOT.jar
[INFO] Writing OBR metadata
[INFO] 
[INFO] >>> maven-javadoc-plugin:3.1.1:javadoc (default-cli) > generate-sources @ leshan-server-redis >>>
[INFO] 
[INFO] --- maven-enforcer-plugin:1.4.1:enforce (enforce-maven) @ leshan-server-redis ---
[INFO] 
[INFO] --- maven-toolchains-plugin:3.0.0:toolchain (default) @ leshan-server-redis ---
[INFO] Required toolchain: jdk [ version='1.7' ]
[INFO] Found matching toolchain for type jdk: JDK[/opt/tools/java/oracle/jdk-7/latest]
[INFO] 
[INFO] <<< maven-javadoc-plugin:3.1.1:javadoc (default-cli) < generate-sources @ leshan-server-redis <<<
[INFO] 
[INFO] 
[INFO] --- maven-javadoc-plugin:3.1.1:javadoc (default-cli) @ leshan-server-redis ---
[INFO] Toolchain in maven-javadoc-plugin: JDK[/opt/tools/java/oracle/jdk-7/latest]
[INFO] 
[INFO] ---------------< org.eclipse.leshan:leshan-client-core >----------------
[INFO] Building leshan - client core 1.1.0-SNAPSHOT                      [7/12]
[INFO] -------------------------------[ bundle ]-------------------------------
[INFO] 
[INFO] --- maven-clean-plugin:3.1.0:clean (default-clean) @ leshan-client-core ---
[INFO] 
[INFO] --- maven-enforcer-plugin:1.4.1:enforce (enforce-maven) @ leshan-client-core ---
[INFO] 
[INFO] --- maven-toolchains-plugin:3.0.0:toolchain (default) @ leshan-client-core ---
[INFO] Required toolchain: jdk [ version='1.7' ]
[INFO] Found matching toolchain for type jdk: JDK[/opt/tools/java/oracle/jdk-7/latest]
[INFO] 
[INFO] --- maven-resources-plugin:3.1.0:resources (default-resources) @ leshan-client-core ---
[INFO] Using 'UTF-8' encoding to copy filtered resources.
[INFO] skip non existing resourceDirectory /home/jenkins/agent/workspace/leshan/leshan-client-core/src/main/resources
[INFO] 
[INFO] --- maven-compiler-plugin:3.8.1:compile (default-compile) @ leshan-client-core ---
[INFO] Toolchain in maven-compiler-plugin: JDK[/opt/tools/java/oracle/jdk-7/latest]
[INFO] Changes detected - recompiling the module!
[INFO] Compiling 41 source files to /home/jenkins/agent/workspace/leshan/leshan-client-core/target/classes
[INFO] 
[INFO] --- animal-sniffer-maven-plugin:1.18:check (default) @ leshan-client-core ---
[INFO] Checking unresolved references to net.sf.androidscents.signature:android-api-level-19:4.4.2_r4
[INFO] 
[INFO] --- maven-resources-plugin:3.1.0:testResources (default-testResources) @ leshan-client-core ---
[INFO] Using 'UTF-8' encoding to copy filtered resources.
[INFO] skip non existing resourceDirectory /home/jenkins/agent/workspace/leshan/leshan-client-core/src/test/resources
[INFO] 
[INFO] --- maven-compiler-plugin:3.8.1:testCompile (default-testCompile) @ leshan-client-core ---
[INFO] Toolchain in maven-compiler-plugin: JDK[/opt/tools/java/oracle/jdk-7/latest]
[INFO] Changes detected - recompiling the module!
[INFO] Compiling 5 source files to /home/jenkins/agent/workspace/leshan/leshan-client-core/target/test-classes
[INFO] 
[INFO] --- maven-surefire-plugin:3.0.0-M4:test (default-test) @ leshan-client-core ---
[INFO] Toolchain in maven-surefire-plugin: JDK[/opt/tools/java/oracle/jdk-7/latest]
[INFO] 
[INFO] -------------------------------------------------------
[INFO]  T E S T S
[INFO] -------------------------------------------------------
[INFO] Running org.eclipse.leshan.client.util.LinkFormatHelperTest
[INFO] Tests run: 9, Failures: 0, Errors: 0, Skipped: 0, Time elapsed: 0.658 s - in org.eclipse.leshan.client.util.LinkFormatHelperTest
[INFO] Running org.eclipse.leshan.client.util.ObjectsInitializerTest
[INFO] Tests run: 2, Failures: 0, Errors: 0, Skipped: 0, Time elapsed: 0.546 s - in org.eclipse.leshan.client.util.ObjectsInitializerTest
[INFO] Running org.eclipse.leshan.client.util.ServerTest
[INFO] Tests run: 3, Failures: 0, Errors: 0, Skipped: 0, Time elapsed: 0.017 s - in org.eclipse.leshan.client.util.ServerTest
[INFO] Running org.eclipse.leshan.client.util.ObjectEnablerTest
[INFO] Tests run: 1, Failures: 0, Errors: 0, Skipped: 0, Time elapsed: 0.451 s - in org.eclipse.leshan.client.util.ObjectEnablerTest
[INFO] Running org.eclipse.leshan.client.util.BaseInstanceEnablerFactoryTest
SLF4J: A number (20) of logging calls during the initialization phase have been intercepted and are
SLF4J: now being replayed. These are subject to the filtering rules of the underlying logging system.
SLF4J: See also http://www.slf4j.org/codes.html#replay
[INFO] Tests run: 2, Failures: 0, Errors: 0, Skipped: 0, Time elapsed: 0.436 s - in org.eclipse.leshan.client.util.BaseInstanceEnablerFactoryTest
[INFO] 
[INFO] Results:
[INFO] 
[INFO] Tests run: 17, Failures: 0, Errors: 0, Skipped: 0
[INFO] 
[INFO] 
[INFO] --- maven-bundle-plugin:4.0.0:bundle (default-bundle) @ leshan-client-core ---
[INFO] 
[INFO] >>> maven-source-plugin:3.2.1:jar (attach-sources) > generate-sources @ leshan-client-core >>>
[INFO] 
[INFO] --- maven-enforcer-plugin:1.4.1:enforce (enforce-maven) @ leshan-client-core ---
[INFO] 
[INFO] --- maven-toolchains-plugin:3.0.0:toolchain (default) @ leshan-client-core ---
[INFO] Required toolchain: jdk [ version='1.7' ]
[INFO] Found matching toolchain for type jdk: JDK[/opt/tools/java/oracle/jdk-7/latest]
[INFO] 
[INFO] <<< maven-source-plugin:3.2.1:jar (attach-sources) < generate-sources @ leshan-client-core <<<
[INFO] 
[INFO] 
[INFO] --- maven-source-plugin:3.2.1:jar (attach-sources) @ leshan-client-core ---
[INFO] Building jar: /home/jenkins/agent/workspace/leshan/leshan-client-core/target/leshan-client-core-1.1.0-SNAPSHOT-sources.jar
[INFO] 
[INFO] --- revapi-maven-plugin:0.11.2:check (default) @ leshan-client-core ---
[INFO] Comparing [org.eclipse.leshan:leshan-client-core:jar:1.0.0] against [org.eclipse.leshan:leshan-client-core:jar:1.1.0-SNAPSHOT] (including their transitive dependencies).
[INFO] API checks completed without failures.
[INFO] 
[INFO] --- maven-install-plugin:2.5.2:install (default-install) @ leshan-client-core ---
[INFO] Installing /home/jenkins/agent/workspace/leshan/leshan-client-core/target/leshan-client-core-1.1.0-SNAPSHOT.jar to /home/jenkins/.m2/repository/org/eclipse/leshan/leshan-client-core/1.1.0-SNAPSHOT/leshan-client-core-1.1.0-SNAPSHOT.jar
[INFO] Installing /home/jenkins/agent/workspace/leshan/leshan-client-core/pom.xml to /home/jenkins/.m2/repository/org/eclipse/leshan/leshan-client-core/1.1.0-SNAPSHOT/leshan-client-core-1.1.0-SNAPSHOT.pom
[INFO] Installing /home/jenkins/agent/workspace/leshan/leshan-client-core/target/leshan-client-core-1.1.0-SNAPSHOT-sources.jar to /home/jenkins/.m2/repository/org/eclipse/leshan/leshan-client-core/1.1.0-SNAPSHOT/leshan-client-core-1.1.0-SNAPSHOT-sources.jar
[INFO] 
[INFO] --- maven-bundle-plugin:4.0.0:install (default-install) @ leshan-client-core ---
[INFO] Installing org/eclipse/leshan/leshan-client-core/1.1.0-SNAPSHOT/leshan-client-core-1.1.0-SNAPSHOT.jar
[INFO] Writing OBR metadata
[INFO] 
[INFO] >>> maven-javadoc-plugin:3.1.1:javadoc (default-cli) > generate-sources @ leshan-client-core >>>
[INFO] 
[INFO] --- maven-enforcer-plugin:1.4.1:enforce (enforce-maven) @ leshan-client-core ---
[INFO] 
[INFO] --- maven-toolchains-plugin:3.0.0:toolchain (default) @ leshan-client-core ---
[INFO] Required toolchain: jdk [ version='1.7' ]
[INFO] Found matching toolchain for type jdk: JDK[/opt/tools/java/oracle/jdk-7/latest]
[INFO] 
[INFO] <<< maven-javadoc-plugin:3.1.1:javadoc (default-cli) < generate-sources @ leshan-client-core <<<
[INFO] 
[INFO] 
[INFO] --- maven-javadoc-plugin:3.1.1:javadoc (default-cli) @ leshan-client-core ---
[INFO] Toolchain in maven-javadoc-plugin: JDK[/opt/tools/java/oracle/jdk-7/latest]
[INFO] 
[INFO] ----------------< org.eclipse.leshan:leshan-client-cf >-----------------
[INFO] Building leshan - client californium 1.1.0-SNAPSHOT               [8/12]
[INFO] -------------------------------[ bundle ]-------------------------------
[INFO] 
[INFO] --- maven-clean-plugin:3.1.0:clean (default-clean) @ leshan-client-cf ---
[INFO] 
[INFO] --- maven-enforcer-plugin:1.4.1:enforce (enforce-maven) @ leshan-client-cf ---
[INFO] 
[INFO] --- maven-toolchains-plugin:3.0.0:toolchain (default) @ leshan-client-cf ---
[INFO] Required toolchain: jdk [ version='1.7' ]
[INFO] Found matching toolchain for type jdk: JDK[/opt/tools/java/oracle/jdk-7/latest]
[INFO] 
[INFO] --- maven-resources-plugin:3.1.0:resources (default-resources) @ leshan-client-cf ---
[INFO] Using 'UTF-8' encoding to copy filtered resources.
[INFO] skip non existing resourceDirectory /home/jenkins/agent/workspace/leshan/leshan-client-cf/src/main/resources
[INFO] 
[INFO] --- maven-compiler-plugin:3.8.1:compile (default-compile) @ leshan-client-cf ---
[INFO] Toolchain in maven-compiler-plugin: JDK[/opt/tools/java/oracle/jdk-7/latest]
[INFO] Changes detected - recompiling the module!
[INFO] Compiling 12 source files to /home/jenkins/agent/workspace/leshan/leshan-client-cf/target/classes
[INFO] 
[INFO] --- animal-sniffer-maven-plugin:1.18:check (default) @ leshan-client-cf ---
[INFO] Checking unresolved references to net.sf.androidscents.signature:android-api-level-19:4.4.2_r4
[INFO] 
[INFO] --- maven-resources-plugin:3.1.0:testResources (default-testResources) @ leshan-client-cf ---
[INFO] Using 'UTF-8' encoding to copy filtered resources.
[INFO] skip non existing resourceDirectory /home/jenkins/agent/workspace/leshan/leshan-client-cf/src/test/resources
[INFO] 
[INFO] --- maven-compiler-plugin:3.8.1:testCompile (default-testCompile) @ leshan-client-cf ---
[INFO] Toolchain in maven-compiler-plugin: JDK[/opt/tools/java/oracle/jdk-7/latest]
[INFO] Changes detected - recompiling the module!
[INFO] Compiling 1 source file to /home/jenkins/agent/workspace/leshan/leshan-client-cf/target/test-classes
[INFO] 
[INFO] --- maven-surefire-plugin:3.0.0-M4:test (default-test) @ leshan-client-cf ---
[INFO] Toolchain in maven-surefire-plugin: JDK[/opt/tools/java/oracle/jdk-7/latest]
[INFO] 
[INFO] -------------------------------------------------------
[INFO]  T E S T S
[INFO] -------------------------------------------------------
[INFO] Running org.eclipse.leshan.client.californium.LeshanBuilderTest
[INFO] Tests run: 1, Failures: 0, Errors: 0, Skipped: 0, Time elapsed: 0.369 s - in org.eclipse.leshan.client.californium.LeshanBuilderTest
[INFO] 
[INFO] Results:
[INFO] 
[INFO] Tests run: 1, Failures: 0, Errors: 0, Skipped: 0
[INFO] 
[INFO] 
[INFO] --- maven-bundle-plugin:4.0.0:bundle (default-bundle) @ leshan-client-cf ---
[INFO] 
[INFO] >>> maven-source-plugin:3.2.1:jar (attach-sources) > generate-sources @ leshan-client-cf >>>
[INFO] 
[INFO] --- maven-enforcer-plugin:1.4.1:enforce (enforce-maven) @ leshan-client-cf ---
[INFO] 
[INFO] --- maven-toolchains-plugin:3.0.0:toolchain (default) @ leshan-client-cf ---
[INFO] Required toolchain: jdk [ version='1.7' ]
[INFO] Found matching toolchain for type jdk: JDK[/opt/tools/java/oracle/jdk-7/latest]
[INFO] 
[INFO] <<< maven-source-plugin:3.2.1:jar (attach-sources) < generate-sources @ leshan-client-cf <<<
[INFO] 
[INFO] 
[INFO] --- maven-source-plugin:3.2.1:jar (attach-sources) @ leshan-client-cf ---
[INFO] Building jar: /home/jenkins/agent/workspace/leshan/leshan-client-cf/target/leshan-client-cf-1.1.0-SNAPSHOT-sources.jar
[INFO] 
[INFO] --- revapi-maven-plugin:0.11.2:check (default) @ leshan-client-cf ---
[INFO] Comparing [org.eclipse.leshan:leshan-client-cf:jar:1.0.0] against [org.eclipse.leshan:leshan-client-cf:jar:1.1.0-SNAPSHOT] (including their transitive dependencies).
[INFO] API checks completed without failures.
[INFO] 
[INFO] --- maven-install-plugin:2.5.2:install (default-install) @ leshan-client-cf ---
[INFO] Installing /home/jenkins/agent/workspace/leshan/leshan-client-cf/target/leshan-client-cf-1.1.0-SNAPSHOT.jar to /home/jenkins/.m2/repository/org/eclipse/leshan/leshan-client-cf/1.1.0-SNAPSHOT/leshan-client-cf-1.1.0-SNAPSHOT.jar
[INFO] Installing /home/jenkins/agent/workspace/leshan/leshan-client-cf/pom.xml to /home/jenkins/.m2/repository/org/eclipse/leshan/leshan-client-cf/1.1.0-SNAPSHOT/leshan-client-cf-1.1.0-SNAPSHOT.pom
[INFO] Installing /home/jenkins/agent/workspace/leshan/leshan-client-cf/target/leshan-client-cf-1.1.0-SNAPSHOT-sources.jar to /home/jenkins/.m2/repository/org/eclipse/leshan/leshan-client-cf/1.1.0-SNAPSHOT/leshan-client-cf-1.1.0-SNAPSHOT-sources.jar
[INFO] 
[INFO] --- maven-bundle-plugin:4.0.0:install (default-install) @ leshan-client-cf ---
[INFO] Installing org/eclipse/leshan/leshan-client-cf/1.1.0-SNAPSHOT/leshan-client-cf-1.1.0-SNAPSHOT.jar
[INFO] Writing OBR metadata
[INFO] 
[INFO] >>> maven-javadoc-plugin:3.1.1:javadoc (default-cli) > generate-sources @ leshan-client-cf >>>
[INFO] 
[INFO] --- maven-enforcer-plugin:1.4.1:enforce (enforce-maven) @ leshan-client-cf ---
[INFO] 
[INFO] --- maven-toolchains-plugin:3.0.0:toolchain (default) @ leshan-client-cf ---
[INFO] Required toolchain: jdk [ version='1.7' ]
[INFO] Found matching toolchain for type jdk: JDK[/opt/tools/java/oracle/jdk-7/latest]
[INFO] 
[INFO] <<< maven-javadoc-plugin:3.1.1:javadoc (default-cli) < generate-sources @ leshan-client-cf <<<
[INFO] 
[INFO] 
[INFO] --- maven-javadoc-plugin:3.1.1:javadoc (default-cli) @ leshan-client-cf ---
[INFO] Toolchain in maven-javadoc-plugin: JDK[/opt/tools/java/oracle/jdk-7/latest]
[INFO] 
[INFO] ------------< org.eclipse.leshan:leshan-integration-tests >-------------
[INFO] Building leshan - integration tests 1.1.0-SNAPSHOT                [9/12]
[INFO] --------------------------------[ jar ]---------------------------------
[INFO] 
[INFO] --- maven-clean-plugin:3.1.0:clean (default-clean) @ leshan-integration-tests ---
[INFO] 
[INFO] --- maven-enforcer-plugin:1.4.1:enforce (enforce-maven) @ leshan-integration-tests ---
[INFO] 
[INFO] --- maven-toolchains-plugin:3.0.0:toolchain (default) @ leshan-integration-tests ---
[INFO] Required toolchain: jdk [ version='1.7' ]
[INFO] Found matching toolchain for type jdk: JDK[/opt/tools/java/oracle/jdk-7/latest]
[INFO] 
[INFO] --- maven-resources-plugin:3.1.0:resources (default-resources) @ leshan-integration-tests ---
[INFO] Using 'UTF-8' encoding to copy filtered resources.
[INFO] skip non existing resourceDirectory /home/jenkins/agent/workspace/leshan/leshan-integration-tests/src/main/resources
[INFO] 
[INFO] --- maven-compiler-plugin:3.8.1:compile (default-compile) @ leshan-integration-tests ---
[INFO] Toolchain in maven-compiler-plugin: JDK[/opt/tools/java/oracle/jdk-7/latest]
[INFO] No sources to compile
[INFO] 
[INFO] --- maven-resources-plugin:3.1.0:testResources (default-testResources) @ leshan-integration-tests ---
[INFO] Using 'UTF-8' encoding to copy filtered resources.
[INFO] skip non existing resourceDirectory /home/jenkins/agent/workspace/leshan/leshan-integration-tests/src/test/resources
[INFO] 
[INFO] --- maven-compiler-plugin:3.8.1:testCompile (default-testCompile) @ leshan-integration-tests ---
[INFO] Toolchain in maven-compiler-plugin: JDK[/opt/tools/java/oracle/jdk-7/latest]
[INFO] Changes detected - recompiling the module!
[INFO] Compiling 28 source files to /home/jenkins/agent/workspace/leshan/leshan-integration-tests/target/test-classes
[INFO] 
[INFO] --- maven-surefire-plugin:3.0.0-M4:test (default-test) @ leshan-integration-tests ---
[INFO] Toolchain in maven-surefire-plugin: JDK[/opt/tools/java/oracle/jdk-7/latest]
[INFO] 
[INFO] -------------------------------------------------------
[INFO]  T E S T S
[INFO] -------------------------------------------------------
[INFO] Running org.eclipse.leshan.integration.tests.DiscoverTest
[INFO] Tests run: 9, Failures: 0, Errors: 0, Skipped: 0, Time elapsed: 5.289 s - in org.eclipse.leshan.integration.tests.DiscoverTest
[INFO] Running org.eclipse.leshan.integration.tests.SecurityTest
[INFO] Tests run: 27, Failures: 0, Errors: 0, Skipped: 0, Time elapsed: 30.328 s - in org.eclipse.leshan.integration.tests.SecurityTest
[INFO] Running org.eclipse.leshan.integration.tests.FailingTest
[INFO] Tests run: 4, Failures: 0, Errors: 0, Skipped: 0, Time elapsed: 10.388 s - in org.eclipse.leshan.integration.tests.FailingTest
[INFO] Running org.eclipse.leshan.integration.tests.ExecuteTest
[INFO] Tests run: 7, Failures: 0, Errors: 0, Skipped: 0, Time elapsed: 4.975 s - in org.eclipse.leshan.integration.tests.ExecuteTest
[INFO] Running org.eclipse.leshan.integration.tests.QueueModeTest
[INFO] Tests run: 4, Failures: 0, Errors: 0, Skipped: 0, Time elapsed: 7.292 s - in org.eclipse.leshan.integration.tests.QueueModeTest
[INFO] Running org.eclipse.leshan.integration.tests.ObserveTest
[INFO] Tests run: 9, Failures: 0, Errors: 0, Skipped: 0, Time elapsed: 6.809 s - in org.eclipse.leshan.integration.tests.ObserveTest
[INFO] Running org.eclipse.leshan.integration.tests.WriteTest
[INFO] Tests run: 44, Failures: 0, Errors: 0, Skipped: 0, Time elapsed: 7.369 s - in org.eclipse.leshan.integration.tests.WriteTest
[INFO] Running org.eclipse.leshan.integration.tests.CreateTest
[INFO] Tests run: 10, Failures: 0, Errors: 0, Skipped: 0, Time elapsed: 5.581 s - in org.eclipse.leshan.integration.tests.CreateTest
[INFO] Running org.eclipse.leshan.integration.tests.RegistrationTest
[INFO] Tests run: 7, Failures: 0, Errors: 0, Skipped: 0, Time elapsed: 8.527 s - in org.eclipse.leshan.integration.tests.RegistrationTest
[INFO] Running org.eclipse.leshan.integration.tests.DeleteTest
[INFO] Tests run: 5, Failures: 0, Errors: 0, Skipped: 0, Time elapsed: 4.798 s - in org.eclipse.leshan.integration.tests.DeleteTest
[INFO] Running org.eclipse.leshan.integration.tests.BootstrapTest
[INFO] Tests run: 9, Failures: 0, Errors: 0, Skipped: 0, Time elapsed: 8.465 s - in org.eclipse.leshan.integration.tests.BootstrapTest
[INFO] Running org.eclipse.leshan.integration.tests.ReadTest
[INFO] Tests run: 10, Failures: 0, Errors: 0, Skipped: 0, Time elapsed: 5.482 s - in org.eclipse.leshan.integration.tests.ReadTest
[INFO] 
[INFO] Results:
[INFO] 
[INFO] Tests run: 145, Failures: 0, Errors: 0, Skipped: 0
[INFO] 
[INFO] 
[INFO] --- maven-jar-plugin:3.2.0:jar (default-jar) @ leshan-integration-tests ---
[INFO] Skipping packaging of the jar
[INFO] 
[INFO] >>> maven-source-plugin:3.2.1:jar (attach-sources) > generate-sources @ leshan-integration-tests >>>
[INFO] 
[INFO] --- maven-enforcer-plugin:1.4.1:enforce (enforce-maven) @ leshan-integration-tests ---
[INFO] 
[INFO] --- maven-toolchains-plugin:3.0.0:toolchain (default) @ leshan-integration-tests ---
[INFO] Required toolchain: jdk [ version='1.7' ]
[INFO] Found matching toolchain for type jdk: JDK[/opt/tools/java/oracle/jdk-7/latest]
[INFO] 
[INFO] <<< maven-source-plugin:3.2.1:jar (attach-sources) < generate-sources @ leshan-integration-tests <<<
[INFO] 
[INFO] 
[INFO] --- maven-source-plugin:3.2.1:jar (attach-sources) @ leshan-integration-tests ---
[INFO] No sources in project. Archive not created.
[INFO] 
[INFO] --- revapi-maven-plugin:0.11.2:check (default) @ leshan-integration-tests ---
[INFO] 
[INFO] --- maven-install-plugin:2.5.2:install (default-install) @ leshan-integration-tests ---
[INFO] Skipping artifact installation
[INFO] 
[INFO] >>> maven-javadoc-plugin:3.1.1:javadoc (default-cli) > generate-sources @ leshan-integration-tests >>>
[INFO] 
[INFO] --- maven-enforcer-plugin:1.4.1:enforce (enforce-maven) @ leshan-integration-tests ---
[INFO] 
[INFO] --- maven-toolchains-plugin:3.0.0:toolchain (default) @ leshan-integration-tests ---
[INFO] Required toolchain: jdk [ version='1.7' ]
[INFO] Found matching toolchain for type jdk: JDK[/opt/tools/java/oracle/jdk-7/latest]
[INFO] 
[INFO] <<< maven-javadoc-plugin:3.1.1:javadoc (default-cli) < generate-sources @ leshan-integration-tests <<<
[INFO] 
[INFO] 
[INFO] --- maven-javadoc-plugin:3.1.1:javadoc (default-cli) @ leshan-integration-tests ---
[INFO] 
[INFO] ---------------< org.eclipse.leshan:leshan-server-demo >----------------
[INFO] Building leshan - server demo 1.1.0-SNAPSHOT                     [10/12]
[INFO] --------------------------------[ jar ]---------------------------------
[INFO] 
[INFO] --- maven-clean-plugin:3.1.0:clean (default-clean) @ leshan-server-demo ---
[INFO] 
[INFO] --- maven-enforcer-plugin:1.4.1:enforce (enforce-maven) @ leshan-server-demo ---
[INFO] 
[INFO] --- maven-toolchains-plugin:3.0.0:toolchain (default) @ leshan-server-demo ---
[INFO] Required toolchain: jdk [ version='1.7' ]
[INFO] Found matching toolchain for type jdk: JDK[/opt/tools/java/oracle/jdk-7/latest]
[INFO] 
[INFO] --- buildnumber-maven-plugin:1.4:create (default) @ leshan-server-demo ---
[INFO] Executing: /bin/sh -c cd '/home/jenkins/agent/workspace/leshan/leshan-server-demo' && 'git' 'rev-parse' '--verify' 'HEAD'
[INFO] Working directory: /home/jenkins/agent/workspace/leshan/leshan-server-demo
[INFO] Storing buildNumber: 9b4556c69b59c7a760d3c06e875ed1e6384e6286 at timestamp: 1592927682199
[WARNING] Cannot get the branch information from the git repository: 
Detecting the current branch failed: fatal: ref HEAD is not a symbolic ref

[INFO] Executing: /bin/sh -c cd '/home/jenkins/agent/workspace/leshan/leshan-server-demo' && 'git' 'rev-parse' '--verify' 'HEAD'
[INFO] Working directory: /home/jenkins/agent/workspace/leshan/leshan-server-demo
[INFO] Storing buildScmBranch: UNKNOWN
[INFO] 
[INFO] --- maven-resources-plugin:3.1.0:resources (default-resources) @ leshan-server-demo ---
[INFO] Using 'UTF-8' encoding to copy filtered resources.
[INFO] Copying 275 resources
[INFO] 
[INFO] --- maven-compiler-plugin:3.8.1:compile (default-compile) @ leshan-server-demo ---
[INFO] Toolchain in maven-compiler-plugin: JDK[/opt/tools/java/oracle/jdk-7/latest]
[INFO] Changes detected - recompiling the module!
[INFO] Compiling 21 source files to /home/jenkins/agent/workspace/leshan/leshan-server-demo/target/classes
[INFO] 
[INFO] --- replacer:1.5.3:replace (default) @ leshan-server-demo ---
[INFO] Replacement run on 1 file.
[INFO] 
[INFO] --- maven-resources-plugin:3.1.0:testResources (default-testResources) @ leshan-server-demo ---
[INFO] Using 'UTF-8' encoding to copy filtered resources.
[INFO] skip non existing resourceDirectory /home/jenkins/agent/workspace/leshan/leshan-server-demo/src/test/resources
[INFO] 
[INFO] --- maven-compiler-plugin:3.8.1:testCompile (default-testCompile) @ leshan-server-demo ---
[INFO] Toolchain in maven-compiler-plugin: JDK[/opt/tools/java/oracle/jdk-7/latest]
[INFO] Changes detected - recompiling the module!
[INFO] Compiling 1 source file to /home/jenkins/agent/workspace/leshan/leshan-server-demo/target/test-classes
[INFO] 
[INFO] --- maven-surefire-plugin:3.0.0-M4:test (default-test) @ leshan-server-demo ---
[INFO] Toolchain in maven-surefire-plugin: JDK[/opt/tools/java/oracle/jdk-7/latest]
[INFO] 
[INFO] -------------------------------------------------------
[INFO]  T E S T S
[INFO] -------------------------------------------------------
[INFO] Running org.eclipse.leshan.server.demo.model.ValidateServerDemoModelsTest
[ERROR] Tests run: 1, Failures: 0, Errors: 1, Skipped: 0, Time elapsed: 0.09 s <<< FAILURE! - in org.eclipse.leshan.server.demo.model.ValidateServerDemoModelsTest
[ERROR] org.eclipse.leshan.server.demo.model.ValidateServerDemoModelsTest.validate_embedded_models  Time elapsed: 0.09 s  <<< ERROR!
java.lang.UnsupportedClassVersionError: org/eclipse/jetty/server/Handler : Unsupported major.minor version 52.0
	at org.eclipse.leshan.server.demo.model.ValidateServerDemoModelsTest.validate_embedded_models(ValidateServerDemoModelsTest.java:30)

[INFO] 
[INFO] Results:
[INFO] 
[ERROR] Errors: 
[ERROR]   ValidateServerDemoModelsTest.validate_embedded_models:30 ยป UnsupportedClassVersion
[INFO] 
[ERROR] Tests run: 1, Failures: 0, Errors: 1, Skipped: 0
[INFO] 
[INFO] ------------------------------------------------------------------------
[INFO] Reactor Summary for leshan 1.1.0-SNAPSHOT:
[INFO] 
[INFO] leshan ............................................. SUCCESS [ 19.691 s]
[INFO] leshan - core ...................................... SUCCESS [ 31.564 s]
[INFO] leshan - core californium .......................... SUCCESS [  8.128 s]
[INFO] leshan - server core ............................... SUCCESS [  9.120 s]
[INFO] leshan - server californium ........................ SUCCESS [ 31.095 s]
[INFO] leshan - server redis .............................. SUCCESS [ 13.417 s]
[INFO] leshan - client core ............................... SUCCESS [  9.405 s]
[INFO] leshan - client californium ........................ SUCCESS [  8.242 s]
[INFO] leshan - integration tests ......................... SUCCESS [ 39.709 s]
[INFO] leshan - server demo ............................... FAILURE [ 18.074 s]
[INFO] leshan - client demo ............................... SKIPPED
[INFO] leshan - bootstrap server demo ..................... SKIPPED
[INFO] ------------------------------------------------------------------------
[INFO] BUILD FAILURE
[INFO] ------------------------------------------------------------------------
[INFO] Total time:  03:35 min
[INFO] Finished at: 2020-06-23T15:54:52Z
[INFO] ------------------------------------------------------------------------
[ERROR] Failed to execute goal org.apache.maven.plugins:maven-surefire-plugin:3.0.0-M4:test (default-test) on project leshan-server-demo: There are test failures.
[ERROR] 
[ERROR] Please refer to /home/jenkins/agent/workspace/leshan/leshan-server-demo/target/surefire-reports for the individual test results.
[ERROR] Please refer to dump files (if any exist) [date].dump, [date]-jvmRun[N].dump and [date].dumpstream.
[ERROR] -> [Help 1]
[ERROR] 
[ERROR] To see the full stack trace of the errors, re-run Maven with the -e switch.
[ERROR] Re-run Maven using the -X switch to enable full debug logging.
[ERROR] 
[ERROR] For more information about the errors and possible solutions, please read the following articles:
[ERROR] [Help 1] http://cwiki.apache.org/confluence/display/MAVEN/MojoFailureException
[ERROR] 
[ERROR] After correcting the problems, you can resume the build with the command
[ERROR]   mvn <args> -rf :leshan-server-demo
Build step 'Invoke top-level Maven targets' marked build as failure
Not sending mail to unregistered user sbernard@sierrawireless.com
Sending e-mails to: sbernard@sierrawireless.com
Recording test results
Archiving artifacts
Finished: FAILURE