FailedConsole Output

Started by user sbernard@sierrawireless.com
Building in workspace /home/hudson/genie.leshan/.jenkins/jobs/leshan-hudson-test/workspace
 > /usr/local/bin/git rev-parse --is-inside-work-tree # timeout=10
Fetching changes from the remote Git repository
 > /usr/local/bin/git config remote.origin.url https://github.com/eclipse/leshan.git # timeout=10
Fetching upstream changes from https://github.com/eclipse/leshan.git
 > /usr/local/bin/git --version # timeout=10
 > /usr/local/bin/git fetch --tags --progress https://github.com/eclipse/leshan.git +refs/heads/*:refs/remotes/origin/*
 > /usr/local/bin/git rev-parse origin/hudson_test^{commit} # timeout=10
Checking out Revision 82dd43b96dbb5a6d9a1abf94f0bf3becd60b7bbc (origin/hudson_test)
 > /usr/local/bin/git config core.sparsecheckout # timeout=10
 > /usr/local/bin/git checkout -f 82dd43b96dbb5a6d9a1abf94f0bf3becd60b7bbc
Commit message: "Display more RPK information in leshan-server-demo UI."
 > /usr/local/bin/git rev-list --no-walk 82dd43b96dbb5a6d9a1abf94f0bf3becd60b7bbc # timeout=10
[workspace] $ /shared/common/apache-maven-latest/bin/mvn -f pom.xml -DBRANCH=hudson_test clean install -Pall
Picked up JAVA_TOOL_OPTIONS: -Xmx2G -Djava.io.tmpdir=/tmp/genie.leshan
[INFO] Scanning for projects...
[INFO] ------------------------------------------------------------------------
[INFO] Reactor Build Order:
[INFO] 
[INFO] leshan                                                             [pom]
[INFO] leshan - core                                                   [bundle]
[INFO] leshan - core californium                                       [bundle]
[INFO] leshan - server core                                            [bundle]
[INFO] leshan - server californium                                     [bundle]
[INFO] leshan - server cluster                                         [bundle]
[INFO] leshan - client core                                            [bundle]
[INFO] leshan - client californium                                     [bundle]
[INFO] leshan - integration tests                                         [jar]
[INFO] leshan - server demo                                               [jar]
[INFO] leshan - client demo                                               [jar]
[INFO] leshan - bootstrap server demo                                     [jar]
[INFO] leshan - all                                                       [jar]
[INFO] 
[INFO] ---------------------< org.eclipse.leshan:leshan >----------------------
[INFO] Building leshan 1.0.0-SNAPSHOT                                    [1/13]
[INFO] --------------------------------[ pom ]---------------------------------
[INFO] 
[INFO] --- maven-clean-plugin:3.0.0:clean (default-clean) @ leshan ---
[INFO] 
[INFO] --- maven-enforcer-plugin:1.4.1:enforce (enforce-maven) @ leshan ---
[INFO] 
[INFO] >>> maven-source-plugin:3.0.1:jar (attach-sources) > generate-sources @ leshan >>>
[INFO] 
[INFO] --- maven-enforcer-plugin:1.4.1:enforce (enforce-maven) @ leshan ---
[INFO] 
[INFO] <<< maven-source-plugin:3.0.1:jar (attach-sources) < generate-sources @ leshan <<<
[INFO] 
[INFO] 
[INFO] --- maven-source-plugin:3.0.1:jar (attach-sources) @ leshan ---
[INFO] 
[INFO] --- maven-install-plugin:2.5.2:install (default-install) @ leshan ---
[INFO] Installing /jobs/genie.leshan/leshan-hudson-test/workspace/pom.xml to /opt/public/hipp/homes/genie.leshan/.m2/repository/org/eclipse/leshan/leshan/1.0.0-SNAPSHOT/leshan-1.0.0-SNAPSHOT.pom
[INFO] 
[INFO] -------------------< org.eclipse.leshan:leshan-core >-------------------
[INFO] Building leshan - core 1.0.0-SNAPSHOT                             [2/13]
[INFO] -------------------------------[ bundle ]-------------------------------
[INFO] 
[INFO] --- maven-clean-plugin:3.0.0:clean (default-clean) @ leshan-core ---
[INFO] Deleting /jobs/genie.leshan/leshan-hudson-test/workspace/leshan-core/target
[INFO] 
[INFO] --- maven-enforcer-plugin:1.4.1:enforce (enforce-maven) @ leshan-core ---
[INFO] 
[INFO] --- maven-resources-plugin:3.0.2:resources (default-resources) @ leshan-core ---
[INFO] Using 'UTF-8' encoding to copy filtered resources.
[INFO] Copying 8 resources
[INFO] 
[INFO] --- maven-compiler-plugin:3.7.0:compile (default-compile) @ leshan-core ---
[INFO] Changes detected - recompiling the module!
[INFO] Compiling 115 source files to /jobs/genie.leshan/leshan-hudson-test/workspace/leshan-core/target/classes
[INFO] 
[INFO] --- maven-resources-plugin:3.0.2:testResources (default-testResources) @ leshan-core ---
[INFO] Using 'UTF-8' encoding to copy filtered resources.
[INFO] Copying 1 resource
[INFO] 
[INFO] --- maven-compiler-plugin:3.7.0:testCompile (default-testCompile) @ leshan-core ---
[INFO] Changes detected - recompiling the module!
[INFO] Compiling 12 source files to /jobs/genie.leshan/leshan-hudson-test/workspace/leshan-core/target/test-classes
[INFO] 
[INFO] --- maven-surefire-plugin:2.20.1:test (default-test) @ leshan-core ---
[INFO] 
[INFO] -------------------------------------------------------
[INFO]  T E S T S
[INFO] -------------------------------------------------------
SLF4J: A number (109) of logging calls during the initialization phase have been intercepted and are
SLF4J: now being replayed. These are subject to the filtering rules of the underlying logging system.
SLF4J: See also http://www.slf4j.org/codes.html#replay
[INFO] Running org.eclipse.leshan.json.ObjectModelSerDesTest
[INFO] Tests run: 1, Failures: 0, Errors: 0, Skipped: 0, Time elapsed: 0.112 s - in org.eclipse.leshan.json.ObjectModelSerDesTest
[INFO] Running org.eclipse.leshan.core.node.codec.Lwm2mValueConverterTest
[INFO] Tests run: 10, Failures: 0, Errors: 0, Skipped: 0, Time elapsed: 0.022 s - in org.eclipse.leshan.core.node.codec.Lwm2mValueConverterTest
[INFO] Running org.eclipse.leshan.json.JsonSerializerTest
[INFO] Tests run: 1, Failures: 0, Errors: 0, Skipped: 0, Time elapsed: 0.131 s - in org.eclipse.leshan.json.JsonSerializerTest
[INFO] Running org.eclipse.leshan.core.node.codec.LwM2mNodeEncoderTest
[INFO] Tests run: 12, Failures: 0, Errors: 0, Skipped: 0, Time elapsed: 0.084 s - in org.eclipse.leshan.core.node.codec.LwM2mNodeEncoderTest
[INFO] Running org.eclipse.leshan.json.JsonDeserializerTest
[INFO] Tests run: 3, Failures: 0, Errors: 0, Skipped: 0, Time elapsed: 0.187 s - in org.eclipse.leshan.json.JsonDeserializerTest
[INFO] Running org.eclipse.leshan.core.node.codec.LwM2mNodeDecoderTest
[INFO] Tests run: 36, Failures: 0, Errors: 0, Skipped: 0, Time elapsed: 0.182 s - in org.eclipse.leshan.core.node.codec.LwM2mNodeDecoderTest
[INFO] Running org.eclipse.leshan.core.attributes.AttributeSetTest
[INFO] Tests run: 8, Failures: 0, Errors: 0, Skipped: 0, Time elapsed: 0.072 s - in org.eclipse.leshan.core.attributes.AttributeSetTest
[INFO] Running org.eclipse.leshan.tlv.TlvDecoderTest
[INFO] Tests run: 3, Failures: 0, Errors: 0, Skipped: 0, Time elapsed: 0.029 s - in org.eclipse.leshan.tlv.TlvDecoderTest
[INFO] Running org.eclipse.leshan.tlv.TlvEncoderTest
[INFO] Tests run: 6, Failures: 0, Errors: 0, Skipped: 0, Time elapsed: 0.088 s - in org.eclipse.leshan.tlv.TlvEncoderTest
[INFO] Running org.eclipse.leshan.core.node.LwM2MResourceTest
[INFO] Tests run: 16, Failures: 0, Errors: 0, Skipped: 0, Time elapsed: 0.074 s - in org.eclipse.leshan.core.node.LwM2MResourceTest
[INFO] Running org.eclipse.leshan.core.attributes.AttributeTest
[INFO] Tests run: 2, Failures: 0, Errors: 0, Skipped: 0, Time elapsed: 0.014 s - in org.eclipse.leshan.core.attributes.AttributeTest
[INFO] Running org.eclipse.leshan.LinkObjectTest
[INFO] Tests run: 7, Failures: 0, Errors: 0, Skipped: 0, Time elapsed: 0.045 s - in org.eclipse.leshan.LinkObjectTest
[INFO] 
[INFO] Results:
[INFO] 
[INFO] Tests run: 105, Failures: 0, Errors: 0, Skipped: 0
[INFO] 
[INFO] 
[INFO] --- maven-bundle-plugin:3.5.0:bundle (default-bundle) @ leshan-core ---
[INFO] 
[INFO] >>> maven-source-plugin:3.0.1:jar (attach-sources) > generate-sources @ leshan-core >>>
[INFO] 
[INFO] --- maven-enforcer-plugin:1.4.1:enforce (enforce-maven) @ leshan-core ---
[INFO] 
[INFO] <<< maven-source-plugin:3.0.1:jar (attach-sources) < generate-sources @ leshan-core <<<
[INFO] 
[INFO] 
[INFO] --- maven-source-plugin:3.0.1:jar (attach-sources) @ leshan-core ---
[INFO] Building jar: /jobs/genie.leshan/leshan-hudson-test/workspace/leshan-core/target/leshan-core-1.0.0-SNAPSHOT-sources.jar
[INFO] 
[INFO] --- maven-install-plugin:2.5.2:install (default-install) @ leshan-core ---
[INFO] Installing /jobs/genie.leshan/leshan-hudson-test/workspace/leshan-core/target/leshan-core-1.0.0-SNAPSHOT.jar to /opt/public/hipp/homes/genie.leshan/.m2/repository/org/eclipse/leshan/leshan-core/1.0.0-SNAPSHOT/leshan-core-1.0.0-SNAPSHOT.jar
[INFO] Installing /jobs/genie.leshan/leshan-hudson-test/workspace/leshan-core/pom.xml to /opt/public/hipp/homes/genie.leshan/.m2/repository/org/eclipse/leshan/leshan-core/1.0.0-SNAPSHOT/leshan-core-1.0.0-SNAPSHOT.pom
[INFO] Installing /jobs/genie.leshan/leshan-hudson-test/workspace/leshan-core/target/leshan-core-1.0.0-SNAPSHOT-sources.jar to /opt/public/hipp/homes/genie.leshan/.m2/repository/org/eclipse/leshan/leshan-core/1.0.0-SNAPSHOT/leshan-core-1.0.0-SNAPSHOT-sources.jar
[INFO] 
[INFO] --- maven-bundle-plugin:3.5.0:install (default-install) @ leshan-core ---
[INFO] Installing org/eclipse/leshan/leshan-core/1.0.0-SNAPSHOT/leshan-core-1.0.0-SNAPSHOT.jar
[INFO] Writing OBR metadata
[INFO] 
[INFO] -----------------< org.eclipse.leshan:leshan-core-cf >------------------
[INFO] Building leshan - core californium 1.0.0-SNAPSHOT                 [3/13]
[INFO] -------------------------------[ bundle ]-------------------------------
[INFO] 
[INFO] --- maven-clean-plugin:3.0.0:clean (default-clean) @ leshan-core-cf ---
[INFO] Deleting /jobs/genie.leshan/leshan-hudson-test/workspace/leshan-core-cf/target
[INFO] 
[INFO] --- maven-enforcer-plugin:1.4.1:enforce (enforce-maven) @ leshan-core-cf ---
[INFO] 
[INFO] --- maven-resources-plugin:3.0.2:resources (default-resources) @ leshan-core-cf ---
[INFO] Using 'UTF-8' encoding to copy filtered resources.
[INFO] skip non existing resourceDirectory /jobs/genie.leshan/leshan-hudson-test/workspace/leshan-core-cf/src/main/resources
[INFO] 
[INFO] --- maven-compiler-plugin:3.7.0:compile (default-compile) @ leshan-core-cf ---
[INFO] Changes detected - recompiling the module!
[INFO] Compiling 10 source files to /jobs/genie.leshan/leshan-hudson-test/workspace/leshan-core-cf/target/classes
[INFO] 
[INFO] --- maven-resources-plugin:3.0.2:testResources (default-testResources) @ leshan-core-cf ---
[INFO] Using 'UTF-8' encoding to copy filtered resources.
[INFO] skip non existing resourceDirectory /jobs/genie.leshan/leshan-hudson-test/workspace/leshan-core-cf/src/test/resources
[INFO] 
[INFO] --- maven-compiler-plugin:3.7.0:testCompile (default-testCompile) @ leshan-core-cf ---
[INFO] Changes detected - recompiling the module!
[INFO] Compiling 1 source file to /jobs/genie.leshan/leshan-hudson-test/workspace/leshan-core-cf/target/test-classes
[INFO] 
[INFO] --- maven-surefire-plugin:2.20.1:test (default-test) @ leshan-core-cf ---
[INFO] 
[INFO] -------------------------------------------------------
[INFO]  T E S T S
[INFO] -------------------------------------------------------
[INFO] Running org.eclipse.leshan.core.californium.ResponseCodeUtilTest
[INFO] Tests run: 7, Failures: 0, Errors: 0, Skipped: 0, Time elapsed: 1.102 s - in org.eclipse.leshan.core.californium.ResponseCodeUtilTest
[INFO] 
[INFO] Results:
[INFO] 
[INFO] Tests run: 7, Failures: 0, Errors: 0, Skipped: 0
[INFO] 
[INFO] 
[INFO] --- maven-bundle-plugin:3.5.0:bundle (default-bundle) @ leshan-core-cf ---
[INFO] 
[INFO] >>> maven-source-plugin:3.0.1:jar (attach-sources) > generate-sources @ leshan-core-cf >>>
[INFO] 
[INFO] --- maven-enforcer-plugin:1.4.1:enforce (enforce-maven) @ leshan-core-cf ---
[INFO] 
[INFO] <<< maven-source-plugin:3.0.1:jar (attach-sources) < generate-sources @ leshan-core-cf <<<
[INFO] 
[INFO] 
[INFO] --- maven-source-plugin:3.0.1:jar (attach-sources) @ leshan-core-cf ---
[INFO] Building jar: /jobs/genie.leshan/leshan-hudson-test/workspace/leshan-core-cf/target/leshan-core-cf-1.0.0-SNAPSHOT-sources.jar
[INFO] 
[INFO] --- maven-install-plugin:2.5.2:install (default-install) @ leshan-core-cf ---
[INFO] Installing /jobs/genie.leshan/leshan-hudson-test/workspace/leshan-core-cf/target/leshan-core-cf-1.0.0-SNAPSHOT.jar to /opt/public/hipp/homes/genie.leshan/.m2/repository/org/eclipse/leshan/leshan-core-cf/1.0.0-SNAPSHOT/leshan-core-cf-1.0.0-SNAPSHOT.jar
[INFO] Installing /jobs/genie.leshan/leshan-hudson-test/workspace/leshan-core-cf/pom.xml to /opt/public/hipp/homes/genie.leshan/.m2/repository/org/eclipse/leshan/leshan-core-cf/1.0.0-SNAPSHOT/leshan-core-cf-1.0.0-SNAPSHOT.pom
[INFO] Installing /jobs/genie.leshan/leshan-hudson-test/workspace/leshan-core-cf/target/leshan-core-cf-1.0.0-SNAPSHOT-sources.jar to /opt/public/hipp/homes/genie.leshan/.m2/repository/org/eclipse/leshan/leshan-core-cf/1.0.0-SNAPSHOT/leshan-core-cf-1.0.0-SNAPSHOT-sources.jar
[INFO] 
[INFO] --- maven-bundle-plugin:3.5.0:install (default-install) @ leshan-core-cf ---
[INFO] Installing org/eclipse/leshan/leshan-core-cf/1.0.0-SNAPSHOT/leshan-core-cf-1.0.0-SNAPSHOT.jar
[INFO] Writing OBR metadata
[INFO] 
[INFO] ---------------< org.eclipse.leshan:leshan-server-core >----------------
[INFO] Building leshan - server core 1.0.0-SNAPSHOT                      [4/13]
[INFO] -------------------------------[ bundle ]-------------------------------
[INFO] 
[INFO] --- maven-clean-plugin:3.0.0:clean (default-clean) @ leshan-server-core ---
[INFO] Deleting /jobs/genie.leshan/leshan-hudson-test/workspace/leshan-server-core/target
[INFO] 
[INFO] --- maven-enforcer-plugin:1.4.1:enforce (enforce-maven) @ leshan-server-core ---
[INFO] 
[INFO] --- maven-resources-plugin:3.0.2:resources (default-resources) @ leshan-server-core ---
[INFO] Using 'UTF-8' encoding to copy filtered resources.
[INFO] skip non existing resourceDirectory /jobs/genie.leshan/leshan-hudson-test/workspace/leshan-server-core/src/main/resources
[INFO] 
[INFO] --- maven-compiler-plugin:3.7.0:compile (default-compile) @ leshan-server-core ---
[INFO] Changes detected - recompiling the module!
[INFO] Compiling 54 source files to /jobs/genie.leshan/leshan-hudson-test/workspace/leshan-server-core/target/classes
[INFO] 
[INFO] --- maven-resources-plugin:3.0.2:testResources (default-testResources) @ leshan-server-core ---
[INFO] Using 'UTF-8' encoding to copy filtered resources.
[INFO] skip non existing resourceDirectory /jobs/genie.leshan/leshan-hudson-test/workspace/leshan-server-core/src/test/resources
[INFO] 
[INFO] --- maven-compiler-plugin:3.7.0:testCompile (default-testCompile) @ leshan-server-core ---
[INFO] Changes detected - recompiling the module!
[INFO] Compiling 4 source files to /jobs/genie.leshan/leshan-hudson-test/workspace/leshan-server-core/target/test-classes
[INFO] 
[INFO] --- maven-surefire-plugin:2.20.1:test (default-test) @ leshan-server-core ---
[INFO] 
[INFO] -------------------------------------------------------
[INFO]  T E S T S
[INFO] -------------------------------------------------------
[INFO] Running org.eclipse.leshan.server.registration.RegistrationSortObjectLinksTest
[INFO] Tests run: 1, Failures: 0, Errors: 0, Skipped: 0, Time elapsed: 0.125 s - in org.eclipse.leshan.server.registration.RegistrationSortObjectLinksTest
[INFO] Running org.eclipse.leshan.server.queue.PresenceServiceTest
[INFO] Tests run: 2, Failures: 0, Errors: 0, Skipped: 0, Time elapsed: 0.149 s - in org.eclipse.leshan.server.queue.PresenceServiceTest
[INFO] Running org.eclipse.leshan.server.bootstrap.BootstrapHandlerTest
[INFO] Tests run: 3, Failures: 0, Errors: 0, Skipped: 0, Time elapsed: 2.067 s - in org.eclipse.leshan.server.bootstrap.BootstrapHandlerTest
[INFO] Running org.eclipse.leshan.server.registration.RegistrationUpdateTest
[INFO] Tests run: 1, Failures: 0, Errors: 0, Skipped: 0, Time elapsed: 0.149 s - in org.eclipse.leshan.server.registration.RegistrationUpdateTest
[INFO] 
[INFO] Results:
[INFO] 
[INFO] Tests run: 7, Failures: 0, Errors: 0, Skipped: 0
[INFO] 
[INFO] 
[INFO] --- maven-bundle-plugin:3.5.0:bundle (default-bundle) @ leshan-server-core ---
[INFO] 
[INFO] >>> maven-source-plugin:3.0.1:jar (attach-sources) > generate-sources @ leshan-server-core >>>
[INFO] 
[INFO] --- maven-enforcer-plugin:1.4.1:enforce (enforce-maven) @ leshan-server-core ---
[INFO] 
[INFO] <<< maven-source-plugin:3.0.1:jar (attach-sources) < generate-sources @ leshan-server-core <<<
[INFO] 
[INFO] 
[INFO] --- maven-source-plugin:3.0.1:jar (attach-sources) @ leshan-server-core ---
[INFO] Building jar: /jobs/genie.leshan/leshan-hudson-test/workspace/leshan-server-core/target/leshan-server-core-1.0.0-SNAPSHOT-sources.jar
[INFO] 
[INFO] --- maven-install-plugin:2.5.2:install (default-install) @ leshan-server-core ---
[INFO] Installing /jobs/genie.leshan/leshan-hudson-test/workspace/leshan-server-core/target/leshan-server-core-1.0.0-SNAPSHOT.jar to /opt/public/hipp/homes/genie.leshan/.m2/repository/org/eclipse/leshan/leshan-server-core/1.0.0-SNAPSHOT/leshan-server-core-1.0.0-SNAPSHOT.jar
[INFO] Installing /jobs/genie.leshan/leshan-hudson-test/workspace/leshan-server-core/pom.xml to /opt/public/hipp/homes/genie.leshan/.m2/repository/org/eclipse/leshan/leshan-server-core/1.0.0-SNAPSHOT/leshan-server-core-1.0.0-SNAPSHOT.pom
[INFO] Installing /jobs/genie.leshan/leshan-hudson-test/workspace/leshan-server-core/target/leshan-server-core-1.0.0-SNAPSHOT-sources.jar to /opt/public/hipp/homes/genie.leshan/.m2/repository/org/eclipse/leshan/leshan-server-core/1.0.0-SNAPSHOT/leshan-server-core-1.0.0-SNAPSHOT-sources.jar
[INFO] 
[INFO] --- maven-bundle-plugin:3.5.0:install (default-install) @ leshan-server-core ---
[INFO] Installing org/eclipse/leshan/leshan-server-core/1.0.0-SNAPSHOT/leshan-server-core-1.0.0-SNAPSHOT.jar
[INFO] Writing OBR metadata
[INFO] 
[INFO] ----------------< org.eclipse.leshan:leshan-server-cf >-----------------
[INFO] Building leshan - server californium 1.0.0-SNAPSHOT               [5/13]
[INFO] -------------------------------[ bundle ]-------------------------------
[INFO] 
[INFO] --- maven-clean-plugin:3.0.0:clean (default-clean) @ leshan-server-cf ---
[INFO] Deleting /jobs/genie.leshan/leshan-hudson-test/workspace/leshan-server-cf/target
[INFO] 
[INFO] --- maven-enforcer-plugin:1.4.1:enforce (enforce-maven) @ leshan-server-cf ---
[INFO] 
[INFO] --- maven-resources-plugin:3.0.2:resources (default-resources) @ leshan-server-cf ---
[INFO] Using 'UTF-8' encoding to copy filtered resources.
[INFO] skip non existing resourceDirectory /jobs/genie.leshan/leshan-hudson-test/workspace/leshan-server-cf/src/main/resources
[INFO] 
[INFO] --- maven-compiler-plugin:3.7.0:compile (default-compile) @ leshan-server-cf ---
[INFO] Changes detected - recompiling the module!
[INFO] Compiling 18 source files to /jobs/genie.leshan/leshan-hudson-test/workspace/leshan-server-cf/target/classes
[INFO] 
[INFO] --- maven-resources-plugin:3.0.2:testResources (default-testResources) @ leshan-server-cf ---
[INFO] Using 'UTF-8' encoding to copy filtered resources.
[INFO] skip non existing resourceDirectory /jobs/genie.leshan/leshan-hudson-test/workspace/leshan-server-cf/src/test/resources
[INFO] 
[INFO] --- maven-compiler-plugin:3.7.0:testCompile (default-testCompile) @ leshan-server-cf ---
[INFO] Changes detected - recompiling the module!
[INFO] Compiling 6 source files to /jobs/genie.leshan/leshan-hudson-test/workspace/leshan-server-cf/target/test-classes
[INFO] 
[INFO] --- maven-surefire-plugin:2.20.1:test (default-test) @ leshan-server-cf ---
[INFO] 
[INFO] -------------------------------------------------------
[INFO]  T E S T S
[INFO] -------------------------------------------------------
SLF4J: A number (18) of logging calls during the initialization phase have been intercepted and are
SLF4J: now being replayed. These are subject to the filtering rules of the underlying logging system.
SLF4J: See also http://www.slf4j.org/codes.html#replay
[INFO] Running org.eclipse.leshan.server.californium.impl.InMemoryRegistrationStoreTest
[INFO] Tests run: 3, Failures: 0, Errors: 0, Skipped: 0, Time elapsed: 0.134 s - in org.eclipse.leshan.server.californium.impl.InMemoryRegistrationStoreTest
[INFO] Running org.eclipse.leshan.server.californium.LeshanBootstrapServerBuilderTest
[INFO] Tests run: 4, Failures: 0, Errors: 0, Skipped: 0, Time elapsed: 1.511 s - in org.eclipse.leshan.server.californium.LeshanBootstrapServerBuilderTest
[INFO] Running org.eclipse.leshan.server.californium.impl.ObservationServiceTest
[INFO] Tests run: 4, Failures: 0, Errors: 0, Skipped: 0, Time elapsed: 1.461 s - in org.eclipse.leshan.server.californium.impl.ObservationServiceTest
[INFO] Running org.eclipse.leshan.server.californium.LeshanServerBuilderTest
[INFO] Tests run: 4, Failures: 0, Errors: 0, Skipped: 0, Time elapsed: 1.462 s - in org.eclipse.leshan.server.californium.LeshanServerBuilderTest
[INFO] Running org.eclipse.leshan.server.californium.impl.CoapRequestBuilderTest
[INFO] Tests run: 12, Failures: 0, Errors: 0, Skipped: 0, Time elapsed: 0.098 s - in org.eclipse.leshan.server.californium.impl.CoapRequestBuilderTest
[INFO] 
[INFO] Results:
[INFO] 
[INFO] Tests run: 27, Failures: 0, Errors: 0, Skipped: 0
[INFO] 
[INFO] 
[INFO] --- maven-bundle-plugin:3.5.0:bundle (default-bundle) @ leshan-server-cf ---
[INFO] 
[INFO] >>> maven-source-plugin:3.0.1:jar (attach-sources) > generate-sources @ leshan-server-cf >>>
[INFO] 
[INFO] --- maven-enforcer-plugin:1.4.1:enforce (enforce-maven) @ leshan-server-cf ---
[INFO] 
[INFO] <<< maven-source-plugin:3.0.1:jar (attach-sources) < generate-sources @ leshan-server-cf <<<
[INFO] 
[INFO] 
[INFO] --- maven-source-plugin:3.0.1:jar (attach-sources) @ leshan-server-cf ---
[INFO] Building jar: /jobs/genie.leshan/leshan-hudson-test/workspace/leshan-server-cf/target/leshan-server-cf-1.0.0-SNAPSHOT-sources.jar
[INFO] 
[INFO] --- maven-install-plugin:2.5.2:install (default-install) @ leshan-server-cf ---
[INFO] Installing /jobs/genie.leshan/leshan-hudson-test/workspace/leshan-server-cf/target/leshan-server-cf-1.0.0-SNAPSHOT.jar to /opt/public/hipp/homes/genie.leshan/.m2/repository/org/eclipse/leshan/leshan-server-cf/1.0.0-SNAPSHOT/leshan-server-cf-1.0.0-SNAPSHOT.jar
[INFO] Installing /jobs/genie.leshan/leshan-hudson-test/workspace/leshan-server-cf/pom.xml to /opt/public/hipp/homes/genie.leshan/.m2/repository/org/eclipse/leshan/leshan-server-cf/1.0.0-SNAPSHOT/leshan-server-cf-1.0.0-SNAPSHOT.pom
[INFO] Installing /jobs/genie.leshan/leshan-hudson-test/workspace/leshan-server-cf/target/leshan-server-cf-1.0.0-SNAPSHOT-sources.jar to /opt/public/hipp/homes/genie.leshan/.m2/repository/org/eclipse/leshan/leshan-server-cf/1.0.0-SNAPSHOT/leshan-server-cf-1.0.0-SNAPSHOT-sources.jar
[INFO] 
[INFO] --- maven-bundle-plugin:3.5.0:install (default-install) @ leshan-server-cf ---
[INFO] Installing org/eclipse/leshan/leshan-server-cf/1.0.0-SNAPSHOT/leshan-server-cf-1.0.0-SNAPSHOT.jar
[INFO] Writing OBR metadata
[INFO] 
[INFO] --------------< org.eclipse.leshan:leshan-server-cluster >--------------
[INFO] Building leshan - server cluster 1.0.0-SNAPSHOT                   [6/13]
[INFO] -------------------------------[ bundle ]-------------------------------
[INFO] 
[INFO] --- maven-clean-plugin:3.0.0:clean (default-clean) @ leshan-server-cluster ---
[INFO] Deleting /jobs/genie.leshan/leshan-hudson-test/workspace/leshan-server-cluster/target
[INFO] 
[INFO] --- maven-enforcer-plugin:1.4.1:enforce (enforce-maven) @ leshan-server-cluster ---
[INFO] 
[INFO] --- maven-resources-plugin:3.0.2:resources (default-resources) @ leshan-server-cluster ---
[INFO] Using 'UTF-8' encoding to copy filtered resources.
[INFO] skip non existing resourceDirectory /jobs/genie.leshan/leshan-hudson-test/workspace/leshan-server-cluster/src/main/resources
[INFO] 
[INFO] --- maven-compiler-plugin:3.7.0:compile (default-compile) @ leshan-server-cluster ---
[INFO] Changes detected - recompiling the module!
[INFO] Compiling 17 source files to /jobs/genie.leshan/leshan-hudson-test/workspace/leshan-server-cluster/target/classes
[INFO] 
[INFO] --- maven-resources-plugin:3.0.2:testResources (default-testResources) @ leshan-server-cluster ---
[INFO] Using 'UTF-8' encoding to copy filtered resources.
[INFO] skip non existing resourceDirectory /jobs/genie.leshan/leshan-hudson-test/workspace/leshan-server-cluster/src/test/resources
[INFO] 
[INFO] --- maven-compiler-plugin:3.7.0:testCompile (default-testCompile) @ leshan-server-cluster ---
[INFO] Changes detected - recompiling the module!
[INFO] Compiling 5 source files to /jobs/genie.leshan/leshan-hudson-test/workspace/leshan-server-cluster/target/test-classes
[INFO] 
[INFO] --- maven-surefire-plugin:2.20.1:test (default-test) @ leshan-server-cluster ---
[INFO] 
[INFO] -------------------------------------------------------
[INFO]  T E S T S
[INFO] -------------------------------------------------------
[INFO] Running org.eclipse.leshan.server.cluster.serialization.RegistrationSerDesTest
[INFO] Tests run: 1, Failures: 0, Errors: 0, Skipped: 0, Time elapsed: 0.158 s - in org.eclipse.leshan.server.cluster.serialization.RegistrationSerDesTest
[INFO] Running org.eclipse.leshan.server.cluster.serialization.ResponseSerDesTest
[INFO] Tests run: 1, Failures: 0, Errors: 0, Skipped: 0, Time elapsed: 0.111 s - in org.eclipse.leshan.server.cluster.serialization.ResponseSerDesTest
[INFO] Running org.eclipse.leshan.server.cluster.serialization.RegistrationUpdateSerDesTest
[INFO] Tests run: 1, Failures: 0, Errors: 0, Skipped: 0, Time elapsed: 0.059 s - in org.eclipse.leshan.server.cluster.serialization.RegistrationUpdateSerDesTest
[INFO] Running org.eclipse.leshan.server.cluster.serialization.SecurityInfoSerDesTest
[INFO] Tests run: 2, Failures: 0, Errors: 0, Skipped: 0, Time elapsed: 0.42 s - in org.eclipse.leshan.server.cluster.serialization.SecurityInfoSerDesTest
[INFO] Running org.eclipse.leshan.server.cluster.serialization.DownlinkRequestSerDesTest
[INFO] Tests run: 9, Failures: 0, Errors: 0, Skipped: 0, Time elapsed: 0.312 s - in org.eclipse.leshan.server.cluster.serialization.DownlinkRequestSerDesTest
[INFO] 
[INFO] Results:
[INFO] 
[INFO] Tests run: 14, Failures: 0, Errors: 0, Skipped: 0
[INFO] 
[INFO] 
[INFO] --- maven-bundle-plugin:3.5.0:bundle (default-bundle) @ leshan-server-cluster ---
[INFO] 
[INFO] >>> maven-source-plugin:3.0.1:jar (attach-sources) > generate-sources @ leshan-server-cluster >>>
[INFO] 
[INFO] --- maven-enforcer-plugin:1.4.1:enforce (enforce-maven) @ leshan-server-cluster ---
[INFO] 
[INFO] <<< maven-source-plugin:3.0.1:jar (attach-sources) < generate-sources @ leshan-server-cluster <<<
[INFO] 
[INFO] 
[INFO] --- maven-source-plugin:3.0.1:jar (attach-sources) @ leshan-server-cluster ---
[INFO] Building jar: /jobs/genie.leshan/leshan-hudson-test/workspace/leshan-server-cluster/target/leshan-server-cluster-1.0.0-SNAPSHOT-sources.jar
[INFO] 
[INFO] --- maven-assembly-plugin:3.1.0:single (make-assembly) @ leshan-server-cluster ---
[INFO] Reading assembly descriptor: ../jar-with-dependencies-with-logback.xml
[INFO] Building jar: /jobs/genie.leshan/leshan-hudson-test/workspace/leshan-server-cluster/target/leshan-server-cluster-1.0.0-SNAPSHOT-jar-with-dependencies.jar
[INFO] 
[INFO] --- maven-install-plugin:2.5.2:install (default-install) @ leshan-server-cluster ---
[INFO] Installing /jobs/genie.leshan/leshan-hudson-test/workspace/leshan-server-cluster/target/leshan-server-cluster-1.0.0-SNAPSHOT.jar to /opt/public/hipp/homes/genie.leshan/.m2/repository/org/eclipse/leshan/leshan-server-cluster/1.0.0-SNAPSHOT/leshan-server-cluster-1.0.0-SNAPSHOT.jar
[INFO] Installing /jobs/genie.leshan/leshan-hudson-test/workspace/leshan-server-cluster/pom.xml to /opt/public/hipp/homes/genie.leshan/.m2/repository/org/eclipse/leshan/leshan-server-cluster/1.0.0-SNAPSHOT/leshan-server-cluster-1.0.0-SNAPSHOT.pom
[INFO] Installing /jobs/genie.leshan/leshan-hudson-test/workspace/leshan-server-cluster/target/leshan-server-cluster-1.0.0-SNAPSHOT-sources.jar to /opt/public/hipp/homes/genie.leshan/.m2/repository/org/eclipse/leshan/leshan-server-cluster/1.0.0-SNAPSHOT/leshan-server-cluster-1.0.0-SNAPSHOT-sources.jar
[INFO] Installing /jobs/genie.leshan/leshan-hudson-test/workspace/leshan-server-cluster/target/leshan-server-cluster-1.0.0-SNAPSHOT-jar-with-dependencies.jar to /opt/public/hipp/homes/genie.leshan/.m2/repository/org/eclipse/leshan/leshan-server-cluster/1.0.0-SNAPSHOT/leshan-server-cluster-1.0.0-SNAPSHOT-jar-with-dependencies.jar
[INFO] 
[INFO] --- maven-bundle-plugin:3.5.0:install (default-install) @ leshan-server-cluster ---
[INFO] Installing org/eclipse/leshan/leshan-server-cluster/1.0.0-SNAPSHOT/leshan-server-cluster-1.0.0-SNAPSHOT.jar
[INFO] Installing org/eclipse/leshan/leshan-server-cluster/1.0.0-SNAPSHOT/leshan-server-cluster-1.0.0-SNAPSHOT-jar-with-dependencies.jar
[INFO] Writing OBR metadata
[INFO] 
[INFO] ---------------< org.eclipse.leshan:leshan-client-core >----------------
[INFO] Building leshan - client core 1.0.0-SNAPSHOT                      [7/13]
[INFO] -------------------------------[ bundle ]-------------------------------
[INFO] 
[INFO] --- maven-clean-plugin:3.0.0:clean (default-clean) @ leshan-client-core ---
[INFO] Deleting /jobs/genie.leshan/leshan-hudson-test/workspace/leshan-client-core/target
[INFO] 
[INFO] --- maven-enforcer-plugin:1.4.1:enforce (enforce-maven) @ leshan-client-core ---
[INFO] 
[INFO] --- maven-resources-plugin:3.0.2:resources (default-resources) @ leshan-client-core ---
[INFO] Using 'UTF-8' encoding to copy filtered resources.
[INFO] skip non existing resourceDirectory /jobs/genie.leshan/leshan-hudson-test/workspace/leshan-client-core/src/main/resources
[INFO] 
[INFO] --- maven-compiler-plugin:3.7.0:compile (default-compile) @ leshan-client-core ---
[INFO] Changes detected - recompiling the module!
[INFO] Compiling 29 source files to /jobs/genie.leshan/leshan-hudson-test/workspace/leshan-client-core/target/classes
[INFO] 
[INFO] --- maven-resources-plugin:3.0.2:testResources (default-testResources) @ leshan-client-core ---
[INFO] Using 'UTF-8' encoding to copy filtered resources.
[INFO] skip non existing resourceDirectory /jobs/genie.leshan/leshan-hudson-test/workspace/leshan-client-core/src/test/resources
[INFO] 
[INFO] --- maven-compiler-plugin:3.7.0:testCompile (default-testCompile) @ leshan-client-core ---
[INFO] Changes detected - recompiling the module!
[INFO] Compiling 1 source file to /jobs/genie.leshan/leshan-hudson-test/workspace/leshan-client-core/target/test-classes
[INFO] 
[INFO] --- maven-surefire-plugin:2.20.1:test (default-test) @ leshan-client-core ---
[INFO] 
[INFO] -------------------------------------------------------
[INFO]  T E S T S
[INFO] -------------------------------------------------------
[INFO] Running org.eclipse.leshan.client.util.LinkFormatHelperTest
[INFO] Tests run: 9, Failures: 0, Errors: 0, Skipped: 0, Time elapsed: 1.372 s - in org.eclipse.leshan.client.util.LinkFormatHelperTest
[INFO] 
[INFO] Results:
[INFO] 
[INFO] Tests run: 9, Failures: 0, Errors: 0, Skipped: 0
[INFO] 
[INFO] 
[INFO] --- maven-bundle-plugin:3.5.0:bundle (default-bundle) @ leshan-client-core ---
[INFO] 
[INFO] >>> maven-source-plugin:3.0.1:jar (attach-sources) > generate-sources @ leshan-client-core >>>
[INFO] 
[INFO] --- maven-enforcer-plugin:1.4.1:enforce (enforce-maven) @ leshan-client-core ---
[INFO] 
[INFO] <<< maven-source-plugin:3.0.1:jar (attach-sources) < generate-sources @ leshan-client-core <<<
[INFO] 
[INFO] 
[INFO] --- maven-source-plugin:3.0.1:jar (attach-sources) @ leshan-client-core ---
[INFO] Building jar: /jobs/genie.leshan/leshan-hudson-test/workspace/leshan-client-core/target/leshan-client-core-1.0.0-SNAPSHOT-sources.jar
[INFO] 
[INFO] --- maven-install-plugin:2.5.2:install (default-install) @ leshan-client-core ---
[INFO] Installing /jobs/genie.leshan/leshan-hudson-test/workspace/leshan-client-core/target/leshan-client-core-1.0.0-SNAPSHOT.jar to /opt/public/hipp/homes/genie.leshan/.m2/repository/org/eclipse/leshan/leshan-client-core/1.0.0-SNAPSHOT/leshan-client-core-1.0.0-SNAPSHOT.jar
[INFO] Installing /jobs/genie.leshan/leshan-hudson-test/workspace/leshan-client-core/pom.xml to /opt/public/hipp/homes/genie.leshan/.m2/repository/org/eclipse/leshan/leshan-client-core/1.0.0-SNAPSHOT/leshan-client-core-1.0.0-SNAPSHOT.pom
[INFO] Installing /jobs/genie.leshan/leshan-hudson-test/workspace/leshan-client-core/target/leshan-client-core-1.0.0-SNAPSHOT-sources.jar to /opt/public/hipp/homes/genie.leshan/.m2/repository/org/eclipse/leshan/leshan-client-core/1.0.0-SNAPSHOT/leshan-client-core-1.0.0-SNAPSHOT-sources.jar
[INFO] 
[INFO] --- maven-bundle-plugin:3.5.0:install (default-install) @ leshan-client-core ---
[INFO] Installing org/eclipse/leshan/leshan-client-core/1.0.0-SNAPSHOT/leshan-client-core-1.0.0-SNAPSHOT.jar
[INFO] Writing OBR metadata
[INFO] 
[INFO] ----------------< org.eclipse.leshan:leshan-client-cf >-----------------
[INFO] Building leshan - client californium 1.0.0-SNAPSHOT               [8/13]
[INFO] -------------------------------[ bundle ]-------------------------------
[INFO] 
[INFO] --- maven-clean-plugin:3.0.0:clean (default-clean) @ leshan-client-cf ---
[INFO] Deleting /jobs/genie.leshan/leshan-hudson-test/workspace/leshan-client-cf/target
[INFO] 
[INFO] --- maven-enforcer-plugin:1.4.1:enforce (enforce-maven) @ leshan-client-cf ---
[INFO] 
[INFO] --- maven-resources-plugin:3.0.2:resources (default-resources) @ leshan-client-cf ---
[INFO] Using 'UTF-8' encoding to copy filtered resources.
[INFO] skip non existing resourceDirectory /jobs/genie.leshan/leshan-hudson-test/workspace/leshan-client-cf/src/main/resources
[INFO] 
[INFO] --- maven-compiler-plugin:3.7.0:compile (default-compile) @ leshan-client-cf ---
[INFO] Changes detected - recompiling the module!
[INFO] Compiling 12 source files to /jobs/genie.leshan/leshan-hudson-test/workspace/leshan-client-cf/target/classes
[INFO] 
[INFO] --- maven-resources-plugin:3.0.2:testResources (default-testResources) @ leshan-client-cf ---
[INFO] Using 'UTF-8' encoding to copy filtered resources.
[INFO] skip non existing resourceDirectory /jobs/genie.leshan/leshan-hudson-test/workspace/leshan-client-cf/src/test/resources
[INFO] 
[INFO] --- maven-compiler-plugin:3.7.0:testCompile (default-testCompile) @ leshan-client-cf ---
[INFO] No sources to compile
[INFO] 
[INFO] --- maven-surefire-plugin:2.20.1:test (default-test) @ leshan-client-cf ---
[INFO] No tests to run.
[INFO] 
[INFO] --- maven-bundle-plugin:3.5.0:bundle (default-bundle) @ leshan-client-cf ---
[INFO] 
[INFO] >>> maven-source-plugin:3.0.1:jar (attach-sources) > generate-sources @ leshan-client-cf >>>
[INFO] 
[INFO] --- maven-enforcer-plugin:1.4.1:enforce (enforce-maven) @ leshan-client-cf ---
[INFO] 
[INFO] <<< maven-source-plugin:3.0.1:jar (attach-sources) < generate-sources @ leshan-client-cf <<<
[INFO] 
[INFO] 
[INFO] --- maven-source-plugin:3.0.1:jar (attach-sources) @ leshan-client-cf ---
[INFO] Building jar: /jobs/genie.leshan/leshan-hudson-test/workspace/leshan-client-cf/target/leshan-client-cf-1.0.0-SNAPSHOT-sources.jar
[INFO] 
[INFO] --- maven-install-plugin:2.5.2:install (default-install) @ leshan-client-cf ---
[INFO] Installing /jobs/genie.leshan/leshan-hudson-test/workspace/leshan-client-cf/target/leshan-client-cf-1.0.0-SNAPSHOT.jar to /opt/public/hipp/homes/genie.leshan/.m2/repository/org/eclipse/leshan/leshan-client-cf/1.0.0-SNAPSHOT/leshan-client-cf-1.0.0-SNAPSHOT.jar
[INFO] Installing /jobs/genie.leshan/leshan-hudson-test/workspace/leshan-client-cf/pom.xml to /opt/public/hipp/homes/genie.leshan/.m2/repository/org/eclipse/leshan/leshan-client-cf/1.0.0-SNAPSHOT/leshan-client-cf-1.0.0-SNAPSHOT.pom
[INFO] Installing /jobs/genie.leshan/leshan-hudson-test/workspace/leshan-client-cf/target/leshan-client-cf-1.0.0-SNAPSHOT-sources.jar to /opt/public/hipp/homes/genie.leshan/.m2/repository/org/eclipse/leshan/leshan-client-cf/1.0.0-SNAPSHOT/leshan-client-cf-1.0.0-SNAPSHOT-sources.jar
[INFO] 
[INFO] --- maven-bundle-plugin:3.5.0:install (default-install) @ leshan-client-cf ---
[INFO] Installing org/eclipse/leshan/leshan-client-cf/1.0.0-SNAPSHOT/leshan-client-cf-1.0.0-SNAPSHOT.jar
[INFO] Writing OBR metadata
[INFO] 
[INFO] ------------< org.eclipse.leshan:leshan-integration-tests >-------------
[INFO] Building leshan - integration tests 1.0.0-SNAPSHOT                [9/13]
[INFO] --------------------------------[ jar ]---------------------------------
[INFO] 
[INFO] --- maven-clean-plugin:3.0.0:clean (default-clean) @ leshan-integration-tests ---
[INFO] Deleting /jobs/genie.leshan/leshan-hudson-test/workspace/leshan-integration-tests/target
[INFO] 
[INFO] --- maven-enforcer-plugin:1.4.1:enforce (enforce-maven) @ leshan-integration-tests ---
[INFO] 
[INFO] --- maven-resources-plugin:3.0.2:resources (default-resources) @ leshan-integration-tests ---
[INFO] Using 'UTF-8' encoding to copy filtered resources.
[INFO] skip non existing resourceDirectory /jobs/genie.leshan/leshan-hudson-test/workspace/leshan-integration-tests/src/main/resources
[INFO] 
[INFO] --- maven-compiler-plugin:3.7.0:compile (default-compile) @ leshan-integration-tests ---
[INFO] No sources to compile
[INFO] 
[INFO] --- maven-resources-plugin:3.0.2:testResources (default-testResources) @ leshan-integration-tests ---
[INFO] Using 'UTF-8' encoding to copy filtered resources.
[INFO] skip non existing resourceDirectory /jobs/genie.leshan/leshan-hudson-test/workspace/leshan-integration-tests/src/test/resources
[INFO] 
[INFO] --- maven-compiler-plugin:3.7.0:testCompile (default-testCompile) @ leshan-integration-tests ---
[INFO] Changes detected - recompiling the module!
[INFO] Compiling 28 source files to /jobs/genie.leshan/leshan-hudson-test/workspace/leshan-integration-tests/target/test-classes
[INFO] 
[INFO] --- maven-surefire-plugin:2.20.1:test (default-test) @ leshan-integration-tests ---
[INFO] 
[INFO] -------------------------------------------------------
[INFO]  T E S T S
[INFO] -------------------------------------------------------
[INFO] Running org.eclipse.leshan.integration.tests.DiscoverTest
[ERROR] Tests run: 9, Failures: 0, Errors: 4, Skipped: 0, Time elapsed: 39.627 s <<< FAILURE! - in org.eclipse.leshan.integration.tests.DiscoverTest
[ERROR] cant_discover_resource_of_non_existent_object(org.eclipse.leshan.integration.tests.DiscoverTest)  Time elapsed: 5.813 s  <<< ERROR!
java.lang.RuntimeException: java.util.concurrent.TimeoutException: wait for register timeout
	at org.eclipse.leshan.integration.tests.DiscoverTest.start(DiscoverTest.java:43)
Caused by: java.util.concurrent.TimeoutException: wait for register timeout
	at org.eclipse.leshan.integration.tests.DiscoverTest.start(DiscoverTest.java:43)

[ERROR] can_discover_object(org.eclipse.leshan.integration.tests.DiscoverTest)  Time elapsed: 5.13 s  <<< ERROR!
java.lang.RuntimeException: java.util.concurrent.TimeoutException: wait for register timeout
	at org.eclipse.leshan.integration.tests.DiscoverTest.start(DiscoverTest.java:43)
Caused by: java.util.concurrent.TimeoutException: wait for register timeout
	at org.eclipse.leshan.integration.tests.DiscoverTest.start(DiscoverTest.java:43)

[ERROR] cant_discover_resource_of_non_existent_instance_and_resource(org.eclipse.leshan.integration.tests.DiscoverTest)  Time elapsed: 8.96 s  <<< ERROR!
java.lang.RuntimeException: java.util.concurrent.TimeoutException: wait for register timeout
	at org.eclipse.leshan.integration.tests.DiscoverTest.start(DiscoverTest.java:43)
Caused by: java.util.concurrent.TimeoutException: wait for register timeout
	at org.eclipse.leshan.integration.tests.DiscoverTest.start(DiscoverTest.java:43)

[ERROR] cant_discover_resource_of_non_existent_resource(org.eclipse.leshan.integration.tests.DiscoverTest)  Time elapsed: 4.777 s  <<< ERROR!
java.lang.RuntimeException: java.util.concurrent.TimeoutException: wait for register timeout
	at org.eclipse.leshan.integration.tests.DiscoverTest.start(DiscoverTest.java:43)
Caused by: java.util.concurrent.TimeoutException: wait for register timeout
	at org.eclipse.leshan.integration.tests.DiscoverTest.start(DiscoverTest.java:43)

[INFO] Running org.eclipse.leshan.integration.tests.SecurityTest
Exception in thread "DTLS-Connection-Handler-3" java.util.concurrent.RejectedExecutionException: Task java.util.concurrent.ScheduledThreadPoolExecutor$ScheduledFutureTask@11511d51 rejected from java.util.concurrent.ScheduledThreadPoolExecutor@645bb9b8[Terminated, pool size = 0, active threads = 0, queued tasks = 0, completed tasks = 1]
	at java.util.concurrent.ThreadPoolExecutor$AbortPolicy.rejectedExecution(ThreadPoolExecutor.java:2048)
	at java.util.concurrent.ThreadPoolExecutor.reject(ThreadPoolExecutor.java:821)
	at java.util.concurrent.ScheduledThreadPoolExecutor.delayedExecute(ScheduledThreadPoolExecutor.java:325)
	at java.util.concurrent.ScheduledThreadPoolExecutor.schedule(ScheduledThreadPoolExecutor.java:530)
	at java.util.concurrent.Executors$DelegatedScheduledExecutorService.schedule(Executors.java:689)
	at org.eclipse.californium.scandium.DTLSConnector.scheduleRetransmission(DTLSConnector.java:1554)
	at org.eclipse.californium.scandium.DTLSConnector.handleTimeout(DTLSConnector.java:1522)
	at org.eclipse.californium.scandium.DTLSConnector.access$1200(DTLSConnector.java:152)
	at org.eclipse.californium.scandium.DTLSConnector$RetransmitTask$1.run(DTLSConnector.java:1679)
	at eu.javaspecialists.tjsn.concurrency.stripedexecutor.StripedExecutorService$SerialExecutor$1.run(StripedExecutorService.java:460)
	at java.util.concurrent.ThreadPoolExecutor.runWorker(ThreadPoolExecutor.java:1145)
	at java.util.concurrent.ThreadPoolExecutor$Worker.run(ThreadPoolExecutor.java:615)
	at java.lang.Thread.run(Thread.java:745)
[ERROR] Tests run: 19, Failures: 0, Errors: 6, Skipped: 6, Time elapsed: 42.235 s <<< FAILURE! - in org.eclipse.leshan.integration.tests.SecurityTest
[ERROR] registered_device_with_rpk_to_server_with_rpk(org.eclipse.leshan.integration.tests.SecurityTest)  Time elapsed: 3.165 s  <<< ERROR!
java.lang.RuntimeException: java.util.concurrent.TimeoutException: wait for register timeout
	at org.eclipse.leshan.integration.tests.SecurityTest.registered_device_with_rpk_to_server_with_rpk(SecurityTest.java:328)
Caused by: java.util.concurrent.TimeoutException: wait for register timeout
	at org.eclipse.leshan.integration.tests.SecurityTest.registered_device_with_rpk_to_server_with_rpk(SecurityTest.java:328)

[ERROR] registered_device_with_psk_to_server_with_psk(org.eclipse.leshan.integration.tests.SecurityTest)  Time elapsed: 5.16 s  <<< ERROR!
java.lang.RuntimeException: java.util.concurrent.TimeoutException: wait for register timeout
	at org.eclipse.leshan.integration.tests.SecurityTest.registered_device_with_psk_to_server_with_psk(SecurityTest.java:82)
Caused by: java.util.concurrent.TimeoutException: wait for register timeout
	at org.eclipse.leshan.integration.tests.SecurityTest.registered_device_with_psk_to_server_with_psk(SecurityTest.java:82)

[ERROR] register_update_deregister_reregister_device_with_psk_to_server_with_psk(org.eclipse.leshan.integration.tests.SecurityTest)  Time elapsed: 4.617 s  <<< ERROR!
java.lang.RuntimeException: java.util.concurrent.TimeoutException: wait for register timeout
	at org.eclipse.leshan.integration.tests.SecurityTest.register_update_deregister_reregister_device_with_psk_to_server_with_psk(SecurityTest.java:169)
Caused by: java.util.concurrent.TimeoutException: wait for register timeout
	at org.eclipse.leshan.integration.tests.SecurityTest.register_update_deregister_reregister_device_with_psk_to_server_with_psk(SecurityTest.java:169)

[ERROR] register_update_reregister_device_with_psk_to_server_with_psk(org.eclipse.leshan.integration.tests.SecurityTest)  Time elapsed: 4.903 s  <<< ERROR!
java.lang.RuntimeException: java.util.concurrent.TimeoutException: wait for register timeout
	at org.eclipse.leshan.integration.tests.SecurityTest.register_update_reregister_device_with_psk_to_server_with_psk(SecurityTest.java:205)
Caused by: java.util.concurrent.TimeoutException: wait for register timeout
	at org.eclipse.leshan.integration.tests.SecurityTest.register_update_reregister_device_with_psk_to_server_with_psk(SecurityTest.java:205)

[ERROR] dont_sent_request_if_identity_change(org.eclipse.leshan.integration.tests.SecurityTest)  Time elapsed: 4.422 s  <<< ERROR!
java.lang.RuntimeException: java.util.concurrent.TimeoutException: wait for register timeout
	at org.eclipse.leshan.integration.tests.SecurityTest.dont_sent_request_if_identity_change(SecurityTest.java:107)
Caused by: java.util.concurrent.TimeoutException: wait for register timeout
	at org.eclipse.leshan.integration.tests.SecurityTest.dont_sent_request_if_identity_change(SecurityTest.java:107)

[ERROR] registered_device_with_rpk_to_server_with_x509cert(org.eclipse.leshan.integration.tests.SecurityTest)  Time elapsed: 2.201 s  <<< ERROR!
java.lang.RuntimeException: java.util.concurrent.TimeoutException: wait for register timeout
	at org.eclipse.leshan.integration.tests.SecurityTest.registered_device_with_rpk_to_server_with_x509cert(SecurityTest.java:478)
Caused by: java.util.concurrent.TimeoutException: wait for register timeout
	at org.eclipse.leshan.integration.tests.SecurityTest.registered_device_with_rpk_to_server_with_x509cert(SecurityTest.java:478)

[INFO] Running org.eclipse.leshan.integration.tests.FailingTest
[ERROR] Tests run: 4, Failures: 1, Errors: 1, Skipped: 0, Time elapsed: 28.222 s <<< FAILURE! - in org.eclipse.leshan.integration.tests.FailingTest
[ERROR] sync_send_without_acknowleged(org.eclipse.leshan.integration.tests.FailingTest)  Time elapsed: 6.872 s  <<< ERROR!
java.util.concurrent.TimeoutException
	at org.eclipse.leshan.integration.tests.FailingTest.sync_send_without_acknowleged(FailingTest.java:86)

[ERROR] async_send_without_acknowleged(org.eclipse.leshan.integration.tests.FailingTest)  Time elapsed: 4.499 s  <<< FAILURE!
java.lang.AssertionError: we should timeout
	at org.eclipse.leshan.integration.tests.FailingTest.async_send_without_acknowleged(FailingTest.java:134)

[INFO] Running org.eclipse.leshan.integration.tests.ExecuteTest
[ERROR] Tests run: 7, Failures: 0, Errors: 6, Skipped: 0, Time elapsed: 33.365 s <<< FAILURE! - in org.eclipse.leshan.integration.tests.ExecuteTest
[ERROR] can_execute_resource(org.eclipse.leshan.integration.tests.ExecuteTest)  Time elapsed: 5.099 s  <<< ERROR!
java.lang.RuntimeException: java.util.concurrent.TimeoutException: wait for register timeout
	at org.eclipse.leshan.integration.tests.ExecuteTest.start(ExecuteTest.java:45)
Caused by: java.util.concurrent.TimeoutException: wait for register timeout
	at org.eclipse.leshan.integration.tests.ExecuteTest.start(ExecuteTest.java:45)

[ERROR] cannot_execute_nonexisting_resource_on_non_existing_object(org.eclipse.leshan.integration.tests.ExecuteTest)  Time elapsed: 3.674 s  <<< ERROR!
java.lang.RuntimeException: java.util.concurrent.TimeoutException: wait for register timeout
	at org.eclipse.leshan.integration.tests.ExecuteTest.start(ExecuteTest.java:45)
Caused by: java.util.concurrent.TimeoutException: wait for register timeout
	at org.eclipse.leshan.integration.tests.ExecuteTest.start(ExecuteTest.java:45)

[ERROR] can_execute_resource_with_parameters(org.eclipse.leshan.integration.tests.ExecuteTest)  Time elapsed: 5.478 s  <<< ERROR!
java.lang.RuntimeException: java.util.concurrent.TimeoutException: wait for register timeout
	at org.eclipse.leshan.integration.tests.ExecuteTest.start(ExecuteTest.java:45)
Caused by: java.util.concurrent.TimeoutException: wait for register timeout
	at org.eclipse.leshan.integration.tests.ExecuteTest.start(ExecuteTest.java:45)

[ERROR] cannot_execute_security_object(org.eclipse.leshan.integration.tests.ExecuteTest)  Time elapsed: 6.183 s  <<< ERROR!
java.lang.RuntimeException: java.util.concurrent.TimeoutException: wait for register timeout
	at org.eclipse.leshan.integration.tests.ExecuteTest.start(ExecuteTest.java:45)
Caused by: java.util.concurrent.TimeoutException: wait for register timeout
	at org.eclipse.leshan.integration.tests.ExecuteTest.start(ExecuteTest.java:45)

[ERROR] cannot_execute_read_only_resource(org.eclipse.leshan.integration.tests.ExecuteTest)  Time elapsed: 5.225 s  <<< ERROR!
java.lang.RuntimeException: java.util.concurrent.TimeoutException: wait for register timeout
	at org.eclipse.leshan.integration.tests.ExecuteTest.start(ExecuteTest.java:45)
Caused by: java.util.concurrent.TimeoutException: wait for register timeout
	at org.eclipse.leshan.integration.tests.ExecuteTest.start(ExecuteTest.java:45)

[ERROR] cannot_execute_nonexisting_resource_on_existing_object(org.eclipse.leshan.integration.tests.ExecuteTest)  Time elapsed: 2.865 s  <<< ERROR!
java.lang.RuntimeException: java.util.concurrent.TimeoutException: wait for register timeout
	at org.eclipse.leshan.integration.tests.ExecuteTest.start(ExecuteTest.java:45)
Caused by: java.util.concurrent.TimeoutException: wait for register timeout
	at org.eclipse.leshan.integration.tests.ExecuteTest.start(ExecuteTest.java:45)

[INFO] Running org.eclipse.leshan.integration.tests.QueueModeTest
[ERROR] Tests run: 4, Failures: 0, Errors: 4, Skipped: 0, Time elapsed: 22.31 s <<< FAILURE! - in org.eclipse.leshan.integration.tests.QueueModeTest
[ERROR] one_awake_notification(org.eclipse.leshan.integration.tests.QueueModeTest)  Time elapsed: 5.827 s  <<< ERROR!
java.lang.RuntimeException: java.util.concurrent.TimeoutException: wait for awake timeout
	at org.eclipse.leshan.integration.tests.QueueModeTest.one_awake_notification(QueueModeTest.java:98)
Caused by: java.util.concurrent.TimeoutException: wait for awake timeout
	at org.eclipse.leshan.integration.tests.QueueModeTest.one_awake_notification(QueueModeTest.java:98)

[ERROR] awake_sleeping_awake_sleeping(org.eclipse.leshan.integration.tests.QueueModeTest)  Time elapsed: 5.132 s  <<< ERROR!
java.lang.RuntimeException: java.util.concurrent.TimeoutException: wait for awake timeout
	at org.eclipse.leshan.integration.tests.QueueModeTest.awake_sleeping_awake_sleeping(QueueModeTest.java:57)
Caused by: java.util.concurrent.TimeoutException: wait for awake timeout
	at org.eclipse.leshan.integration.tests.QueueModeTest.awake_sleeping_awake_sleeping(QueueModeTest.java:57)

[ERROR] correct_sending_when_awake(org.eclipse.leshan.integration.tests.QueueModeTest)  Time elapsed: 4.716 s  <<< ERROR!
java.lang.RuntimeException: java.util.concurrent.TimeoutException: wait for awake timeout
	at org.eclipse.leshan.integration.tests.QueueModeTest.correct_sending_when_awake(QueueModeTest.java:176)
Caused by: java.util.concurrent.TimeoutException: wait for awake timeout
	at org.eclipse.leshan.integration.tests.QueueModeTest.correct_sending_when_awake(QueueModeTest.java:176)

[ERROR] sleeping_if_timeout(org.eclipse.leshan.integration.tests.QueueModeTest)  Time elapsed: 6.632 s  <<< ERROR!
java.lang.RuntimeException: java.util.concurrent.TimeoutException: wait for awake timeout
	at org.eclipse.leshan.integration.tests.QueueModeTest.sleeping_if_timeout(QueueModeTest.java:148)
Caused by: java.util.concurrent.TimeoutException: wait for awake timeout
	at org.eclipse.leshan.integration.tests.QueueModeTest.sleeping_if_timeout(QueueModeTest.java:148)

[INFO] Running org.eclipse.leshan.integration.tests.ObserveTest
[ERROR] Tests run: 7, Failures: 0, Errors: 5, Skipped: 0, Time elapsed: 40.191 s <<< FAILURE! - in org.eclipse.leshan.integration.tests.ObserveTest
[ERROR] can_observe_object(org.eclipse.leshan.integration.tests.ObserveTest)  Time elapsed: 7.68 s  <<< ERROR!
java.lang.RuntimeException: java.util.concurrent.TimeoutException: wait for register timeout
	at org.eclipse.leshan.integration.tests.ObserveTest.start(ObserveTest.java:77)
Caused by: java.util.concurrent.TimeoutException: wait for register timeout
	at org.eclipse.leshan.integration.tests.ObserveTest.start(ObserveTest.java:77)

[ERROR] can_observe_timestamped_object(org.eclipse.leshan.integration.tests.ObserveTest)  Time elapsed: 6.462 s  <<< ERROR!
java.lang.RuntimeException: java.util.concurrent.TimeoutException: wait for register timeout
	at org.eclipse.leshan.integration.tests.ObserveTest.start(ObserveTest.java:77)
Caused by: java.util.concurrent.TimeoutException: wait for register timeout
	at org.eclipse.leshan.integration.tests.ObserveTest.start(ObserveTest.java:77)

[ERROR] can_handle_error_on_notification(org.eclipse.leshan.integration.tests.ObserveTest)  Time elapsed: 4.901 s  <<< ERROR!
java.lang.RuntimeException: java.util.concurrent.TimeoutException: wait for register timeout
	at org.eclipse.leshan.integration.tests.ObserveTest.start(ObserveTest.java:77)
Caused by: java.util.concurrent.TimeoutException: wait for register timeout
	at org.eclipse.leshan.integration.tests.ObserveTest.start(ObserveTest.java:77)

[ERROR] can_observe_resource(org.eclipse.leshan.integration.tests.ObserveTest)  Time elapsed: 6.57 s  <<< ERROR!
java.lang.RuntimeException: java.util.concurrent.TimeoutException: wait for register timeout
	at org.eclipse.leshan.integration.tests.ObserveTest.start(ObserveTest.java:77)
Caused by: java.util.concurrent.TimeoutException: wait for register timeout
	at org.eclipse.leshan.integration.tests.ObserveTest.start(ObserveTest.java:77)

[ERROR] can_observe_timestamped_resource(org.eclipse.leshan.integration.tests.ObserveTest)  Time elapsed: 5.658 s  <<< ERROR!
java.lang.RuntimeException: java.util.concurrent.TimeoutException: wait for register timeout
	at org.eclipse.leshan.integration.tests.ObserveTest.start(ObserveTest.java:77)
Caused by: java.util.concurrent.TimeoutException: wait for register timeout
	at org.eclipse.leshan.integration.tests.ObserveTest.start(ObserveTest.java:77)

[INFO] Running org.eclipse.leshan.integration.tests.WriteTest
[ERROR] Tests run: 44, Failures: 0, Errors: 5, Skipped: 0, Time elapsed: 66.002 s <<< FAILURE! - in org.eclipse.leshan.integration.tests.WriteTest
[ERROR] can_write_object_instance_in_old_tlv(org.eclipse.leshan.integration.tests.WriteTest)  Time elapsed: 5.651 s  <<< ERROR!
java.lang.RuntimeException: java.util.concurrent.TimeoutException: wait for register timeout
	at org.eclipse.leshan.integration.tests.WriteTest.start(WriteTest.java:61)
Caused by: java.util.concurrent.TimeoutException: wait for register timeout
	at org.eclipse.leshan.integration.tests.WriteTest.start(WriteTest.java:61)

[ERROR] can_write_opaque_resource_in_old_tlv(org.eclipse.leshan.integration.tests.WriteTest)  Time elapsed: 5.781 s  <<< ERROR!
java.lang.RuntimeException: java.util.concurrent.TimeoutException: wait for register timeout
	at org.eclipse.leshan.integration.tests.WriteTest.start(WriteTest.java:61)
Caused by: java.util.concurrent.TimeoutException: wait for register timeout
	at org.eclipse.leshan.integration.tests.WriteTest.start(WriteTest.java:61)

[ERROR] can_write_time_resource_in_old_json(org.eclipse.leshan.integration.tests.WriteTest)  Time elapsed: 5.242 s  <<< ERROR!
java.lang.RuntimeException: java.util.concurrent.TimeoutException: wait for register timeout
	at org.eclipse.leshan.integration.tests.WriteTest.start(WriteTest.java:61)
Caused by: java.util.concurrent.TimeoutException: wait for register timeout
	at org.eclipse.leshan.integration.tests.WriteTest.start(WriteTest.java:61)

[ERROR] can_write_multi_instance_objlnk_resource_in_tlv(org.eclipse.leshan.integration.tests.WriteTest)  Time elapsed: 5.717 s  <<< ERROR!
java.lang.RuntimeException: java.util.concurrent.TimeoutException: wait for register timeout
	at org.eclipse.leshan.integration.tests.WriteTest.start(WriteTest.java:61)
Caused by: java.util.concurrent.TimeoutException: wait for register timeout
	at org.eclipse.leshan.integration.tests.WriteTest.start(WriteTest.java:61)

[ERROR] can_write_string_resource_in_tlv(org.eclipse.leshan.integration.tests.WriteTest)  Time elapsed: 8.281 s  <<< ERROR!
java.lang.NullPointerException
	at org.eclipse.leshan.integration.tests.WriteTest.write_string_resource(WriteTest.java:110)
	at org.eclipse.leshan.integration.tests.WriteTest.can_write_string_resource_in_tlv(WriteTest.java:78)

[INFO] Running org.eclipse.leshan.integration.tests.CreateTest
[ERROR] Tests run: 9, Failures: 0, Errors: 4, Skipped: 3, Time elapsed: 32.815 s <<< FAILURE! - in org.eclipse.leshan.integration.tests.CreateTest
[ERROR] cannot_create_instance_of_object(org.eclipse.leshan.integration.tests.CreateTest)  Time elapsed: 7.017 s  <<< ERROR!
java.lang.RuntimeException: java.util.concurrent.TimeoutException: wait for register timeout
	at org.eclipse.leshan.integration.tests.CreateTest.start(CreateTest.java:53)
Caused by: java.util.concurrent.TimeoutException: wait for register timeout
	at org.eclipse.leshan.integration.tests.CreateTest.start(CreateTest.java:53)

[ERROR] can_create_specific_instance_of_object(org.eclipse.leshan.integration.tests.CreateTest)  Time elapsed: 5.079 s  <<< ERROR!
java.lang.RuntimeException: java.util.concurrent.TimeoutException: wait for register timeout
	at org.eclipse.leshan.integration.tests.CreateTest.start(CreateTest.java:53)
Caused by: java.util.concurrent.TimeoutException: wait for register timeout
	at org.eclipse.leshan.integration.tests.CreateTest.start(CreateTest.java:53)

[ERROR] cannot_create_mandatory_single_object(org.eclipse.leshan.integration.tests.CreateTest)  Time elapsed: 5.865 s  <<< ERROR!
java.lang.RuntimeException: java.util.concurrent.TimeoutException: wait for register timeout
	at org.eclipse.leshan.integration.tests.CreateTest.start(CreateTest.java:53)
Caused by: java.util.concurrent.TimeoutException: wait for register timeout
	at org.eclipse.leshan.integration.tests.CreateTest.start(CreateTest.java:53)

[ERROR] can_create_instance_of_object_without_instance_id(org.eclipse.leshan.integration.tests.CreateTest)  Time elapsed: 5.747 s  <<< ERROR!
java.lang.RuntimeException: java.util.concurrent.TimeoutException: wait for register timeout
	at org.eclipse.leshan.integration.tests.CreateTest.start(CreateTest.java:53)
Caused by: java.util.concurrent.TimeoutException: wait for register timeout
	at org.eclipse.leshan.integration.tests.CreateTest.start(CreateTest.java:53)

[INFO] Running org.eclipse.leshan.integration.tests.RegistrationTest
2018-09-26 11:40:31,724 ERROR org.eclipse.californium.core.network.StripedExchangeJob [CoapServer#1] Exception in striped thread: no registration for this Id
java.lang.IllegalStateException: no registration for this Id
	at org.eclipse.leshan.server.californium.impl.InMemoryRegistrationStore.validateObservation(InMemoryRegistrationStore.java:424)
	at org.eclipse.leshan.server.californium.impl.InMemoryRegistrationStore.add(InMemoryRegistrationStore.java:303)
	at org.eclipse.leshan.server.californium.impl.InMemoryRegistrationStore.putIfAbsent(InMemoryRegistrationStore.java:287)
	at org.eclipse.californium.core.network.BaseMatcher.registerObserve(BaseMatcher.java:187)
	at org.eclipse.californium.core.network.UdpMatcher.sendRequest(UdpMatcher.java:115)
	at org.eclipse.californium.core.network.CoapEndpoint$OutboxImpl.sendRequest(CoapEndpoint.java:703)
	at org.eclipse.californium.core.network.stack.BaseCoapStack$StackBottomAdapter.sendRequest(BaseCoapStack.java:187)
	at org.eclipse.californium.core.network.stack.ReliabilityLayer.sendRequest(ReliabilityLayer.java:107)
	at org.eclipse.californium.core.network.stack.BlockwiseLayer.sendRequest(BlockwiseLayer.java:294)
	at org.eclipse.californium.core.network.stack.AbstractLayer.sendRequest(AbstractLayer.java:66)
	at org.eclipse.californium.core.network.stack.AbstractLayer.sendRequest(AbstractLayer.java:66)
	at org.eclipse.californium.core.network.stack.ExchangeCleanupLayer.sendRequest(ExchangeCleanupLayer.java:45)
	at org.eclipse.californium.core.network.stack.BaseCoapStack$StackTopAdapter.sendRequest(BaseCoapStack.java:142)
	at org.eclipse.californium.core.network.stack.BaseCoapStack.sendRequest(BaseCoapStack.java:80)
	at org.eclipse.californium.core.network.CoapEndpoint$4.runStriped(CoapEndpoint.java:596)
	at org.eclipse.californium.core.network.StripedExchangeJob.run(StripedExchangeJob.java:65)
	at eu.javaspecialists.tjsn.concurrency.stripedexecutor.StripedExecutorService$SerialExecutor$1.run(StripedExecutorService.java:460)
	at java.util.concurrent.Executors$RunnableAdapter.call(Executors.java:471)
	at java.util.concurrent.FutureTask.run(FutureTask.java:262)
	at java.util.concurrent.ScheduledThreadPoolExecutor$ScheduledFutureTask.access$201(ScheduledThreadPoolExecutor.java:178)
	at java.util.concurrent.ScheduledThreadPoolExecutor$ScheduledFutureTask.run(ScheduledThreadPoolExecutor.java:292)
	at java.util.concurrent.ThreadPoolExecutor.runWorker(ThreadPoolExecutor.java:1145)
	at java.util.concurrent.ThreadPoolExecutor$Worker.run(ThreadPoolExecutor.java:615)
	at java.lang.Thread.run(Thread.java:745)
[ERROR] Tests run: 8, Failures: 0, Errors: 4, Skipped: 0, Time elapsed: 40.124 s <<< FAILURE! - in org.eclipse.leshan.integration.tests.RegistrationTest
[ERROR] register_with_additional_attributes(org.eclipse.leshan.integration.tests.RegistrationTest)  Time elapsed: 5.727 s  <<< ERROR!
java.lang.RuntimeException: java.util.concurrent.TimeoutException: wait for register timeout
	at org.eclipse.leshan.integration.tests.RegistrationTest.register_with_additional_attributes(RegistrationTest.java:265)
Caused by: java.util.concurrent.TimeoutException: wait for register timeout
	at org.eclipse.leshan.integration.tests.RegistrationTest.register_with_additional_attributes(RegistrationTest.java:265)

[ERROR] register_update_deregister_reregister(org.eclipse.leshan.integration.tests.RegistrationTest)  Time elapsed: 5.113 s  <<< ERROR!
java.lang.RuntimeException: java.util.concurrent.TimeoutException: wait for register timeout
	at org.eclipse.leshan.integration.tests.RegistrationTest.register_update_deregister_reregister(RegistrationTest.java:149)
Caused by: java.util.concurrent.TimeoutException: wait for register timeout
	at org.eclipse.leshan.integration.tests.RegistrationTest.register_update_deregister_reregister(RegistrationTest.java:149)

[ERROR] register_update_reregister(org.eclipse.leshan.integration.tests.RegistrationTest)  Time elapsed: 7.081 s  <<< ERROR!
java.lang.RuntimeException: java.util.concurrent.TimeoutException: wait for register timeout
	at org.eclipse.leshan.integration.tests.RegistrationTest.register_update_reregister(RegistrationTest.java:177)
Caused by: java.util.concurrent.TimeoutException: wait for register timeout
	at org.eclipse.leshan.integration.tests.RegistrationTest.register_update_reregister(RegistrationTest.java:177)

[ERROR] register_with_invalid_request(org.eclipse.leshan.integration.tests.RegistrationTest)  Time elapsed: 4.502 s  <<< ERROR!
java.lang.NullPointerException
	at org.eclipse.leshan.integration.tests.RegistrationTest.register_with_invalid_request(RegistrationTest.java:296)

[INFO] Running org.eclipse.leshan.integration.tests.DeleteTest
[ERROR] Tests run: 5, Failures: 0, Errors: 4, Skipped: 0, Time elapsed: 33.363 s <<< FAILURE! - in org.eclipse.leshan.integration.tests.DeleteTest
[ERROR] cannot_delete_resource(org.eclipse.leshan.integration.tests.DeleteTest)  Time elapsed: 8.671 s  <<< ERROR!
java.lang.RuntimeException: java.util.concurrent.TimeoutException: wait for register timeout
	at org.eclipse.leshan.integration.tests.DeleteTest.start(DeleteTest.java:52)
Caused by: java.util.concurrent.TimeoutException: wait for register timeout
	at org.eclipse.leshan.integration.tests.DeleteTest.start(DeleteTest.java:52)

[ERROR] cannot_delete_single_manadatory_object_instance(org.eclipse.leshan.integration.tests.DeleteTest)  Time elapsed: 6.412 s  <<< ERROR!
java.lang.RuntimeException: java.util.concurrent.TimeoutException: wait for register timeout
	at org.eclipse.leshan.integration.tests.DeleteTest.start(DeleteTest.java:52)
Caused by: java.util.concurrent.TimeoutException: wait for register timeout
	at org.eclipse.leshan.integration.tests.DeleteTest.start(DeleteTest.java:52)

[ERROR] delete_created_object_instance(org.eclipse.leshan.integration.tests.DeleteTest)  Time elapsed: 4.976 s  <<< ERROR!
java.lang.RuntimeException: java.util.concurrent.TimeoutException: wait for register timeout
	at org.eclipse.leshan.integration.tests.DeleteTest.start(DeleteTest.java:52)
Caused by: java.util.concurrent.TimeoutException: wait for register timeout
	at org.eclipse.leshan.integration.tests.DeleteTest.start(DeleteTest.java:52)

[ERROR] cannot_delete_unknown_object_instance(org.eclipse.leshan.integration.tests.DeleteTest)  Time elapsed: 7.467 s  <<< ERROR!
java.lang.RuntimeException: java.util.concurrent.TimeoutException: wait for register timeout
	at org.eclipse.leshan.integration.tests.DeleteTest.start(DeleteTest.java:52)
Caused by: java.util.concurrent.TimeoutException: wait for register timeout
	at org.eclipse.leshan.integration.tests.DeleteTest.start(DeleteTest.java:52)

[INFO] Running org.eclipse.leshan.integration.tests.BootstrapTest
[ERROR] Tests run: 6, Failures: 0, Errors: 4, Skipped: 0, Time elapsed: 42.843 s <<< FAILURE! - in org.eclipse.leshan.integration.tests.BootstrapTest
[ERROR] bootstrap(org.eclipse.leshan.integration.tests.BootstrapTest)  Time elapsed: 8.616 s  <<< ERROR!
java.lang.RuntimeException: java.util.concurrent.TimeoutException: wait for register timeout
	at org.eclipse.leshan.integration.tests.BootstrapTest.bootstrap(BootstrapTest.java:60)
Caused by: java.util.concurrent.TimeoutException: wait for register timeout
	at org.eclipse.leshan.integration.tests.BootstrapTest.bootstrap(BootstrapTest.java:60)

[ERROR] bootstrapToRPKServer(org.eclipse.leshan.integration.tests.BootstrapTest)  Time elapsed: 12.019 s  <<< ERROR!
java.lang.RuntimeException: java.util.concurrent.TimeoutException: wait for register timeout
	at org.eclipse.leshan.integration.tests.BootstrapTest.bootstrapToRPKServer(BootstrapTest.java:178)
Caused by: java.util.concurrent.TimeoutException: wait for register timeout
	at org.eclipse.leshan.integration.tests.BootstrapTest.bootstrapToRPKServer(BootstrapTest.java:178)

[ERROR] bootstrapToPSKServer(org.eclipse.leshan.integration.tests.BootstrapTest)  Time elapsed: 7.625 s  <<< ERROR!
java.lang.RuntimeException: java.util.concurrent.TimeoutException: wait for register timeout
	at org.eclipse.leshan.integration.tests.BootstrapTest.bootstrapToPSKServer(BootstrapTest.java:152)
Caused by: java.util.concurrent.TimeoutException: wait for register timeout
	at org.eclipse.leshan.integration.tests.BootstrapTest.bootstrapToPSKServer(BootstrapTest.java:152)

[ERROR] bootstrapSecureWithPSK(org.eclipse.leshan.integration.tests.BootstrapTest)  Time elapsed: 3.339 s  <<< ERROR!
java.lang.RuntimeException: java.util.concurrent.TimeoutException: wait for register timeout
	at org.eclipse.leshan.integration.tests.BootstrapTest.bootstrapSecureWithPSK(BootstrapTest.java:82)
Caused by: java.util.concurrent.TimeoutException: wait for register timeout
	at org.eclipse.leshan.integration.tests.BootstrapTest.bootstrapSecureWithPSK(BootstrapTest.java:82)

[INFO] Running org.eclipse.leshan.integration.tests.ReadTest
[ERROR] Tests run: 9, Failures: 0, Errors: 4, Skipped: 0, Time elapsed: 40.392 s <<< FAILURE! - in org.eclipse.leshan.integration.tests.ReadTest
[ERROR] can_read_object(org.eclipse.leshan.integration.tests.ReadTest)  Time elapsed: 8.548 s  <<< ERROR!
java.lang.RuntimeException: java.util.concurrent.TimeoutException: wait for register timeout
	at org.eclipse.leshan.integration.tests.ReadTest.start(ReadTest.java:47)
Caused by: java.util.concurrent.TimeoutException: wait for register timeout
	at org.eclipse.leshan.integration.tests.ReadTest.start(ReadTest.java:47)

[ERROR] can_read_empty_object(org.eclipse.leshan.integration.tests.ReadTest)  Time elapsed: 7.465 s  <<< ERROR!
java.lang.RuntimeException: java.util.concurrent.TimeoutException: wait for register timeout
	at org.eclipse.leshan.integration.tests.ReadTest.start(ReadTest.java:47)
Caused by: java.util.concurrent.TimeoutException: wait for register timeout
	at org.eclipse.leshan.integration.tests.ReadTest.start(ReadTest.java:47)

[ERROR] can_read_object_instance(org.eclipse.leshan.integration.tests.ReadTest)  Time elapsed: 5.291 s  <<< ERROR!
java.lang.RuntimeException: java.util.concurrent.TimeoutException: wait for register timeout
	at org.eclipse.leshan.integration.tests.ReadTest.start(ReadTest.java:47)
Caused by: java.util.concurrent.TimeoutException: wait for register timeout
	at org.eclipse.leshan.integration.tests.ReadTest.start(ReadTest.java:47)

[ERROR] cannot_read_non_existent_resource(org.eclipse.leshan.integration.tests.ReadTest)  Time elapsed: 5.712 s  <<< ERROR!
java.lang.RuntimeException: java.util.concurrent.TimeoutException: wait for register timeout
	at org.eclipse.leshan.integration.tests.ReadTest.start(ReadTest.java:47)
Caused by: java.util.concurrent.TimeoutException: wait for register timeout
	at org.eclipse.leshan.integration.tests.ReadTest.start(ReadTest.java:47)

[INFO] 
[INFO] Results:
[INFO] 
[ERROR] Failures: 
[ERROR]   FailingTest.async_send_without_acknowleged:134 we should timeout
[ERROR] Errors: 
[ERROR]   BootstrapTest.bootstrap:60 » Runtime java.util.concurrent.TimeoutException: wa...
[ERROR]   BootstrapTest.bootstrapSecureWithPSK:82 » Runtime java.util.concurrent.Timeout...
[ERROR]   BootstrapTest.bootstrapToPSKServer:152 » Runtime java.util.concurrent.TimeoutE...
[ERROR]   BootstrapTest.bootstrapToRPKServer:178 » Runtime java.util.concurrent.TimeoutE...
[ERROR]   CreateTest.start:53 » Runtime java.util.concurrent.TimeoutException: wait for ...
[ERROR]   CreateTest.start:53 » Runtime java.util.concurrent.TimeoutException: wait for ...
[ERROR]   CreateTest.start:53 » Runtime java.util.concurrent.TimeoutException: wait for ...
[ERROR]   CreateTest.start:53 » Runtime java.util.concurrent.TimeoutException: wait for ...
[ERROR]   DeleteTest.start:52 » Runtime java.util.concurrent.TimeoutException: wait for ...
[ERROR]   DeleteTest.start:52 » Runtime java.util.concurrent.TimeoutException: wait for ...
[ERROR]   DeleteTest.start:52 » Runtime java.util.concurrent.TimeoutException: wait for ...
[ERROR]   DeleteTest.start:52 » Runtime java.util.concurrent.TimeoutException: wait for ...
[ERROR]   DiscoverTest.start:43 » Runtime java.util.concurrent.TimeoutException: wait fo...
[ERROR]   DiscoverTest.start:43 » Runtime java.util.concurrent.TimeoutException: wait fo...
[ERROR]   DiscoverTest.start:43 » Runtime java.util.concurrent.TimeoutException: wait fo...
[ERROR]   DiscoverTest.start:43 » Runtime java.util.concurrent.TimeoutException: wait fo...
[ERROR]   ExecuteTest.start:45 » Runtime java.util.concurrent.TimeoutException: wait for...
[ERROR]   ExecuteTest.start:45 » Runtime java.util.concurrent.TimeoutException: wait for...
[ERROR]   ExecuteTest.start:45 » Runtime java.util.concurrent.TimeoutException: wait for...
[ERROR]   ExecuteTest.start:45 » Runtime java.util.concurrent.TimeoutException: wait for...
[ERROR]   ExecuteTest.start:45 » Runtime java.util.concurrent.TimeoutException: wait for...
[ERROR]   ExecuteTest.start:45 » Runtime java.util.concurrent.TimeoutException: wait for...
[ERROR]   FailingTest.sync_send_without_acknowleged:86 » Timeout
[ERROR]   ObserveTest.start:77 » Runtime java.util.concurrent.TimeoutException: wait for...
[ERROR]   ObserveTest.start:77 » Runtime java.util.concurrent.TimeoutException: wait for...
[ERROR]   ObserveTest.start:77 » Runtime java.util.concurrent.TimeoutException: wait for...
[ERROR]   ObserveTest.start:77 » Runtime java.util.concurrent.TimeoutException: wait for...
[ERROR]   ObserveTest.start:77 » Runtime java.util.concurrent.TimeoutException: wait for...
[ERROR]   QueueModeTest.awake_sleeping_awake_sleeping:57 » Runtime java.util.concurrent....
[ERROR]   QueueModeTest.correct_sending_when_awake:176 » Runtime java.util.concurrent.Ti...
[ERROR]   QueueModeTest.one_awake_notification:98 » Runtime java.util.concurrent.Timeout...
[ERROR]   QueueModeTest.sleeping_if_timeout:148 » Runtime java.util.concurrent.TimeoutEx...
[ERROR]   ReadTest.start:47 » Runtime java.util.concurrent.TimeoutException: wait for re...
[ERROR]   ReadTest.start:47 » Runtime java.util.concurrent.TimeoutException: wait for re...
[ERROR]   ReadTest.start:47 » Runtime java.util.concurrent.TimeoutException: wait for re...
[ERROR]   ReadTest.start:47 » Runtime java.util.concurrent.TimeoutException: wait for re...
[ERROR]   RegistrationTest.register_update_deregister_reregister:149 » Runtime java.util...
[ERROR]   RegistrationTest.register_update_reregister:177 » Runtime java.util.concurrent...
[ERROR]   RegistrationTest.register_with_additional_attributes:265 » Runtime java.util.c...
[ERROR]   RegistrationTest.register_with_invalid_request:296 NullPointer
[ERROR]   SecurityTest.dont_sent_request_if_identity_change:107 » Runtime java.util.conc...
[ERROR]   SecurityTest.register_update_deregister_reregister_device_with_psk_to_server_with_psk:169 » Runtime
[ERROR]   SecurityTest.register_update_reregister_device_with_psk_to_server_with_psk:205 » Runtime
[ERROR]   SecurityTest.registered_device_with_psk_to_server_with_psk:82 » Runtime java.u...
[ERROR]   SecurityTest.registered_device_with_rpk_to_server_with_rpk:328 » Runtime java....
[ERROR]   SecurityTest.registered_device_with_rpk_to_server_with_x509cert:478 » Runtime ...
[ERROR]   WriteTest.start:61 » Runtime java.util.concurrent.TimeoutException: wait for r...
[ERROR]   WriteTest.start:61 » Runtime java.util.concurrent.TimeoutException: wait for r...
[ERROR]   WriteTest.start:61 » Runtime java.util.concurrent.TimeoutException: wait for r...
[ERROR]   WriteTest.can_write_string_resource_in_tlv:78->write_string_resource:110 NullPointer
[ERROR]   WriteTest.start:61 » Runtime java.util.concurrent.TimeoutException: wait for r...
[INFO] 
[ERROR] Tests run: 131, Failures: 1, Errors: 51, Skipped: 9
[INFO] 
[INFO] ------------------------------------------------------------------------
[INFO] Reactor Summary:
[INFO] 
[INFO] leshan 1.0.0-SNAPSHOT .............................. SUCCESS [  3.115 s]
[INFO] leshan - core ...................................... SUCCESS [ 58.302 s]
[INFO] leshan - core californium .......................... SUCCESS [ 14.464 s]
[INFO] leshan - server core ............................... SUCCESS [ 16.260 s]
[INFO] leshan - server californium ........................ SUCCESS [ 11.879 s]
[INFO] leshan - server cluster ............................ SUCCESS [ 24.051 s]
[INFO] leshan - client core ............................... SUCCESS [  5.615 s]
[INFO] leshan - client californium ........................ SUCCESS [  2.891 s]
[INFO] leshan - integration tests ......................... FAILURE [01:13 min]
[INFO] leshan - server demo ............................... SKIPPED
[INFO] leshan - client demo ............................... SKIPPED
[INFO] leshan - bootstrap server demo ..................... SKIPPED
[INFO] leshan - all 1.0.0-SNAPSHOT ........................ SKIPPED
[INFO] ------------------------------------------------------------------------
[INFO] BUILD FAILURE
[INFO] ------------------------------------------------------------------------
[INFO] Total time: 03:35 min
[INFO] Finished at: 2018-09-26T11:41:13-04:00
[INFO] ------------------------------------------------------------------------
[ERROR] Failed to execute goal org.apache.maven.plugins:maven-surefire-plugin:2.20.1:test (default-test) on project leshan-integration-tests: There are test failures.
[ERROR] 
[ERROR] Please refer to /jobs/genie.leshan/leshan-hudson-test/workspace/leshan-integration-tests/target/surefire-reports for the individual test results.
[ERROR] Please refer to dump files (if any exist) [date]-jvmRun[N].dump, [date].dumpstream and [date]-jvmRun[N].dumpstream.
[ERROR] -> [Help 1]
[ERROR] 
[ERROR] To see the full stack trace of the errors, re-run Maven with the -e switch.
[ERROR] Re-run Maven using the -X switch to enable full debug logging.
[ERROR] 
[ERROR] For more information about the errors and possible solutions, please read the following articles:
[ERROR] [Help 1] http://cwiki.apache.org/confluence/display/MAVEN/MojoFailureException
[ERROR] 
[ERROR] After correcting the problems, you can resume the build with the command
[ERROR]   mvn <goals> -rf :leshan-integration-tests
Build step 'Invoke top-level Maven targets' marked build as failure
Recording test results
Started calculate disk usage of build
Finished Calculation of disk usage of build in 0 seconds
Started calculate disk usage of workspace
Finished Calculation of disk usage of workspace in 0 seconds
Finished: FAILURE