FailedConsole Output

Started by user Simon Bernard
Running as Simon Bernard
Agent default-agent-z59lm is provisioned from template Kubernetes Pod Template
---
apiVersion: "v1"
kind: "Pod"
metadata:
  annotations: {}
  labels:
    jenkins: "slave"
    jenkins/label: "slave-default"
  name: "default-agent-z59lm"
spec:
  containers:
  - env:
    - name: "MAVEN_OPTS"
      value: "-Dorg.slf4j.simpleLogger.log.org.apache.maven.cli.transfer.Slf4jMavenTransferListener=warn"
    - name: "JENKINS_SECRET"
      value: "********"
    - name: "JENKINS_TUNNEL"
      value: "jenkins-discovery.leshan.svc.cluster.local:50000"
    - name: "JENKINS_AGENT_NAME"
      value: "default-agent-z59lm"
    - name: "MAVEN_CONFIG"
      value: "-B -e"
    - name: "JENKINS_NAME"
      value: "default-agent-z59lm"
    - name: "JENKINS_AGENT_WORKDIR"
      value: "/home/jenkins/agent"
    - name: "JENKINS_URL"
      value: "http://jenkins-ui.leshan.svc.cluster.local/leshan/"
    - name: "HOME"
      value: "/home/jenkins"
    image: "eclipsecbijenkins/jenkins-agent:3.35@sha256:399fbc3bd69ebc1b60231bf7bdb9f9a9fe9518d0b2540dbef7ee19c89559b83d"
    imagePullPolicy: "IfNotPresent"
    name: "jnlp"
    resources:
      limits:
        memory: "4096Mi"
        cpu: "2000m"
      requests:
        memory: "4096Mi"
        cpu: "1000m"
    securityContext:
      privileged: false
    tty: true
    volumeMounts:
    - mountPath: "/home/jenkins/.m2/toolchains.xml"
      name: "toolchains-xml"
      readOnly: true
      subPath: "toolchains.xml"
    - mountPath: "/opt/tools"
      name: "volume-0"
      readOnly: false
    - mountPath: "/home/jenkins"
      name: "volume-2"
      readOnly: false
    - mountPath: "/home/jenkins/.m2/repository"
      name: "volume-3"
      readOnly: false
    - mountPath: "/home/jenkins/.m2/settings-security.xml"
      name: "settings-security-xml"
      readOnly: true
      subPath: "settings-security.xml"
    - mountPath: "/home/jenkins/.m2/settings.xml"
      name: "settings-xml"
      readOnly: true
      subPath: "settings.xml"
    - mountPath: "/home/jenkins/.ssh"
      name: "volume-1"
      readOnly: false
    - mountPath: "/home/jenkins/agent"
      name: "workspace-volume"
      readOnly: false
    workingDir: "/home/jenkins/agent"
  nodeSelector:
    beta.kubernetes.io/os: "linux"
  restartPolicy: "Never"
  securityContext: {}
  volumes:
  - name: "settings-security-xml"
    secret:
      items:
      - key: "settings-security.xml"
        path: "settings-security.xml"
      secretName: "m2-secret-dir"
  - name: "volume-0"
    persistentVolumeClaim:
      claimName: "tools-claim-jiro-leshan"
      readOnly: true
  - configMap:
      items:
      - key: "toolchains.xml"
        path: "toolchains.xml"
      name: "m2-dir"
    name: "toolchains-xml"
  - emptyDir:
      medium: ""
    name: "volume-2"
  - configMap:
      name: "known-hosts"
    name: "volume-1"
  - name: "settings-xml"
    secret:
      items:
      - key: "settings.xml"
        path: "settings.xml"
      secretName: "m2-secret-dir"
  - emptyDir:
      medium: ""
    name: "workspace-volume"
  - emptyDir:
      medium: ""
    name: "volume-3"

Building remotely on default-agent-z59lm in workspace /home/jenkins/agent/workspace/leshan-hudson-test
No credentials specified
Cloning the remote Git repository
Cloning repository https://github.com/eclipse/leshan.git
 > git init /home/jenkins/agent/workspace/leshan-hudson-test # timeout=10
Fetching upstream changes from https://github.com/eclipse/leshan.git
 > git --version # timeout=10
 > git fetch --tags --force --progress -- https://github.com/eclipse/leshan.git +refs/heads/*:refs/remotes/origin/* # timeout=10
 > git config remote.origin.url https://github.com/eclipse/leshan.git # timeout=10
 > git config --add remote.origin.fetch +refs/heads/*:refs/remotes/origin/* # timeout=10
 > git config remote.origin.url https://github.com/eclipse/leshan.git # timeout=10
Fetching upstream changes from https://github.com/eclipse/leshan.git
 > git fetch --tags --force --progress -- https://github.com/eclipse/leshan.git +refs/heads/*:refs/remotes/origin/* # timeout=10
 > git rev-parse origin/javadoc^{commit} # timeout=10
Checking out Revision b67a17c0bd3addc99495159961b34b01363d242a (origin/javadoc)
 > git config core.sparsecheckout # timeout=10
 > git checkout -f b67a17c0bd3addc99495159961b34b01363d242a # timeout=10
Commit message: "Fix javadoc issue"
 > git rev-list --no-walk b67a17c0bd3addc99495159961b34b01363d242a # timeout=10
[leshan-hudson-test] $ /opt/tools/apache-maven/latest/bin/mvn -f pom.xml -DBRANCH=javadoc -DJAVA_TOOL_OPTIONS= -D_JAVA_OPTIONS= "-Dmaven.compiler.fork=true " -Dmaven.compiler.executable=/opt/tools/java/oracle/jdk-7/latest/bin/javac clean install javadoc:javadoc -B
[INFO] Scanning for projects...
[INFO] ------------------------------------------------------------------------
[INFO] Reactor Build Order:
[INFO] 
[INFO] leshan                                                             [pom]
[INFO] leshan - core                                                   [bundle]
[INFO] leshan - core californium                                       [bundle]
[INFO] leshan - server core                                            [bundle]
[INFO] leshan - server californium                                     [bundle]
[INFO] leshan - server redis                                           [bundle]
[INFO] leshan - client core                                            [bundle]
[INFO] leshan - client californium                                     [bundle]
[INFO] leshan - integration tests                                         [jar]
[INFO] leshan - server demo                                               [jar]
[INFO] leshan - client demo                                               [jar]
[INFO] leshan - bootstrap server demo                                     [jar]
[INFO] 
[INFO] ---------------------< org.eclipse.leshan:leshan >----------------------
[INFO] Building leshan 1.0.0-SNAPSHOT                                    [1/12]
[INFO] --------------------------------[ pom ]---------------------------------
[INFO] 
[INFO] --- maven-clean-plugin:3.1.0:clean (default-clean) @ leshan ---
[INFO] 
[INFO] --- maven-enforcer-plugin:1.4.1:enforce (enforce-maven) @ leshan ---
[INFO] 
[INFO] >>> maven-source-plugin:3.2.1:jar (attach-sources) > generate-sources @ leshan >>>
[INFO] 
[INFO] --- maven-enforcer-plugin:1.4.1:enforce (enforce-maven) @ leshan ---
[INFO] 
[INFO] <<< maven-source-plugin:3.2.1:jar (attach-sources) < generate-sources @ leshan <<<
[INFO] 
[INFO] 
[INFO] --- maven-source-plugin:3.2.1:jar (attach-sources) @ leshan ---
[INFO] 
[INFO] --- maven-install-plugin:2.5.2:install (default-install) @ leshan ---
[INFO] Installing /home/jenkins/agent/workspace/leshan-hudson-test/pom.xml to /home/jenkins/.m2/repository/org/eclipse/leshan/leshan/1.0.0-SNAPSHOT/leshan-1.0.0-SNAPSHOT.pom
[INFO] 
[INFO] >>> maven-javadoc-plugin:3.1.1:javadoc (default-cli) > generate-sources @ leshan >>>
[INFO] 
[INFO] --- maven-enforcer-plugin:1.4.1:enforce (enforce-maven) @ leshan ---
[INFO] 
[INFO] <<< maven-javadoc-plugin:3.1.1:javadoc (default-cli) < generate-sources @ leshan <<<
[INFO] 
[INFO] 
[INFO] --- maven-javadoc-plugin:3.1.1:javadoc (default-cli) @ leshan ---
[INFO] 
[INFO] -------------------< org.eclipse.leshan:leshan-core >-------------------
[INFO] Building leshan - core 1.0.0-SNAPSHOT                             [2/12]
[INFO] -------------------------------[ bundle ]-------------------------------
[INFO] 
[INFO] --- maven-clean-plugin:3.1.0:clean (default-clean) @ leshan-core ---
[INFO] 
[INFO] --- maven-enforcer-plugin:1.4.1:enforce (enforce-maven) @ leshan-core ---
[INFO] 
[INFO] --- maven-resources-plugin:3.1.0:resources (default-resources) @ leshan-core ---
[INFO] Using 'UTF-8' encoding to copy filtered resources.
[INFO] Copying 8 resources
[INFO] 
[INFO] --- maven-compiler-plugin:3.8.1:compile (default-compile) @ leshan-core ---
[INFO] Changes detected - recompiling the module!
[INFO] Compiling 122 source files to /home/jenkins/agent/workspace/leshan-hudson-test/leshan-core/target/classes
[INFO] 
[INFO] --- animal-sniffer-maven-plugin:1.18:check (default) @ leshan-core ---
[INFO] Checking unresolved references to net.sf.androidscents.signature:android-api-level-19:4.4.2_r4
[INFO] 
[INFO] --- maven-resources-plugin:3.1.0:testResources (default-testResources) @ leshan-core ---
[INFO] Using 'UTF-8' encoding to copy filtered resources.
[INFO] skip non existing resourceDirectory /home/jenkins/agent/workspace/leshan-hudson-test/leshan-core/src/test/resources
[INFO] 
[INFO] --- maven-compiler-plugin:3.8.1:testCompile (default-testCompile) @ leshan-core ---
[INFO] Changes detected - recompiling the module!
[INFO] Compiling 10 source files to /home/jenkins/agent/workspace/leshan-hudson-test/leshan-core/target/test-classes
[INFO] 
[INFO] --- maven-surefire-plugin:3.0.0-M4:test (default-test) @ leshan-core ---
[INFO] 
[INFO] -------------------------------------------------------
[INFO]  T E S T S
[INFO] -------------------------------------------------------
[INFO] Running org.eclipse.leshan.core.attributes.AttributeTest
[INFO] Tests run: 2, Failures: 0, Errors: 0, Skipped: 0, Time elapsed: 0.006 s - in org.eclipse.leshan.core.attributes.AttributeTest
[INFO] Running org.eclipse.leshan.LinkObjectTest
[INFO] Tests run: 10, Failures: 0, Errors: 0, Skipped: 0, Time elapsed: 0.016 s - in org.eclipse.leshan.LinkObjectTest
SLF4J: A number (99) of logging calls during the initialization phase have been intercepted and are
SLF4J: now being replayed. These are subject to the filtering rules of the underlying logging system.
SLF4J: See also http://www.slf4j.org/codes.html#replay
[INFO] Running org.eclipse.leshan.core.node.codec.LwM2mNodeDecoderTest
[INFO] Tests run: 41, Failures: 0, Errors: 0, Skipped: 0, Time elapsed: 0.03 s - in org.eclipse.leshan.core.node.codec.LwM2mNodeDecoderTest
[INFO] Running org.eclipse.leshan.json.JsonDeserializerTest
[INFO] Tests run: 3, Failures: 0, Errors: 0, Skipped: 0, Time elapsed: 0.107 s - in org.eclipse.leshan.json.JsonDeserializerTest
[INFO] Running org.eclipse.leshan.json.JsonSerializerTest
[INFO] Tests run: 1, Failures: 0, Errors: 0, Skipped: 0, Time elapsed: 0.103 s - in org.eclipse.leshan.json.JsonSerializerTest
[INFO] Running org.eclipse.leshan.core.node.LwM2MResourceTest
[INFO] Tests run: 16, Failures: 0, Errors: 0, Skipped: 0, Time elapsed: 0.107 s - in org.eclipse.leshan.core.node.LwM2MResourceTest
[INFO] Running org.eclipse.leshan.tlv.TlvEncoderTest
[INFO] Tests run: 6, Failures: 0, Errors: 0, Skipped: 0, Time elapsed: 0.1 s - in org.eclipse.leshan.tlv.TlvEncoderTest
[INFO] Running org.eclipse.leshan.tlv.TlvDecoderTest
[INFO] Tests run: 3, Failures: 0, Errors: 0, Skipped: 0, Time elapsed: 0.093 s - in org.eclipse.leshan.tlv.TlvDecoderTest
[INFO] Running org.eclipse.leshan.core.attributes.AttributeSetTest
[INFO] Tests run: 9, Failures: 0, Errors: 0, Skipped: 0, Time elapsed: 0.105 s - in org.eclipse.leshan.core.attributes.AttributeSetTest
[INFO] Running org.eclipse.leshan.core.node.codec.LwM2mNodeEncoderTest
[INFO] Tests run: 12, Failures: 0, Errors: 0, Skipped: 0, Time elapsed: 0.011 s - in org.eclipse.leshan.core.node.codec.LwM2mNodeEncoderTest
[INFO] 
[INFO] Results:
[INFO] 
[INFO] Tests run: 103, Failures: 0, Errors: 0, Skipped: 0
[INFO] 
[INFO] 
[INFO] --- maven-bundle-plugin:4.0.0:bundle (default-bundle) @ leshan-core ---
[INFO] 
[INFO] >>> maven-source-plugin:3.2.1:jar (attach-sources) > generate-sources @ leshan-core >>>
[INFO] 
[INFO] --- maven-enforcer-plugin:1.4.1:enforce (enforce-maven) @ leshan-core ---
[INFO] 
[INFO] <<< maven-source-plugin:3.2.1:jar (attach-sources) < generate-sources @ leshan-core <<<
[INFO] 
[INFO] 
[INFO] --- maven-source-plugin:3.2.1:jar (attach-sources) @ leshan-core ---
[INFO] Building jar: /home/jenkins/agent/workspace/leshan-hudson-test/leshan-core/target/leshan-core-1.0.0-SNAPSHOT-sources.jar
[INFO] 
[INFO] --- maven-install-plugin:2.5.2:install (default-install) @ leshan-core ---
[INFO] Installing /home/jenkins/agent/workspace/leshan-hudson-test/leshan-core/target/leshan-core-1.0.0-SNAPSHOT.jar to /home/jenkins/.m2/repository/org/eclipse/leshan/leshan-core/1.0.0-SNAPSHOT/leshan-core-1.0.0-SNAPSHOT.jar
[INFO] Installing /home/jenkins/agent/workspace/leshan-hudson-test/leshan-core/pom.xml to /home/jenkins/.m2/repository/org/eclipse/leshan/leshan-core/1.0.0-SNAPSHOT/leshan-core-1.0.0-SNAPSHOT.pom
[INFO] Installing /home/jenkins/agent/workspace/leshan-hudson-test/leshan-core/target/leshan-core-1.0.0-SNAPSHOT-sources.jar to /home/jenkins/.m2/repository/org/eclipse/leshan/leshan-core/1.0.0-SNAPSHOT/leshan-core-1.0.0-SNAPSHOT-sources.jar
[INFO] 
[INFO] --- maven-bundle-plugin:4.0.0:install (default-install) @ leshan-core ---
[INFO] Writing OBR metadata
[INFO] Installing org/eclipse/leshan/leshan-core/1.0.0-SNAPSHOT/leshan-core-1.0.0-SNAPSHOT.jar
[INFO] Writing OBR metadata
[INFO] 
[INFO] >>> maven-javadoc-plugin:3.1.1:javadoc (default-cli) > generate-sources @ leshan-core >>>
[INFO] 
[INFO] --- maven-enforcer-plugin:1.4.1:enforce (enforce-maven) @ leshan-core ---
[INFO] 
[INFO] <<< maven-javadoc-plugin:3.1.1:javadoc (default-cli) < generate-sources @ leshan-core <<<
[INFO] 
[INFO] 
[INFO] --- maven-javadoc-plugin:3.1.1:javadoc (default-cli) @ leshan-core ---
[INFO] 
100 warnings
[WARNING] Javadoc Warnings
[WARNING] /home/jenkins/agent/workspace/leshan-hudson-test/leshan-core/src/main/java/org/eclipse/leshan/Link.java:67: warning: no @param for <T>
[WARNING] public <T> Link(String url, Map<String, String> attributes) {
[WARNING] ^
[WARNING] /home/jenkins/agent/workspace/leshan-hudson-test/leshan-core/src/main/java/org/eclipse/leshan/Link.java:84: warning: no @param for <T>
[WARNING] public <T> Link(String url, Map<String, T> attributes, Class<T> clazz) {
[WARNING] ^
[WARNING] /home/jenkins/agent/workspace/leshan-hudson-test/leshan-core/src/main/java/org/eclipse/leshan/Link.java:84: warning: no @param for clazz
[WARNING] public <T> Link(String url, Map<String, T> attributes, Class<T> clazz) {
[WARNING] ^
[WARNING] /home/jenkins/agent/workspace/leshan-hudson-test/leshan-core/src/main/java/org/eclipse/leshan/core/attributes/AttributeSet.java:174: warning: no @param for uriQueries
[WARNING] public static AttributeSet parse(String uriQueries) {
[WARNING] ^
[WARNING] /home/jenkins/agent/workspace/leshan-hudson-test/leshan-core/src/main/java/org/eclipse/leshan/core/attributes/AttributeSet.java:174: warning: no @return
[WARNING] public static AttributeSet parse(String uriQueries) {
[WARNING] ^
[WARNING] /home/jenkins/agent/workspace/leshan-hudson-test/leshan-core/src/main/java/org/eclipse/leshan/core/attributes/AttributeSet.java:190: warning: no @param for queryParams
[WARNING] public static AttributeSet parse(String... queryParams) {
[WARNING] ^
[WARNING] /home/jenkins/agent/workspace/leshan-hudson-test/leshan-core/src/main/java/org/eclipse/leshan/core/attributes/AttributeSet.java:190: warning: no @return
[WARNING] public static AttributeSet parse(String... queryParams) {
[WARNING] ^
[WARNING] /home/jenkins/agent/workspace/leshan-hudson-test/leshan-core/src/main/java/org/eclipse/leshan/core/attributes/AttributeSet.java:202: warning: no @param for queryParams
[WARNING] public static AttributeSet parse(Collection<String> queryParams) {
[WARNING] ^
[WARNING] /home/jenkins/agent/workspace/leshan-hudson-test/leshan-core/src/main/java/org/eclipse/leshan/core/attributes/AttributeSet.java:202: warning: no @return
[WARNING] public static AttributeSet parse(Collection<String> queryParams) {
[WARNING] ^
[WARNING] /home/jenkins/agent/workspace/leshan-hudson-test/leshan-core/src/main/java/org/eclipse/leshan/core/credentials/CredentialsReader.java:34: warning: no @param for fileName
[WARNING] public T readFromFile(String fileName) throws IOException, GeneralSecurityException {
[WARNING] ^
[WARNING] /home/jenkins/agent/workspace/leshan-hudson-test/leshan-core/src/main/java/org/eclipse/leshan/core/credentials/CredentialsReader.java:34: warning: no @return
[WARNING] public T readFromFile(String fileName) throws IOException, GeneralSecurityException {
[WARNING] ^
[WARNING] /home/jenkins/agent/workspace/leshan-hudson-test/leshan-core/src/main/java/org/eclipse/leshan/core/credentials/CredentialsReader.java:34: warning: no @throws for java.io.IOException
[WARNING] public T readFromFile(String fileName) throws IOException, GeneralSecurityException {
[WARNING] ^
[WARNING] /home/jenkins/agent/workspace/leshan-hudson-test/leshan-core/src/main/java/org/eclipse/leshan/core/credentials/CredentialsReader.java:34: warning: no @throws for java.security.GeneralSecurityException
[WARNING] public T readFromFile(String fileName) throws IOException, GeneralSecurityException {
[WARNING] ^
[WARNING] /home/jenkins/agent/workspace/leshan-hudson-test/leshan-core/src/main/java/org/eclipse/leshan/core/credentials/CredentialsReader.java:47: warning: no @param for resourcePath
[WARNING] public T readFromResource(String resourcePath) throws IOException, GeneralSecurityException {
[WARNING] ^
[WARNING] /home/jenkins/agent/workspace/leshan-hudson-test/leshan-core/src/main/java/org/eclipse/leshan/core/credentials/CredentialsReader.java:47: warning: no @return
[WARNING] public T readFromResource(String resourcePath) throws IOException, GeneralSecurityException {
[WARNING] ^
[WARNING] /home/jenkins/agent/workspace/leshan-hudson-test/leshan-core/src/main/java/org/eclipse/leshan/core/credentials/CredentialsReader.java:47: warning: no @throws for java.io.IOException
[WARNING] public T readFromResource(String resourcePath) throws IOException, GeneralSecurityException {
[WARNING] ^
[WARNING] /home/jenkins/agent/workspace/leshan-hudson-test/leshan-core/src/main/java/org/eclipse/leshan/core/credentials/CredentialsReader.java:47: warning: no @throws for java.security.GeneralSecurityException
[WARNING] public T readFromResource(String resourcePath) throws IOException, GeneralSecurityException {
[WARNING] ^
[WARNING] /home/jenkins/agent/workspace/leshan-hudson-test/leshan-core/src/main/java/org/eclipse/leshan/core/credentials/CredentialsReader.java:56: warning: no @param for bytes
[WARNING] public T decode(byte[] bytes) throws IOException, GeneralSecurityException {
[WARNING] ^
[WARNING] /home/jenkins/agent/workspace/leshan-hudson-test/leshan-core/src/main/java/org/eclipse/leshan/core/credentials/CredentialsReader.java:56: warning: no @return
[WARNING] public T decode(byte[] bytes) throws IOException, GeneralSecurityException {
[WARNING] ^
[WARNING] /home/jenkins/agent/workspace/leshan-hudson-test/leshan-core/src/main/java/org/eclipse/leshan/core/credentials/CredentialsReader.java:56: warning: no @throws for java.io.IOException
[WARNING] public T decode(byte[] bytes) throws IOException, GeneralSecurityException {
[WARNING] ^
[WARNING] /home/jenkins/agent/workspace/leshan-hudson-test/leshan-core/src/main/java/org/eclipse/leshan/core/credentials/CredentialsReader.java:56: warning: no @throws for java.security.GeneralSecurityException
[WARNING] public T decode(byte[] bytes) throws IOException, GeneralSecurityException {
[WARNING] ^
[WARNING] /home/jenkins/agent/workspace/leshan-hudson-test/leshan-core/src/main/java/org/eclipse/leshan/core/credentials/CredentialsReader.java:65: warning: no @param for in
[WARNING] public T decode(InputStream in) throws IOException, GeneralSecurityException {
[WARNING] ^
[WARNING] /home/jenkins/agent/workspace/leshan-hudson-test/leshan-core/src/main/java/org/eclipse/leshan/core/credentials/CredentialsReader.java:65: warning: no @return
[WARNING] public T decode(InputStream in) throws IOException, GeneralSecurityException {
[WARNING] ^
[WARNING] /home/jenkins/agent/workspace/leshan-hudson-test/leshan-core/src/main/java/org/eclipse/leshan/core/credentials/CredentialsReader.java:65: warning: no @throws for java.io.IOException
[WARNING] public T decode(InputStream in) throws IOException, GeneralSecurityException {
[WARNING] ^
[WARNING] /home/jenkins/agent/workspace/leshan-hudson-test/leshan-core/src/main/java/org/eclipse/leshan/core/credentials/CredentialsReader.java:65: warning: no @throws for java.security.GeneralSecurityException
[WARNING] public T decode(InputStream in) throws IOException, GeneralSecurityException {
[WARNING] ^
[WARNING] /home/jenkins/agent/workspace/leshan-hudson-test/leshan-core/src/main/java/org/eclipse/leshan/core/model/ObjectLoader.java:44: warning: no @return
[WARNING] public static List<ObjectModel> loadDefault() {
[WARNING] ^
[WARNING] /home/jenkins/agent/workspace/leshan-hudson-test/leshan-core/src/main/java/org/eclipse/leshan/core/model/ObjectLoader.java:59: warning: no @return
[WARNING] public static List<ObjectModel> load(File modelDir) {
[WARNING] ^
[WARNING] /home/jenkins/agent/workspace/leshan-hudson-test/leshan-core/src/main/java/org/eclipse/leshan/core/model/ObjectLoader.java:69: warning: no @return
[WARNING] public static List<ObjectModel> loadDdfFile(InputStream input, String streamName) {
[WARNING] ^
[WARNING] /home/jenkins/agent/workspace/leshan-hudson-test/leshan-core/src/main/java/org/eclipse/leshan/core/model/ObjectLoader.java:82: warning: no @return
[WARNING] public static List<ObjectModel> loadDdfResources(String path, String[] filenames) {
[WARNING] ^
[WARNING] /home/jenkins/agent/workspace/leshan-hudson-test/leshan-core/src/main/java/org/eclipse/leshan/core/model/ObjectLoader.java:107: warning: no @return
[WARNING] public static List<ObjectModel> loadDdfResources(String[] paths) {
[WARNING] ^
[WARNING] /home/jenkins/agent/workspace/leshan-hudson-test/leshan-core/src/main/java/org/eclipse/leshan/core/node/LwM2mMultipleResource.java:138: warning: no description for @exception
[WARNING] * @exception NoSuchElementException
[WARNING] ^
[WARNING] /home/jenkins/agent/workspace/leshan-hudson-test/leshan-core/src/main/java/org/eclipse/leshan/core/node/LwM2mResource.java:87: warning: no @param for id
[WARNING] Object getValue(int id);
[WARNING] ^
[WARNING] /home/jenkins/agent/workspace/leshan-hudson-test/leshan-core/src/main/java/org/eclipse/leshan/core/node/LwM2mNode.java:31: warning: no @param for visitor
[WARNING] void accept(LwM2mNodeVisitor visitor);
[WARNING] ^
[WARNING] /home/jenkins/agent/workspace/leshan-hudson-test/leshan-core/src/main/java/org/eclipse/leshan/core/node/LwM2mObject.java:82: warning: no @param for id
[WARNING] public LwM2mObjectInstance getInstance(int id) {
[WARNING] ^
[WARNING] /home/jenkins/agent/workspace/leshan-hudson-test/leshan-core/src/main/java/org/eclipse/leshan/core/node/LwM2mObjectInstance.java:102: warning: no @param for id
[WARNING] public LwM2mResource getResource(int id) {
[WARNING] ^
[WARNING] /home/jenkins/agent/workspace/leshan-hudson-test/leshan-core/src/main/java/org/eclipse/leshan/core/node/LwM2mObjectInstance.java:46: warning: no @param for resources
[WARNING] public LwM2mObjectInstance(Collection<LwM2mResource> resources) {
[WARNING] ^
[WARNING] /home/jenkins/agent/workspace/leshan-hudson-test/leshan-core/src/main/java/org/eclipse/leshan/core/node/LwM2mSingleResource.java:135: warning: no description for @exception
[WARNING] * @exception NoSuchElementException
[WARNING] ^
[WARNING] /home/jenkins/agent/workspace/leshan-hudson-test/leshan-core/src/main/java/org/eclipse/leshan/core/node/LwM2mSingleResource.java:143: warning: no description for @exception
[WARNING] * @exception NoSuchElementException
[WARNING] ^
[WARNING] /home/jenkins/agent/workspace/leshan-hudson-test/leshan-core/src/main/java/org/eclipse/leshan/core/node/ObjectLink.java:60: warning: no @param for path
[WARNING] public static ObjectLink fromPath(String path) {
[WARNING] ^
[WARNING] /home/jenkins/agent/workspace/leshan-hudson-test/leshan-core/src/main/java/org/eclipse/leshan/core/node/ObjectLink.java:60: warning: no @return
[WARNING] public static ObjectLink fromPath(String path) {
[WARNING] ^
[WARNING] /home/jenkins/agent/workspace/leshan-hudson-test/leshan-core/src/main/java/org/eclipse/leshan/core/node/ObjectLink.java:44: warning: no @param for objectId
[WARNING] public ObjectLink(int objectId, int objectInstanceId) {
[WARNING] ^
[WARNING] /home/jenkins/agent/workspace/leshan-hudson-test/leshan-core/src/main/java/org/eclipse/leshan/core/node/ObjectLink.java:44: warning: no @param for objectInstanceId
[WARNING] public ObjectLink(int objectId, int objectInstanceId) {
[WARNING] ^
[WARNING] /home/jenkins/agent/workspace/leshan-hudson-test/leshan-core/src/main/java/org/eclipse/leshan/core/node/codec/LwM2mNodeDecoder.java:53: warning: no @param for <T>
[WARNING] <T extends LwM2mNode> T decode(byte[] content, ContentFormat format, LwM2mPath path, LwM2mModel model,
[WARNING] ^
[WARNING] /home/jenkins/agent/workspace/leshan-hudson-test/leshan-core/src/main/java/org/eclipse/leshan/core/node/codec/LwM2mNodeDecoder.java:72: warning: no @param for format
[WARNING] boolean isSupported(ContentFormat format);
[WARNING] ^
[WARNING] /home/jenkins/agent/workspace/leshan-hudson-test/leshan-core/src/main/java/org/eclipse/leshan/core/node/codec/LwM2mNodeDecoder.java:72: warning: no @return
[WARNING] boolean isSupported(ContentFormat format);
[WARNING] ^
[WARNING] /home/jenkins/agent/workspace/leshan-hudson-test/leshan-core/src/main/java/org/eclipse/leshan/core/node/codec/DefaultLwM2mNodeDecoder.java:41: warning: empty <p> tag
[WARNING] * <p>
[WARNING] ^
[WARNING] /home/jenkins/agent/workspace/leshan-hudson-test/leshan-core/src/main/java/org/eclipse/leshan/core/node/codec/LwM2mNodeEncoder.java:57: warning: no @param for format
[WARNING] boolean isSupported(ContentFormat format);
[WARNING] ^
[WARNING] /home/jenkins/agent/workspace/leshan-hudson-test/leshan-core/src/main/java/org/eclipse/leshan/core/node/codec/LwM2mNodeEncoder.java:57: warning: no @return
[WARNING] boolean isSupported(ContentFormat format);
[WARNING] ^
[WARNING] /home/jenkins/agent/workspace/leshan-hudson-test/leshan-core/src/main/java/org/eclipse/leshan/core/node/codec/DefaultLwM2mNodeEncoder.java:36: warning: empty <p> tag
[WARNING] * <p>
[WARNING] ^
[WARNING] /home/jenkins/agent/workspace/leshan-hudson-test/leshan-core/src/main/java/org/eclipse/leshan/core/node/codec/LwM2mValueConverter.java:41: warning: no @return
[WARNING] Object convertValue(Object value, Type currentType, Type expectedType, LwM2mPath resourcePath);
[WARNING] ^
[WARNING] /home/jenkins/agent/workspace/leshan-hudson-test/leshan-core/src/main/java/org/eclipse/leshan/core/observation/Observation.java:63: warning: no @return
[WARNING] public byte[] getId() {
[WARNING] ^
[WARNING] /home/jenkins/agent/workspace/leshan-hudson-test/leshan-core/src/main/java/org/eclipse/leshan/core/request/DownlinkRequest.java:37: warning: no @param for visitor
[WARNING] void accept(DownlinkRequestVisitor visitor);
[WARNING] ^
[WARNING] /home/jenkins/agent/workspace/leshan-hudson-test/leshan-core/src/main/java/org/eclipse/leshan/core/request/UplinkRequest.java:29: warning: no @param for visitor
[WARNING] void accept(UplinkRequestVisitor visitor);
[WARNING] ^
[WARNING] /home/jenkins/agent/workspace/leshan-hudson-test/leshan-core/src/main/java/org/eclipse/leshan/core/request/ContentFormat.java:73: warning: no @param for mediaType
[WARNING] public static ContentFormat fromMediaType(String mediaType) {
[WARNING] ^
[WARNING] /home/jenkins/agent/workspace/leshan-hudson-test/leshan-core/src/main/java/org/eclipse/leshan/core/request/ContentFormat.java:73: warning: no @return
[WARNING] public static ContentFormat fromMediaType(String mediaType) {
[WARNING] ^
[WARNING] /home/jenkins/agent/workspace/leshan-hudson-test/leshan-core/src/main/java/org/eclipse/leshan/core/request/ContentFormat.java:87: warning: no @param for code
[WARNING] public static ContentFormat fromCode(int code) {
[WARNING] ^
[WARNING] /home/jenkins/agent/workspace/leshan-hudson-test/leshan-core/src/main/java/org/eclipse/leshan/core/request/ContentFormat.java:101: warning: no @param for name
[WARNING] public static ContentFormat fromName(String name) {
[WARNING] ^
[WARNING] /home/jenkins/agent/workspace/leshan-hudson-test/leshan-core/src/main/java/org/eclipse/leshan/core/request/UpdateRequest.java:49: warning: no @param for additionalAttributes
[WARNING] public UpdateRequest(String registrationId, Long lifetime, String smsNumber, BindingMode binding,
[WARNING] ^
[WARNING] /home/jenkins/agent/workspace/leshan-hudson-test/leshan-core/src/main/java/org/eclipse/leshan/core/request/WriteRequest.java:150: warning: no @param for contentFormat
[WARNING] public WriteRequest(ContentFormat contentFormat, int objectId, int objectInstanceId, int resourceId, boolean value)
[WARNING] ^
[WARNING] /home/jenkins/agent/workspace/leshan-hudson-test/leshan-core/src/main/java/org/eclipse/leshan/core/request/WriteRequest.java:150: warning: no @param for objectId
[WARNING] public WriteRequest(ContentFormat contentFormat, int objectId, int objectInstanceId, int resourceId, boolean value)
[WARNING] ^
[WARNING] /home/jenkins/agent/workspace/leshan-hudson-test/leshan-core/src/main/java/org/eclipse/leshan/core/request/WriteRequest.java:150: warning: no @param for objectInstanceId
[WARNING] public WriteRequest(ContentFormat contentFormat, int objectId, int objectInstanceId, int resourceId, boolean value)
[WARNING] ^
[WARNING] /home/jenkins/agent/workspace/leshan-hudson-test/leshan-core/src/main/java/org/eclipse/leshan/core/request/WriteRequest.java:150: warning: no @param for resourceId
[WARNING] public WriteRequest(ContentFormat contentFormat, int objectId, int objectInstanceId, int resourceId, boolean value)
[WARNING] ^
[WARNING] /home/jenkins/agent/workspace/leshan-hudson-test/leshan-core/src/main/java/org/eclipse/leshan/core/request/WriteRequest.java:150: warning: no @param for value
[WARNING] public WriteRequest(ContentFormat contentFormat, int objectId, int objectInstanceId, int resourceId, boolean value)
[WARNING] ^
[WARNING] /home/jenkins/agent/workspace/leshan-hudson-test/leshan-core/src/main/java/org/eclipse/leshan/core/request/WriteRequest.java:222: warning: no @param for contentFormat
[WARNING] public WriteRequest(ContentFormat contentFormat, int objectId, int objectInstanceId, int resourceId, byte[] value)
[WARNING] ^
[WARNING] /home/jenkins/agent/workspace/leshan-hudson-test/leshan-core/src/main/java/org/eclipse/leshan/core/request/WriteRequest.java:222: warning: no @param for objectId
[WARNING] public WriteRequest(ContentFormat contentFormat, int objectId, int objectInstanceId, int resourceId, byte[] value)
[WARNING] ^
[WARNING] /home/jenkins/agent/workspace/leshan-hudson-test/leshan-core/src/main/java/org/eclipse/leshan/core/request/WriteRequest.java:222: warning: no @param for objectInstanceId
[WARNING] public WriteRequest(ContentFormat contentFormat, int objectId, int objectInstanceId, int resourceId, byte[] value)
[WARNING] ^
[WARNING] /home/jenkins/agent/workspace/leshan-hudson-test/leshan-core/src/main/java/org/eclipse/leshan/core/request/WriteRequest.java:222: warning: no @param for resourceId
[WARNING] public WriteRequest(ContentFormat contentFormat, int objectId, int objectInstanceId, int resourceId, byte[] value)
[WARNING] ^
[WARNING] /home/jenkins/agent/workspace/leshan-hudson-test/leshan-core/src/main/java/org/eclipse/leshan/core/request/WriteRequest.java:222: warning: no @param for value
[WARNING] public WriteRequest(ContentFormat contentFormat, int objectId, int objectInstanceId, int resourceId, byte[] value)
[WARNING] ^
[WARNING] /home/jenkins/agent/workspace/leshan-hudson-test/leshan-core/src/main/java/org/eclipse/leshan/core/request/WriteRequest.java:204: warning: no @param for contentFormat
[WARNING] public WriteRequest(ContentFormat contentFormat, int objectId, int objectInstanceId, int resourceId, Date value)
[WARNING] ^
[WARNING] /home/jenkins/agent/workspace/leshan-hudson-test/leshan-core/src/main/java/org/eclipse/leshan/core/request/WriteRequest.java:204: warning: no @param for objectId
[WARNING] public WriteRequest(ContentFormat contentFormat, int objectId, int objectInstanceId, int resourceId, Date value)
[WARNING] ^
[WARNING] /home/jenkins/agent/workspace/leshan-hudson-test/leshan-core/src/main/java/org/eclipse/leshan/core/request/WriteRequest.java:204: warning: no @param for objectInstanceId
[WARNING] public WriteRequest(ContentFormat contentFormat, int objectId, int objectInstanceId, int resourceId, Date value)
[WARNING] ^
[WARNING] /home/jenkins/agent/workspace/leshan-hudson-test/leshan-core/src/main/java/org/eclipse/leshan/core/request/WriteRequest.java:204: warning: no @param for resourceId
[WARNING] public WriteRequest(ContentFormat contentFormat, int objectId, int objectInstanceId, int resourceId, Date value)
[WARNING] ^
[WARNING] /home/jenkins/agent/workspace/leshan-hudson-test/leshan-core/src/main/java/org/eclipse/leshan/core/request/WriteRequest.java:204: warning: no @param for value
[WARNING] public WriteRequest(ContentFormat contentFormat, int objectId, int objectInstanceId, int resourceId, Date value)
[WARNING] ^
[WARNING] /home/jenkins/agent/workspace/leshan-hudson-test/leshan-core/src/main/java/org/eclipse/leshan/core/request/WriteRequest.java:186: warning: no @param for contentFormat
[WARNING] public WriteRequest(ContentFormat contentFormat, int objectId, int objectInstanceId, int resourceId, double value)
[WARNING] ^
[WARNING] /home/jenkins/agent/workspace/leshan-hudson-test/leshan-core/src/main/java/org/eclipse/leshan/core/request/WriteRequest.java:186: warning: no @param for objectId
[WARNING] public WriteRequest(ContentFormat contentFormat, int objectId, int objectInstanceId, int resourceId, double value)
[WARNING] ^
[WARNING] /home/jenkins/agent/workspace/leshan-hudson-test/leshan-core/src/main/java/org/eclipse/leshan/core/request/WriteRequest.java:186: warning: no @param for objectInstanceId
[WARNING] public WriteRequest(ContentFormat contentFormat, int objectId, int objectInstanceId, int resourceId, double value)
[WARNING] ^
[WARNING] /home/jenkins/agent/workspace/leshan-hudson-test/leshan-core/src/main/java/org/eclipse/leshan/core/request/WriteRequest.java:186: warning: no @param for resourceId
[WARNING] public WriteRequest(ContentFormat contentFormat, int objectId, int objectInstanceId, int resourceId, double value)
[WARNING] ^
[WARNING] /home/jenkins/agent/workspace/leshan-hudson-test/leshan-core/src/main/java/org/eclipse/leshan/core/request/WriteRequest.java:186: warning: no @param for value
[WARNING] public WriteRequest(ContentFormat contentFormat, int objectId, int objectInstanceId, int resourceId, double value)
[WARNING] ^
[WARNING] /home/jenkins/agent/workspace/leshan-hudson-test/leshan-core/src/main/java/org/eclipse/leshan/core/request/WriteRequest.java:168: warning: no @param for contentFormat
[WARNING] public WriteRequest(ContentFormat contentFormat, int objectId, int objectInstanceId, int resourceId, long value)
[WARNING] ^
[WARNING] /home/jenkins/agent/workspace/leshan-hudson-test/leshan-core/src/main/java/org/eclipse/leshan/core/request/WriteRequest.java:168: warning: no @param for objectId
[WARNING] public WriteRequest(ContentFormat contentFormat, int objectId, int objectInstanceId, int resourceId, long value)
[WARNING] ^
[WARNING] /home/jenkins/agent/workspace/leshan-hudson-test/leshan-core/src/main/java/org/eclipse/leshan/core/request/WriteRequest.java:168: warning: no @param for objectInstanceId
[WARNING] public WriteRequest(ContentFormat contentFormat, int objectId, int objectInstanceId, int resourceId, long value)
[WARNING] ^
[WARNING] /home/jenkins/agent/workspace/leshan-hudson-test/leshan-core/src/main/java/org/eclipse/leshan/core/request/WriteRequest.java:168: warning: no @param for resourceId
[WARNING] public WriteRequest(ContentFormat contentFormat, int objectId, int objectInstanceId, int resourceId, long value)
[WARNING] ^
[WARNING] /home/jenkins/agent/workspace/leshan-hudson-test/leshan-core/src/main/java/org/eclipse/leshan/core/request/WriteRequest.java:168: warning: no @param for value
[WARNING] public WriteRequest(ContentFormat contentFormat, int objectId, int objectInstanceId, int resourceId, long value)
[WARNING] ^
[WARNING] /home/jenkins/agent/workspace/leshan-hudson-test/leshan-core/src/main/java/org/eclipse/leshan/core/request/WriteRequest.java:240: warning: no @param for contentFormat
[WARNING] public WriteRequest(ContentFormat contentFormat, int objectId, int objectInstanceId, int resourceId,
[WARNING] ^
[WARNING] /home/jenkins/agent/workspace/leshan-hudson-test/leshan-core/src/main/java/org/eclipse/leshan/core/request/WriteRequest.java:240: warning: no @param for objectId
[WARNING] public WriteRequest(ContentFormat contentFormat, int objectId, int objectInstanceId, int resourceId,
[WARNING] ^
[WARNING] /home/jenkins/agent/workspace/leshan-hudson-test/leshan-core/src/main/java/org/eclipse/leshan/core/request/WriteRequest.java:240: warning: no @param for objectInstanceId
[WARNING] public WriteRequest(ContentFormat contentFormat, int objectId, int objectInstanceId, int resourceId,
[WARNING] ^
[WARNING] /home/jenkins/agent/workspace/leshan-hudson-test/leshan-core/src/main/java/org/eclipse/leshan/core/request/WriteRequest.java:240: warning: no @param for resourceId
[WARNING] public WriteRequest(ContentFormat contentFormat, int objectId, int objectInstanceId, int resourceId,
[WARNING] ^
[WARNING] /home/jenkins/agent/workspace/leshan-hudson-test/leshan-core/src/main/java/org/eclipse/leshan/core/request/WriteRequest.java:240: warning: no @param for value
[WARNING] public WriteRequest(ContentFormat contentFormat, int objectId, int objectInstanceId, int resourceId,
[WARNING] ^
[WARNING] /home/jenkins/agent/workspace/leshan-hudson-test/leshan-core/src/main/java/org/eclipse/leshan/core/request/WriteRequest.java:132: warning: no @param for contentFormat
[WARNING] public WriteRequest(ContentFormat contentFormat, int objectId, int objectInstanceId, int resourceId, String value)
[WARNING] ^
[WARNING] /home/jenkins/agent/workspace/leshan-hudson-test/leshan-core/src/main/java/org/eclipse/leshan/core/request/WriteRequest.java:132: warning: no @param for objectId
[WARNING] public WriteRequest(ContentFormat contentFormat, int objectId, int objectInstanceId, int resourceId, String value)
[WARNING] ^
[WARNING] /home/jenkins/agent/workspace/leshan-hudson-test/leshan-core/src/main/java/org/eclipse/leshan/core/request/WriteRequest.java:132: warning: no @param for objectInstanceId
[WARNING] public WriteRequest(ContentFormat contentFormat, int objectId, int objectInstanceId, int resourceId, String value)
[WARNING] ^
[WARNING] /home/jenkins/agent/workspace/leshan-hudson-test/leshan-core/src/main/java/org/eclipse/leshan/core/request/WriteRequest.java:132: warning: no @param for resourceId
[WARNING] public WriteRequest(ContentFormat contentFormat, int objectId, int objectInstanceId, int resourceId, String value)
[WARNING] ^
[WARNING] /home/jenkins/agent/workspace/leshan-hudson-test/leshan-core/src/main/java/org/eclipse/leshan/core/request/WriteRequest.java:132: warning: no @param for value
[WARNING] public WriteRequest(ContentFormat contentFormat, int objectId, int objectInstanceId, int resourceId, String value)
[WARNING] ^
[WARNING] /home/jenkins/agent/workspace/leshan-hudson-test/leshan-core/src/main/java/org/eclipse/leshan/core/request/WriteRequest.java:141: warning: no @param for objectId
[WARNING] public WriteRequest(int objectId, int objectInstanceId, int resourceId, boolean value) {
[WARNING] ^
[WARNING] /home/jenkins/agent/workspace/leshan-hudson-test/leshan-core/src/main/java/org/eclipse/leshan/core/request/WriteRequest.java:141: warning: no @param for objectInstanceId
[WARNING] public WriteRequest(int objectId, int objectInstanceId, int resourceId, boolean value) {
[WARNING] ^
[WARNING] /home/jenkins/agent/workspace/leshan-hudson-test/leshan-core/src/main/java/org/eclipse/leshan/core/request/WriteRequest.java:141: warning: no @param for resourceId
[WARNING] public WriteRequest(int objectId, int objectInstanceId, int resourceId, boolean value) {
[WARNING] ^
[WARNING] /home/jenkins/agent/workspace/leshan-hudson-test/leshan-core/src/main/java/org/eclipse/leshan/core/request/WriteRequest.java:141: warning: no @param for value
[WARNING] public WriteRequest(int objectId, int objectInstanceId, int resourceId, boolean value) {
[WARNING] ^
[WARNING] /home/jenkins/agent/workspace/leshan-hudson-test/leshan-core/src/main/java/org/eclipse/leshan/core/request/WriteRequest.java:213: warning: no @param for objectId
[WARNING] public WriteRequest(int objectId, int objectInstanceId, int resourceId, byte[] value) {
[WARNING] ^
[WARNING] /home/jenkins/agent/workspace/leshan-hudson-test/leshan-core/src/main/java/org/eclipse/leshan/core/request/WriteRequest.java:213: warning: no @param for objectInstanceId
[WARNING] public WriteRequest(int objectId, int objectInstanceId, int resourceId, byte[] value) {
[WARNING] ^
[WARNING] /home/jenkins/agent/workspace/leshan-hudson-test/leshan-core/src/main/java/org/eclipse/leshan/core/request/WriteRequest.java:213: warning: no @param for resourceId
[WARNING] public WriteRequest(int objectId, int objectInstanceId, int resourceId, byte[] value) {
[WARNING] ^
[INFO] 
[INFO] -----------------< org.eclipse.leshan:leshan-core-cf >------------------
[INFO] Building leshan - core californium 1.0.0-SNAPSHOT                 [3/12]
[INFO] -------------------------------[ bundle ]-------------------------------
[INFO] 
[INFO] --- maven-clean-plugin:3.1.0:clean (default-clean) @ leshan-core-cf ---
[INFO] 
[INFO] --- maven-enforcer-plugin:1.4.1:enforce (enforce-maven) @ leshan-core-cf ---
[INFO] 
[INFO] --- maven-resources-plugin:3.1.0:resources (default-resources) @ leshan-core-cf ---
[INFO] Using 'UTF-8' encoding to copy filtered resources.
[INFO] skip non existing resourceDirectory /home/jenkins/agent/workspace/leshan-hudson-test/leshan-core-cf/src/main/resources
[INFO] 
[INFO] --- maven-compiler-plugin:3.8.1:compile (default-compile) @ leshan-core-cf ---
[INFO] Changes detected - recompiling the module!
[INFO] Compiling 12 source files to /home/jenkins/agent/workspace/leshan-hudson-test/leshan-core-cf/target/classes
[INFO] 
[INFO] --- animal-sniffer-maven-plugin:1.18:check (default) @ leshan-core-cf ---
[INFO] Checking unresolved references to net.sf.androidscents.signature:android-api-level-19:4.4.2_r4
[INFO] 
[INFO] --- maven-resources-plugin:3.1.0:testResources (default-testResources) @ leshan-core-cf ---
[INFO] Using 'UTF-8' encoding to copy filtered resources.
[INFO] skip non existing resourceDirectory /home/jenkins/agent/workspace/leshan-hudson-test/leshan-core-cf/src/test/resources
[INFO] 
[INFO] --- maven-compiler-plugin:3.8.1:testCompile (default-testCompile) @ leshan-core-cf ---
[INFO] Changes detected - recompiling the module!
[INFO] Compiling 1 source file to /home/jenkins/agent/workspace/leshan-hudson-test/leshan-core-cf/target/test-classes
[INFO] 
[INFO] --- maven-surefire-plugin:3.0.0-M4:test (default-test) @ leshan-core-cf ---
[INFO] 
[INFO] -------------------------------------------------------
[INFO]  T E S T S
[INFO] -------------------------------------------------------
[INFO] Running org.eclipse.leshan.core.californium.ResponseCodeUtilTest
[INFO] Tests run: 7, Failures: 0, Errors: 0, Skipped: 0, Time elapsed: 0.179 s - in org.eclipse.leshan.core.californium.ResponseCodeUtilTest
[INFO] 
[INFO] Results:
[INFO] 
[INFO] Tests run: 7, Failures: 0, Errors: 0, Skipped: 0
[INFO] 
[INFO] 
[INFO] --- maven-bundle-plugin:4.0.0:bundle (default-bundle) @ leshan-core-cf ---
[INFO] 
[INFO] >>> maven-source-plugin:3.2.1:jar (attach-sources) > generate-sources @ leshan-core-cf >>>
[INFO] 
[INFO] --- maven-enforcer-plugin:1.4.1:enforce (enforce-maven) @ leshan-core-cf ---
[INFO] 
[INFO] <<< maven-source-plugin:3.2.1:jar (attach-sources) < generate-sources @ leshan-core-cf <<<
[INFO] 
[INFO] 
[INFO] --- maven-source-plugin:3.2.1:jar (attach-sources) @ leshan-core-cf ---
[INFO] Building jar: /home/jenkins/agent/workspace/leshan-hudson-test/leshan-core-cf/target/leshan-core-cf-1.0.0-SNAPSHOT-sources.jar
[INFO] 
[INFO] --- maven-install-plugin:2.5.2:install (default-install) @ leshan-core-cf ---
[INFO] Installing /home/jenkins/agent/workspace/leshan-hudson-test/leshan-core-cf/target/leshan-core-cf-1.0.0-SNAPSHOT.jar to /home/jenkins/.m2/repository/org/eclipse/leshan/leshan-core-cf/1.0.0-SNAPSHOT/leshan-core-cf-1.0.0-SNAPSHOT.jar
[INFO] Installing /home/jenkins/agent/workspace/leshan-hudson-test/leshan-core-cf/pom.xml to /home/jenkins/.m2/repository/org/eclipse/leshan/leshan-core-cf/1.0.0-SNAPSHOT/leshan-core-cf-1.0.0-SNAPSHOT.pom
[INFO] Installing /home/jenkins/agent/workspace/leshan-hudson-test/leshan-core-cf/target/leshan-core-cf-1.0.0-SNAPSHOT-sources.jar to /home/jenkins/.m2/repository/org/eclipse/leshan/leshan-core-cf/1.0.0-SNAPSHOT/leshan-core-cf-1.0.0-SNAPSHOT-sources.jar
[INFO] 
[INFO] --- maven-bundle-plugin:4.0.0:install (default-install) @ leshan-core-cf ---
[INFO] Installing org/eclipse/leshan/leshan-core-cf/1.0.0-SNAPSHOT/leshan-core-cf-1.0.0-SNAPSHOT.jar
[INFO] Writing OBR metadata
[INFO] 
[INFO] >>> maven-javadoc-plugin:3.1.1:javadoc (default-cli) > generate-sources @ leshan-core-cf >>>
[INFO] 
[INFO] --- maven-enforcer-plugin:1.4.1:enforce (enforce-maven) @ leshan-core-cf ---
[INFO] 
[INFO] <<< maven-javadoc-plugin:3.1.1:javadoc (default-cli) < generate-sources @ leshan-core-cf <<<
[INFO] 
[INFO] 
[INFO] --- maven-javadoc-plugin:3.1.1:javadoc (default-cli) @ leshan-core-cf ---
[INFO] 
3 errors
10 warnings
[INFO] ------------------------------------------------------------------------
[INFO] Reactor Summary for leshan 1.0.0-SNAPSHOT:
[INFO] 
[INFO] leshan ............................................. SUCCESS [ 14.409 s]
[INFO] leshan - core ...................................... SUCCESS [ 25.679 s]
[INFO] leshan - core californium .......................... FAILURE [  4.590 s]
[INFO] leshan - server core ............................... SKIPPED
[INFO] leshan - server californium ........................ SKIPPED
[INFO] leshan - server redis .............................. SKIPPED
[INFO] leshan - client core ............................... SKIPPED
[INFO] leshan - client californium ........................ SKIPPED
[INFO] leshan - integration tests ......................... SKIPPED
[INFO] leshan - server demo ............................... SKIPPED
[INFO] leshan - client demo ............................... SKIPPED
[INFO] leshan - bootstrap server demo ..................... SKIPPED
[INFO] ------------------------------------------------------------------------
[INFO] BUILD FAILURE
[INFO] ------------------------------------------------------------------------
[INFO] Total time:  59.217 s
[INFO] Finished at: 2020-04-01T07:42:32Z
[INFO] ------------------------------------------------------------------------
[ERROR] Failed to execute goal org.apache.maven.plugins:maven-javadoc-plugin:3.1.1:javadoc (default-cli) on project leshan-core-cf: An error has occurred in Javadoc report generation: 
[ERROR] Exit code: 1 - /home/jenkins/agent/workspace/leshan-hudson-test/leshan-core-cf/src/main/java/org/eclipse/leshan/core/californium/CoapResponseCallback.java:29: warning: no @param for response
[ERROR]     void onResponse(Response response);
[ERROR]          ^
[ERROR] /home/jenkins/agent/workspace/leshan-hudson-test/leshan-core-cf/src/main/java/org/eclipse/leshan/core/californium/DefaultEndpointFactory.java:89: warning: no @param for address
[ERROR]     protected CoapEndpoint.Builder createUnsecuredEndpointBuilder(InetSocketAddress address, NetworkConfig coapConfig,
[ERROR]                                    ^
[ERROR] /home/jenkins/agent/workspace/leshan-hudson-test/leshan-core-cf/src/main/java/org/eclipse/leshan/core/californium/DefaultEndpointFactory.java:89: warning: no @param for coapConfig
[ERROR]     protected CoapEndpoint.Builder createUnsecuredEndpointBuilder(InetSocketAddress address, NetworkConfig coapConfig,
[ERROR]                                    ^
[ERROR] /home/jenkins/agent/workspace/leshan-hudson-test/leshan-core-cf/src/main/java/org/eclipse/leshan/core/californium/DefaultEndpointFactory.java:89: warning: no @param for store
[ERROR]     protected CoapEndpoint.Builder createUnsecuredEndpointBuilder(InetSocketAddress address, NetworkConfig coapConfig,
[ERROR]                                    ^
[ERROR] /home/jenkins/agent/workspace/leshan-hudson-test/leshan-core-cf/src/main/java/org/eclipse/leshan/core/californium/DefaultEndpointFactory.java:115: warning: no @param for address
[ERROR]     protected Connector createUnsecuredConnector(InetSocketAddress address) {
[ERROR]                         ^
[ERROR] /home/jenkins/agent/workspace/leshan-hudson-test/leshan-core-cf/src/main/java/org/eclipse/leshan/core/californium/DefaultEndpointFactory.java:130: warning: no @param for dtlsConfig
[ERROR]     protected CoapEndpoint.Builder createSecuredEndpointBuilder(DtlsConnectorConfig dtlsConfig,
[ERROR]                                    ^
[ERROR] /home/jenkins/agent/workspace/leshan-hudson-test/leshan-core-cf/src/main/java/org/eclipse/leshan/core/californium/DefaultEndpointFactory.java:130: warning: no @param for coapConfig
[ERROR]     protected CoapEndpoint.Builder createSecuredEndpointBuilder(DtlsConnectorConfig dtlsConfig,
[ERROR]                                    ^
[ERROR] /home/jenkins/agent/workspace/leshan-hudson-test/leshan-core-cf/src/main/java/org/eclipse/leshan/core/californium/DefaultEndpointFactory.java:130: warning: no @param for store
[ERROR]     protected CoapEndpoint.Builder createSecuredEndpointBuilder(DtlsConnectorConfig dtlsConfig,
[ERROR]                                    ^
[ERROR] /home/jenkins/agent/workspace/leshan-hudson-test/leshan-core-cf/src/main/java/org/eclipse/leshan/core/californium/DefaultEndpointFactory.java:156: warning: no @param for dtlsConfig
[ERROR]     protected Connector createSecuredConnector(DtlsConnectorConfig dtlsConfig) {
[ERROR]                         ^
[ERROR] /home/jenkins/agent/workspace/leshan-hudson-test/leshan-core-cf/src/main/java/org/eclipse/leshan/core/californium/LwM2mCoapResource.java:116: error: unknown tag: null
[ERROR]      * @return The corresponding Leshan {@link Identity} or <code>null</null> if we didn't succeed to extract Identity.
[ERROR]                                                                       ^
[ERROR] /home/jenkins/agent/workspace/leshan-hudson-test/leshan-core-cf/src/main/java/org/eclipse/leshan/core/californium/LwM2mCoapResource.java:116: error: element not closed: code
[ERROR]      * @return The corresponding Leshan {@link Identity} or <code>null</null> if we didn't succeed to extract Identity.
[ERROR]                                                             ^
[ERROR] /home/jenkins/agent/workspace/leshan-hudson-test/leshan-core-cf/src/main/java/org/eclipse/leshan/core/californium/LwM2mCoapResource.java:43: warning: no @param for name
[ERROR]     public LwM2mCoapResource(String name) {
[ERROR]            ^
[ERROR] /home/jenkins/agent/workspace/leshan-hudson-test/leshan-core-cf/src/main/java/org/eclipse/leshan/core/californium/SyncRequestObserver.java:47: error: reference not found
[ERROR]      * @throws RequestCanceledException if the request is cancelled.
[ERROR]        ^
[ERROR] 
[ERROR] Command line was: /opt/tools/java/oracle/jdk-8/1.8.0_202/jre/../bin/javadoc @options @packages
[ERROR] 
[ERROR] Refer to the generated Javadoc files in '/home/jenkins/agent/workspace/leshan-hudson-test/leshan-core-cf/target/site/apidocs' dir.
[ERROR] -> [Help 1]
[ERROR] 
[ERROR] To see the full stack trace of the errors, re-run Maven with the -e switch.
[ERROR] Re-run Maven using the -X switch to enable full debug logging.
[ERROR] 
[ERROR] For more information about the errors and possible solutions, please read the following articles:
[ERROR] [Help 1] http://cwiki.apache.org/confluence/display/MAVEN/MojoExecutionException
[ERROR] 
[ERROR] After correcting the problems, you can resume the build with the command
[ERROR]   mvn <args> -rf :leshan-core-cf
Build step 'Invoke top-level Maven targets' marked build as failure
Recording test results
Finished: FAILURE