FailedConsole Output

Started by user matteo.maiero@eurotech.com
Checkout:workspace / /home/hudson/genie.kura/.hudson/jobs/kura-release/workspace - hudson.remoting.LocalChannel@238abfb0
Using strategy: Default
Last Built Revision: Revision c10ed3add9e795db989053e150c22256a0d749d5 (tags/KURA_2.0.1_RELEASE)
Checkout:workspace / /home/hudson/genie.kura/.hudson/jobs/kura-release/workspace - hudson.remoting.LocalChannel@238abfb0
Fetching changes from the remote Git repository
Fetching upstream changes from https://github.com/eclipse/kura
Commencing build of Revision c10ed3add9e795db989053e150c22256a0d749d5 (tags/KURA_2.0.1_RELEASE)
Checking out Revision c10ed3add9e795db989053e150c22256a0d749d5 (tags/KURA_2.0.1_RELEASE)
[INFO] Using Maven 3 installation: apache-maven-3.0.5
[INFO] Checking Maven 3 installation environment
[workspace] $ /shared/common/apache-maven-3.0.5/bin/mvn --help
[INFO] Checking Maven 3 installation version
[INFO] Detected Maven 3 installation version: 3.0.5
[workspace] $ /shared/common/apache-maven-3.0.5/bin/mvn clean install -U -e -Pweb -V -B -DRELEASE_VERSION=2.0.1 -Dmaven.test.skip=true -Dmaven.ext.class.path=/home/hudson/genie.kura/.hudson/maven/slavebundle/resources:/home/hudson/genie.kura/.hudson/maven/slavebundle/lib/maven3-eventspy-3.0.jar:/home/hudson/genie.kura/.hudson/war/webapp/WEB-INF/lib/hudson-remoting-3.0.3.jar -Dhudson.eventspy.port=54706 -Dmaven.repo.local=/home/hudson/genie.kura/.hudson/jobs/kura-release/workspace/.maven/repo -f kura/pom_pom.xml
[DEBUG] Waiting for connection on port: 54706
Apache Maven 3.0.5 (r01de14724cdef164cd33c7c8c2fe155faf9602da; 2013-02-19 08:51:28-0500)
Maven home: /shared/common/apache-maven-3.0.5
Java version: 1.7.0_80, vendor: Oracle Corporation
Java home: /opt/public/common/jdk1.7.0_80/jre
Default locale: en_US, platform encoding: UTF-8
OS name: "linux", version: "3.0.101-0.47.71-default", arch: "amd64", family: "unix"
[DEBUG] Connected to remote
[INFO] Error stacktraces are turned on.
[INFO] o.h.m.e.h.SettingsBuildingRequestHandler - Using global settings document ID: 274d7662-4381-4b47-8251-76275899526c
[INFO] Scanning for projects...
[INFO] ------------------------------------------------------------------------
[INFO] Reactor Build Order:
[INFO] 
[INFO] kura
[INFO] org.eclipse.kura.web2
[INFO] distrib
[INFO] tools
[INFO] Eclipse Kura Archetypes
[INFO] Eclipse Kura App Quickstart Archetype
[INFO]                                                                         
[INFO] ------------------------------------------------------------------------
[INFO] Building kura 2.0.1
[INFO] ------------------------------------------------------------------------
[INFO] 
[INFO] --- maven-clean-plugin:2.4.1:clean (default-clean) @ kura ---
[INFO] Deleting /jobs/genie.kura/kura-release/workspace/kura/target
[INFO] 
[INFO] --- build-helper-maven-plugin:1.9:regex-property (set-deployment-package-version) @ kura ---
[INFO] No match to regex '-SNAPSHOT' found in '2.0.1'. The initial value '2.0.1' is left as-is...
[INFO] 
[INFO] --- maven-install-plugin:2.3.1:install (default-install) @ kura ---
[INFO] Installing /jobs/genie.kura/kura-release/workspace/kura/pom_pom.xml to /home/hudson/genie.kura/.hudson/jobs/kura-release/workspace/.maven/repo/org/eclipse/kura/kura/2.0.1/kura-2.0.1.pom
[INFO]                                                                         
[INFO] ------------------------------------------------------------------------
[INFO] Building org.eclipse.kura.web2 2.0.1
[INFO] ------------------------------------------------------------------------
Downloading: https://raw.github.com/eurotech/kura_addons/mvn-repo/org/eclipse/kura/org.eclipse.kura.api/maven-metadata.xml
Downloading: http://repo.maven.apache.org/maven2/org/eclipse/kura/org.eclipse.kura.api/maven-metadata.xml
Downloading: https://raw.github.com/eurotech/kura_addons/mvn-repo/org/eclipse/kura/org.eclipse.kura.api/1.0.6-SNAPSHOT/maven-metadata.xml
Downloading: https://raw.github.com/eurotech/kura_addons/mvn-repo/org/eclipse/kura/org.eclipse.kura.core/maven-metadata.xml
Downloading: http://repo.maven.apache.org/maven2/org/eclipse/kura/org.eclipse.kura.core/maven-metadata.xml
Downloading: https://raw.github.com/eurotech/kura_addons/mvn-repo/org/eclipse/kura/org.eclipse.kura.core/1.0.6-SNAPSHOT/maven-metadata.xml
Downloading: https://raw.github.com/eurotech/kura_addons/mvn-repo/org/eclipse/kura/org.eclipse.kura.core.configuration/maven-metadata.xml
Downloading: http://repo.maven.apache.org/maven2/org/eclipse/kura/org.eclipse.kura.core.configuration/maven-metadata.xml
Downloading: https://raw.github.com/eurotech/kura_addons/mvn-repo/org/eclipse/kura/org.eclipse.kura.core.configuration/1.0.5-SNAPSHOT/maven-metadata.xml
Downloading: https://raw.github.com/eurotech/kura_addons/mvn-repo/org/eclipse/kura/org.eclipse.kura.core.net/maven-metadata.xml
Downloading: http://repo.maven.apache.org/maven2/org/eclipse/kura/org.eclipse.kura.core.net/maven-metadata.xml
Downloading: https://raw.github.com/eurotech/kura_addons/mvn-repo/org/eclipse/kura/org.eclipse.kura.core.net/1.0.6-SNAPSHOT/maven-metadata.xml
Downloading: https://raw.github.com/eurotech/kura_addons/mvn-repo/org/eclipse/kura/org.eclipse.kura.deployment.agent/maven-metadata.xml
Downloading: http://repo.maven.apache.org/maven2/org/eclipse/kura/org.eclipse.kura.deployment.agent/maven-metadata.xml
Downloading: https://raw.github.com/eurotech/kura_addons/mvn-repo/org/eclipse/kura/org.eclipse.kura.deployment.agent/1.0.4-SNAPSHOT/maven-metadata.xml
Downloading: https://raw.github.com/eurotech/kura_addons/mvn-repo/org/eclipse/kura/org.eclipse.kura.deployment.agent/1.0.7-SNAPSHOT/maven-metadata.xml
[INFO] 
[INFO] --- maven-clean-plugin:2.4.1:clean (default-clean) @ org.eclipse.kura.web2 ---
[INFO] Deleting /jobs/genie.kura/kura-release/workspace/kura/org.eclipse.kura.web2/target
[INFO] Deleting /jobs/genie.kura/kura-release/workspace/kura/org.eclipse.kura.web2/src/main/webapp/WEB-INF/classes
[INFO] Deleting /jobs/genie.kura/kura-release/workspace/kura/org.eclipse.kura.web2/src/main/webapp/denali (includes = [], excludes = [blank.html, clear.gif, hosted.html])
[INFO] Deleting /jobs/genie.kura/kura-release/workspace/kura/org.eclipse.kura.web2/src/main/webapp/WEB-INF (includes = [], excludes = [web.xml])
[INFO] 
[INFO] --- build-helper-maven-plugin:1.9:regex-property (set-deployment-package-version) @ org.eclipse.kura.web2 ---
[INFO] No match to regex '-SNAPSHOT' found in '2.0.1'. The initial value '2.0.1' is left as-is...
[INFO] 
[INFO] --- gwt-maven-plugin:2.7.0:i18n (default) @ org.eclipse.kura.web2 ---
[INFO] 
[INFO] --- gwt-maven-plugin:2.7.0:generateAsync (default) @ org.eclipse.kura.web2 ---
[INFO] 
[INFO] --- maven-resources-plugin:2.5:resources (default-resources) @ org.eclipse.kura.web2 ---
[debug] execute contextualize
[INFO] Using 'UTF-8' encoding to copy filtered resources.
[INFO] Copying 4 resources
[INFO] 
[INFO] --- maven-compiler-plugin:3.3:compile (default-compile) @ org.eclipse.kura.web2 ---
[INFO] Changes detected - recompiling the module!
[INFO] Compiling 134 source files to /jobs/genie.kura/kura-release/workspace/kura/org.eclipse.kura.web2/src/main/webapp/WEB-INF/classes
[INFO] 
[INFO] --- properties-maven-plugin:1.0-alpha-1:read-project-properties (default) @ org.eclipse.kura.web2 ---
[INFO] 
[INFO] --- maven-war-plugin:2.1.1:exploded (default) @ org.eclipse.kura.web2 ---
[INFO] Exploding webapp
[INFO] Assembling webapp [org.eclipse.kura.web2] in [/jobs/genie.kura/kura-release/workspace/kura/org.eclipse.kura.web2/target/org.eclipse.kura.web2-2.0.1]
[INFO] Processing war project
[INFO] Copying webapp resources [/jobs/genie.kura/kura-release/workspace/kura/org.eclipse.kura.web2/src/main/webapp]
[INFO] Webapp assembled in [431 msecs]
[INFO] 
[INFO] --- maven-resources-plugin:2.5:testResources (default-testResources) @ org.eclipse.kura.web2 ---
[debug] execute contextualize
[INFO] Using 'UTF-8' encoding to copy filtered resources.
[INFO] skip non existing resourceDirectory /jobs/genie.kura/kura-release/workspace/kura/org.eclipse.kura.web2/src/test/resources
[INFO] 
[INFO] --- maven-compiler-plugin:3.3:testCompile (default-testCompile) @ org.eclipse.kura.web2 ---
[INFO] Not compiling test sources
[INFO] 
[INFO] --- maven-surefire-plugin:2.10:test (default-test) @ org.eclipse.kura.web2 ---
[INFO] Tests are skipped.
[INFO] 
[INFO] --- gwt-maven-plugin:2.7.0:compile (default) @ org.eclipse.kura.web2 ---
[INFO] auto discovered modules [org.eclipse.kura.web.denali]
[INFO] Compiling module org.eclipse.kura.web.denali
[INFO]    Compiling 10 permutations
[INFO]       Compiling permutation 4...
[INFO]       Process output
[INFO]          Compiling
[INFO]             Compiling permutation 0...
[INFO]       Process output
[INFO]          Compiling
[INFO]             Compiling permutation 8...
[INFO]       Process output
[INFO]          Compiling
[INFO]             Compiling permutation 5...
[INFO]       Process output
[INFO]          Compiling
[INFO]             Compiling permutation 7...
[INFO]       Process output
[INFO]          Compiling
[INFO]             Compiling permutation 2...
[INFO]       Process output
[INFO]          Compiling
[INFO]             Compiling permutation 6...
[INFO]       Process output
[INFO]          Compiling
[INFO]             Compiling permutation 9...
[INFO]       Process output
[INFO]          Compiling
[INFO]             Compiling permutation 1...
[INFO]       Process output
[INFO]          Compiling
[INFO]             Compiling permutation 3...
[INFO]    Compile of permutations succeeded
[INFO]    Compilation succeeded -- 61.007s
[INFO] Linking into /jobs/genie.kura/kura-release/workspace/kura/org.eclipse.kura.web2/src/main/webapp/denali
[INFO]    Link succeeded
[INFO]    Linking succeeded -- 3.177s
[INFO] 
[INFO] --- maven-war-plugin:2.1.1:war (default-war) @ org.eclipse.kura.web2 ---
[INFO] Packaging webapp
[INFO] Assembling webapp [org.eclipse.kura.web2] in [/jobs/genie.kura/kura-release/workspace/kura/org.eclipse.kura.web2/target/org.eclipse.kura.web2-2.0.1]
[INFO] Processing war project
[INFO] Copying webapp resources [/jobs/genie.kura/kura-release/workspace/kura/org.eclipse.kura.web2/src/main/webapp]
[INFO] Webapp assembled in [404 msecs]
[INFO] Building war: /jobs/genie.kura/kura-release/workspace/kura/org.eclipse.kura.web2/target/org.eclipse.kura.web2-2.0.1.war
[INFO] WEB-INF/web.xml already added, skipping
[INFO] 
[INFO] --- maven-assembly-plugin:2.4:single (buid-version-jar) @ org.eclipse.kura.web2 ---
[INFO] Reading assembly descriptor: src/main/assembly/bundle.xml
[INFO] Building jar: /jobs/genie.kura/kura-release/workspace/kura/org.eclipse.kura.web2/target/org.eclipse.kura.web2-2.0.1.jar
[INFO] 
[INFO] --- maven-assembly-plugin:2.4:single (standard-jar) @ org.eclipse.kura.web2 ---
[INFO] Reading assembly descriptor: src/main/assembly/bundle.xml
[INFO] Building jar: /jobs/genie.kura/kura-release/workspace/kura/org.eclipse.kura.web2/target/org.eclipse.kura.web2-2.0.1.jar
[WARNING] Artifact org.eclipse.kura:org.eclipse.kura.web2:jar:2.0.1 already attached to project, ignoring duplicate
[INFO] 
[INFO] --- maven-antrun-plugin:1.8:run (verify-jdeps) @ org.eclipse.kura.web2 ---
[INFO] Executing tasks

verify.jdeps:
[INFO] Executed tasks
[INFO] 
[INFO] --- maven-antrun-plugin:1.8:run (verify-compact2-compliance) @ org.eclipse.kura.web2 ---
[INFO] Executing tasks

exec.jdeps:
[INFO] Executed tasks
[INFO] 
[INFO] --- gwt-maven-plugin:2.7.0:test (default) @ org.eclipse.kura.web2 ---
[INFO] 
[INFO] --- maven-install-plugin:2.3.1:install (default-install) @ org.eclipse.kura.web2 ---
[INFO] Installing /jobs/genie.kura/kura-release/workspace/kura/org.eclipse.kura.web2/target/org.eclipse.kura.web2-2.0.1.war to /home/hudson/genie.kura/.hudson/jobs/kura-release/workspace/.maven/repo/org/eclipse/kura/org.eclipse.kura.web2/2.0.1/org.eclipse.kura.web2-2.0.1.war
[INFO] Installing /jobs/genie.kura/kura-release/workspace/kura/org.eclipse.kura.web2/pom.xml to /home/hudson/genie.kura/.hudson/jobs/kura-release/workspace/.maven/repo/org/eclipse/kura/org.eclipse.kura.web2/2.0.1/org.eclipse.kura.web2-2.0.1.pom
[INFO] Installing /jobs/genie.kura/kura-release/workspace/kura/org.eclipse.kura.web2/target/org.eclipse.kura.web2-2.0.1.jar to /home/hudson/genie.kura/.hudson/jobs/kura-release/workspace/.maven/repo/org/eclipse/kura/org.eclipse.kura.web2/2.0.1/org.eclipse.kura.web2-2.0.1.jar
[INFO]                                                                         
[INFO] ------------------------------------------------------------------------
[INFO] Building distrib 2.0.1
[INFO] ------------------------------------------------------------------------
[INFO] 
[INFO] --- maven-clean-plugin:2.4.1:clean (default-clean) @ distrib ---
[INFO] Deleting /jobs/genie.kura/kura-release/workspace/kura/distrib/target
[INFO] 
[INFO] --- build-helper-maven-plugin:1.9:regex-property (set-deployment-package-version) @ distrib ---
[INFO] No match to regex '-SNAPSHOT' found in '2.0.1'. The initial value '2.0.1' is left as-is...
[INFO] 
[INFO] --- buildnumber-maven-plugin:1.0:create-timestamp (default) @ distrib ---
[INFO] 
[INFO] --- properties-maven-plugin:1.0-alpha-1:read-project-properties (default) @ distrib ---
[INFO] 
[INFO] --- maven-dependency-plugin:2.8:copy (get-kura-bundles) @ distrib ---
[INFO] Configured Artifact: org.eclipse.kura:org.eclipse.kura.api:1.0.9:jar
[INFO] Configured Artifact: org.eclipse.kura:org.eclipse.kura.camel:1.0.1:jar
[INFO] Configured Artifact: org.eclipse.kura:org.eclipse.kura.camel.sun.misc:1.0.0:jar
[INFO] Configured Artifact: org.eclipse.kura:org.eclipse.kura.core:1.0.9:jar
[INFO] Configured Artifact: org.eclipse.kura:org.eclipse.kura.core.certificates:1.0.2:jar
[INFO] Configured Artifact: org.eclipse.kura:org.eclipse.kura.core.cloud:1.0.8:jar
[INFO] Configured Artifact: org.eclipse.kura:org.eclipse.kura.core.comm:1.0.2:jar
[INFO] Configured Artifact: org.eclipse.kura:org.eclipse.kura.core.configuration:1.0.8:jar
[INFO] Configured Artifact: org.eclipse.kura:org.eclipse.kura.core.crypto:1.0.4:jar
[INFO] Configured Artifact: org.eclipse.kura:org.eclipse.kura.core.deployment:1.1.1:jar
[INFO] Configured Artifact: org.eclipse.kura:org.eclipse.kura.core.log:1.0.1:jar
[INFO] Configured Artifact: org.eclipse.kura:org.eclipse.kura.core.net:1.0.9:jar
[INFO] Configured Artifact: org.eclipse.kura:org.eclipse.kura.deployment.agent:1.0.6:jar
[INFO] Configured Artifact: org.eclipse.kura:org.eclipse.kura.deployment.customizer:1.0.4:jar
[INFO] Configured Artifact: org.eclipse.kura:org.eclipse.kura.deployment.customizer.upgrade:1.0.3:jar
[INFO] Configured Artifact: org.eclipse.kura:org.eclipse.kura.deployment.update:1.0.2:jar
[INFO] Configured Artifact: org.eclipse.kura:org.eclipse.kura.emulator:1.0.7:jar
[INFO] Configured Artifact: org.eclipse.kura:org.eclipse.kura.emulator.gpio:1.0.1:jar
[INFO] Configured Artifact: org.eclipse.kura:org.eclipse.kura.emulator.clock:1.0.0:jar
[INFO] Configured Artifact: org.eclipse.kura:org.eclipse.kura.emulator.net:1.0.1:jar
[INFO] Configured Artifact: org.eclipse.kura:org.eclipse.kura.emulator.position:1.0.1:jar
[INFO] Configured Artifact: org.eclipse.kura:org.eclipse.kura.emulator.usb:1.0.0:jar
[INFO] Configured Artifact: org.eclipse.kura:org.eclipse.kura.emulator.watchdog:1.0.0:jar
[INFO] Configured Artifact: org.eclipse.kura:org.eclipse.kura.linux.clock:1.0.6:jar
[INFO] Configured Artifact: org.eclipse.kura:org.eclipse.kura.linux.command:1.0.4:jar
[INFO] Configured Artifact: org.eclipse.kura:org.eclipse.kura.linux.net:1.0.10:jar
[INFO] Configured Artifact: org.eclipse.kura:org.eclipse.kura.linux.position:1.0.6:jar
[INFO] Configured Artifact: org.eclipse.kura:org.eclipse.kura.linux.usb:1.0.7:jar
[INFO] Configured Artifact: org.eclipse.kura:org.eclipse.kura.linux.bluetooth:1.0.5:jar
[INFO] Configured Artifact: org.eclipse.kura:org.eclipse.kura.linux.watchdog:1.0.5:jar
[INFO] Configured Artifact: org.eclipse.kura:org.eclipse.kura.core.status:1.0.1:jar
[INFO] Configured Artifact: org.eclipse.kura:org.eclipse.kura.net.admin:1.0.10:jar
[INFO] Configured Artifact: org.eclipse.kura:org.eclipse.kura.protocol.modbus:1.0.2:jar
[INFO] Configured Artifact: org.eclipse.kura:org.eclipse.kura.example.camel.aggregation:1.0.1:jar
Downloading: https://repo.eclipse.org/content/repositories/kura/org/eclipse/kura/org.eclipse.kura.example.camel.aggregation/1.0.1/org.eclipse.kura.example.camel.aggregation-1.0.1.jar
Downloading: https://raw.github.com/eurotech/kura_addons/mvn-repo/org/eclipse/kura/org.eclipse.kura.example.camel.aggregation/1.0.1/org.eclipse.kura.example.camel.aggregation-1.0.1.jar
Downloading: http://repo.maven.apache.org/maven2/org/eclipse/kura/org.eclipse.kura.example.camel.aggregation/1.0.1/org.eclipse.kura.example.camel.aggregation-1.0.1.jar
[INFO] ------------------------------------------------------------------------
[INFO] Reactor Summary:
[INFO] 
[INFO] kura .............................................. SUCCESS [0.817s]
[INFO] org.eclipse.kura.web2 ............................. SUCCESS [1:30.057s]
[INFO] distrib ........................................... FAILURE [16.149s]
[INFO] tools ............................................. SKIPPED
[INFO] Eclipse Kura Archetypes ........................... SKIPPED
[INFO] Eclipse Kura App Quickstart Archetype ............. SKIPPED
[INFO] ------------------------------------------------------------------------
[INFO] BUILD FAILURE
[INFO] ------------------------------------------------------------------------
[INFO] Total time: 1:50.515s
[INFO] Finished at: Wed Aug 31 10:32:20 EDT 2016
[INFO] Final Memory: 31M/435M
[INFO] ------------------------------------------------------------------------
[INFO] o.h.m.e.h.MavenExecutionResultHandler - Build failed with exception(s)
[INFO] o.h.m.e.h.MavenExecutionResultHandler - [1] org.apache.maven.lifecycle.LifecycleExecutionException: Failed to execute goal org.apache.maven.plugins:maven-dependency-plugin:2.8:copy (get-kura-bundles) on project distrib: Unable to find artifact.
[DEBUG] Closing connection to remote
[ERROR] Failed to execute goal org.apache.maven.plugins:maven-dependency-plugin:2.8:copy (get-kura-bundles) on project distrib: Unable to find artifact. Could not find artifact org.eclipse.kura:org.eclipse.kura.example.camel.aggregation:jar:1.0.1 in kura_releases (https://repo.eclipse.org/content/repositories/kura/)
[ERROR] 
[ERROR] Try downloading the file manually from the project website.
[ERROR] 
[ERROR] Then, install it using the command:
[ERROR] mvn install:install-file -DgroupId=org.eclipse.kura -DartifactId=org.eclipse.kura.example.camel.aggregation -Dversion=1.0.1 -Dpackaging=jar -Dfile=/path/to/file
[ERROR] 
[ERROR] Alternatively, if you host your own repository you can deploy the file there:
[ERROR] mvn deploy:deploy-file -DgroupId=org.eclipse.kura -DartifactId=org.eclipse.kura.example.camel.aggregation -Dversion=1.0.1 -Dpackaging=jar -Dfile=/path/to/file -Durl=[url] -DrepositoryId=[id]
[ERROR] 
[ERROR] 
[ERROR] org.eclipse.kura:org.eclipse.kura.example.camel.aggregation:jar:1.0.1
[ERROR] 
[ERROR] from the specified remote repositories:
[ERROR] kura_releases (https://repo.eclipse.org/content/repositories/kura/, releases=true, snapshots=false),
[ERROR] kura_addons (https://raw.github.com/eurotech/kura_addons/mvn-repo/, releases=true, snapshots=true),
[ERROR] central (http://repo.maven.apache.org/maven2, releases=true, snapshots=false)
[ERROR] -> [Help 1]
org.apache.maven.lifecycle.LifecycleExecutionException: Failed to execute goal org.apache.maven.plugins:maven-dependency-plugin:2.8:copy (get-kura-bundles) on project distrib: Unable to find artifact.
	at org.apache.maven.lifecycle.internal.MojoExecutor.execute(MojoExecutor.java:217)
	at org.apache.maven.lifecycle.internal.MojoExecutor.execute(MojoExecutor.java:153)
	at org.apache.maven.lifecycle.internal.MojoExecutor.execute(MojoExecutor.java:145)
	at org.apache.maven.lifecycle.internal.LifecycleModuleBuilder.buildProject(LifecycleModuleBuilder.java:84)
	at org.apache.maven.lifecycle.internal.LifecycleModuleBuilder.buildProject(LifecycleModuleBuilder.java:59)
	at org.apache.maven.lifecycle.internal.LifecycleStarter.singleThreadedBuild(LifecycleStarter.java:183)
	at org.apache.maven.lifecycle.internal.LifecycleStarter.execute(LifecycleStarter.java:161)
	at org.apache.maven.DefaultMaven.doExecute(DefaultMaven.java:320)
	at org.apache.maven.DefaultMaven.execute(DefaultMaven.java:156)
	at org.apache.maven.cli.MavenCli.execute(MavenCli.java:537)
	at org.apache.maven.cli.MavenCli.doMain(MavenCli.java:196)
	at org.apache.maven.cli.MavenCli.main(MavenCli.java:141)
	at sun.reflect.NativeMethodAccessorImpl.invoke0(Native Method)
	at sun.reflect.NativeMethodAccessorImpl.invoke(NativeMethodAccessorImpl.java:57)
	at sun.reflect.DelegatingMethodAccessorImpl.invoke(DelegatingMethodAccessorImpl.java:43)
	at java.lang.reflect.Method.invoke(Method.java:606)
	at org.codehaus.plexus.classworlds.launcher.Launcher.launchEnhanced(Launcher.java:290)
	at org.codehaus.plexus.classworlds.launcher.Launcher.launch(Launcher.java:230)
	at org.codehaus.plexus.classworlds.launcher.Launcher.mainWithExitCode(Launcher.java:409)
	at org.codehaus.plexus.classworlds.launcher.Launcher.main(Launcher.java:352)
Caused by: org.apache.maven.plugin.MojoExecutionException: Unable to find artifact.
	at org.apache.maven.plugin.dependency.fromConfiguration.AbstractFromConfigurationMojo.getArtifact(AbstractFromConfigurationMojo.java:265)
	at org.apache.maven.plugin.dependency.fromConfiguration.AbstractFromConfigurationMojo.getProcessedArtifactItems(AbstractFromConfigurationMojo.java:171)
	at org.apache.maven.plugin.dependency.fromConfiguration.CopyMojo.doExecute(CopyMojo.java:105)
	at org.apache.maven.plugin.dependency.AbstractDependencyMojo.execute(AbstractDependencyMojo.java:167)
	at org.apache.maven.plugin.DefaultBuildPluginManager.executeMojo(DefaultBuildPluginManager.java:101)
	at org.apache.maven.lifecycle.internal.MojoExecutor.execute(MojoExecutor.java:209)
	... 19 more
Caused by: org.apache.maven.artifact.resolver.ArtifactNotFoundException: Could not find artifact org.eclipse.kura:org.eclipse.kura.example.camel.aggregation:jar:1.0.1 in kura_releases (https://repo.eclipse.org/content/repositories/kura/)

Try downloading the file manually from the project website.

Then, install it using the command: 
    mvn install:install-file -DgroupId=org.eclipse.kura -DartifactId=org.eclipse.kura.example.camel.aggregation -Dversion=1.0.1 -Dpackaging=jar -Dfile=/path/to/file

Alternatively, if you host your own repository you can deploy the file there: 
    mvn deploy:deploy-file -DgroupId=org.eclipse.kura -DartifactId=org.eclipse.kura.example.camel.aggregation -Dversion=1.0.1 -Dpackaging=jar -Dfile=/path/to/file -Durl=[url] -DrepositoryId=[id]


  org.eclipse.kura:org.eclipse.kura.example.camel.aggregation:jar:1.0.1

from the specified remote repositories:
  kura_releases (https://repo.eclipse.org/content/repositories/kura/, releases=true, snapshots=false),
  kura_addons (https://raw.github.com/eurotech/kura_addons/mvn-repo/, releases=true, snapshots=true),
  central (http://repo.maven.apache.org/maven2, releases=true, snapshots=false)

	at org.apache.maven.artifact.resolver.DefaultArtifactResolver.resolve(DefaultArtifactResolver.java:219)
	at org.apache.maven.artifact.resolver.DefaultArtifactResolver.resolve(DefaultArtifactResolver.java:157)
	at org.apache.maven.artifact.resolver.DefaultArtifactResolver.resolve(DefaultArtifactResolver.java:525)
	at org.apache.maven.plugin.dependency.fromConfiguration.AbstractFromConfigurationMojo.getArtifact(AbstractFromConfigurationMojo.java:257)
	... 24 more
Caused by: org.sonatype.aether.resolution.ArtifactResolutionException: Could not find artifact org.eclipse.kura:org.eclipse.kura.example.camel.aggregation:jar:1.0.1 in kura_releases (https://repo.eclipse.org/content/repositories/kura/)
	at org.sonatype.aether.impl.internal.DefaultArtifactResolver.resolve(DefaultArtifactResolver.java:538)
	at org.sonatype.aether.impl.internal.DefaultArtifactResolver.resolveArtifacts(DefaultArtifactResolver.java:216)
	at org.sonatype.aether.impl.internal.DefaultArtifactResolver.resolveArtifact(DefaultArtifactResolver.java:193)
	at org.sonatype.aether.impl.internal.DefaultRepositorySystem.resolveArtifact(DefaultRepositorySystem.java:286)
	at org.apache.maven.artifact.resolver.DefaultArtifactResolver.resolve(DefaultArtifactResolver.java:213)
	... 27 more
Caused by: org.sonatype.aether.transfer.ArtifactNotFoundException: Could not find artifact org.eclipse.kura:org.eclipse.kura.example.camel.aggregation:jar:1.0.1 in kura_releases (https://repo.eclipse.org/content/repositories/kura/)
	at org.sonatype.aether.connector.wagon.WagonRepositoryConnector$4.wrap(WagonRepositoryConnector.java:947)
	at org.sonatype.aether.connector.wagon.WagonRepositoryConnector$4.wrap(WagonRepositoryConnector.java:941)
	at org.sonatype.aether.connector.wagon.WagonRepositoryConnector$GetTask.run(WagonRepositoryConnector.java:669)
	at org.sonatype.aether.util.concurrency.RunnableErrorForwarder$1.run(RunnableErrorForwarder.java:60)
	at java.util.concurrent.ThreadPoolExecutor.runWorker(ThreadPoolExecutor.java:1145)
	at java.util.concurrent.ThreadPoolExecutor$Worker.run(ThreadPoolExecutor.java:615)
	at java.lang.Thread.run(Thread.java:745)
[ERROR] 
[ERROR] Re-run Maven using the -X switch to enable full debug logging.
[ERROR] 
[ERROR] For more information about the errors and possible solutions, please read the following articles:
[ERROR] [Help 1] http://cwiki.apache.org/confluence/display/MAVEN/MojoExecutionException
[ERROR] 
[ERROR] After correcting the problems, you can resume the build with the command
[ERROR]   mvn <goals> -rf :distrib
[DEBUG] Waiting for process to finish
[DEBUG] Result: 1
[FINDBUGS] Skipping publisher since build result is FAILURE
Finished: FAILURE