FailedConsole Output

Started by timer
Obtained Jenkinsfile from git https://github.com/eclipse/kuksa.integration.git
Running in Durability level: PERFORMANCE_OPTIMIZED
[Pipeline] Start of Pipeline
[Pipeline] node
Still waiting to schedule task
Waiting for next available executor
Agent default-agent-h1m9v is provisioned from template Kubernetes Pod Template
---
apiVersion: "v1"
kind: "Pod"
metadata:
  annotations: {}
  labels:
    jenkins: "slave"
  name: "default-agent-h1m9v"
spec:
  containers:
  - env:
    - name: "MAVEN_OPTS"
      value: "-Dorg.slf4j.simpleLogger.log.org.apache.maven.cli.transfer.Slf4jMavenTransferListener=warn"
    - name: "JENKINS_SECRET"
      value: "********"
    - name: "JENKINS_TUNNEL"
      value: "jenkins-discovery.kuksa.svc.cluster.local:50000"
    - name: "JENKINS_AGENT_NAME"
      value: "default-agent-h1m9v"
    - name: "MAVEN_CONFIG"
      value: "-B -e"
    - name: "JENKINS_NAME"
      value: "default-agent-h1m9v"
    - name: "JENKINS_AGENT_WORKDIR"
      value: "/home/jenkins/agent"
    - name: "JENKINS_URL"
      value: "http://jenkins-ui.kuksa.svc.cluster.local/kuksa/"
    - name: "HOME"
      value: "/home/jenkins"
    image: "eclipsecbijenkins/jenkins-agent:3.35@sha256:5d06ebec6e9dffc44fb41009a51d085a83944a23f651416531b960143d186340"
    imagePullPolicy: "IfNotPresent"
    name: "jnlp"
    resources:
      limits:
        memory: "4096Mi"
        cpu: "2000m"
      requests:
        memory: "4096Mi"
        cpu: "1000m"
    securityContext:
      privileged: false
    tty: true
    volumeMounts:
    - mountPath: "/home/jenkins/agent"
      name: "workspace-volume"
      readOnly: false
    - mountPath: "/home/jenkins/.m2/toolchains.xml"
      name: "toolchains-xml"
      readOnly: true
      subPath: "toolchains.xml"
    - mountPath: "/opt/tools"
      name: "volume-0"
      readOnly: false
    - mountPath: "/home/jenkins"
      name: "volume-2"
      readOnly: false
    - mountPath: "/home/jenkins/.m2/repository"
      name: "volume-3"
      readOnly: false
    - mountPath: "/home/jenkins/.m2/settings-security.xml"
      name: "settings-security-xml"
      readOnly: true
      subPath: "settings-security.xml"
    - mountPath: "/home/jenkins/.m2/settings.xml"
      name: "settings-xml"
      readOnly: true
      subPath: "settings.xml"
    - mountPath: "/home/jenkins/.ssh"
      name: "volume-1"
      readOnly: false
    workingDir: "/home/jenkins/agent"
  nodeSelector: {}
  restartPolicy: "Never"
  volumes:
  - name: "settings-security-xml"
    secret:
      items:
      - key: "settings-security.xml"
        path: "settings-security.xml"
      secretName: "m2-secret-dir"
  - name: "volume-0"
    persistentVolumeClaim:
      claimName: "tools-claim-jiro-kuksa"
      readOnly: true
  - configMap:
      items:
      - key: "toolchains.xml"
        path: "toolchains.xml"
      name: "m2-dir"
    name: "toolchains-xml"
  - emptyDir:
      medium: ""
    name: "volume-2"
  - configMap:
      name: "known-hosts"
    name: "volume-1"
  - name: "settings-xml"
    secret:
      items:
      - key: "settings.xml"
        path: "settings.xml"
      secretName: "m2-secret-dir"
  - emptyDir:
      medium: ""
    name: "workspace-volume"
  - emptyDir:
      medium: ""
    name: "volume-3"

Running on default-agent-h1m9v in /home/jenkins/agent/workspace/run-kuksa-tests
[Pipeline] {
[Pipeline] stage
[Pipeline] { (Declarative: Checkout SCM)
[Pipeline] checkout
No credentials specified
Cloning the remote Git repository
Checking out Revision 7b7ffd5827d628185d6576a432060cfd078298a2 (refs/remotes/origin/master)
Cloning repository https://github.com/eclipse/kuksa.integration.git
 > git init /home/jenkins/agent/workspace/run-kuksa-tests # timeout=10
Fetching upstream changes from https://github.com/eclipse/kuksa.integration.git
 > git --version # timeout=10
 > git fetch --tags --force --progress -- https://github.com/eclipse/kuksa.integration.git +refs/heads/*:refs/remotes/origin/*
 > git config remote.origin.url https://github.com/eclipse/kuksa.integration.git # timeout=10
 > git config --add remote.origin.fetch +refs/heads/*:refs/remotes/origin/* # timeout=10
 > git config remote.origin.url https://github.com/eclipse/kuksa.integration.git # timeout=10
Fetching upstream changes from https://github.com/eclipse/kuksa.integration.git
 > git fetch --tags --force --progress -- https://github.com/eclipse/kuksa.integration.git +refs/heads/*:refs/remotes/origin/*
 > git rev-parse refs/remotes/origin/master^{commit} # timeout=10
 > git rev-parse refs/remotes/origin/origin/master^{commit} # timeout=10
 > git config core.sparsecheckout # timeout=10
 > git checkout -f 7b7ffd5827d628185d6576a432060cfd078298a2
Commit message: "0.1 Release commit (#19)"
 > git rev-list --no-walk 7b7ffd5827d628185d6576a432060cfd078298a2 # timeout=10
[Pipeline] }
[Pipeline] // stage
[Pipeline] withEnv
[Pipeline] {
[Pipeline] stage
[Pipeline] { (Test)
[Pipeline] git
No credentials specified
Fetching changes from the remote Git repository
Checking out Revision 7b7ffd5827d628185d6576a432060cfd078298a2 (refs/remotes/origin/master)
Commit message: "0.1 Release commit (#19)"
[Pipeline] sh
+ cd testing
+ export 'JAVA_HOME=/opt/tools/java/openjdk/latest'
+ /opt/tools/apache-maven/latest/bin/mvn --batch-mode clean test '-Dhono_device_registry=https://hono-service-device-registry.appstacle.appstaclecloud.org:8443/' '-Dhono_dispatch_router=tcp://hono-dispatch-router.appstacle.appstaclecloud.org:5671' '-Dhono_adapter_http_vertx=https://hono-adapter-http-vertx.appstacle.appstaclecloud.org:8443/' '-Dhono_adapter_mqtt_vertx=ssl://hono-adapter-mqtt-vertx.appstacle.appstaclecloud.org:8883' '-Dhawkbit_address=http://hawkbit-appstacle.westeurope.cloudapp.azure.com:8080/' '-Dhawkbit_username=admin' '-Dhawkbit_password=admin' '-Dappstore_address=https://kuksa-appstore.appstacle.appstaclecloud.org:8443/' '-Dappstore_username=admin' '-Dappstore_password=admin' '-Dhono_client_host=hono-dispatch-router.appstacle.appstaclecloud.org' '-Dhono_client_port=5671' '-Dhono_client_password=verysecret' '-Dhono_client_username=consumer@HONO'
Picked up JAVA_TOOL_OPTIONS: -XX:+IgnoreUnrecognizedVMOptions -XX:+UseContainerSupport -XX:+UnlockExperimentalVMOptions -XX:+UseCGroupMemoryLimitForHeap
Picked up _JAVA_OPTIONS: -XX:MaxRAMPercentage=64.0
 > git rev-parse --is-inside-work-tree # timeout=10
 > git config remote.origin.url https://github.com/eclipse/kuksa.integration.git # timeout=10
Fetching upstream changes from https://github.com/eclipse/kuksa.integration.git
 > git --version # timeout=10
 > git fetch --tags --force --progress -- https://github.com/eclipse/kuksa.integration.git +refs/heads/*:refs/remotes/origin/*
 > git rev-parse refs/remotes/origin/master^{commit} # timeout=10
 > git rev-parse refs/remotes/origin/origin/master^{commit} # timeout=10
 > git config core.sparsecheckout # timeout=10
 > git checkout -f 7b7ffd5827d628185d6576a432060cfd078298a2
 > git branch -a -v --no-abbrev # timeout=10
 > git checkout -b master 7b7ffd5827d628185d6576a432060cfd078298a2
[INFO] Scanning for projects...
[WARNING] 
[WARNING] Some problems were encountered while building the effective model for org.eclipse:kuksa.testing:jar:0.0.1-SNAPSHOT
[WARNING] 'dependencies.dependency.(groupId:artifactId:type:classifier)' must be unique: org.springframework:spring-web:jar -> version 5.1.5.RELEASE vs 5.1.8.RELEASE @ line 169, column 15
[WARNING] 
[WARNING] It is highly recommended to fix these problems because they threaten the stability of your build.
[WARNING] 
[WARNING] For this reason, future Maven versions might no longer support building such malformed projects.
[WARNING] 
[INFO] 
[INFO] ---------------------< org.eclipse:kuksa.testing >----------------------
[INFO] Building kuksa.testing 0.0.1-SNAPSHOT
[INFO] --------------------------------[ jar ]---------------------------------
[INFO] 
[INFO] --- maven-clean-plugin:3.1.0:clean (default-clean) @ kuksa.testing ---
[INFO] 
[INFO] --- maven-resources-plugin:3.1.0:resources (default-resources) @ kuksa.testing ---
[INFO] Using 'UTF-8' encoding to copy filtered resources.
[INFO] Copying 2 resources
[INFO] Copying 1 resource
[INFO] 
[INFO] --- maven-compiler-plugin:3.8.0:compile (default-compile) @ kuksa.testing ---
[INFO] Changes detected - recompiling the module!
[INFO] Compiling 7 source files to /home/jenkins/agent/workspace/run-kuksa-tests/testing/target/classes
[INFO] /home/jenkins/agent/workspace/run-kuksa-tests/testing/src/main/java/org/eclipse/kuksa/testing/FeignMultipartEncoder.java: /home/jenkins/agent/workspace/run-kuksa-tests/testing/src/main/java/org/eclipse/kuksa/testing/FeignMultipartEncoder.java uses or overrides a deprecated API.
[INFO] /home/jenkins/agent/workspace/run-kuksa-tests/testing/src/main/java/org/eclipse/kuksa/testing/FeignMultipartEncoder.java: Recompile with -Xlint:deprecation for details.
[INFO] 
[INFO] --- maven-resources-plugin:3.1.0:testResources (default-testResources) @ kuksa.testing ---
[INFO] Using 'UTF-8' encoding to copy filtered resources.
[INFO] Copying 13 resources
[INFO] 
[INFO] --- maven-compiler-plugin:3.8.0:testCompile (default-testCompile) @ kuksa.testing ---
[INFO] Changes detected - recompiling the module!
[INFO] Compiling 23 source files to /home/jenkins/agent/workspace/run-kuksa-tests/testing/target/test-classes
[INFO] 
[INFO] --- maven-surefire-plugin:3.0.0-M1:test (default-test) @ kuksa.testing ---
[INFO] 
[INFO] -------------------------------------------------------
[INFO]  T E S T S
[INFO] -------------------------------------------------------
[INFO] Running org.eclipse.kuksa.testing.appstore.AppStoreCategoryTest
2020-01-09 02:38:00.758  INFO 433 --- [           main] trationDelegate$BeanPostProcessorChecker : Bean 'org.springframework.cloud.autoconfigure.ConfigurationPropertiesRebinderAutoConfiguration' of type [org.springframework.cloud.autoconfigure.ConfigurationPropertiesRebinderAutoConfiguration$$EnhancerBySpringCGLIB$$83cff4a8] is not eligible for getting processed by all BeanPostProcessors (for example: not eligible for auto-proxying)

  .   ____          _            __ _ _
 /\\ / ___'_ __ _ _(_)_ __  __ _ \ \ \ \
( ( )\___ | '_ | '_| | '_ \/ _` | \ \ \ \
 \\/  ___)| |_)| | | | | || (_| |  ) ) ) )
  '  |____| .__|_| |_|_| |_\__, | / / / /
 =========|_|==============|___/=/_/_/_/
 :: Spring Boot ::        (v2.1.0.RELEASE)

cleaning UP
cleaning UP
cleaning UP
cleaning UP
cleaning UP
[ERROR] Tests run: 5, Failures: 0, Errors: 5, Skipped: 0, Time elapsed: 17.168 s <<< FAILURE! - in org.eclipse.kuksa.testing.appstore.AppStoreCategoryTest
[ERROR] testGetAppCategory(org.eclipse.kuksa.testing.appstore.AppStoreCategoryTest)  Time elapsed: 15.385 s  <<< ERROR!
org.springframework.web.client.ResourceAccessException: I/O error on GET request for "https://kuksa-appstore.appstacle.appstaclecloud.org:8443/api/1.0/appcategory": kuksa-appstore.appstacle.appstaclecloud.org; nested exception is java.net.UnknownHostException: kuksa-appstore.appstacle.appstaclecloud.org
	at org.eclipse.kuksa.testing.appstore.AppStoreCategoryTest.testSetup(AppStoreCategoryTest.java:40)
Caused by: java.net.UnknownHostException: kuksa-appstore.appstacle.appstaclecloud.org
	at org.eclipse.kuksa.testing.appstore.AppStoreCategoryTest.testSetup(AppStoreCategoryTest.java:40)

[ERROR] testGetAllAppCategories(org.eclipse.kuksa.testing.appstore.AppStoreCategoryTest)  Time elapsed: 0.003 s  <<< ERROR!
org.springframework.web.client.ResourceAccessException: I/O error on GET request for "https://kuksa-appstore.appstacle.appstaclecloud.org:8443/api/1.0/appcategory": kuksa-appstore.appstacle.appstaclecloud.org; nested exception is java.net.UnknownHostException: kuksa-appstore.appstacle.appstaclecloud.org
	at org.eclipse.kuksa.testing.appstore.AppStoreCategoryTest.testSetup(AppStoreCategoryTest.java:40)
Caused by: java.net.UnknownHostException: kuksa-appstore.appstacle.appstaclecloud.org
	at org.eclipse.kuksa.testing.appstore.AppStoreCategoryTest.testSetup(AppStoreCategoryTest.java:40)

[ERROR] testCreateAppCategory(org.eclipse.kuksa.testing.appstore.AppStoreCategoryTest)  Time elapsed: 0.003 s  <<< ERROR!
org.springframework.web.client.ResourceAccessException: I/O error on GET request for "https://kuksa-appstore.appstacle.appstaclecloud.org:8443/api/1.0/appcategory": kuksa-appstore.appstacle.appstaclecloud.org; nested exception is java.net.UnknownHostException: kuksa-appstore.appstacle.appstaclecloud.org
	at org.eclipse.kuksa.testing.appstore.AppStoreCategoryTest.testSetup(AppStoreCategoryTest.java:40)
Caused by: java.net.UnknownHostException: kuksa-appstore.appstacle.appstaclecloud.org
	at org.eclipse.kuksa.testing.appstore.AppStoreCategoryTest.testSetup(AppStoreCategoryTest.java:40)

[ERROR] testRemoveAppCategory(org.eclipse.kuksa.testing.appstore.AppStoreCategoryTest)  Time elapsed: 0.003 s  <<< ERROR!
org.springframework.web.client.ResourceAccessException: I/O error on GET request for "https://kuksa-appstore.appstacle.appstaclecloud.org:8443/api/1.0/appcategory": kuksa-appstore.appstacle.appstaclecloud.org; nested exception is java.net.UnknownHostException: kuksa-appstore.appstacle.appstaclecloud.org
	at org.eclipse.kuksa.testing.appstore.AppStoreCategoryTest.testSetup(AppStoreCategoryTest.java:40)
Caused by: java.net.UnknownHostException: kuksa-appstore.appstacle.appstaclecloud.org
	at org.eclipse.kuksa.testing.appstore.AppStoreCategoryTest.testSetup(AppStoreCategoryTest.java:40)

[ERROR] testUpdateAppCategory(org.eclipse.kuksa.testing.appstore.AppStoreCategoryTest)  Time elapsed: 0.003 s  <<< ERROR!
org.springframework.web.client.ResourceAccessException: I/O error on GET request for "https://kuksa-appstore.appstacle.appstaclecloud.org:8443/api/1.0/appcategory": kuksa-appstore.appstacle.appstaclecloud.org; nested exception is java.net.UnknownHostException: kuksa-appstore.appstacle.appstaclecloud.org
	at org.eclipse.kuksa.testing.appstore.AppStoreCategoryTest.testSetup(AppStoreCategoryTest.java:40)
Caused by: java.net.UnknownHostException: kuksa-appstore.appstacle.appstaclecloud.org
	at org.eclipse.kuksa.testing.appstore.AppStoreCategoryTest.testSetup(AppStoreCategoryTest.java:40)

[INFO] Running org.eclipse.kuksa.testing.appstore.AppStoreOemTest
cleaning UP
cleaning UP
[ERROR] Tests run: 2, Failures: 0, Errors: 2, Skipped: 0, Time elapsed: 0.046 s <<< FAILURE! - in org.eclipse.kuksa.testing.appstore.AppStoreOemTest
[ERROR] testCreateOem(org.eclipse.kuksa.testing.appstore.AppStoreOemTest)  Time elapsed: 0.04 s  <<< ERROR!
org.springframework.web.client.ResourceAccessException: I/O error on POST request for "https://kuksa-appstore.appstacle.appstaclecloud.org:8443/api/1.0/oem/": kuksa-appstore.appstacle.appstaclecloud.org; nested exception is java.net.UnknownHostException: kuksa-appstore.appstacle.appstaclecloud.org
	at org.eclipse.kuksa.testing.appstore.AppStoreOemTest.testCreateOem(AppStoreOemTest.java:81)
Caused by: java.net.UnknownHostException: kuksa-appstore.appstacle.appstaclecloud.org
	at org.eclipse.kuksa.testing.appstore.AppStoreOemTest.testCreateOem(AppStoreOemTest.java:81)

[ERROR] testGetOem(org.eclipse.kuksa.testing.appstore.AppStoreOemTest)  Time elapsed: 0.006 s  <<< ERROR!
org.springframework.web.client.ResourceAccessException: I/O error on POST request for "https://kuksa-appstore.appstacle.appstaclecloud.org:8443/api/1.0/oem/": kuksa-appstore.appstacle.appstaclecloud.org; nested exception is java.net.UnknownHostException: kuksa-appstore.appstacle.appstaclecloud.org
	at org.eclipse.kuksa.testing.appstore.AppStoreOemTest.createOem(AppStoreOemTest.java:56)
	at org.eclipse.kuksa.testing.appstore.AppStoreOemTest.testGetOem(AppStoreOemTest.java:102)
Caused by: java.net.UnknownHostException: kuksa-appstore.appstacle.appstaclecloud.org
	at org.eclipse.kuksa.testing.appstore.AppStoreOemTest.createOem(AppStoreOemTest.java:56)
	at org.eclipse.kuksa.testing.appstore.AppStoreOemTest.testGetOem(AppStoreOemTest.java:102)

[INFO] Running org.eclipse.kuksa.testing.appstore.AppStoreUserTest
cleaning UP
cleaning UP
cleaning UP
cleaning UP
cleaning UP
cleaning UP
[ERROR] Tests run: 6, Failures: 0, Errors: 6, Skipped: 0, Time elapsed: 0.072 s <<< FAILURE! - in org.eclipse.kuksa.testing.appstore.AppStoreUserTest
[ERROR] testUpdateUser(org.eclipse.kuksa.testing.appstore.AppStoreUserTest)  Time elapsed: 0.006 s  <<< ERROR!
org.springframework.web.client.ResourceAccessException: I/O error on GET request for "https://kuksa-appstore.appstacle.appstaclecloud.org:8443/api/1.0/user": kuksa-appstore.appstacle.appstaclecloud.org; nested exception is java.net.UnknownHostException: kuksa-appstore.appstacle.appstaclecloud.org
	at org.eclipse.kuksa.testing.appstore.AppStoreUserTest.testSetup(AppStoreUserTest.java:38)
Caused by: java.net.UnknownHostException: kuksa-appstore.appstacle.appstaclecloud.org
	at org.eclipse.kuksa.testing.appstore.AppStoreUserTest.testSetup(AppStoreUserTest.java:38)

[ERROR] testGetAllUser(org.eclipse.kuksa.testing.appstore.AppStoreUserTest)  Time elapsed: 0.004 s  <<< ERROR!
org.springframework.web.client.ResourceAccessException: I/O error on GET request for "https://kuksa-appstore.appstacle.appstaclecloud.org:8443/api/1.0/user": kuksa-appstore.appstacle.appstaclecloud.org; nested exception is java.net.UnknownHostException: kuksa-appstore.appstacle.appstaclecloud.org
	at org.eclipse.kuksa.testing.appstore.AppStoreUserTest.testSetup(AppStoreUserTest.java:38)
Caused by: java.net.UnknownHostException: kuksa-appstore.appstacle.appstaclecloud.org
	at org.eclipse.kuksa.testing.appstore.AppStoreUserTest.testSetup(AppStoreUserTest.java:38)

[ERROR] testGetUser(org.eclipse.kuksa.testing.appstore.AppStoreUserTest)  Time elapsed: 0.004 s  <<< ERROR!
org.springframework.web.client.ResourceAccessException: I/O error on GET request for "https://kuksa-appstore.appstacle.appstaclecloud.org:8443/api/1.0/user": kuksa-appstore.appstacle.appstaclecloud.org; nested exception is java.net.UnknownHostException: kuksa-appstore.appstacle.appstaclecloud.org
	at org.eclipse.kuksa.testing.appstore.AppStoreUserTest.testSetup(AppStoreUserTest.java:38)
Caused by: java.net.UnknownHostException: kuksa-appstore.appstacle.appstaclecloud.org
	at org.eclipse.kuksa.testing.appstore.AppStoreUserTest.testSetup(AppStoreUserTest.java:38)

[ERROR] testCreateUser(org.eclipse.kuksa.testing.appstore.AppStoreUserTest)  Time elapsed: 0.044 s  <<< ERROR!
org.springframework.web.client.ResourceAccessException: I/O error on GET request for "https://kuksa-appstore.appstacle.appstaclecloud.org:8443/api/1.0/user": kuksa-appstore.appstacle.appstaclecloud.org; nested exception is java.net.UnknownHostException: kuksa-appstore.appstacle.appstaclecloud.org
	at org.eclipse.kuksa.testing.appstore.AppStoreUserTest.testSetup(AppStoreUserTest.java:38)
Caused by: java.net.UnknownHostException: kuksa-appstore.appstacle.appstaclecloud.org
	at org.eclipse.kuksa.testing.appstore.AppStoreUserTest.testSetup(AppStoreUserTest.java:38)

[ERROR] testDeleteUser(org.eclipse.kuksa.testing.appstore.AppStoreUserTest)  Time elapsed: 0.013 s  <<< ERROR!
org.springframework.web.client.ResourceAccessException: I/O error on GET request for "https://kuksa-appstore.appstacle.appstaclecloud.org:8443/api/1.0/user": kuksa-appstore.appstacle.appstaclecloud.org; nested exception is java.net.UnknownHostException: kuksa-appstore.appstacle.appstaclecloud.org
	at org.eclipse.kuksa.testing.appstore.AppStoreUserTest.testSetup(AppStoreUserTest.java:38)
Caused by: java.net.UnknownHostException: kuksa-appstore.appstacle.appstaclecloud.org
	at org.eclipse.kuksa.testing.appstore.AppStoreUserTest.testSetup(AppStoreUserTest.java:38)

[ERROR] testValidateUser(org.eclipse.kuksa.testing.appstore.AppStoreUserTest)  Time elapsed: 0 s  <<< ERROR!
org.springframework.web.client.ResourceAccessException: I/O error on GET request for "https://kuksa-appstore.appstacle.appstaclecloud.org:8443/api/1.0/user": kuksa-appstore.appstacle.appstaclecloud.org; nested exception is java.net.UnknownHostException: kuksa-appstore.appstacle.appstaclecloud.org
	at org.eclipse.kuksa.testing.appstore.AppStoreUserTest.testSetup(AppStoreUserTest.java:38)
Caused by: java.net.UnknownHostException: kuksa-appstore.appstacle.appstaclecloud.org
	at org.eclipse.kuksa.testing.appstore.AppStoreUserTest.testSetup(AppStoreUserTest.java:38)

[INFO] Running org.eclipse.kuksa.testing.appstore.AppStoreAppTest
cleaning UP
cleaning UP
cleaning UP
cleaning UP
cleaning UP
cleaning UP
cleaning UP
cleaning UP
cleaning UP
cleaning UP
cleaning UP
[ERROR] Tests run: 11, Failures: 0, Errors: 11, Skipped: 0, Time elapsed: 0.093 s <<< FAILURE! - in org.eclipse.kuksa.testing.appstore.AppStoreAppTest
[ERROR] testGetUserInstalledApp(org.eclipse.kuksa.testing.appstore.AppStoreAppTest)  Time elapsed: 0 s  <<< ERROR!
org.springframework.web.client.ResourceAccessException: I/O error on GET request for "https://kuksa-appstore.appstacle.appstaclecloud.org:8443/api/1.0/app": kuksa-appstore.appstacle.appstaclecloud.org; nested exception is java.net.UnknownHostException: kuksa-appstore.appstacle.appstaclecloud.org
	at org.eclipse.kuksa.testing.appstore.AppStoreAppTest.testSetup(AppStoreAppTest.java:52)
Caused by: java.net.UnknownHostException: kuksa-appstore.appstacle.appstaclecloud.org
	at org.eclipse.kuksa.testing.appstore.AppStoreAppTest.testSetup(AppStoreAppTest.java:52)

[ERROR] testGetAppsByCategory(org.eclipse.kuksa.testing.appstore.AppStoreAppTest)  Time elapsed: 0.005 s  <<< ERROR!
org.springframework.web.client.ResourceAccessException: I/O error on GET request for "https://kuksa-appstore.appstacle.appstaclecloud.org:8443/api/1.0/app": kuksa-appstore.appstacle.appstaclecloud.org; nested exception is java.net.UnknownHostException: kuksa-appstore.appstacle.appstaclecloud.org
	at org.eclipse.kuksa.testing.appstore.AppStoreAppTest.testSetup(AppStoreAppTest.java:52)
Caused by: java.net.UnknownHostException: kuksa-appstore.appstacle.appstaclecloud.org
	at org.eclipse.kuksa.testing.appstore.AppStoreAppTest.testSetup(AppStoreAppTest.java:52)

[ERROR] testUpdateApp(org.eclipse.kuksa.testing.appstore.AppStoreAppTest)  Time elapsed: 0.005 s  <<< ERROR!
org.springframework.web.client.ResourceAccessException: I/O error on GET request for "https://kuksa-appstore.appstacle.appstaclecloud.org:8443/api/1.0/app": kuksa-appstore.appstacle.appstaclecloud.org; nested exception is java.net.UnknownHostException: kuksa-appstore.appstacle.appstaclecloud.org
	at org.eclipse.kuksa.testing.appstore.AppStoreAppTest.testSetup(AppStoreAppTest.java:52)
Caused by: java.net.UnknownHostException: kuksa-appstore.appstacle.appstaclecloud.org
	at org.eclipse.kuksa.testing.appstore.AppStoreAppTest.testSetup(AppStoreAppTest.java:52)

[ERROR] testGetAppInstalledUsers(org.eclipse.kuksa.testing.appstore.AppStoreAppTest)  Time elapsed: 0.004 s  <<< ERROR!
org.springframework.web.client.ResourceAccessException: I/O error on GET request for "https://kuksa-appstore.appstacle.appstaclecloud.org:8443/api/1.0/app": kuksa-appstore.appstacle.appstaclecloud.org; nested exception is java.net.UnknownHostException: kuksa-appstore.appstacle.appstaclecloud.org
	at org.eclipse.kuksa.testing.appstore.AppStoreAppTest.testSetup(AppStoreAppTest.java:52)
Caused by: java.net.UnknownHostException: kuksa-appstore.appstacle.appstaclecloud.org
	at org.eclipse.kuksa.testing.appstore.AppStoreAppTest.testSetup(AppStoreAppTest.java:52)

[ERROR] testGetAllApps(org.eclipse.kuksa.testing.appstore.AppStoreAppTest)  Time elapsed: 0.003 s  <<< ERROR!
org.springframework.web.client.ResourceAccessException: I/O error on GET request for "https://kuksa-appstore.appstacle.appstaclecloud.org:8443/api/1.0/app": kuksa-appstore.appstacle.appstaclecloud.org; nested exception is java.net.UnknownHostException: kuksa-appstore.appstacle.appstaclecloud.org
	at org.eclipse.kuksa.testing.appstore.AppStoreAppTest.testSetup(AppStoreAppTest.java:52)
Caused by: java.net.UnknownHostException: kuksa-appstore.appstacle.appstaclecloud.org
	at org.eclipse.kuksa.testing.appstore.AppStoreAppTest.testSetup(AppStoreAppTest.java:52)

[ERROR] testPurchaseApp(org.eclipse.kuksa.testing.appstore.AppStoreAppTest)  Time elapsed: 0.004 s  <<< ERROR!
org.springframework.web.client.ResourceAccessException: I/O error on GET request for "https://kuksa-appstore.appstacle.appstaclecloud.org:8443/api/1.0/app": kuksa-appstore.appstacle.appstaclecloud.org; nested exception is java.net.UnknownHostException: kuksa-appstore.appstacle.appstaclecloud.org
	at org.eclipse.kuksa.testing.appstore.AppStoreAppTest.testSetup(AppStoreAppTest.java:52)
Caused by: java.net.UnknownHostException: kuksa-appstore.appstacle.appstaclecloud.org
	at org.eclipse.kuksa.testing.appstore.AppStoreAppTest.testSetup(AppStoreAppTest.java:52)

[ERROR] testGetAppsByCategoryAndAppName(org.eclipse.kuksa.testing.appstore.AppStoreAppTest)  Time elapsed: 0.004 s  <<< ERROR!
org.springframework.web.client.ResourceAccessException: I/O error on GET request for "https://kuksa-appstore.appstacle.appstaclecloud.org:8443/api/1.0/app": kuksa-appstore.appstacle.appstaclecloud.org; nested exception is java.net.UnknownHostException: kuksa-appstore.appstacle.appstaclecloud.org
	at org.eclipse.kuksa.testing.appstore.AppStoreAppTest.testSetup(AppStoreAppTest.java:52)
Caused by: java.net.UnknownHostException: kuksa-appstore.appstacle.appstaclecloud.org
	at org.eclipse.kuksa.testing.appstore.AppStoreAppTest.testSetup(AppStoreAppTest.java:52)

[ERROR] testCreateApp(org.eclipse.kuksa.testing.appstore.AppStoreAppTest)  Time elapsed: 0.004 s  <<< ERROR!
org.springframework.web.client.ResourceAccessException: I/O error on GET request for "https://kuksa-appstore.appstacle.appstaclecloud.org:8443/api/1.0/app": kuksa-appstore.appstacle.appstaclecloud.org; nested exception is java.net.UnknownHostException: kuksa-appstore.appstacle.appstaclecloud.org
	at org.eclipse.kuksa.testing.appstore.AppStoreAppTest.testSetup(AppStoreAppTest.java:52)
Caused by: java.net.UnknownHostException: kuksa-appstore.appstacle.appstaclecloud.org
	at org.eclipse.kuksa.testing.appstore.AppStoreAppTest.testSetup(AppStoreAppTest.java:52)

[ERROR] testGetApp(org.eclipse.kuksa.testing.appstore.AppStoreAppTest)  Time elapsed: 0.003 s  <<< ERROR!
org.springframework.web.client.ResourceAccessException: I/O error on GET request for "https://kuksa-appstore.appstacle.appstaclecloud.org:8443/api/1.0/app": kuksa-appstore.appstacle.appstaclecloud.org; nested exception is java.net.UnknownHostException: kuksa-appstore.appstacle.appstaclecloud.org
	at org.eclipse.kuksa.testing.appstore.AppStoreAppTest.testSetup(AppStoreAppTest.java:52)
Caused by: java.net.UnknownHostException: kuksa-appstore.appstacle.appstaclecloud.org
	at org.eclipse.kuksa.testing.appstore.AppStoreAppTest.testSetup(AppStoreAppTest.java:52)

[ERROR] testGetUserInstalledAppsWithText(org.eclipse.kuksa.testing.appstore.AppStoreAppTest)  Time elapsed: 0.003 s  <<< ERROR!
org.springframework.web.client.ResourceAccessException: I/O error on GET request for "https://kuksa-appstore.appstacle.appstaclecloud.org:8443/api/1.0/app": kuksa-appstore.appstacle.appstaclecloud.org; nested exception is java.net.UnknownHostException: kuksa-appstore.appstacle.appstaclecloud.org
	at org.eclipse.kuksa.testing.appstore.AppStoreAppTest.testSetup(AppStoreAppTest.java:52)
Caused by: java.net.UnknownHostException: kuksa-appstore.appstacle.appstaclecloud.org
	at org.eclipse.kuksa.testing.appstore.AppStoreAppTest.testSetup(AppStoreAppTest.java:52)

[ERROR] testRemoveApp(org.eclipse.kuksa.testing.appstore.AppStoreAppTest)  Time elapsed: 0.004 s  <<< ERROR!
org.springframework.web.client.ResourceAccessException: I/O error on GET request for "https://kuksa-appstore.appstacle.appstaclecloud.org:8443/api/1.0/app": kuksa-appstore.appstacle.appstaclecloud.org; nested exception is java.net.UnknownHostException: kuksa-appstore.appstacle.appstaclecloud.org
	at org.eclipse.kuksa.testing.appstore.AppStoreAppTest.testSetup(AppStoreAppTest.java:52)
Caused by: java.net.UnknownHostException: kuksa-appstore.appstacle.appstaclecloud.org
	at org.eclipse.kuksa.testing.appstore.AppStoreAppTest.testSetup(AppStoreAppTest.java:52)

[INFO] Running org.eclipse.kuksa.testing.SmallIntegrationTest
2020-01-09 02:38:16.780  INFO 433 --- [           main] trationDelegate$BeanPostProcessorChecker : Bean 'org.springframework.cloud.autoconfigure.ConfigurationPropertiesRebinderAutoConfiguration' of type [org.springframework.cloud.autoconfigure.ConfigurationPropertiesRebinderAutoConfiguration$$EnhancerBySpringCGLIB$$83cff4a8] is not eligible for getting processed by all BeanPostProcessors (for example: not eligible for auto-proxying)

  .   ____          _            __ _ _
 /\\ / ___'_ __ _ _(_)_ __  __ _ \ \ \ \
( ( )\___ | '_ | '_| | '_ \/ _` | \ \ \ \
 \\/  ___)| |_)| | | | | || (_| |  ) ) ) )
  '  |____| .__|_| |_|_| |_\__, | / / / /
 =========|_|==============|___/=/_/_/_/
 :: Spring Boot ::        (v2.1.0.RELEASE)

log4j:WARN No appenders could be found for logger (com.netflix.config.sources.URLConfigurationSource).
log4j:WARN Please initialize the log4j system properly.
log4j:WARN See http://logging.apache.org/log4j/1.2/faq.html#noconfig for more info.
SETUP START
CREATING USER
cleaning UP
Installing app to null
cleaning UP
CLEANUP START
[ERROR] Tests run: 2, Failures: 0, Errors: 2, Skipped: 0, Time elapsed: 1.413 s <<< FAILURE! - in org.eclipse.kuksa.testing.SmallIntegrationTest
[ERROR] integrationSetup(org.eclipse.kuksa.testing.SmallIntegrationTest)  Time elapsed: 0.009 s  <<< ERROR!
org.springframework.web.client.ResourceAccessException: I/O error on POST request for "https://kuksa-appstore.appstacle.appstaclecloud.org:8443/api/1.0/user/": kuksa-appstore.appstacle.appstaclecloud.org; nested exception is java.net.UnknownHostException: kuksa-appstore.appstacle.appstaclecloud.org
	at org.eclipse.kuksa.testing.SmallIntegrationTest.createUser(SmallIntegrationTest.java:402)
	at org.eclipse.kuksa.testing.SmallIntegrationTest.integrationSetup(SmallIntegrationTest.java:119)
Caused by: java.net.UnknownHostException: kuksa-appstore.appstacle.appstaclecloud.org
	at org.eclipse.kuksa.testing.SmallIntegrationTest.createUser(SmallIntegrationTest.java:402)
	at org.eclipse.kuksa.testing.SmallIntegrationTest.integrationSetup(SmallIntegrationTest.java:119)

[ERROR] installationTest(org.eclipse.kuksa.testing.SmallIntegrationTest)  Time elapsed: 0.004 s  <<< ERROR!
org.springframework.web.client.ResourceAccessException: I/O error on POST request for "https://kuksa-appstore.appstacle.appstaclecloud.org:8443/api/1.0/app/null/install/null": kuksa-appstore.appstacle.appstaclecloud.org; nested exception is java.net.UnknownHostException: kuksa-appstore.appstacle.appstaclecloud.org
	at org.eclipse.kuksa.testing.SmallIntegrationTest.installationTest(SmallIntegrationTest.java:376)
Caused by: java.net.UnknownHostException: kuksa-appstore.appstacle.appstaclecloud.org
	at org.eclipse.kuksa.testing.SmallIntegrationTest.installationTest(SmallIntegrationTest.java:376)

[INFO] Running org.eclipse.kuksa.testing.HonoApiTest
[ERROR] Tests run: 2, Failures: 0, Errors: 2, Skipped: 0, Time elapsed: 10.016 s <<< FAILURE! - in org.eclipse.kuksa.testing.HonoApiTest
[ERROR] org.eclipse.kuksa.testing.HonoApiTest  Time elapsed: 10.016 s  <<< ERROR!
org.springframework.web.client.ResourceAccessException: I/O error on POST request for "https://hono-service-device-registry.appstacle.appstaclecloud.org:8443/tenant/": hono-service-device-registry.appstacle.appstaclecloud.org; nested exception is java.net.UnknownHostException: hono-service-device-registry.appstacle.appstaclecloud.org
	at org.eclipse.kuksa.testing.HonoApiTest.createTenant(HonoApiTest.java:363)
	at org.eclipse.kuksa.testing.HonoApiTest.setup(HonoApiTest.java:67)
Caused by: java.net.UnknownHostException: hono-service-device-registry.appstacle.appstaclecloud.org
	at org.eclipse.kuksa.testing.HonoApiTest.createTenant(HonoApiTest.java:363)
	at org.eclipse.kuksa.testing.HonoApiTest.setup(HonoApiTest.java:67)

[ERROR] org.eclipse.kuksa.testing.HonoApiTest  Time elapsed: 10.016 s  <<< ERROR!
org.springframework.web.client.ResourceAccessException: I/O error on DELETE request for "https://hono-service-device-registry.appstacle.appstaclecloud.org:8443/tenant/EXPLEO_TENANT4": hono-service-device-registry.appstacle.appstaclecloud.org; nested exception is java.net.UnknownHostException: hono-service-device-registry.appstacle.appstaclecloud.org
	at org.eclipse.kuksa.testing.HonoApiTest.removeTenant(HonoApiTest.java:391)
	at org.eclipse.kuksa.testing.HonoApiTest.clean(HonoApiTest.java:77)
Caused by: java.net.UnknownHostException: hono-service-device-registry.appstacle.appstaclecloud.org
	at org.eclipse.kuksa.testing.HonoApiTest.removeTenant(HonoApiTest.java:391)
	at org.eclipse.kuksa.testing.HonoApiTest.clean(HonoApiTest.java:77)

[INFO] Running org.eclipse.kuksa.testing.HawkBitTargetApiTest
2020-01-09 02:38:28.187  INFO 433 --- [           main] trationDelegate$BeanPostProcessorChecker : Bean 'org.springframework.cloud.autoconfigure.ConfigurationPropertiesRebinderAutoConfiguration' of type [org.springframework.cloud.autoconfigure.ConfigurationPropertiesRebinderAutoConfiguration$$EnhancerBySpringCGLIB$$83cff4a8] is not eligible for getting processed by all BeanPostProcessors (for example: not eligible for auto-proxying)

  .   ____          _            __ _ _
 /\\ / ___'_ __ _ _(_)_ __  __ _ \ \ \ \
( ( )\___ | '_ | '_| | '_ \/ _` | \ \ \ \
 \\/  ___)| |_)| | | | | || (_| |  ) ) ) )
  '  |____| .__|_| |_|_| |_\__, | / / / /
 =========|_|==============|___/=/_/_/_/
 :: Spring Boot ::        (v2.1.0.RELEASE)

cleaning UP
cleaning UP
cleaning UP
cleaning UP
cleaning UP
cleaning UP
[ERROR] Tests run: 6, Failures: 0, Errors: 6, Skipped: 0, Time elapsed: 0.317 s <<< FAILURE! - in org.eclipse.kuksa.testing.HawkBitTargetApiTest
[ERROR] testCreateTarget(org.eclipse.kuksa.testing.HawkBitTargetApiTest)  Time elapsed: 0.111 s  <<< ERROR!
org.springframework.web.client.ResourceAccessException: I/O error on POST request for "http://hawkbit-appstacle.westeurope.cloudapp.azure.com:8080/rest/v1/targets": hawkbit-appstacle.westeurope.cloudapp.azure.com; nested exception is java.net.UnknownHostException: hawkbit-appstacle.westeurope.cloudapp.azure.com
	at org.eclipse.kuksa.testing.HawkBitTargetApiTest.createTarget(HawkBitTargetApiTest.java:92)
	at org.eclipse.kuksa.testing.HawkBitTargetApiTest.testSetup(HawkBitTargetApiTest.java:61)
Caused by: java.net.UnknownHostException: hawkbit-appstacle.westeurope.cloudapp.azure.com
	at org.eclipse.kuksa.testing.HawkBitTargetApiTest.createTarget(HawkBitTargetApiTest.java:92)
	at org.eclipse.kuksa.testing.HawkBitTargetApiTest.testSetup(HawkBitTargetApiTest.java:61)

[ERROR] testGetTargetActions(org.eclipse.kuksa.testing.HawkBitTargetApiTest)  Time elapsed: 0.005 s  <<< ERROR!
org.springframework.web.client.ResourceAccessException: I/O error on POST request for "http://hawkbit-appstacle.westeurope.cloudapp.azure.com:8080/rest/v1/targets": hawkbit-appstacle.westeurope.cloudapp.azure.com; nested exception is java.net.UnknownHostException: hawkbit-appstacle.westeurope.cloudapp.azure.com
	at org.eclipse.kuksa.testing.HawkBitTargetApiTest.createTarget(HawkBitTargetApiTest.java:92)
	at org.eclipse.kuksa.testing.HawkBitTargetApiTest.testSetup(HawkBitTargetApiTest.java:61)
Caused by: java.net.UnknownHostException: hawkbit-appstacle.westeurope.cloudapp.azure.com
	at org.eclipse.kuksa.testing.HawkBitTargetApiTest.createTarget(HawkBitTargetApiTest.java:92)
	at org.eclipse.kuksa.testing.HawkBitTargetApiTest.testSetup(HawkBitTargetApiTest.java:61)

[ERROR] testDeleteTarget(org.eclipse.kuksa.testing.HawkBitTargetApiTest)  Time elapsed: 0.005 s  <<< ERROR!
org.springframework.web.client.ResourceAccessException: I/O error on POST request for "http://hawkbit-appstacle.westeurope.cloudapp.azure.com:8080/rest/v1/targets": hawkbit-appstacle.westeurope.cloudapp.azure.com; nested exception is java.net.UnknownHostException: hawkbit-appstacle.westeurope.cloudapp.azure.com
	at org.eclipse.kuksa.testing.HawkBitTargetApiTest.createTarget(HawkBitTargetApiTest.java:92)
	at org.eclipse.kuksa.testing.HawkBitTargetApiTest.testSetup(HawkBitTargetApiTest.java:61)
Caused by: java.net.UnknownHostException: hawkbit-appstacle.westeurope.cloudapp.azure.com
	at org.eclipse.kuksa.testing.HawkBitTargetApiTest.createTarget(HawkBitTargetApiTest.java:92)
	at org.eclipse.kuksa.testing.HawkBitTargetApiTest.testSetup(HawkBitTargetApiTest.java:61)

[ERROR] testEditTarget(org.eclipse.kuksa.testing.HawkBitTargetApiTest)  Time elapsed: 0.005 s  <<< ERROR!
org.springframework.web.client.ResourceAccessException: I/O error on POST request for "http://hawkbit-appstacle.westeurope.cloudapp.azure.com:8080/rest/v1/targets": hawkbit-appstacle.westeurope.cloudapp.azure.com; nested exception is java.net.UnknownHostException: hawkbit-appstacle.westeurope.cloudapp.azure.com
	at org.eclipse.kuksa.testing.HawkBitTargetApiTest.createTarget(HawkBitTargetApiTest.java:92)
	at org.eclipse.kuksa.testing.HawkBitTargetApiTest.testSetup(HawkBitTargetApiTest.java:61)
Caused by: java.net.UnknownHostException: hawkbit-appstacle.westeurope.cloudapp.azure.com
	at org.eclipse.kuksa.testing.HawkBitTargetApiTest.createTarget(HawkBitTargetApiTest.java:92)
	at org.eclipse.kuksa.testing.HawkBitTargetApiTest.testSetup(HawkBitTargetApiTest.java:61)

[ERROR] testGetAllTargets(org.eclipse.kuksa.testing.HawkBitTargetApiTest)  Time elapsed: 0.009 s  <<< ERROR!
org.springframework.web.client.ResourceAccessException: I/O error on POST request for "http://hawkbit-appstacle.westeurope.cloudapp.azure.com:8080/rest/v1/targets": hawkbit-appstacle.westeurope.cloudapp.azure.com; nested exception is java.net.UnknownHostException: hawkbit-appstacle.westeurope.cloudapp.azure.com
	at org.eclipse.kuksa.testing.HawkBitTargetApiTest.createTarget(HawkBitTargetApiTest.java:92)
	at org.eclipse.kuksa.testing.HawkBitTargetApiTest.testSetup(HawkBitTargetApiTest.java:61)
Caused by: java.net.UnknownHostException: hawkbit-appstacle.westeurope.cloudapp.azure.com
	at org.eclipse.kuksa.testing.HawkBitTargetApiTest.createTarget(HawkBitTargetApiTest.java:92)
	at org.eclipse.kuksa.testing.HawkBitTargetApiTest.testSetup(HawkBitTargetApiTest.java:61)

[ERROR] testGetTarget(org.eclipse.kuksa.testing.HawkBitTargetApiTest)  Time elapsed: 0.011 s  <<< ERROR!
org.springframework.web.client.ResourceAccessException: I/O error on POST request for "http://hawkbit-appstacle.westeurope.cloudapp.azure.com:8080/rest/v1/targets": hawkbit-appstacle.westeurope.cloudapp.azure.com; nested exception is java.net.UnknownHostException: hawkbit-appstacle.westeurope.cloudapp.azure.com
	at org.eclipse.kuksa.testing.HawkBitTargetApiTest.createTarget(HawkBitTargetApiTest.java:92)
	at org.eclipse.kuksa.testing.HawkBitTargetApiTest.testSetup(HawkBitTargetApiTest.java:61)
Caused by: java.net.UnknownHostException: hawkbit-appstacle.westeurope.cloudapp.azure.com
	at org.eclipse.kuksa.testing.HawkBitTargetApiTest.createTarget(HawkBitTargetApiTest.java:92)
	at org.eclipse.kuksa.testing.HawkBitTargetApiTest.testSetup(HawkBitTargetApiTest.java:61)

[INFO] 
[INFO] Results:
[INFO] 
[ERROR] Errors: 
[ERROR]   HawkBitTargetApiTest>AbstractTestCase.initialize:97->testSetup:61->createTarget:92->AbstractTestCase.executeApiCall:167 » ResourceAccess
[ERROR]   HawkBitTargetApiTest>AbstractTestCase.initialize:97->testSetup:61->createTarget:92->AbstractTestCase.executeApiCall:167 » ResourceAccess
[ERROR]   HawkBitTargetApiTest>AbstractTestCase.initialize:97->testSetup:61->createTarget:92->AbstractTestCase.executeApiCall:167 » ResourceAccess
[ERROR]   HawkBitTargetApiTest>AbstractTestCase.initialize:97->testSetup:61->createTarget:92->AbstractTestCase.executeApiCall:167 » ResourceAccess
[ERROR]   HawkBitTargetApiTest>AbstractTestCase.initialize:97->testSetup:61->createTarget:92->AbstractTestCase.executeApiCall:167 » ResourceAccess
[ERROR]   HawkBitTargetApiTest>AbstractTestCase.initialize:97->testSetup:61->createTarget:92->AbstractTestCase.executeApiCall:167 » ResourceAccess
[ERROR] org.eclipse.kuksa.testing.HonoApiTest.org.eclipse.kuksa.testing.HonoApiTest
[ERROR]   Run 1: HonoApiTest.setup:67->createTenant:363->AbstractTestCase.executeApiCall:167 » ResourceAccess
[ERROR]   Run 2: HonoApiTest.clean:77->removeTenant:391->AbstractTestCase.executeApiCall:167 » ResourceAccess
[INFO] 
[ERROR]   SmallIntegrationTest.installationTest:376->AbstractTestCase.executeApiCall:167 » ResourceAccess
[ERROR]   SmallIntegrationTest.integrationSetup:119->createUser:402->AbstractTestCase.executeApiCall:167 » ResourceAccess
[ERROR]   AppStoreAppTest>AbstractTestCase.initialize:97->testSetup:52->AbstractAppStoreTest.checkAppExists:304->AbstractTestCase.executeApiCall:167 » ResourceAccess
[ERROR]   AppStoreAppTest>AbstractTestCase.initialize:97->testSetup:52->AbstractAppStoreTest.checkAppExists:304->AbstractTestCase.executeApiCall:167 » ResourceAccess
[ERROR]   AppStoreAppTest>AbstractTestCase.initialize:97->testSetup:52->AbstractAppStoreTest.checkAppExists:304->AbstractTestCase.executeApiCall:167 » ResourceAccess
[ERROR]   AppStoreAppTest>AbstractTestCase.initialize:97->testSetup:52->AbstractAppStoreTest.checkAppExists:304->AbstractTestCase.executeApiCall:167 » ResourceAccess
[ERROR]   AppStoreAppTest>AbstractTestCase.initialize:97->testSetup:52->AbstractAppStoreTest.checkAppExists:304->AbstractTestCase.executeApiCall:167 » ResourceAccess
[ERROR]   AppStoreAppTest>AbstractTestCase.initialize:97->testSetup:52->AbstractAppStoreTest.checkAppExists:304->AbstractTestCase.executeApiCall:167 » ResourceAccess
[ERROR]   AppStoreAppTest>AbstractTestCase.initialize:97->testSetup:52->AbstractAppStoreTest.checkAppExists:304->AbstractTestCase.executeApiCall:167 » ResourceAccess
[ERROR]   AppStoreAppTest>AbstractTestCase.initialize:97->testSetup:52->AbstractAppStoreTest.checkAppExists:304->AbstractTestCase.executeApiCall:167 » ResourceAccess
[ERROR]   AppStoreAppTest>AbstractTestCase.initialize:97->testSetup:52->AbstractAppStoreTest.checkAppExists:304->AbstractTestCase.executeApiCall:167 » ResourceAccess
[ERROR]   AppStoreAppTest>AbstractTestCase.initialize:97->testSetup:52->AbstractAppStoreTest.checkAppExists:304->AbstractTestCase.executeApiCall:167 » ResourceAccess
[ERROR]   AppStoreAppTest>AbstractTestCase.initialize:97->testSetup:52->AbstractAppStoreTest.checkAppExists:304->AbstractTestCase.executeApiCall:167 » ResourceAccess
[ERROR]   AppStoreCategoryTest>AbstractTestCase.initialize:97->testSetup:40->AbstractAppStoreTest.checkCategoryExists:269->AbstractTestCase.executeApiCall:167 » ResourceAccess
[ERROR]   AppStoreCategoryTest>AbstractTestCase.initialize:97->testSetup:40->AbstractAppStoreTest.checkCategoryExists:269->AbstractTestCase.executeApiCall:167 » ResourceAccess
[ERROR]   AppStoreCategoryTest>AbstractTestCase.initialize:97->testSetup:40->AbstractAppStoreTest.checkCategoryExists:269->AbstractTestCase.executeApiCall:167 » ResourceAccess
[ERROR]   AppStoreCategoryTest>AbstractTestCase.initialize:97->testSetup:40->AbstractAppStoreTest.checkCategoryExists:269->AbstractTestCase.executeApiCall:167 » ResourceAccess
[ERROR]   AppStoreCategoryTest>AbstractTestCase.initialize:97->testSetup:40->AbstractAppStoreTest.checkCategoryExists:269->AbstractTestCase.executeApiCall:167 » ResourceAccess
[ERROR]   AppStoreOemTest.testCreateOem:81->AbstractTestCase.executeApiCall:167 » ResourceAccess
[ERROR]   AppStoreOemTest.testGetOem:102->createOem:56->AbstractTestCase.executeApiCall:167 » ResourceAccess
[ERROR]   AppStoreUserTest>AbstractTestCase.initialize:97->testSetup:38->AbstractAppStoreTest.checkUsernameExists:233->AbstractTestCase.executeApiCall:167 » ResourceAccess
[ERROR]   AppStoreUserTest>AbstractTestCase.initialize:97->testSetup:38->AbstractAppStoreTest.checkUsernameExists:233->AbstractTestCase.executeApiCall:167 » ResourceAccess
[ERROR]   AppStoreUserTest>AbstractTestCase.initialize:97->testSetup:38->AbstractAppStoreTest.checkUsernameExists:233->AbstractTestCase.executeApiCall:167 » ResourceAccess
[ERROR]   AppStoreUserTest>AbstractTestCase.initialize:97->testSetup:38->AbstractAppStoreTest.checkUsernameExists:233->AbstractTestCase.executeApiCall:167 » ResourceAccess
[ERROR]   AppStoreUserTest>AbstractTestCase.initialize:97->testSetup:38->AbstractAppStoreTest.checkUsernameExists:233->AbstractTestCase.executeApiCall:167 » ResourceAccess
[ERROR]   AppStoreUserTest>AbstractTestCase.initialize:97->testSetup:38->AbstractAppStoreTest.checkUsernameExists:233->AbstractTestCase.executeApiCall:167 » ResourceAccess
[INFO] 
[ERROR] Tests run: 33, Failures: 0, Errors: 33, Skipped: 0
[INFO] 
[INFO] ------------------------------------------------------------------------
[INFO] BUILD FAILURE
[INFO] ------------------------------------------------------------------------
[INFO] Total time:  51.818 s
[INFO] Finished at: 2020-01-09T02:38:28Z
[INFO] ------------------------------------------------------------------------
[ERROR] Failed to execute goal org.apache.maven.plugins:maven-surefire-plugin:3.0.0-M1:test (default-test) on project kuksa.testing: There are test failures.
[ERROR] 
[ERROR] Please refer to /home/jenkins/agent/workspace/run-kuksa-tests/testing/target/surefire-reports for the individual test results.
[ERROR] Please refer to dump files (if any exist) [date].dump, [date]-jvmRun[N].dump and [date].dumpstream.
[ERROR] -> [Help 1]
[ERROR] 
[ERROR] To see the full stack trace of the errors, re-run Maven with the -e switch.
[ERROR] Re-run Maven using the -X switch to enable full debug logging.
[ERROR] 
[ERROR] For more information about the errors and possible solutions, please read the following articles:
[ERROR] [Help 1] http://cwiki.apache.org/confluence/display/MAVEN/MojoFailureException
[Pipeline] }
[Pipeline] // stage
[Pipeline] stage
[Pipeline] { (Declarative: Post Actions)
[Pipeline] mail
[Pipeline] }
[Pipeline] // stage
[Pipeline] }
[Pipeline] // withEnv
[Pipeline] }
[Pipeline] // node
[Pipeline] End of Pipeline
ERROR: script returned exit code 1
Finished: FAILURE