Console Output

Skipping 27,797 KB.. Full Log
[INFO] skip non existing resourceDirectory /home/jenkins/agent/workspace/develop/extras/foreignkeys/src/test/resources
[INFO] 
[INFO] --- maven-compiler-plugin:3.6.1:testCompile (default-testCompile) @ kapua-foreignkeys ---
[INFO] No sources to compile
[INFO] 
[INFO] --- maven-surefire-plugin:2.20:test (default-test) @ kapua-foreignkeys ---
[INFO] No tests to run.
[INFO] 
[INFO] --- jacoco-maven-plugin:0.7.9:report (default-report) @ kapua-foreignkeys ---
[INFO] Skipping JaCoCo execution due to missing execution data file.
[INFO] 
[INFO] --- maven-jar-plugin:2.4:jar (default-jar) @ kapua-foreignkeys ---
[INFO] 
[INFO] --- maven-source-plugin:2.4:jar-no-fork (attach-sources) @ kapua-foreignkeys ---
[INFO] 
[INFO] --- jacoco-extras:0.1.1:xml (default) @ kapua-foreignkeys ---
[INFO] 
[INFO] ----------------< org.eclipse.kapua:kapua-es-migrator >-----------------
[INFO] Building kapua-es-migrator 1.5.0-SNAPSHOT                      [159/190]
[INFO] --------------------------------[ jar ]---------------------------------
[INFO] 
[INFO] --- maven-checkstyle-plugin:2.17:check (checkstyle-check) @ kapua-es-migrator ---
[INFO] 
[INFO] --- jacoco-maven-plugin:0.7.9:prepare-agent (default-prepare-agent) @ kapua-es-migrator ---
[INFO] argLine set to -javaagent:/home/jenkins/agent/workspace/develop/.repository/org/jacoco/org.jacoco.agent/0.7.9/org.jacoco.agent-0.7.9-runtime.jar=destfile=/home/jenkins/agent/workspace/develop/extras/es-migrator/target/jacoco.exec
[INFO] 
[INFO] --- maven-resources-plugin:3.0.2:resources (default-resources) @ kapua-es-migrator ---
[INFO] Using 'UTF-8' encoding to copy filtered resources.
[INFO] Copying 4 resources
[INFO] 
[INFO] --- maven-compiler-plugin:3.6.1:compile (default-compile) @ kapua-es-migrator ---
[INFO] Nothing to compile - all classes are up to date
[INFO] 
[INFO] --- maven-resources-plugin:3.0.2:testResources (default-testResources) @ kapua-es-migrator ---
[INFO] Using 'UTF-8' encoding to copy filtered resources.
[INFO] skip non existing resourceDirectory /home/jenkins/agent/workspace/develop/extras/es-migrator/src/test/resources
[INFO] 
[INFO] --- maven-compiler-plugin:3.6.1:testCompile (default-testCompile) @ kapua-es-migrator ---
[INFO] No sources to compile
[INFO] 
[INFO] --- maven-surefire-plugin:2.20:test (default-test) @ kapua-es-migrator ---
[INFO] No tests to run.
[INFO] 
[INFO] --- jacoco-maven-plugin:0.7.9:report (default-report) @ kapua-es-migrator ---
[INFO] Skipping JaCoCo execution due to missing execution data file.
[INFO] 
[INFO] --- maven-jar-plugin:2.4:jar (default-jar) @ kapua-es-migrator ---
[INFO] 
[INFO] --- maven-source-plugin:2.4:jar-no-fork (attach-sources) @ kapua-es-migrator ---
[INFO] Building jar: /home/jenkins/agent/workspace/develop/extras/es-migrator/target/kapua-es-migrator-1.5.0-SNAPSHOT-sources.jar
[INFO] 
[INFO] --- maven-shade-plugin:3.0.0:shade (default) @ kapua-es-migrator ---
[INFO] Including commons-configuration:commons-configuration:jar:1.9 in the shaded jar.
[INFO] Including commons-lang:commons-lang:jar:2.6 in the shaded jar.
[INFO] Including commons-io:commons-io:jar:2.4 in the shaded jar.
[INFO] Including commons-beanutils:commons-beanutils:jar:1.9.4 in the shaded jar.
[INFO] Including commons-logging:commons-logging:jar:1.2 in the shaded jar.
[INFO] Including commons-collections:commons-collections:jar:3.2.2 in the shaded jar.
[INFO] Including com.fasterxml.jackson.core:jackson-databind:jar:2.12.2 in the shaded jar.
[INFO] Including com.fasterxml.jackson.core:jackson-annotations:jar:2.12.2 in the shaded jar.
[INFO] Including com.fasterxml.jackson.core:jackson-core:jar:2.12.2 in the shaded jar.
[INFO] Including org.elasticsearch.client:elasticsearch-rest-high-level-client:jar:6.8.7 in the shaded jar.
[INFO] Including org.elasticsearch:elasticsearch:jar:6.8.7 in the shaded jar.
[INFO] Including org.elasticsearch:elasticsearch-core:jar:6.8.7 in the shaded jar.
[INFO] Including org.elasticsearch:elasticsearch-secure-sm:jar:6.8.7 in the shaded jar.
[INFO] Including org.elasticsearch:elasticsearch-x-content:jar:6.8.7 in the shaded jar.
[INFO] Including com.fasterxml.jackson.dataformat:jackson-dataformat-smile:jar:2.8.11 in the shaded jar.
[INFO] Including com.fasterxml.jackson.dataformat:jackson-dataformat-yaml:jar:2.8.11 in the shaded jar.
[INFO] Including com.fasterxml.jackson.dataformat:jackson-dataformat-cbor:jar:2.8.11 in the shaded jar.
[INFO] Including org.apache.lucene:lucene-core:jar:7.7.2 in the shaded jar.
[INFO] Including org.apache.lucene:lucene-analyzers-common:jar:7.7.2 in the shaded jar.
[INFO] Including org.apache.lucene:lucene-backward-codecs:jar:7.7.2 in the shaded jar.
[INFO] Including org.apache.lucene:lucene-grouping:jar:7.7.2 in the shaded jar.
[INFO] Including org.apache.lucene:lucene-highlighter:jar:7.7.2 in the shaded jar.
[INFO] Including org.apache.lucene:lucene-join:jar:7.7.2 in the shaded jar.
[INFO] Including org.apache.lucene:lucene-memory:jar:7.7.2 in the shaded jar.
[INFO] Including org.apache.lucene:lucene-misc:jar:7.7.2 in the shaded jar.
[INFO] Including org.apache.lucene:lucene-queries:jar:7.7.2 in the shaded jar.
[INFO] Including org.apache.lucene:lucene-queryparser:jar:7.7.2 in the shaded jar.
[INFO] Including org.apache.lucene:lucene-sandbox:jar:7.7.2 in the shaded jar.
[INFO] Including org.apache.lucene:lucene-spatial:jar:7.7.2 in the shaded jar.
[INFO] Including org.apache.lucene:lucene-spatial-extras:jar:7.7.2 in the shaded jar.
[INFO] Including org.apache.lucene:lucene-spatial3d:jar:7.7.2 in the shaded jar.
[INFO] Including org.apache.lucene:lucene-suggest:jar:7.7.2 in the shaded jar.
[INFO] Including org.elasticsearch:elasticsearch-cli:jar:6.8.7 in the shaded jar.
[INFO] Including net.sf.jopt-simple:jopt-simple:jar:5.0.2 in the shaded jar.
[INFO] Including com.carrotsearch:hppc:jar:0.7.1 in the shaded jar.
[INFO] Including com.tdunning:t-digest:jar:3.2 in the shaded jar.
[INFO] Including org.hdrhistogram:HdrHistogram:jar:2.1.9 in the shaded jar.
[INFO] Including org.elasticsearch:jna:jar:4.5.1 in the shaded jar.
[INFO] Including org.elasticsearch.client:elasticsearch-rest-client:jar:6.8.7 in the shaded jar.
[INFO] Including org.apache.httpcomponents:httpclient:jar:4.5.13 in the shaded jar.
[INFO] Including org.apache.httpcomponents:httpcore:jar:4.4.5 in the shaded jar.
[INFO] Including org.apache.httpcomponents:httpasyncclient:jar:4.1.2 in the shaded jar.
[INFO] Including org.apache.httpcomponents:httpcore-nio:jar:4.4.5 in the shaded jar.
[INFO] Including commons-codec:commons-codec:jar:1.15 in the shaded jar.
[INFO] Including org.elasticsearch.plugin:parent-join-client:jar:6.8.7 in the shaded jar.
[INFO] Including org.elasticsearch.plugin:aggs-matrix-stats-client:jar:6.8.7 in the shaded jar.
[INFO] Including org.elasticsearch.plugin:rank-eval-client:jar:6.8.7 in the shaded jar.
[INFO] Including org.elasticsearch.plugin:lang-mustache-client:jar:6.8.7 in the shaded jar.
[INFO] Including com.github.spullara.mustache.java:compiler:jar:0.9.3 in the shaded jar.
[INFO] Including org.eclipse.kapua:kapua-commons:jar:1.5.0-SNAPSHOT in the shaded jar.
[INFO] Including org.eclipse.kapua:kapua-account-api:jar:1.5.0-SNAPSHOT in the shaded jar.
[INFO] Including org.eclipse.kapua:kapua-service-api:jar:1.5.0-SNAPSHOT in the shaded jar.
[INFO] Including javax.annotation:javax.annotation-api:jar:1.2 in the shaded jar.
[INFO] Including org.eclipse.kapua:kapua-security-authentication-api:jar:1.5.0-SNAPSHOT in the shaded jar.
[INFO] Including com.google.guava:guava:jar:30.1-jre in the shaded jar.
[INFO] Including com.google.guava:failureaccess:jar:1.0.1 in the shaded jar.
[INFO] Including com.google.guava:listenablefuture:jar:9999.0-empty-to-avoid-conflict-with-guava in the shaded jar.
[INFO] Including com.google.inject:guice:jar:4.1.0 in the shaded jar.
[INFO] Including javax.inject:javax.inject:jar:1 in the shaded jar.
[INFO] Including aopalliance:aopalliance:jar:1.0 in the shaded jar.
[INFO] Including io.dropwizard.metrics:metrics-core:jar:3.2.2 in the shaded jar.
[INFO] Including joda-time:joda-time:jar:2.9.4 in the shaded jar.
[INFO] Including org.apache.commons:commons-lang3:jar:3.4 in the shaded jar.
[INFO] Including org.apache.commons:commons-pool2:jar:2.3 in the shaded jar.
[INFO] Including org.apache.qpid:qpid-jms-client:jar:0.40.0 in the shaded jar.
[INFO] Including org.apache.geronimo.specs:geronimo-jms_2.0_spec:jar:1.0-alpha-2 in the shaded jar.
[INFO] Including org.apache.qpid:proton-j:jar:0.31.0 in the shaded jar.
[INFO] Including io.netty:netty-buffer:jar:4.1.60.Final in the shaded jar.
[INFO] Including io.netty:netty-common:jar:4.1.60.Final in the shaded jar.
[INFO] Including io.netty:netty-handler:jar:4.1.60.Final in the shaded jar.
[INFO] Including io.netty:netty-resolver:jar:4.1.60.Final in the shaded jar.
[INFO] Including io.netty:netty-codec:jar:4.1.60.Final in the shaded jar.
[INFO] Including io.netty:netty-transport:jar:4.1.60.Final in the shaded jar.
[INFO] Including io.netty:netty-transport-native-epoll:jar:linux-x86_64:4.1.60.Final in the shaded jar.
[INFO] Including io.netty:netty-transport-native-unix-common:jar:4.1.60.Final in the shaded jar.
[INFO] Including io.netty:netty-transport-native-kqueue:jar:osx-x86_64:4.1.60.Final in the shaded jar.
[INFO] Including io.netty:netty-codec-http:jar:4.1.60.Final in the shaded jar.
[INFO] Including org.eclipse.persistence:org.eclipse.persistence.jpa:jar:2.7.7 in the shaded jar.
[INFO] Including org.eclipse.persistence:jakarta.persistence:jar:2.2.3 in the shaded jar.
[INFO] Including org.eclipse.persistence:org.eclipse.persistence.asm:jar:2.7.7 in the shaded jar.
[INFO] Including org.eclipse.persistence:org.eclipse.persistence.antlr:jar:2.7.7 in the shaded jar.
[INFO] Including org.eclipse.persistence:org.eclipse.persistence.jpa.jpql:jar:2.7.7 in the shaded jar.
[INFO] Including org.eclipse.persistence:org.eclipse.persistence.core:jar:2.7.7 in the shaded jar.
[INFO] Including org.eclipse.persistence:org.eclipse.persistence.moxy:jar:2.7.7 in the shaded jar.
[INFO] Including org.eclipse.persistence:org.eclipse.persistence.extension:jar:2.7.7 in the shaded jar.
[INFO] Including org.liquibase:liquibase-core:jar:3.6.3 in the shaded jar.
[INFO] Including org.yaml:snakeyaml:jar:1.28 in the shaded jar.
[INFO] Including org.reflections:reflections:jar:0.9.10 in the shaded jar.
[INFO] Including org.javassist:javassist:jar:3.19.0-GA in the shaded jar.
[INFO] Including com.google.code.findbugs:annotations:jar:2.0.1 in the shaded jar.
[INFO] Including javax.cache:cache-api:jar:1.1.1 in the shaded jar.
[INFO] Including org.slf4j:slf4j-api:jar:1.7.30 in the shaded jar.
[INFO] Including org.apache.logging.log4j:log4j-to-slf4j:jar:2.14.0 in the shaded jar.
[INFO] Including org.apache.logging.log4j:log4j-api:jar:2.14.0 in the shaded jar.
[INFO] Including ch.qos.logback:logback-classic:jar:1.2.3 in the shaded jar.
[INFO] Including ch.qos.logback:logback-core:jar:1.2.3 in the shaded jar.
[INFO] Including org.eclipse.kapua:kapua-datastore-internal:jar:1.5.0-SNAPSHOT in the shaded jar.
[INFO] Including org.eclipse.kapua:kapua-datastore-api:jar:1.5.0-SNAPSHOT in the shaded jar.
[INFO] Including org.eclipse.kapua:kapua-message-api:jar:1.5.0-SNAPSHOT in the shaded jar.
[INFO] Including org.eclipse.kapua:kapua-service-storable-api:jar:1.5.0-SNAPSHOT in the shaded jar.
[INFO] Including org.eclipse.kapua:kapua-security-authorization-api:jar:1.5.0-SNAPSHOT in the shaded jar.
[INFO] Including org.eclipse.kapua:kapua-user-api:jar:1.5.0-SNAPSHOT in the shaded jar.
[INFO] Including org.eclipse.kapua:kapua-message-internal:jar:1.5.0-SNAPSHOT in the shaded jar.
[INFO] Including com.sun.xml.bind:jaxb-impl:jar:2.2.5 in the shaded jar.
[INFO] Including javax.validation:validation-api:jar:1.1.0.Final in the shaded jar.
[INFO] Including org.eclipse.kapua:kapua-service-elasticsearch-client-api:jar:1.5.0-SNAPSHOT in the shaded jar.
[INFO] Including org.eclipse.kapua:kapua-service-storable-internal:jar:1.5.0-SNAPSHOT in the shaded jar.
[WARNING] jackson-annotations-2.12.2.jar, jackson-databind-2.12.2.jar, jackson-core-2.12.2.jar define 1 overlapping classes: 
[WARNING]   - module-info
[WARNING] maven-shade-plugin has detected that some class files are
[WARNING] present in two or more JARs. When this happens, only one
[WARNING] single version of the class is copied to the uber jar.
[WARNING] Usually this is not harmful and you can skip these warnings,
[WARNING] otherwise try to manually exclude artifacts based on
[WARNING] mvn dependency:tree -Ddetail=true and the above output.
[WARNING] See http://maven.apache.org/plugins/maven-shade-plugin/
[INFO] Attaching shaded artifact.
[INFO] 
[INFO] --- jacoco-extras:0.1.1:xml (default) @ kapua-es-migrator ---
[INFO] 
[INFO] ---------------< org.eclipse.kapua:kapua-job-engine-app >---------------
[INFO] Building kapua-job-engine-app 1.5.0-SNAPSHOT                   [160/190]
[INFO] --------------------------------[ pom ]---------------------------------
[INFO] 
[INFO] --- maven-checkstyle-plugin:2.17:check (checkstyle-check) @ kapua-job-engine-app ---
[INFO] 
[INFO] --- jacoco-maven-plugin:0.7.9:prepare-agent (default-prepare-agent) @ kapua-job-engine-app ---
[INFO] argLine set to -javaagent:/home/jenkins/agent/workspace/develop/.repository/org/jacoco/org.jacoco.agent/0.7.9/org.jacoco.agent-0.7.9-runtime.jar=destfile=/home/jenkins/agent/workspace/develop/job-engine/app/target/jacoco.exec
[INFO] 
[INFO] --- jacoco-maven-plugin:0.7.9:report (default-report) @ kapua-job-engine-app ---
[INFO] Skipping JaCoCo execution due to missing execution data file.
[INFO] 
[INFO] --- maven-source-plugin:2.4:jar-no-fork (attach-sources) @ kapua-job-engine-app ---
[INFO] 
[INFO] --- jacoco-extras:0.1.1:xml (default) @ kapua-job-engine-app ---
[INFO] 
[INFO] ------------< org.eclipse.kapua:kapua-job-engine-app-core >-------------
[INFO] Building kapua-job-engine-app-core 1.5.0-SNAPSHOT              [161/190]
[INFO] --------------------------------[ jar ]---------------------------------
[INFO] 
[INFO] --- maven-checkstyle-plugin:2.17:check (checkstyle-check) @ kapua-job-engine-app-core ---
[INFO] 
[INFO] --- jacoco-maven-plugin:0.7.9:prepare-agent (default-prepare-agent) @ kapua-job-engine-app-core ---
[INFO] argLine set to -javaagent:/home/jenkins/agent/workspace/develop/.repository/org/jacoco/org.jacoco.agent/0.7.9/org.jacoco.agent-0.7.9-runtime.jar=destfile=/home/jenkins/agent/workspace/develop/job-engine/app/core/target/jacoco.exec
[INFO] 
[INFO] --- maven-resources-plugin:3.0.2:resources (default-resources) @ kapua-job-engine-app-core ---
[INFO] Using 'UTF-8' encoding to copy filtered resources.
[INFO] skip non existing resourceDirectory /home/jenkins/agent/workspace/develop/job-engine/app/core/src/main/resources
[INFO] 
[INFO] --- maven-compiler-plugin:3.6.1:compile (default-compile) @ kapua-job-engine-app-core ---
[INFO] Nothing to compile - all classes are up to date
[INFO] 
[INFO] --- maven-resources-plugin:3.0.2:testResources (default-testResources) @ kapua-job-engine-app-core ---
[INFO] Using 'UTF-8' encoding to copy filtered resources.
[INFO] skip non existing resourceDirectory /home/jenkins/agent/workspace/develop/job-engine/app/core/src/test/resources
[INFO] 
[INFO] --- maven-compiler-plugin:3.6.1:testCompile (default-testCompile) @ kapua-job-engine-app-core ---
[INFO] No sources to compile
[INFO] 
[INFO] --- maven-surefire-plugin:2.20:test (default-test) @ kapua-job-engine-app-core ---
[INFO] No tests to run.
[INFO] 
[INFO] --- jacoco-maven-plugin:0.7.9:report (default-report) @ kapua-job-engine-app-core ---
[INFO] Skipping JaCoCo execution due to missing execution data file.
[INFO] 
[INFO] --- maven-jar-plugin:2.4:jar (default-jar) @ kapua-job-engine-app-core ---
[INFO] 
[INFO] --- maven-source-plugin:2.4:jar-no-fork (attach-sources) @ kapua-job-engine-app-core ---
[INFO] Building jar: /home/jenkins/agent/workspace/develop/job-engine/app/core/target/kapua-job-engine-app-core-1.5.0-SNAPSHOT-sources.jar
[INFO] 
[INFO] --- jacoco-extras:0.1.1:xml (default) @ kapua-job-engine-app-core ---
[INFO] 
[INFO] ----------< org.eclipse.kapua:kapua-job-engine-app-resources >----------
[INFO] Building kapua-job-engine-app-resources 1.5.0-SNAPSHOT         [162/190]
[INFO] --------------------------------[ jar ]---------------------------------
[INFO] 
[INFO] --- maven-checkstyle-plugin:2.17:check (checkstyle-check) @ kapua-job-engine-app-resources ---
[INFO] 
[INFO] --- jacoco-maven-plugin:0.7.9:prepare-agent (default-prepare-agent) @ kapua-job-engine-app-resources ---
[INFO] argLine set to -javaagent:/home/jenkins/agent/workspace/develop/.repository/org/jacoco/org.jacoco.agent/0.7.9/org.jacoco.agent-0.7.9-runtime.jar=destfile=/home/jenkins/agent/workspace/develop/job-engine/app/resources/target/jacoco.exec
[INFO] 
[INFO] --- maven-resources-plugin:3.0.2:resources (default-resources) @ kapua-job-engine-app-resources ---
[INFO] Using 'UTF-8' encoding to copy filtered resources.
[INFO] Copying 5 resources
[INFO] 
[INFO] --- maven-compiler-plugin:3.6.1:compile (default-compile) @ kapua-job-engine-app-resources ---
[INFO] Nothing to compile - all classes are up to date
[INFO] 
[INFO] --- maven-resources-plugin:3.0.2:testResources (default-testResources) @ kapua-job-engine-app-resources ---
[INFO] Using 'UTF-8' encoding to copy filtered resources.
[INFO] skip non existing resourceDirectory /home/jenkins/agent/workspace/develop/job-engine/app/resources/src/test/resources
[INFO] 
[INFO] --- maven-compiler-plugin:3.6.1:testCompile (default-testCompile) @ kapua-job-engine-app-resources ---
[INFO] No sources to compile
[INFO] 
[INFO] --- maven-surefire-plugin:2.20:test (default-test) @ kapua-job-engine-app-resources ---
[INFO] No tests to run.
[INFO] 
[INFO] --- jacoco-maven-plugin:0.7.9:report (default-report) @ kapua-job-engine-app-resources ---
[INFO] Skipping JaCoCo execution due to missing execution data file.
[INFO] 
[INFO] --- maven-jar-plugin:2.4:jar (default-jar) @ kapua-job-engine-app-resources ---
[INFO] 
[INFO] --- maven-source-plugin:2.4:jar-no-fork (attach-sources) @ kapua-job-engine-app-resources ---
[INFO] Building jar: /home/jenkins/agent/workspace/develop/job-engine/app/resources/target/kapua-job-engine-app-resources-1.5.0-SNAPSHOT-sources.jar
[INFO] 
[INFO] --- jacoco-extras:0.1.1:xml (default) @ kapua-job-engine-app-resources ---
[INFO] 
[INFO] -------------< org.eclipse.kapua:kapua-job-engine-app-web >-------------
[INFO] Building kapua-job-engine-app-web 1.5.0-SNAPSHOT               [163/190]
[INFO] --------------------------------[ war ]---------------------------------
[INFO] 
[INFO] --- maven-checkstyle-plugin:2.17:check (checkstyle-check) @ kapua-job-engine-app-web ---
[INFO] 
[INFO] --- jacoco-maven-plugin:0.7.9:prepare-agent (default-prepare-agent) @ kapua-job-engine-app-web ---
[INFO] argLine set to -javaagent:/home/jenkins/agent/workspace/develop/.repository/org/jacoco/org.jacoco.agent/0.7.9/org.jacoco.agent-0.7.9-runtime.jar=destfile=/home/jenkins/agent/workspace/develop/job-engine/app/web/target/jacoco.exec
[INFO] 
[INFO] --- maven-resources-plugin:3.0.2:resources (default-resources) @ kapua-job-engine-app-web ---
[INFO] Using 'UTF-8' encoding to copy filtered resources.
[INFO] Copying 3 resources
[INFO] 
[INFO] --- maven-compiler-plugin:3.6.1:compile (default-compile) @ kapua-job-engine-app-web ---
[INFO] Nothing to compile - all classes are up to date
[INFO] 
[INFO] --- maven-resources-plugin:3.0.2:testResources (default-testResources) @ kapua-job-engine-app-web ---
[INFO] Using 'UTF-8' encoding to copy filtered resources.
[INFO] skip non existing resourceDirectory /home/jenkins/agent/workspace/develop/job-engine/app/web/src/test/resources
[INFO] 
[INFO] --- maven-compiler-plugin:3.6.1:testCompile (default-testCompile) @ kapua-job-engine-app-web ---
[INFO] No sources to compile
[INFO] 
[INFO] --- maven-surefire-plugin:2.20:test (default-test) @ kapua-job-engine-app-web ---
[INFO] No tests to run.
[INFO] 
[INFO] --- jacoco-maven-plugin:0.7.9:report (default-report) @ kapua-job-engine-app-web ---
[INFO] Skipping JaCoCo execution due to missing execution data file.
[INFO] 
[INFO] --- maven-dependency-plugin:3.0.1:unpack (copy-jbatch-config) @ kapua-job-engine-app-web ---
[INFO] Configured Artifact: org.eclipse.kapua:kapua-job-engine-jbatch:?:jar
[INFO] Unpacking /home/jenkins/agent/workspace/develop/job-engine/jbatch/target/kapua-job-engine-jbatch-1.5.0-SNAPSHOT.jar to /home/jenkins/agent/workspace/develop/job-engine/app/web/target/job-engine-app/WEB-INF/classes with includes "**/batch-services.properties" and excludes ""
[INFO] 
[INFO] --- maven-war-plugin:3.0.0:war (default-war) @ kapua-job-engine-app-web ---
[INFO] Packaging webapp
[INFO] Assembling webapp [kapua-job-engine-app-web] in [/home/jenkins/agent/workspace/develop/job-engine/app/web/target/job-engine-app]
[INFO] Processing war project
[INFO] Copying webapp resources [/home/jenkins/agent/workspace/develop/job-engine/app/web/src/main/webapp]
[INFO] Webapp assembled in [206 msecs]
[INFO] Building war: /home/jenkins/agent/workspace/develop/job-engine/app/web/target/job-engine-app.war
[INFO] 
[INFO] --- maven-source-plugin:2.4:jar-no-fork (attach-sources) @ kapua-job-engine-app-web ---
[INFO] Building jar: /home/jenkins/agent/workspace/develop/job-engine/app/web/target/job-engine-app-sources.jar
[INFO] 
[INFO] --- jacoco-extras:0.1.1:xml (default) @ kapua-job-engine-app-web ---
[INFO] 
[INFO] -------------------< org.eclipse.kapua:kapua-client >-------------------
[INFO] Building kapua-client 1.5.0-SNAPSHOT                           [164/190]
[INFO] --------------------------------[ pom ]---------------------------------
[INFO] 
[INFO] --- maven-checkstyle-plugin:2.17:check (checkstyle-check) @ kapua-client ---
[INFO] 
[INFO] --- jacoco-maven-plugin:0.7.9:prepare-agent (default-prepare-agent) @ kapua-client ---
[INFO] argLine set to -javaagent:/home/jenkins/agent/workspace/develop/.repository/org/jacoco/org.jacoco.agent/0.7.9/org.jacoco.agent-0.7.9-runtime.jar=destfile=/home/jenkins/agent/workspace/develop/client/target/jacoco.exec
[INFO] 
[INFO] --- jacoco-maven-plugin:0.7.9:report (default-report) @ kapua-client ---
[INFO] Skipping JaCoCo execution due to missing execution data file.
[INFO] 
[INFO] --- maven-source-plugin:2.4:jar-no-fork (attach-sources) @ kapua-client ---
[INFO] 
[INFO] --- jacoco-extras:0.1.1:xml (default) @ kapua-client ---
[INFO] 
[INFO] ---------------< org.eclipse.kapua:kapua-client-gateway >---------------
[INFO] Building kapua-client-gateway 1.5.0-SNAPSHOT                   [165/190]
[INFO] --------------------------------[ pom ]---------------------------------
[INFO] 
[INFO] --- maven-checkstyle-plugin:2.17:check (checkstyle-check) @ kapua-client-gateway ---
[INFO] 
[INFO] --- jacoco-maven-plugin:0.7.9:prepare-agent (default-prepare-agent) @ kapua-client-gateway ---
[INFO] argLine set to -javaagent:/home/jenkins/agent/workspace/develop/.repository/org/jacoco/org.jacoco.agent/0.7.9/org.jacoco.agent-0.7.9-runtime.jar=destfile=/home/jenkins/agent/workspace/develop/client/gateway/target/jacoco.exec
[INFO] 
[INFO] --- jacoco-maven-plugin:0.7.9:report (default-report) @ kapua-client-gateway ---
[INFO] Skipping JaCoCo execution due to missing execution data file.
[INFO] 
[INFO] --- maven-source-plugin:2.4:jar-no-fork (attach-sources) @ kapua-client-gateway ---
[INFO] 
[INFO] --- jacoco-extras:0.1.1:xml (default) @ kapua-client-gateway ---
[INFO] 
[INFO] -------------< org.eclipse.kapua:kapua-client-gateway-api >-------------
[INFO] Building Eclipse Kapua :: Gateway Client :: API 1.5.0-SNAPSHOT [166/190]
[INFO] -------------------------------[ bundle ]-------------------------------
[INFO] 
[INFO] --- maven-checkstyle-plugin:2.17:check (checkstyle-check) @ kapua-client-gateway-api ---
[INFO] 
[INFO] --- jacoco-maven-plugin:0.7.9:prepare-agent (default-prepare-agent) @ kapua-client-gateway-api ---
[INFO] argLine set to -javaagent:/home/jenkins/agent/workspace/develop/.repository/org/jacoco/org.jacoco.agent/0.7.9/org.jacoco.agent-0.7.9-runtime.jar=destfile=/home/jenkins/agent/workspace/develop/client/gateway/api/target/jacoco.exec
[INFO] 
[INFO] --- maven-resources-plugin:3.0.2:resources (default-resources) @ kapua-client-gateway-api ---
[INFO] Using 'UTF-8' encoding to copy filtered resources.
[INFO] skip non existing resourceDirectory /home/jenkins/agent/workspace/develop/client/gateway/api/src/main/resources
[INFO] 
[INFO] --- maven-resources-plugin:3.0.2:copy-resources (process-about.html) @ kapua-client-gateway-api ---
[INFO] Using 'UTF-8' encoding to copy filtered resources.
[INFO] Copying 1 resource
[INFO] 
[INFO] --- maven-compiler-plugin:3.6.1:compile (default-compile) @ kapua-client-gateway-api ---
[INFO] Changes detected - recompiling the module!
[INFO] Compiling 16 source files to /home/jenkins/agent/workspace/develop/client/gateway/api/target/classes
[INFO] 
[INFO] --- maven-resources-plugin:3.0.2:testResources (default-testResources) @ kapua-client-gateway-api ---
[INFO] Using 'UTF-8' encoding to copy filtered resources.
[INFO] skip non existing resourceDirectory /home/jenkins/agent/workspace/develop/client/gateway/api/src/test/resources
[INFO] 
[INFO] --- maven-compiler-plugin:3.6.1:testCompile (default-testCompile) @ kapua-client-gateway-api ---
[INFO] Nothing to compile - all classes are up to date
[INFO] 
[INFO] --- maven-surefire-plugin:2.20:test (default-test) @ kapua-client-gateway-api ---
[INFO] 
[INFO] -------------------------------------------------------
[INFO]  T E S T S
[INFO] -------------------------------------------------------
[INFO] Running org.eclipse.kapua.client.gateway.TopicTest
[INFO] Tests run: 23, Failures: 0, Errors: 0, Skipped: 0, Time elapsed: 0.096 s - in org.eclipse.kapua.client.gateway.TopicTest
[INFO] Running org.eclipse.kapua.client.gateway.CredentialsTest
[INFO] Tests run: 13, Failures: 0, Errors: 0, Skipped: 0, Time elapsed: 0.004 s - in org.eclipse.kapua.client.gateway.CredentialsTest
[INFO] Running org.eclipse.kapua.client.gateway.TransmissionExceptionTest
[INFO] Tests run: 10, Failures: 0, Errors: 0, Skipped: 0, Time elapsed: 0.002 s - in org.eclipse.kapua.client.gateway.TransmissionExceptionTest
[INFO] Running org.eclipse.kapua.client.gateway.util.ErrorsTest
[INFO] Tests run: 3, Failures: 0, Errors: 0, Skipped: 0, Time elapsed: 0.003 s - in org.eclipse.kapua.client.gateway.util.ErrorsTest
[INFO] Running org.eclipse.kapua.client.gateway.PayloadTest
[INFO] Tests run: 16, Failures: 0, Errors: 0, Skipped: 0, Time elapsed: 0.017 s - in org.eclipse.kapua.client.gateway.PayloadTest
[INFO] 
[INFO] Results:
[INFO] 
[INFO] Tests run: 65, Failures: 0, Errors: 0, Skipped: 0
[INFO] 
[INFO] 
[INFO] --- jacoco-maven-plugin:0.7.9:report (default-report) @ kapua-client-gateway-api ---
[INFO] Loading execution data file /home/jenkins/agent/workspace/develop/client/gateway/api/target/jacoco.exec
[INFO] Analyzed bundle 'Eclipse Kapua :: Gateway Client :: API' with 12 classes
[INFO] 
[INFO] --- maven-bundle-plugin:3.3.0:bundle (default-bundle) @ kapua-client-gateway-api ---
[INFO] 
[INFO] --- maven-source-plugin:2.4:jar-no-fork (attach-sources) @ kapua-client-gateway-api ---
[INFO] Building jar: /home/jenkins/agent/workspace/develop/client/gateway/api/target/kapua-client-gateway-api-1.5.0-SNAPSHOT-sources.jar
[INFO] 
[INFO] --- jacoco-extras:0.1.1:xml (default) @ kapua-client-gateway-api ---
[INFO] Loading execution data file /home/jenkins/agent/workspace/develop/client/gateway/api/target/jacoco.exec
[INFO] 
[INFO] -------------< org.eclipse.kapua:kapua-client-gateway-spi >-------------
[INFO] Building Eclipse Kapua :: Gateway Client :: SPI 1.5.0-SNAPSHOT [167/190]
[INFO] -------------------------------[ bundle ]-------------------------------
[INFO] 
[INFO] --- maven-checkstyle-plugin:2.17:check (checkstyle-check) @ kapua-client-gateway-spi ---
[INFO] 
[INFO] --- jacoco-maven-plugin:0.7.9:prepare-agent (default-prepare-agent) @ kapua-client-gateway-spi ---
[INFO] argLine set to -javaagent:/home/jenkins/agent/workspace/develop/.repository/org/jacoco/org.jacoco.agent/0.7.9/org.jacoco.agent-0.7.9-runtime.jar=destfile=/home/jenkins/agent/workspace/develop/client/gateway/spi/target/jacoco.exec
[INFO] 
[INFO] --- maven-resources-plugin:3.0.2:resources (default-resources) @ kapua-client-gateway-spi ---
[INFO] Using 'UTF-8' encoding to copy filtered resources.
[INFO] skip non existing resourceDirectory /home/jenkins/agent/workspace/develop/client/gateway/spi/src/main/resources
[INFO] 
[INFO] --- maven-resources-plugin:3.0.2:copy-resources (process-about.html) @ kapua-client-gateway-spi ---
[INFO] Using 'UTF-8' encoding to copy filtered resources.
[INFO] Copying 1 resource
[INFO] 
[INFO] --- maven-compiler-plugin:3.6.1:compile (default-compile) @ kapua-client-gateway-spi ---
[INFO] Changes detected - recompiling the module!
[INFO] Compiling 15 source files to /home/jenkins/agent/workspace/develop/client/gateway/spi/target/classes
[INFO] 
[INFO] --- maven-resources-plugin:3.0.2:testResources (default-testResources) @ kapua-client-gateway-spi ---
[INFO] Using 'UTF-8' encoding to copy filtered resources.
[INFO] skip non existing resourceDirectory /home/jenkins/agent/workspace/develop/client/gateway/spi/src/test/resources
[INFO] 
[INFO] --- maven-compiler-plugin:3.6.1:testCompile (default-testCompile) @ kapua-client-gateway-spi ---
[INFO] Nothing to compile - all classes are up to date
[INFO] 
[INFO] --- maven-surefire-plugin:2.20:test (default-test) @ kapua-client-gateway-spi ---
[INFO] 
[INFO] -------------------------------------------------------
[INFO]  T E S T S
[INFO] -------------------------------------------------------
[INFO] Running org.eclipse.kapua.client.gateway.spi.util.MoreExecutorsTest
[INFO] Tests run: 43, Failures: 0, Errors: 0, Skipped: 0, Time elapsed: 5.214 s - in org.eclipse.kapua.client.gateway.spi.util.MoreExecutorsTest
[INFO] Running org.eclipse.kapua.client.gateway.spi.util.StringsTest
[INFO] Tests run: 24, Failures: 0, Errors: 0, Skipped: 0, Time elapsed: 0.018 s - in org.eclipse.kapua.client.gateway.spi.util.StringsTest
[INFO] Running org.eclipse.kapua.client.gateway.spi.util.FuturesTest
[INFO] Tests run: 4, Failures: 0, Errors: 0, Skipped: 0, Time elapsed: 0.03 s - in org.eclipse.kapua.client.gateway.spi.util.FuturesTest
[INFO] Running org.eclipse.kapua.client.gateway.spi.util.TransportProxyTest
[INFO] Tests run: 7, Failures: 0, Errors: 0, Skipped: 0, Time elapsed: 0.018 s - in org.eclipse.kapua.client.gateway.spi.util.TransportProxyTest
[INFO] Running org.eclipse.kapua.client.gateway.spi.util.BuffersTest
[INFO] Tests run: 5, Failures: 0, Errors: 0, Skipped: 0, Time elapsed: 0.018 s - in org.eclipse.kapua.client.gateway.spi.util.BuffersTest
[INFO] Running org.eclipse.kapua.client.gateway.spi.util.TransportAsyncTest
[INFO] Tests run: 5, Failures: 0, Errors: 0, Skipped: 0, Time elapsed: 0.005 s - in org.eclipse.kapua.client.gateway.spi.util.TransportAsyncTest
[INFO] Running org.eclipse.kapua.client.gateway.spi.AbstractClientTest
[INFO] Tests run: 200, Failures: 0, Errors: 0, Skipped: 0, Time elapsed: 0.192 s - in org.eclipse.kapua.client.gateway.spi.AbstractClientTest
[INFO] Running org.eclipse.kapua.client.gateway.spi.DefaultApplicationTest
[INFO] Tests run: 14, Failures: 0, Errors: 0, Skipped: 0, Time elapsed: 0.04 s - in org.eclipse.kapua.client.gateway.spi.DefaultApplicationTest
[INFO] Running org.eclipse.kapua.client.gateway.spi.DefaultClientTest
[INFO] Tests run: 22, Failures: 0, Errors: 0, Skipped: 0, Time elapsed: 0.01 s - in org.eclipse.kapua.client.gateway.spi.DefaultClientTest
[INFO] Running org.eclipse.kapua.client.gateway.spi.DefaultDataTest
11:45:59.483 [main] DEBUG org.eclipse.kapua.client.gateway.spi.DefaultData - Setting subscription for: string
[INFO] Tests run: 5, Failures: 0, Errors: 0, Skipped: 0, Time elapsed: 0.008 s - in org.eclipse.kapua.client.gateway.spi.DefaultDataTest
[INFO] 
[INFO] Results:
[INFO] 
[INFO] Tests run: 329, Failures: 0, Errors: 0, Skipped: 0
[INFO] 
[INFO] 
[INFO] --- jacoco-maven-plugin:0.7.9:report (default-report) @ kapua-client-gateway-spi ---
[INFO] Loading execution data file /home/jenkins/agent/workspace/develop/client/gateway/spi/target/jacoco.exec
[INFO] Analyzed bundle 'Eclipse Kapua :: Gateway Client :: SPI' with 18 classes
[INFO] 
[INFO] --- maven-bundle-plugin:3.3.0:bundle (default-bundle) @ kapua-client-gateway-spi ---
[INFO] 
[INFO] --- maven-source-plugin:2.4:jar-no-fork (attach-sources) @ kapua-client-gateway-spi ---
[INFO] Building jar: /home/jenkins/agent/workspace/develop/client/gateway/spi/target/kapua-client-gateway-spi-1.5.0-SNAPSHOT-sources.jar
[INFO] 
[INFO] --- jacoco-extras:0.1.1:xml (default) @ kapua-client-gateway-spi ---
[INFO] Loading execution data file /home/jenkins/agent/workspace/develop/client/gateway/spi/target/jacoco.exec
[INFO] Analyzed bundle 'kapua-client-gateway-api' with 12 classes
[INFO] 
[INFO] ----------< org.eclipse.kapua:kapua-client-gateway-provider >-----------
[INFO] Building Eclipse Kapua :: Gateway Client :: Provider 1.5.0-SNAPSHOT [168/190]
[INFO] --------------------------------[ pom ]---------------------------------
[INFO] 
[INFO] --- maven-checkstyle-plugin:2.17:check (checkstyle-check) @ kapua-client-gateway-provider ---
[INFO] 
[INFO] --- jacoco-maven-plugin:0.7.9:prepare-agent (default-prepare-agent) @ kapua-client-gateway-provider ---
[INFO] argLine set to -javaagent:/home/jenkins/agent/workspace/develop/.repository/org/jacoco/org.jacoco.agent/0.7.9/org.jacoco.agent-0.7.9-runtime.jar=destfile=/home/jenkins/agent/workspace/develop/client/gateway/provider/target/jacoco.exec
[INFO] 
[INFO] --- jacoco-maven-plugin:0.7.9:report (default-report) @ kapua-client-gateway-provider ---
[INFO] Skipping JaCoCo execution due to missing execution data file.
[INFO] 
[INFO] --- maven-source-plugin:2.4:jar-no-fork (attach-sources) @ kapua-client-gateway-provider ---
[INFO] 
[INFO] --- jacoco-extras:0.1.1:xml (default) @ kapua-client-gateway-provider ---
[INFO] 
[INFO] --------< org.eclipse.kapua:kapua-client-gateway-provider-mqtt >--------
[INFO] Building Eclipse Kapua :: Gateway Client :: Provider :: Core MQTT 1.5.0-SNAPSHOT [169/190]
[INFO] -------------------------------[ bundle ]-------------------------------
[INFO] 
[INFO] --- maven-checkstyle-plugin:2.17:check (checkstyle-check) @ kapua-client-gateway-provider-mqtt ---
[INFO] 
[INFO] --- jacoco-maven-plugin:0.7.9:prepare-agent (default-prepare-agent) @ kapua-client-gateway-provider-mqtt ---
[INFO] argLine set to -javaagent:/home/jenkins/agent/workspace/develop/.repository/org/jacoco/org.jacoco.agent/0.7.9/org.jacoco.agent-0.7.9-runtime.jar=destfile=/home/jenkins/agent/workspace/develop/client/gateway/provider/mqtt/target/jacoco.exec
[INFO] 
[INFO] --- maven-resources-plugin:3.0.2:resources (default-resources) @ kapua-client-gateway-provider-mqtt ---
[INFO] Using 'UTF-8' encoding to copy filtered resources.
[INFO] skip non existing resourceDirectory /home/jenkins/agent/workspace/develop/client/gateway/provider/mqtt/src/main/resources
[INFO] 
[INFO] --- maven-resources-plugin:3.0.2:copy-resources (process-about.html) @ kapua-client-gateway-provider-mqtt ---
[INFO] Using 'UTF-8' encoding to copy filtered resources.
[INFO] Copying 1 resource
[INFO] 
[INFO] --- maven-compiler-plugin:3.6.1:compile (default-compile) @ kapua-client-gateway-provider-mqtt ---
[INFO] Changes detected - recompiling the module!
[INFO] Compiling 5 source files to /home/jenkins/agent/workspace/develop/client/gateway/provider/mqtt/target/classes
[INFO] 
[INFO] --- maven-resources-plugin:3.0.2:testResources (default-testResources) @ kapua-client-gateway-provider-mqtt ---
[INFO] Using 'UTF-8' encoding to copy filtered resources.
[INFO] skip non existing resourceDirectory /home/jenkins/agent/workspace/develop/client/gateway/provider/mqtt/src/test/resources
[INFO] 
[INFO] --- maven-compiler-plugin:3.6.1:testCompile (default-testCompile) @ kapua-client-gateway-provider-mqtt ---
[INFO] Nothing to compile - all classes are up to date
[INFO] 
[INFO] --- maven-surefire-plugin:2.20:test (default-test) @ kapua-client-gateway-provider-mqtt ---
[INFO] 
[INFO] -------------------------------------------------------
[INFO]  T E S T S
[INFO] -------------------------------------------------------
[INFO] Running org.eclipse.kapua.client.gateway.mqtt.AbstractMqttChannelTest
11:46:00.912 [main] DEBUG org.eclipse.kapua.client.gateway.mqtt.AbstractMqttChannel - Publishing values - null -> {}
11:46:00.919 [main] DEBUG org.eclipse.kapua.client.gateway.mqtt.AbstractMqttChannel - Publishing values - string -> {}
11:46:00.924 [main] DEBUG org.eclipse.kapua.client.gateway.mqtt.AbstractMqttChannel - Received: null
11:46:00.928 [main] DEBUG org.eclipse.kapua.client.gateway.mqtt.AbstractMqttChannel - Publishing values - string -> {}
[INFO] Tests run: 41, Failures: 0, Errors: 0, Skipped: 0, Time elapsed: 0.357 s - in org.eclipse.kapua.client.gateway.mqtt.AbstractMqttChannelTest
[INFO] 
[INFO] Results:
[INFO] 
[INFO] Tests run: 41, Failures: 0, Errors: 0, Skipped: 0
[INFO] 
[INFO] 
[INFO] --- jacoco-maven-plugin:0.7.9:report (default-report) @ kapua-client-gateway-provider-mqtt ---
[INFO] Loading execution data file /home/jenkins/agent/workspace/develop/client/gateway/provider/mqtt/target/jacoco.exec
[INFO] Analyzed bundle 'Eclipse Kapua :: Gateway Client :: Provider :: Core MQTT' with 3 classes
[INFO] 
[INFO] --- maven-bundle-plugin:3.3.0:bundle (default-bundle) @ kapua-client-gateway-provider-mqtt ---
[INFO] 
[INFO] --- maven-source-plugin:2.4:jar-no-fork (attach-sources) @ kapua-client-gateway-provider-mqtt ---
[INFO] Building jar: /home/jenkins/agent/workspace/develop/client/gateway/provider/mqtt/target/kapua-client-gateway-provider-mqtt-1.5.0-SNAPSHOT-sources.jar
[INFO] 
[INFO] --- jacoco-extras:0.1.1:xml (default) @ kapua-client-gateway-provider-mqtt ---
[INFO] Loading execution data file /home/jenkins/agent/workspace/develop/client/gateway/provider/mqtt/target/jacoco.exec
[INFO] Analyzed bundle 'kapua-client-gateway-api' with 12 classes
[INFO] Analyzed bundle 'kapua-client-gateway-spi' with 18 classes
[INFO] 
[INFO] --------< org.eclipse.kapua:kapua-client-gateway-provider-fuse >--------
[INFO] Building Eclipse Kapua :: Gateway Client :: Provider :: FUSE MQTT 1.5.0-SNAPSHOT [170/190]
[INFO] -------------------------------[ bundle ]-------------------------------
[INFO] 
[INFO] --- maven-checkstyle-plugin:2.17:check (checkstyle-check) @ kapua-client-gateway-provider-fuse ---
[INFO] 
[INFO] --- jacoco-maven-plugin:0.7.9:prepare-agent (default-prepare-agent) @ kapua-client-gateway-provider-fuse ---
[INFO] argLine set to -javaagent:/home/jenkins/agent/workspace/develop/.repository/org/jacoco/org.jacoco.agent/0.7.9/org.jacoco.agent-0.7.9-runtime.jar=destfile=/home/jenkins/agent/workspace/develop/client/gateway/provider/fuse/target/jacoco.exec
[INFO] 
[INFO] --- maven-resources-plugin:3.0.2:resources (default-resources) @ kapua-client-gateway-provider-fuse ---
[INFO] Using 'UTF-8' encoding to copy filtered resources.
[INFO] skip non existing resourceDirectory /home/jenkins/agent/workspace/develop/client/gateway/provider/fuse/src/main/resources
[INFO] 
[INFO] --- maven-resources-plugin:3.0.2:copy-resources (process-about.html) @ kapua-client-gateway-provider-fuse ---
[INFO] Using 'UTF-8' encoding to copy filtered resources.
[INFO] Copying 1 resource
[INFO] 
[INFO] --- maven-compiler-plugin:3.6.1:compile (default-compile) @ kapua-client-gateway-provider-fuse ---
[INFO] Changes detected - recompiling the module!
[INFO] Compiling 3 source files to /home/jenkins/agent/workspace/develop/client/gateway/provider/fuse/target/classes
[INFO] 
[INFO] --- maven-resources-plugin:3.0.2:testResources (default-testResources) @ kapua-client-gateway-provider-fuse ---
[INFO] Using 'UTF-8' encoding to copy filtered resources.
[INFO] skip non existing resourceDirectory /home/jenkins/agent/workspace/develop/client/gateway/provider/fuse/src/test/resources
[INFO] 
[INFO] --- maven-compiler-plugin:3.6.1:testCompile (default-testCompile) @ kapua-client-gateway-provider-fuse ---
[INFO] Nothing to compile - all classes are up to date
[INFO] 
[INFO] --- maven-surefire-plugin:2.20:test (default-test) @ kapua-client-gateway-provider-fuse ---
[INFO] 
[INFO] -------------------------------------------------------
[INFO]  T E S T S
[INFO] -------------------------------------------------------
[INFO] Running org.eclipse.kapua.client.gateway.mqtt.fuse.FuseChannelTest
11:46:02.487 [main] INFO org.eclipse.kapua.client.gateway.mqtt.fuse.FuseChannel - Unsubscribe from: null
11:46:02.496 [main] INFO org.eclipse.kapua.client.gateway.mqtt.fuse.FuseChannel - Unsubscribe from: [India]
[INFO] Tests run: 21, Failures: 0, Errors: 0, Skipped: 0, Time elapsed: 0.706 s - in org.eclipse.kapua.client.gateway.mqtt.fuse.FuseChannelTest
[INFO] Running org.eclipse.kapua.client.gateway.mqtt.fuse.internal.CallbacksTest
[INFO] Tests run: 4, Failures: 0, Errors: 0, Skipped: 0, Time elapsed: 0.07 s - in org.eclipse.kapua.client.gateway.mqtt.fuse.internal.CallbacksTest
[INFO] 
[INFO] Results:
[INFO] 
[INFO] Tests run: 25, Failures: 0, Errors: 0, Skipped: 0
[INFO] 
[INFO] 
[INFO] --- jacoco-maven-plugin:0.7.9:report (default-report) @ kapua-client-gateway-provider-fuse ---
[INFO] Loading execution data file /home/jenkins/agent/workspace/develop/client/gateway/provider/fuse/target/jacoco.exec
[INFO] Analyzed bundle 'Eclipse Kapua :: Gateway Client :: Provider :: FUSE MQTT' with 6 classes
[INFO] 
[INFO] --- maven-bundle-plugin:3.3.0:bundle (default-bundle) @ kapua-client-gateway-provider-fuse ---
[INFO] 
[INFO] --- maven-source-plugin:2.4:jar-no-fork (attach-sources) @ kapua-client-gateway-provider-fuse ---
[INFO] Building jar: /home/jenkins/agent/workspace/develop/client/gateway/provider/fuse/target/kapua-client-gateway-provider-fuse-1.5.0-SNAPSHOT-sources.jar
[INFO] 
[INFO] --- jacoco-extras:0.1.1:xml (default) @ kapua-client-gateway-provider-fuse ---
[INFO] Loading execution data file /home/jenkins/agent/workspace/develop/client/gateway/provider/fuse/target/jacoco.exec
[INFO] Analyzed bundle 'kapua-client-gateway-api' with 12 classes
[INFO] Analyzed bundle 'kapua-client-gateway-provider-mqtt' with 3 classes
[INFO] Analyzed bundle 'kapua-client-gateway-spi' with 18 classes
[INFO] 
[INFO] --------< org.eclipse.kapua:kapua-client-gateway-provider-paho >--------
[INFO] Building Eclipse Kapua :: Gateway Client :: Provider :: Eclipse Paho 1.5.0-SNAPSHOT [171/190]
[INFO] -------------------------------[ bundle ]-------------------------------
[INFO] 
[INFO] --- maven-checkstyle-plugin:2.17:check (checkstyle-check) @ kapua-client-gateway-provider-paho ---
[INFO] 
[INFO] --- jacoco-maven-plugin:0.7.9:prepare-agent (default-prepare-agent) @ kapua-client-gateway-provider-paho ---
[INFO] argLine set to -javaagent:/home/jenkins/agent/workspace/develop/.repository/org/jacoco/org.jacoco.agent/0.7.9/org.jacoco.agent-0.7.9-runtime.jar=destfile=/home/jenkins/agent/workspace/develop/client/gateway/provider/paho/target/jacoco.exec
[INFO] 
[INFO] --- maven-resources-plugin:3.0.2:resources (default-resources) @ kapua-client-gateway-provider-paho ---
[INFO] Using 'UTF-8' encoding to copy filtered resources.
[INFO] skip non existing resourceDirectory /home/jenkins/agent/workspace/develop/client/gateway/provider/paho/src/main/resources
[INFO] 
[INFO] --- maven-resources-plugin:3.0.2:copy-resources (process-about.html) @ kapua-client-gateway-provider-paho ---
[INFO] Using 'UTF-8' encoding to copy filtered resources.
[INFO] Copying 1 resource
[INFO] 
[INFO] --- maven-compiler-plugin:3.6.1:compile (default-compile) @ kapua-client-gateway-provider-paho ---
[INFO] Changes detected - recompiling the module!
[INFO] Compiling 3 source files to /home/jenkins/agent/workspace/develop/client/gateway/provider/paho/target/classes
[INFO] 
[INFO] --- maven-resources-plugin:3.0.2:testResources (default-testResources) @ kapua-client-gateway-provider-paho ---
[INFO] Using 'UTF-8' encoding to copy filtered resources.
[INFO] skip non existing resourceDirectory /home/jenkins/agent/workspace/develop/client/gateway/provider/paho/src/test/resources
[INFO] 
[INFO] --- maven-compiler-plugin:3.6.1:testCompile (default-testCompile) @ kapua-client-gateway-provider-paho ---
[INFO] Nothing to compile - all classes are up to date
[INFO] 
[INFO] --- maven-surefire-plugin:2.20:test (default-test) @ kapua-client-gateway-provider-paho ---
[INFO] 
[INFO] -------------------------------------------------------
[INFO]  T E S T S
[INFO] -------------------------------------------------------
[INFO] Running org.eclipse.kapua.client.gateway.mqtt.paho.internal.ListenersTest
[INFO] Tests run: 18, Failures: 0, Errors: 0, Skipped: 0, Time elapsed: 0.347 s - in org.eclipse.kapua.client.gateway.mqtt.paho.internal.ListenersTest
[INFO] 
[INFO] Results:
[INFO] 
[INFO] Tests run: 18, Failures: 0, Errors: 0, Skipped: 0
[INFO] 
[INFO] 
[INFO] --- jacoco-maven-plugin:0.7.9:report (default-report) @ kapua-client-gateway-provider-paho ---
[INFO] Loading execution data file /home/jenkins/agent/workspace/develop/client/gateway/provider/paho/target/jacoco.exec
[INFO] Analyzed bundle 'Eclipse Kapua :: Gateway Client :: Provider :: Eclipse Paho' with 6 classes
[INFO] 
[INFO] --- maven-bundle-plugin:3.3.0:bundle (default-bundle) @ kapua-client-gateway-provider-paho ---
[INFO] 
[INFO] --- maven-source-plugin:2.4:jar-no-fork (attach-sources) @ kapua-client-gateway-provider-paho ---
[INFO] Building jar: /home/jenkins/agent/workspace/develop/client/gateway/provider/paho/target/kapua-client-gateway-provider-paho-1.5.0-SNAPSHOT-sources.jar
[INFO] 
[INFO] --- jacoco-extras:0.1.1:xml (default) @ kapua-client-gateway-provider-paho ---
[INFO] Loading execution data file /home/jenkins/agent/workspace/develop/client/gateway/provider/paho/target/jacoco.exec
[INFO] Analyzed bundle 'kapua-client-gateway-api' with 12 classes
[INFO] Analyzed bundle 'kapua-client-gateway-provider-mqtt' with 3 classes
[INFO] Analyzed bundle 'kapua-client-gateway-spi' with 18 classes
[INFO] 
[INFO] --------< org.eclipse.kapua:kapua-client-gateway-profile-kura >---------
[INFO] Building Eclipse Kapua :: Gateway Client :: Profile :: Eclipse Kura 1.5.0-SNAPSHOT [172/190]
[INFO] -------------------------------[ bundle ]-------------------------------
[INFO] 
[INFO] --- maven-checkstyle-plugin:2.17:check (checkstyle-check) @ kapua-client-gateway-profile-kura ---
[INFO] 
[INFO] --- jacoco-maven-plugin:0.7.9:prepare-agent (default-prepare-agent) @ kapua-client-gateway-profile-kura ---
[INFO] argLine set to -javaagent:/home/jenkins/agent/workspace/develop/.repository/org/jacoco/org.jacoco.agent/0.7.9/org.jacoco.agent-0.7.9-runtime.jar=destfile=/home/jenkins/agent/workspace/develop/client/gateway/profile/kura/target/jacoco.exec
[INFO] 
[INFO] --- protoc-jar-maven-plugin:3.8.0:run (default) @ kapua-client-gateway-profile-kura ---
[INFO] Protoc version: 3.8.0
protoc-jar: protoc version: 3.8.0, detected platform: linux-x86_64 (linux/amd64)
protoc-jar: embedded: bin/3.8.0/protoc-3.8.0-linux-x86_64.exe
protoc-jar: executing: [/tmp/protocjar4814889608222162760/bin/protoc.exe, --version]
libprotoc 3.8.0
[INFO] Protoc command: /tmp/protocjar4814889608222162760/bin/protoc.exe
[INFO] Additional include types: /tmp/protocjar4442238711194538343/include
[INFO] Input directories:
[INFO]     /home/jenkins/agent/workspace/develop/client/gateway/profile/kura/src/main/protobuf
[INFO] Include directories:
[INFO]     /tmp/protocjar4442238711194538343/include
[INFO] Output targets:
[INFO]     java: /home/jenkins/agent/workspace/develop/client/gateway/profile/kura/target/generated-sources (add: main, clean: false, plugin: null, outputOptions: null)
[INFO]     Processing (java): kurapayload.proto
protoc-jar: executing: [/tmp/protocjar4814889608222162760/bin/protoc.exe, -I/tmp/protocjar4442238711194538343/include, -I/home/jenkins/agent/workspace/develop/client/gateway/profile/kura/src/main/protobuf, --java_out=/home/jenkins/agent/workspace/develop/client/gateway/profile/kura/target/generated-sources, /home/jenkins/agent/workspace/develop/client/gateway/profile/kura/src/main/protobuf/kurapayload.proto]
[INFO] Adding generated sources (java): /home/jenkins/agent/workspace/develop/client/gateway/profile/kura/target/generated-sources
[INFO] 
[INFO] --- maven-resources-plugin:3.0.2:resources (default-resources) @ kapua-client-gateway-profile-kura ---
[INFO] Using 'UTF-8' encoding to copy filtered resources.
[INFO] skip non existing resourceDirectory /home/jenkins/agent/workspace/develop/client/gateway/profile/kura/src/main/resources
[INFO] 
[INFO] --- maven-resources-plugin:3.0.2:copy-resources (process-about.html) @ kapua-client-gateway-profile-kura ---
[INFO] Using 'UTF-8' encoding to copy filtered resources.
[INFO] Copying 1 resource
[INFO] 
[INFO] --- maven-compiler-plugin:3.6.1:compile (default-compile) @ kapua-client-gateway-profile-kura ---
[INFO] Changes detected - recompiling the module!
[INFO] Compiling 7 source files to /home/jenkins/agent/workspace/develop/client/gateway/profile/kura/target/classes
[INFO] 
[INFO] --- maven-resources-plugin:3.0.2:testResources (default-testResources) @ kapua-client-gateway-profile-kura ---
[INFO] Using 'UTF-8' encoding to copy filtered resources.
[INFO] skip non existing resourceDirectory /home/jenkins/agent/workspace/develop/client/gateway/profile/kura/src/test/resources
[INFO] 
[INFO] --- maven-compiler-plugin:3.6.1:testCompile (default-testCompile) @ kapua-client-gateway-profile-kura ---
[INFO] Nothing to compile - all classes are up to date
[INFO] 
[INFO] --- maven-surefire-plugin:2.20:test (default-test) @ kapua-client-gateway-profile-kura ---
[INFO] 
[INFO] -------------------------------------------------------
[INFO]  T E S T S
[INFO] -------------------------------------------------------
[INFO] Running org.eclipse.kapua.client.gateway.kura.KuraBinaryPayloadCodecTest
[INFO] Tests run: 8, Failures: 0, Errors: 0, Skipped: 0, Time elapsed: 0.312 s - in org.eclipse.kapua.client.gateway.kura.KuraBinaryPayloadCodecTest
[INFO] Running org.eclipse.kapua.client.gateway.kura.KuraNamespaceTest
[INFO] Tests run: 13, Failures: 0, Errors: 0, Skipped: 0, Time elapsed: 0.051 s - in org.eclipse.kapua.client.gateway.kura.KuraNamespaceTest
[INFO] Running org.eclipse.kapua.client.gateway.kura.KuraBirthCertificateModuleTest
[INFO] Tests run: 14, Failures: 0, Errors: 0, Skipped: 0, Time elapsed: 0.06 s - in org.eclipse.kapua.client.gateway.kura.KuraBirthCertificateModuleTest
[INFO] Running org.eclipse.kapua.client.gateway.kura.internal.MetricsTest
[INFO] Tests run: 22, Failures: 0, Errors: 0, Skipped: 0, Time elapsed: 0.084 s - in org.eclipse.kapua.client.gateway.kura.internal.MetricsTest
[INFO] Running org.eclipse.kapua.client.gateway.profile.kura.KuraMqttProfileTest
[INFO] Tests run: 16, Failures: 0, Errors: 0, Skipped: 0, Time elapsed: 0.099 s - in org.eclipse.kapua.client.gateway.profile.kura.KuraMqttProfileTest
[INFO] 
[INFO] Results:
[INFO] 
[INFO] Tests run: 73, Failures: 0, Errors: 0, Skipped: 0
[INFO] 
[INFO] 
[INFO] --- jacoco-maven-plugin:0.7.9:report (default-report) @ kapua-client-gateway-profile-kura ---
[INFO] Loading execution data file /home/jenkins/agent/workspace/develop/client/gateway/profile/kura/target/jacoco.exec
[INFO] Analyzed bundle 'Eclipse Kapua :: Gateway Client :: Profile :: Eclipse Kura' with 24 classes
[INFO] 
[INFO] --- maven-bundle-plugin:3.3.0:bundle (default-bundle) @ kapua-client-gateway-profile-kura ---
[INFO] 
[INFO] --- maven-source-plugin:2.4:jar-no-fork (attach-sources) @ kapua-client-gateway-profile-kura ---
[INFO] Building jar: /home/jenkins/agent/workspace/develop/client/gateway/profile/kura/target/kapua-client-gateway-profile-kura-1.5.0-SNAPSHOT-sources.jar
[INFO] 
[INFO] --- jacoco-extras:0.1.1:xml (default) @ kapua-client-gateway-profile-kura ---
[INFO] Loading execution data file /home/jenkins/agent/workspace/develop/client/gateway/profile/kura/target/jacoco.exec
[INFO] Analyzed bundle 'kapua-client-gateway-api' with 12 classes
[INFO] Analyzed bundle 'kapua-client-gateway-provider-mqtt' with 3 classes
[INFO] Analyzed bundle 'kapua-client-gateway-spi' with 18 classes
[INFO] 
[INFO] ----------< org.eclipse.kapua:kapua-client-gateway-features >-----------
[INFO] Building Eclipse Kapua :: Gateway Client :: Features 1.5.0-SNAPSHOT [173/190]
[INFO] --------------------------------[ pom ]---------------------------------
[INFO] 
[INFO] --- maven-checkstyle-plugin:2.17:check (checkstyle-check) @ kapua-client-gateway-features ---
[INFO] 
[INFO] --- jacoco-maven-plugin:0.7.9:prepare-agent (default-prepare-agent) @ kapua-client-gateway-features ---
[INFO] argLine set to -javaagent:/home/jenkins/agent/workspace/develop/.repository/org/jacoco/org.jacoco.agent/0.7.9/org.jacoco.agent-0.7.9-runtime.jar=destfile=/home/jenkins/agent/workspace/develop/client/gateway/features/target/jacoco.exec
[INFO] 
[INFO] --- jacoco-maven-plugin:0.7.9:report (default-report) @ kapua-client-gateway-features ---
[INFO] Skipping JaCoCo execution due to missing execution data file.
[INFO] 
[INFO] --- maven-source-plugin:2.4:jar-no-fork (attach-sources) @ kapua-client-gateway-features ---
[INFO] 
[INFO] --- jacoco-extras:0.1.1:xml (default) @ kapua-client-gateway-features ---
[INFO] 
[INFO] --------< org.eclipse.kapua:kapua-client-gateway-feature-karaf >--------
[INFO] Building Eclipse Kapua :: Gateway Client :: Features :: Karaf 1.5.0-SNAPSHOT [174/190]
[INFO] ------------------------------[ feature ]-------------------------------
[INFO] 
[INFO] --- maven-checkstyle-plugin:2.17:check (checkstyle-check) @ kapua-client-gateway-feature-karaf ---
[INFO] 
[INFO] --- jacoco-maven-plugin:0.7.9:prepare-agent (default-prepare-agent) @ kapua-client-gateway-feature-karaf ---
[INFO] argLine set to -javaagent:/home/jenkins/agent/workspace/develop/.repository/org/jacoco/org.jacoco.agent/0.7.9/org.jacoco.agent-0.7.9-runtime.jar=destfile=/home/jenkins/agent/workspace/develop/client/gateway/features/karaf/target/jacoco.exec
[INFO] 
[INFO] --- karaf-maven-plugin:4.1.1:features-generate-descriptor (default-features-generate-descriptor) @ kapua-client-gateway-feature-karaf ---
[INFO] 
[INFO] --- karaf-maven-plugin:4.1.1:verify (default-verify) @ kapua-client-gateway-feature-karaf ---
[INFO] Using repositories: https://repo.eclipse.org/content/repositories/maven_central/@id=eclipse.maven.central.mirror
[INFO] 
[INFO] --- jacoco-maven-plugin:0.7.9:report (default-report) @ kapua-client-gateway-feature-karaf ---
[INFO] Skipping JaCoCo execution due to missing execution data file.
[INFO] 
[INFO] --- maven-source-plugin:2.4:jar-no-fork (attach-sources) @ kapua-client-gateway-feature-karaf ---
[INFO] No sources in project. Archive not created.
[INFO] 
[INFO] --- jacoco-extras:0.1.1:xml (default) @ kapua-client-gateway-feature-karaf ---
[INFO] 
[INFO] --- karaf-maven-plugin:4.1.1:verify (verify) @ kapua-client-gateway-feature-karaf ---
[INFO] Using repositories: https://repo.eclipse.org/content/repositories/maven_central/@id=eclipse.maven.central.mirror
[INFO] Verification of feature kapua-client-gateway-kura-fuse/1.5.0.SNAPSHOT succeeded
[INFO] Verification of feature kapua-client-gateway-kura-paho/1.5.0.SNAPSHOT succeeded
[INFO] 
[INFO] ------------------< org.eclipse.kapua:kapua-assembly >------------------
[INFO] Building kapua-assembly 1.5.0-SNAPSHOT                         [175/190]
[INFO] --------------------------------[ pom ]---------------------------------
[INFO] 
[INFO] --- maven-checkstyle-plugin:2.17:check (checkstyle-check) @ kapua-assembly ---
[INFO] 
[INFO] --- jacoco-maven-plugin:0.7.9:prepare-agent (default-prepare-agent) @ kapua-assembly ---
[INFO] argLine set to -javaagent:/home/jenkins/agent/workspace/develop/.repository/org/jacoco/org.jacoco.agent/0.7.9/org.jacoco.agent-0.7.9-runtime.jar=destfile=/home/jenkins/agent/workspace/develop/assembly/target/jacoco.exec
[INFO] 
[INFO] --- jacoco-maven-plugin:0.7.9:report (default-report) @ kapua-assembly ---
[INFO] Skipping JaCoCo execution due to missing execution data file.
[INFO] 
[INFO] --- maven-source-plugin:2.4:jar-no-fork (attach-sources) @ kapua-assembly ---
[INFO] 
[INFO] --- jacoco-extras:0.1.1:xml (default) @ kapua-assembly ---
[INFO] 
[INFO] -------------< org.eclipse.kapua:kapua-assembly-java-base >-------------
[INFO] Building kapua-assembly-java-base 1.5.0-SNAPSHOT               [176/190]
[INFO] --------------------------------[ pom ]---------------------------------
[INFO] 
[INFO] --- maven-checkstyle-plugin:2.17:check (checkstyle-check) @ kapua-assembly-java-base ---
[INFO] 
[INFO] --- jacoco-maven-plugin:0.7.9:prepare-agent (default-prepare-agent) @ kapua-assembly-java-base ---
[INFO] argLine set to -javaagent:/home/jenkins/agent/workspace/develop/.repository/org/jacoco/org.jacoco.agent/0.7.9/org.jacoco.agent-0.7.9-runtime.jar=destfile=/home/jenkins/agent/workspace/develop/assembly/java-base/target/jacoco.exec
[INFO] 
[INFO] --- jacoco-maven-plugin:0.7.9:report (default-report) @ kapua-assembly-java-base ---
[INFO] Skipping JaCoCo execution due to missing execution data file.
[INFO] 
[INFO] --- maven-source-plugin:2.4:jar-no-fork (attach-sources) @ kapua-assembly-java-base ---
[INFO] 
[INFO] --- jacoco-extras:0.1.1:xml (default) @ kapua-assembly-java-base ---
[INFO] 
[INFO] ------------< org.eclipse.kapua:kapua-assembly-jetty-base >-------------
[INFO] Building kapua-assembly-jetty-base 1.5.0-SNAPSHOT              [177/190]
[INFO] --------------------------------[ pom ]---------------------------------
[INFO] 
[INFO] --- maven-checkstyle-plugin:2.17:check (checkstyle-check) @ kapua-assembly-jetty-base ---
[INFO] 
[INFO] --- jacoco-maven-plugin:0.7.9:prepare-agent (default-prepare-agent) @ kapua-assembly-jetty-base ---
[INFO] argLine set to -javaagent:/home/jenkins/agent/workspace/develop/.repository/org/jacoco/org.jacoco.agent/0.7.9/org.jacoco.agent-0.7.9-runtime.jar=destfile=/home/jenkins/agent/workspace/develop/assembly/jetty-base/target/jacoco.exec
[INFO] 
[INFO] --- jacoco-maven-plugin:0.7.9:report (default-report) @ kapua-assembly-jetty-base ---
[INFO] Skipping JaCoCo execution due to missing execution data file.
[INFO] 
[INFO] --- maven-source-plugin:2.4:jar-no-fork (attach-sources) @ kapua-assembly-jetty-base ---
[INFO] 
[INFO] --- jacoco-extras:0.1.1:xml (default) @ kapua-assembly-jetty-base ---
[INFO] 
[INFO] ----------------< org.eclipse.kapua:kapua-assembly-sql >----------------
[INFO] Building kapua-assembly-sql 1.5.0-SNAPSHOT                     [178/190]
[INFO] --------------------------------[ pom ]---------------------------------
[INFO] 
[INFO] --- maven-checkstyle-plugin:2.17:check (checkstyle-check) @ kapua-assembly-sql ---
[INFO] 
[INFO] --- jacoco-maven-plugin:0.7.9:prepare-agent (default-prepare-agent) @ kapua-assembly-sql ---
[INFO] argLine set to -javaagent:/home/jenkins/agent/workspace/develop/.repository/org/jacoco/org.jacoco.agent/0.7.9/org.jacoco.agent-0.7.9-runtime.jar=destfile=/home/jenkins/agent/workspace/develop/assembly/sql/target/jacoco.exec
[INFO] 
[INFO] --- jacoco-maven-plugin:0.7.9:report (default-report) @ kapua-assembly-sql ---
[INFO] Skipping JaCoCo execution due to missing execution data file.
[INFO] 
[INFO] --- maven-source-plugin:2.4:jar-no-fork (attach-sources) @ kapua-assembly-sql ---
[INFO] 
[INFO] --- jacoco-extras:0.1.1:xml (default) @ kapua-assembly-sql ---
[INFO] 
[INFO] -----------< org.eclipse.kapua:kapua-assembly-events-broker >-----------
[INFO] Building kapua-assembly-events-broker 1.5.0-SNAPSHOT           [179/190]
[INFO] --------------------------------[ pom ]---------------------------------
[INFO] 
[INFO] --- maven-checkstyle-plugin:2.17:check (checkstyle-check) @ kapua-assembly-events-broker ---
[INFO] 
[INFO] --- jacoco-maven-plugin:0.7.9:prepare-agent (default-prepare-agent) @ kapua-assembly-events-broker ---
[INFO] argLine set to -javaagent:/home/jenkins/agent/workspace/develop/.repository/org/jacoco/org.jacoco.agent/0.7.9/org.jacoco.agent-0.7.9-runtime.jar=destfile=/home/jenkins/agent/workspace/develop/assembly/events-broker/target/jacoco.exec
[INFO] 
[INFO] --- jacoco-maven-plugin:0.7.9:report (default-report) @ kapua-assembly-events-broker ---
[INFO] Skipping JaCoCo execution due to missing execution data file.
[INFO] 
[INFO] --- maven-source-plugin:2.4:jar-no-fork (attach-sources) @ kapua-assembly-events-broker ---
[INFO] 
[INFO] --- jacoco-extras:0.1.1:xml (default) @ kapua-assembly-events-broker ---
[INFO] 
[INFO] --------------< org.eclipse.kapua:kapua-assembly-broker >---------------
[INFO] Building kapua-assembly-broker 1.5.0-SNAPSHOT                  [180/190]
[INFO] --------------------------------[ pom ]---------------------------------
[INFO] 
[INFO] --- maven-checkstyle-plugin:2.17:check (checkstyle-check) @ kapua-assembly-broker ---
[INFO] 
[INFO] --- jacoco-maven-plugin:0.7.9:prepare-agent (default-prepare-agent) @ kapua-assembly-broker ---
[INFO] argLine set to -javaagent:/home/jenkins/agent/workspace/develop/.repository/org/jacoco/org.jacoco.agent/0.7.9/org.jacoco.agent-0.7.9-runtime.jar=destfile=/home/jenkins/agent/workspace/develop/assembly/broker/target/jacoco.exec
[INFO] 
[INFO] --- maven-dependency-plugin:3.0.1:unpack (unpack-activemq) @ kapua-assembly-broker ---
[INFO] Configured Artifact: org.apache.activemq:apache-activemq:bin:?:tar.gz
[INFO] apache-activemq-5.14.5-bin.tar.gz already unpacked.
[INFO] 
[INFO] --- jacoco-maven-plugin:0.7.9:report (default-report) @ kapua-assembly-broker ---
[INFO] Skipping JaCoCo execution due to missing execution data file.
[INFO] 
[INFO] --- maven-source-plugin:2.4:jar-no-fork (attach-sources) @ kapua-assembly-broker ---
[INFO] 
[INFO] --- maven-assembly-plugin:3.0.0:single (kapua-broker) @ kapua-assembly-broker ---
[INFO] Reading assembly descriptor: descriptors/kapua-broker.xml
[INFO] Building tar: /home/jenkins/agent/workspace/develop/assembly/broker/target/kapua-broker-1.5.0-SNAPSHOT.tar.gz
[INFO] 
[INFO] --- maven-dependency-plugin:3.0.1:copy (copy) @ kapua-assembly-broker ---
[INFO] Configured Artifact: com.google.guava:guava:?:jar
[INFO] Configured Artifact: com.google.guava:failureaccess:?:jar
[INFO] Configured Artifact: com.google.guava:listenablefuture:?:jar
[INFO] Configured Artifact: com.google.inject:guice:?:jar
[INFO] Configured Artifact: javax.inject:javax.inject:1:jar
[INFO] Configured Artifact: aopalliance:aopalliance:?:jar
[INFO] Configured Artifact: org.eclipse.persistence:javax.persistence:?:jar
[INFO] Configured Artifact: org.eclipse.persistence:org.eclipse.persistence.jpa:?:jar
[INFO] Configured Artifact: org.eclipse.persistence:org.eclipse.persistence.core:?:jar
[INFO] Configured Artifact: org.eclipse.persistence:org.eclipse.persistence.asm:?:jar
[INFO] Configured Artifact: org.eclipse.persistence:org.eclipse.persistence.jpa.jpql:?:jar
[INFO] Configured Artifact: org.eclipse.persistence:org.eclipse.persistence.moxy:?:jar
[INFO] Configured Artifact: commons-configuration:commons-configuration:?:jar
[INFO] Configured Artifact: org.springframework.security:spring-security-core:?:jar
[INFO] Configured Artifact: io.dropwizard.metrics:metrics-core:?:jar
[INFO] Configured Artifact: com.h2database:h2:?:jar
[INFO] Configured Artifact: com.google.protobuf:protobuf-java:?:jar
[INFO] Configured Artifact: org.apache.shiro:shiro-core:1.5.3:jar
[INFO] Configured Artifact: org.eclipse.paho:org.eclipse.paho.client.mqttv3:1.2.1:jar
[INFO] Configured Artifact: org.apache.qpid:qpid-jms-client:0.40.0:jar
[INFO] Configured Artifact: org.apache.qpid:proton-j:0.31.0:jar
[INFO] Configured Artifact: org.apache.commons:commons-pool2:2.3:jar
[INFO] Configured Artifact: org.bitbucket.b_c:jose4j:0.7.0:jar
[INFO] Configured Artifact: org.elasticsearch:elasticsearch:6.8.7:jar
[INFO] Configured Artifact: org.reflections:reflections:0.9.10:jar
[INFO] Configured Artifact: org.javassist:javassist:3.19.0-GA:jar
[INFO] Configured Artifact: commons-io:commons-io:2.4:jar
[INFO] Configured Artifact: org.apache.commons:commons-lang3:3.4:jar
[INFO] Configured Artifact: commons-collections:commons-collections:3.2.2:jar
[INFO] Configured Artifact: org.liquibase:liquibase-core:3.6.3:jar
[INFO] Configured Artifact: org.yaml:snakeyaml:1.28:jar
[INFO] Copying guava-30.1-jre.jar to /home/jenkins/agent/workspace/develop/assembly/broker/target/broker_dependency/guava-30.1-jre.jar
[INFO] Copying failureaccess-1.0.1.jar to /home/jenkins/agent/workspace/develop/assembly/broker/target/broker_dependency/failureaccess-1.0.1.jar
[INFO] Copying listenablefuture-9999.0-empty-to-avoid-conflict-with-guava.jar to /home/jenkins/agent/workspace/develop/assembly/broker/target/broker_dependency/listenablefuture-9999.0-empty-to-avoid-conflict-with-guava.jar
[INFO] Copying guice-4.1.0.jar to /home/jenkins/agent/workspace/develop/assembly/broker/target/broker_dependency/guice-4.1.0.jar
[INFO] Copying javax.inject-1.jar to /home/jenkins/agent/workspace/develop/assembly/broker/target/broker_dependency/javax.inject-1.jar
[INFO] Copying aopalliance-1.0.jar to /home/jenkins/agent/workspace/develop/assembly/broker/target/broker_dependency/aopalliance-1.0.jar
[INFO] Copying javax.persistence-2.1.1.jar to /home/jenkins/agent/workspace/develop/assembly/broker/target/broker_dependency/javax.persistence-2.1.1.jar
[INFO] Copying org.eclipse.persistence.jpa-2.7.7.jar to /home/jenkins/agent/workspace/develop/assembly/broker/target/broker_dependency/org.eclipse.persistence.jpa-2.7.7.jar
[INFO] Copying org.eclipse.persistence.core-2.7.7.jar to /home/jenkins/agent/workspace/develop/assembly/broker/target/broker_dependency/org.eclipse.persistence.core-2.7.7.jar
[INFO] Copying org.eclipse.persistence.asm-2.7.7.jar to /home/jenkins/agent/workspace/develop/assembly/broker/target/broker_dependency/org.eclipse.persistence.asm-2.7.7.jar
[INFO] Copying org.eclipse.persistence.jpa.jpql-2.7.7.jar to /home/jenkins/agent/workspace/develop/assembly/broker/target/broker_dependency/org.eclipse.persistence.jpa.jpql-2.7.7.jar
[INFO] Copying org.eclipse.persistence.moxy-2.7.7.jar to /home/jenkins/agent/workspace/develop/assembly/broker/target/broker_dependency/org.eclipse.persistence.moxy-2.7.7.jar
[INFO] Copying commons-configuration-1.9.jar to /home/jenkins/agent/workspace/develop/assembly/broker/target/broker_dependency/commons-configuration-1.9.jar
[INFO] Copying spring-security-core-4.1.3.RELEASE.jar to /home/jenkins/agent/workspace/develop/assembly/broker/target/broker_dependency/spring-security-core-4.1.3.RELEASE.jar
[INFO] Copying metrics-core-3.2.2.jar to /home/jenkins/agent/workspace/develop/assembly/broker/target/broker_dependency/metrics-core-3.2.2.jar
[INFO] Copying h2-1.4.199.jar to /home/jenkins/agent/workspace/develop/assembly/broker/target/broker_dependency/h2-1.4.199.jar
[INFO] Copying protobuf-java-3.8.0.jar to /home/jenkins/agent/workspace/develop/assembly/broker/target/broker_dependency/protobuf-java-3.8.0.jar
[INFO] Copying shiro-core-1.5.3.jar to /home/jenkins/agent/workspace/develop/assembly/broker/target/broker_dependency/shiro-core-1.5.3.jar
[INFO] Copying org.eclipse.paho.client.mqttv3-1.2.1.jar to /home/jenkins/agent/workspace/develop/assembly/broker/target/broker_dependency/org.eclipse.paho.client.mqttv3-1.2.1.jar
[INFO] Copying qpid-jms-client-0.40.0.jar to /home/jenkins/agent/workspace/develop/assembly/broker/target/broker_dependency/qpid-jms-client-0.40.0.jar
[INFO] Copying proton-j-0.31.0.jar to /home/jenkins/agent/workspace/develop/assembly/broker/target/broker_dependency/proton-j-0.31.0.jar
[INFO] Copying commons-pool2-2.3.jar to /home/jenkins/agent/workspace/develop/assembly/broker/target/broker_dependency/commons-pool2-2.3.jar
[INFO] Copying jose4j-0.7.0.jar to /home/jenkins/agent/workspace/develop/assembly/broker/target/broker_dependency/jose4j-0.7.0.jar
[INFO] Copying elasticsearch-6.8.7.jar to /home/jenkins/agent/workspace/develop/assembly/broker/target/broker_dependency/elasticsearch-6.8.7.jar
[INFO] Copying reflections-0.9.10.jar to /home/jenkins/agent/workspace/develop/assembly/broker/target/broker_dependency/reflections-0.9.10.jar
[INFO] Copying javassist-3.19.0-GA.jar to /home/jenkins/agent/workspace/develop/assembly/broker/target/broker_dependency/javassist-3.19.0-GA.jar
[INFO] Copying commons-io-2.4.jar to /home/jenkins/agent/workspace/develop/assembly/broker/target/broker_dependency/commons-io-2.4.jar
[INFO] Copying commons-lang3-3.4.jar to /home/jenkins/agent/workspace/develop/assembly/broker/target/broker_dependency/commons-lang3-3.4.jar
[INFO] Copying commons-collections-3.2.2.jar to /home/jenkins/agent/workspace/develop/assembly/broker/target/broker_dependency/commons-collections-3.2.2.jar
[INFO] Copying liquibase-core-3.6.3.jar to /home/jenkins/agent/workspace/develop/assembly/broker/target/broker_dependency/liquibase-core-3.6.3.jar
[INFO] Copying snakeyaml-1.28.jar to /home/jenkins/agent/workspace/develop/assembly/broker/target/broker_dependency/snakeyaml-1.28.jar
[INFO] 
[INFO] --- jacoco-extras:0.1.1:xml (default) @ kapua-assembly-broker ---
[INFO] 
[INFO] ----------------< org.eclipse.kapua:kapua-assembly-api >----------------
[INFO] Building kapua-assembly-api 1.5.0-SNAPSHOT                     [181/190]
[INFO] --------------------------------[ pom ]---------------------------------
[INFO] 
[INFO] --- maven-checkstyle-plugin:2.17:check (checkstyle-check) @ kapua-assembly-api ---
[INFO] 
[INFO] --- jacoco-maven-plugin:0.7.9:prepare-agent (default-prepare-agent) @ kapua-assembly-api ---
[INFO] argLine set to -javaagent:/home/jenkins/agent/workspace/develop/.repository/org/jacoco/org.jacoco.agent/0.7.9/org.jacoco.agent-0.7.9-runtime.jar=destfile=/home/jenkins/agent/workspace/develop/assembly/api/target/jacoco.exec
[INFO] 
[INFO] --- frontend-maven-plugin:1.8.0:install-node-and-npm (install-node-and-npm) @ kapua-assembly-api ---
[INFO] testFailureIgnore property is ignored in non test phases
[INFO] Node v10.16.3 is already installed.
[INFO] 
[INFO] --- frontend-maven-plugin:1.8.0:npm (install-swagger-cli) @ kapua-assembly-api ---
[INFO] testFailureIgnore property is ignored in non test phases
[INFO] Running 'npm install -g @apidevtools/swagger-cli@4.0.2' in /home/jenkins/agent/workspace/develop/assembly/api
[INFO] /home/jenkins/agent/workspace/develop/assembly/api/target/bin/swagger-cli -> /home/jenkins/agent/workspace/develop/assembly/api/target/lib/node_modules/@apidevtools/swagger-cli/bin/swagger-cli.js
[INFO] + @apidevtools/swagger-cli@4.0.2
[INFO] updated 1 package in 2.291s
[INFO] 
[INFO] --- jacoco-maven-plugin:0.7.9:report (default-report) @ kapua-assembly-api ---
[INFO] Skipping JaCoCo execution due to missing execution data file.
[INFO] 
[INFO] --- maven-dependency-plugin:3.0.1:unpack (unpack-swagger-ui) @ kapua-assembly-api ---
[INFO] Configured Artifact: org.webjars:swagger-ui:3.23.0:jar
[INFO] Unpacking /home/jenkins/agent/workspace/develop/.repository/org/webjars/swagger-ui/3.23.0/swagger-ui-3.23.0.jar to /home/jenkins/agent/workspace/develop/assembly/api/target/tmp/swagger-ui with includes "" and excludes ""
[INFO] 
[INFO] --- maven-dependency-plugin:3.0.1:unpack (unpack-openapi) @ kapua-assembly-api ---
[INFO] Configured Artifact: org.eclipse.kapua:kapua-rest-api-resources:1.5.0-SNAPSHOT:jar
[INFO] Unpacking /home/jenkins/agent/workspace/develop/rest-api/resources/target/kapua-rest-api-resources-1.5.0-SNAPSHOT.jar to /home/jenkins/agent/workspace/develop/assembly/api/target/tmp with includes "openapi/**/*" and excludes ""
[INFO] 
[INFO] --- exec-maven-plugin:1.6.0:exec (copy-openapi) @ kapua-assembly-api ---
(node:16252) ExperimentalWarning: The fs.promises API is experimental
Created /home/jenkins/agent/workspace/develop/assembly/api/target/tmp/openapi.yaml from /home/jenkins/agent/workspace/develop/assembly/api/target/tmp/openapi/openapi.yaml
[INFO] 
[INFO] --- maven-source-plugin:2.4:jar-no-fork (attach-sources) @ kapua-assembly-api ---
[INFO] 
[INFO] --- maven-assembly-plugin:3.0.0:single (kapua-api) @ kapua-assembly-api ---
[INFO] Reading assembly descriptor: /home/jenkins/agent/workspace/develop/assembly/api/descriptors/kapua-api-jetty.xml
[INFO] Building tar: /home/jenkins/agent/workspace/develop/assembly/api/target/kapua-api-1.5.0-SNAPSHOT.tar.gz
[INFO] 
[INFO] --- jacoco-extras:0.1.1:xml (default) @ kapua-assembly-api ---
[INFO] 
[INFO] ------------< org.eclipse.kapua:kapua-assembly-job-engine >-------------
[INFO] Building kapua-assembly-job-engine 1.5.0-SNAPSHOT              [182/190]
[INFO] --------------------------------[ jar ]---------------------------------
[INFO] 
[INFO] --- maven-checkstyle-plugin:2.17:check (checkstyle-check) @ kapua-assembly-job-engine ---
[INFO] 
[INFO] --- jacoco-maven-plugin:0.7.9:prepare-agent (default-prepare-agent) @ kapua-assembly-job-engine ---
[INFO] argLine set to -javaagent:/home/jenkins/agent/workspace/develop/.repository/org/jacoco/org.jacoco.agent/0.7.9/org.jacoco.agent-0.7.9-runtime.jar=destfile=/home/jenkins/agent/workspace/develop/assembly/job-engine/target/jacoco.exec
[INFO] 
[INFO] --- maven-resources-plugin:3.0.2:resources (default-resources) @ kapua-assembly-job-engine ---
[INFO] Using 'UTF-8' encoding to copy filtered resources.
[INFO] skip non existing resourceDirectory /home/jenkins/agent/workspace/develop/assembly/job-engine/src/main/resources
[INFO] 
[INFO] --- maven-compiler-plugin:3.6.1:compile (default-compile) @ kapua-assembly-job-engine ---
[INFO] No sources to compile
[INFO] 
[INFO] --- maven-resources-plugin:3.0.2:testResources (default-testResources) @ kapua-assembly-job-engine ---
[INFO] Using 'UTF-8' encoding to copy filtered resources.
[INFO] skip non existing resourceDirectory /home/jenkins/agent/workspace/develop/assembly/job-engine/src/test/resources
[INFO] 
[INFO] --- maven-compiler-plugin:3.6.1:testCompile (default-testCompile) @ kapua-assembly-job-engine ---
[INFO] No sources to compile
[INFO] 
[INFO] --- maven-surefire-plugin:2.20:test (default-test) @ kapua-assembly-job-engine ---
[INFO] No tests to run.
[INFO] 
[INFO] --- jacoco-maven-plugin:0.7.9:report (default-report) @ kapua-assembly-job-engine ---
[INFO] Skipping JaCoCo execution due to missing execution data file.
[INFO] 
[INFO] --- maven-jar-plugin:2.4:jar (default-jar) @ kapua-assembly-job-engine ---
[WARNING] JAR will be empty - no content was marked for inclusion!
[INFO] 
[INFO] --- maven-source-plugin:2.4:jar-no-fork (attach-sources) @ kapua-assembly-job-engine ---
[INFO] No sources in project. Archive not created.
[INFO] 
[INFO] --- maven-assembly-plugin:3.0.0:single (kapua-job-engine) @ kapua-assembly-job-engine ---
[INFO] Reading assembly descriptor: /home/jenkins/agent/workspace/develop/assembly/job-engine/descriptors/kapua-job-engine-jetty.xml
[INFO] Building tar: /home/jenkins/agent/workspace/develop/assembly/job-engine/target/kapua-job-engine-1.5.0-SNAPSHOT.tar.gz
[INFO] 
[INFO] --- jacoco-extras:0.1.1:xml (default) @ kapua-assembly-job-engine ---
[INFO] 
[INFO] -----------------< org.eclipse.kapua:kapua-dev-tools >------------------
[INFO] Building kapua-dev-tools 1.5.0-SNAPSHOT                        [183/190]
[INFO] --------------------------------[ pom ]---------------------------------
[INFO] 
[INFO] --- maven-checkstyle-plugin:2.17:check (checkstyle-check) @ kapua-dev-tools ---
[INFO] 
[INFO] --- jacoco-maven-plugin:0.7.9:prepare-agent (default-prepare-agent) @ kapua-dev-tools ---
[INFO] argLine set to -javaagent:/home/jenkins/agent/workspace/develop/.repository/org/jacoco/org.jacoco.agent/0.7.9/org.jacoco.agent-0.7.9-runtime.jar=destfile=/home/jenkins/agent/workspace/develop/dev-tools/target/jacoco.exec
[INFO] 
[INFO] --- jacoco-maven-plugin:0.7.9:report (default-report) @ kapua-dev-tools ---
[INFO] Skipping JaCoCo execution due to missing execution data file.
[INFO] 
[INFO] --- maven-source-plugin:2.4:jar-no-fork (attach-sources) @ kapua-dev-tools ---
[INFO] 
[INFO] --- jacoco-extras:0.1.1:xml (default) @ kapua-dev-tools ---
[INFO] 
[INFO] --------------< org.eclipse.kapua:kapua-cucumber-reports >--------------
[INFO] Building kapua-cucumber-reports 1.5.0-SNAPSHOT                 [184/190]
[INFO] --------------------------------[ pom ]---------------------------------
[INFO] 
[INFO] --- maven-checkstyle-plugin:2.17:check (checkstyle-check) @ kapua-cucumber-reports ---
[INFO] 
[INFO] --- jacoco-maven-plugin:0.7.9:prepare-agent (default-prepare-agent) @ kapua-cucumber-reports ---
[INFO] argLine set to -javaagent:/home/jenkins/agent/workspace/develop/.repository/org/jacoco/org.jacoco.agent/0.7.9/org.jacoco.agent-0.7.9-runtime.jar=destfile=/home/jenkins/agent/workspace/develop/dev-tools/cucumber-reports/target/jacoco.exec
[INFO] 
[INFO] --- jacoco-maven-plugin:0.7.9:report (default-report) @ kapua-cucumber-reports ---
[INFO] Skipping JaCoCo execution due to missing execution data file.
[INFO] 
[INFO] --- maven-source-plugin:2.4:jar-no-fork (attach-sources) @ kapua-cucumber-reports ---
[INFO] 
[INFO] --- maven-assembly-plugin:3.0.0:single (kapua-cucumber-report) @ kapua-cucumber-reports ---
[INFO] Reading assembly descriptor: src/main/descriptors/kapua-cucumber-report.xml
[INFO] Copying files to /home/jenkins/agent/workspace/develop/dev-tools/cucumber-reports/target/kapua-cucumber-report
[INFO] 
[INFO] --- jacoco-extras:0.1.1:xml (default) @ kapua-cucumber-reports ---
[INFO] 
[INFO] -------------< org.eclipse.kapua:kapua-dev-tools-vagrant >--------------
[INFO] Building kapua-dev-tools-vagrant 1.5.0-SNAPSHOT                [185/190]
[INFO] --------------------------------[ pom ]---------------------------------
[INFO] 
[INFO] --- maven-checkstyle-plugin:2.17:check (checkstyle-check) @ kapua-dev-tools-vagrant ---
[INFO] 
[INFO] --- jacoco-maven-plugin:0.7.9:prepare-agent (default-prepare-agent) @ kapua-dev-tools-vagrant ---
[INFO] argLine set to -javaagent:/home/jenkins/agent/workspace/develop/.repository/org/jacoco/org.jacoco.agent/0.7.9/org.jacoco.agent-0.7.9-runtime.jar=destfile=/home/jenkins/agent/workspace/develop/dev-tools/vagrant/target/jacoco.exec
[INFO] 
[INFO] --- maven-dependency-plugin:3.0.1:copy-dependencies (Copy provided dependencies) @ kapua-dev-tools-vagrant ---
[INFO] com.h2database:h2:jar:1.4.199 already exists in destination.
[INFO] 
[INFO] --- jacoco-maven-plugin:0.7.9:report (default-report) @ kapua-dev-tools-vagrant ---
[INFO] Skipping JaCoCo execution due to missing execution data file.
[INFO] 
[INFO] --- maven-source-plugin:2.4:jar-no-fork (attach-sources) @ kapua-dev-tools-vagrant ---
[INFO] 
[INFO] --- jacoco-extras:0.1.1:xml (default) @ kapua-dev-tools-vagrant ---
[INFO] 
[INFO] -----------------< org.eclipse.kapua:kapua-deployment >-----------------
[INFO] Building kapua-deployment 1.5.0-SNAPSHOT                       [186/190]
[INFO] --------------------------------[ pom ]---------------------------------
[INFO] 
[INFO] --- maven-checkstyle-plugin:2.17:check (checkstyle-check) @ kapua-deployment ---
[INFO] 
[INFO] --- jacoco-maven-plugin:0.7.9:prepare-agent (default-prepare-agent) @ kapua-deployment ---
[INFO] argLine set to -javaagent:/home/jenkins/agent/workspace/develop/.repository/org/jacoco/org.jacoco.agent/0.7.9/org.jacoco.agent-0.7.9-runtime.jar=destfile=/home/jenkins/agent/workspace/develop/deployment/target/jacoco.exec
[INFO] 
[INFO] --- jacoco-maven-plugin:0.7.9:report (default-report) @ kapua-deployment ---
[INFO] Skipping JaCoCo execution due to missing execution data file.
[INFO] 
[INFO] --- maven-source-plugin:2.4:jar-no-fork (attach-sources) @ kapua-deployment ---
[INFO] 
[INFO] --- jacoco-extras:0.1.1:xml (default) @ kapua-deployment ---
[INFO] 
[INFO] -------------------< org.eclipse.kapua:kapua-docker >-------------------
[INFO] Building kapua-docker 1.5.0-SNAPSHOT                           [187/190]
[INFO] --------------------------------[ pom ]---------------------------------
[INFO] 
[INFO] --- maven-checkstyle-plugin:2.17:check (checkstyle-check) @ kapua-docker ---
[INFO] 
[INFO] --- jacoco-maven-plugin:0.7.9:prepare-agent (default-prepare-agent) @ kapua-docker ---
[INFO] argLine set to -javaagent:/home/jenkins/agent/workspace/develop/.repository/org/jacoco/org.jacoco.agent/0.7.9/org.jacoco.agent-0.7.9-runtime.jar=destfile=/home/jenkins/agent/workspace/develop/deployment/docker/target/jacoco.exec
[INFO] 
[INFO] --- jacoco-maven-plugin:0.7.9:report (default-report) @ kapua-docker ---
[INFO] Skipping JaCoCo execution due to missing execution data file.
[INFO] 
[INFO] --- maven-source-plugin:2.4:jar-no-fork (attach-sources) @ kapua-docker ---
[INFO] 
[INFO] --- jacoco-extras:0.1.1:xml (default) @ kapua-docker ---
[INFO] 
[INFO] -----------------< org.eclipse.kapua:kapua-minishift >------------------
[INFO] Building kapua-minishift 1.5.0-SNAPSHOT                        [188/190]
[INFO] --------------------------------[ pom ]---------------------------------
[INFO] 
[INFO] --- maven-checkstyle-plugin:2.17:check (checkstyle-check) @ kapua-minishift ---
[INFO] 
[INFO] --- jacoco-maven-plugin:0.7.9:prepare-agent (default-prepare-agent) @ kapua-minishift ---
[INFO] argLine set to -javaagent:/home/jenkins/agent/workspace/develop/.repository/org/jacoco/org.jacoco.agent/0.7.9/org.jacoco.agent-0.7.9-runtime.jar=destfile=/home/jenkins/agent/workspace/develop/deployment/minishift/target/jacoco.exec
[INFO] 
[INFO] --- jacoco-maven-plugin:0.7.9:report (default-report) @ kapua-minishift ---
[INFO] Skipping JaCoCo execution due to missing execution data file.
[INFO] 
[INFO] --- maven-source-plugin:2.4:jar-no-fork (attach-sources) @ kapua-minishift ---
[INFO] 
[INFO] --- jacoco-extras:0.1.1:xml (default) @ kapua-minishift ---
[INFO] 
[INFO] -----------------< org.eclipse.kapua:kapua-openshift >------------------
[INFO] Building kapua-openshift 1.5.0-SNAPSHOT                        [189/190]
[INFO] --------------------------------[ pom ]---------------------------------
[INFO] 
[INFO] --- maven-checkstyle-plugin:2.17:check (checkstyle-check) @ kapua-openshift ---
[INFO] 
[INFO] --- jacoco-maven-plugin:0.7.9:prepare-agent (default-prepare-agent) @ kapua-openshift ---
[INFO] argLine set to -javaagent:/home/jenkins/agent/workspace/develop/.repository/org/jacoco/org.jacoco.agent/0.7.9/org.jacoco.agent-0.7.9-runtime.jar=destfile=/home/jenkins/agent/workspace/develop/deployment/openshift/target/jacoco.exec
[INFO] 
[INFO] --- jacoco-maven-plugin:0.7.9:report (default-report) @ kapua-openshift ---
[INFO] Skipping JaCoCo execution due to missing execution data file.
[INFO] 
[INFO] --- maven-source-plugin:2.4:jar-no-fork (attach-sources) @ kapua-openshift ---
[INFO] 
[INFO] --- jacoco-extras:0.1.1:xml (default) @ kapua-openshift ---
[INFO] 
[INFO] -------------< org.eclipse.kapua:kapua-deployment-commons >-------------
[INFO] Building kapua-deployment-commons 1.5.0-SNAPSHOT               [190/190]
[INFO] --------------------------------[ pom ]---------------------------------
[INFO] 
[INFO] --- maven-checkstyle-plugin:2.17:check (checkstyle-check) @ kapua-deployment-commons ---
[INFO] 
[INFO] --- jacoco-maven-plugin:0.7.9:prepare-agent (default-prepare-agent) @ kapua-deployment-commons ---
[INFO] argLine set to -javaagent:/home/jenkins/agent/workspace/develop/.repository/org/jacoco/org.jacoco.agent/0.7.9/org.jacoco.agent-0.7.9-runtime.jar=destfile=/home/jenkins/agent/workspace/develop/deployment/commons/target/jacoco.exec
[INFO] 
[INFO] --- jacoco-maven-plugin:0.7.9:report (default-report) @ kapua-deployment-commons ---
[INFO] Skipping JaCoCo execution due to missing execution data file.
[INFO] 
[INFO] --- maven-source-plugin:2.4:jar-no-fork (attach-sources) @ kapua-deployment-commons ---
[INFO] 
[INFO] --- jacoco-extras:0.1.1:xml (default) @ kapua-deployment-commons ---
[INFO] 
[INFO] ----------------------< org.eclipse.kapua:kapua >-----------------------
[INFO] Building kapua 1.5.0-SNAPSHOT                                  [191/190]
[INFO] --------------------------------[ pom ]---------------------------------
[WARNING] Failed to retrieve plugin descriptor for org.apache.maven.plugins:maven-deploy-plugin:2.8.2: Plugin org.apache.maven.plugins:maven-deploy-plugin:2.8.2 or one of its dependencies could not be resolved: Failed to read artifact descriptor for org.apache.maven.plugins:maven-deploy-plugin:jar:2.8.2
[WARNING] Failed to retrieve plugin descriptor for org.apache.maven.plugins:maven-antrun-plugin:1.8: Plugin org.apache.maven.plugins:maven-antrun-plugin:1.8 or one of its dependencies could not be resolved: Failed to read artifact descriptor for org.apache.maven.plugins:maven-antrun-plugin:jar:1.8
[WARNING] Failed to retrieve plugin descriptor for org.apache.maven.plugins:maven-deploy-plugin:2.8.2: Plugin org.apache.maven.plugins:maven-deploy-plugin:2.8.2 or one of its dependencies could not be resolved: Failed to read artifact descriptor for org.apache.maven.plugins:maven-deploy-plugin:jar:2.8.2
[WARNING] Failed to retrieve plugin descriptor for org.apache.maven.plugins:maven-enforcer-plugin:1.4.1: Plugin org.apache.maven.plugins:maven-enforcer-plugin:1.4.1 or one of its dependencies could not be resolved: Failed to read artifact descriptor for org.apache.maven.plugins:maven-enforcer-plugin:jar:1.4.1
[WARNING] Failed to retrieve plugin descriptor for io.fabric8:docker-maven-plugin:0.24.0: Plugin io.fabric8:docker-maven-plugin:0.24.0 or one of its dependencies could not be resolved: Failed to read artifact descriptor for io.fabric8:docker-maven-plugin:jar:0.24.0
[WARNING] Failed to retrieve plugin descriptor for org.codehaus.mojo:sql-maven-plugin:1.5: Plugin org.codehaus.mojo:sql-maven-plugin:1.5 or one of its dependencies could not be resolved: Failed to read artifact descriptor for org.codehaus.mojo:sql-maven-plugin:jar:1.5
[WARNING] Failed to retrieve plugin descriptor for org.codehaus.mojo:license-maven-plugin:1.9: Plugin org.codehaus.mojo:license-maven-plugin:1.9 or one of its dependencies could not be resolved: Failed to read artifact descriptor for org.codehaus.mojo:license-maven-plugin:jar:1.9
[WARNING] Failed to retrieve plugin descriptor for org.eclipse.m2e:lifecycle-mapping:1.0.0: Plugin org.eclipse.m2e:lifecycle-mapping:1.0.0 or one of its dependencies could not be resolved: Failed to read artifact descriptor for org.eclipse.m2e:lifecycle-mapping:jar:1.0.0
[WARNING] Failed to retrieve plugin descriptor for org.liquibase:liquibase-maven-plugin:3.6.3: Plugin org.liquibase:liquibase-maven-plugin:3.6.3 or one of its dependencies could not be resolved: Failed to read artifact descriptor for org.liquibase:liquibase-maven-plugin:jar:3.6.3
[INFO] 
[INFO] --- sonar-maven-plugin:3.9.0.2155:sonar (default-cli) @ kapua ---
[INFO] ------------------------------------------------------------------------
[INFO] Reactor Summary for kapua 1.5.0-SNAPSHOT:
[INFO] 
[INFO] kapua-build-tools .................................. SUCCESS [  0.238 s]
[INFO] kapua .............................................. FAILURE [  1.119 s]
[INFO] kapua-qa ........................................... SUCCESS [  0.516 s]
[INFO] kapua-qa-markers ................................... SUCCESS [  0.168 s]
[INFO] kapua-service ...................................... SUCCESS [  2.146 s]
[INFO] kapua-service-api .................................. SUCCESS [  6.149 s]
[INFO] kapua-account ...................................... SUCCESS [  0.109 s]
[INFO] kapua-account-api .................................. SUCCESS [  0.067 s]
[INFO] kapua-user ......................................... SUCCESS [  0.112 s]
[INFO] kapua-user-api ..................................... SUCCESS [  0.067 s]
[INFO] kapua-security ..................................... SUCCESS [  0.627 s]
[INFO] kapua-security-authorization ....................... SUCCESS [  0.077 s]
[INFO] kapua-security-authorization-api ................... SUCCESS [  0.126 s]
[INFO] kapua-security-authentication ...................... SUCCESS [  0.077 s]
[INFO] kapua-security-authentication-api .................. SUCCESS [  0.637 s]
[INFO] kapua-commons ...................................... SUCCESS [ 16.491 s]
[INFO] kapua-locator ...................................... SUCCESS [  0.046 s]
[INFO] kapua-locator-guice ................................ SUCCESS [  1.721 s]
[INFO] kapua-service-commons .............................. SUCCESS [  0.117 s]
[INFO] kapua-service-elasticsearch ........................ SUCCESS [  0.081 s]
[INFO] kapua-service-elasticsearch-client-api ............. SUCCESS [  2.155 s]
[INFO] kapua-service-elasticsearch-client-rest ............ SUCCESS [  0.097 s]
[INFO] kapua-service-elasticsearch-server-embedded ........ SUCCESS [  0.084 s]
[INFO] kapua-service-storable ............................. SUCCESS [  0.069 s]
[INFO] kapua-service-storable-api ......................... SUCCESS [  0.075 s]
[INFO] kapua-service-storable-internal .................... SUCCESS [  0.067 s]
[INFO] kapua-account-internal ............................. SUCCESS [  0.111 s]
[INFO] kapua-message ...................................... SUCCESS [  0.093 s]
[INFO] kapua-message-api .................................. SUCCESS [  0.071 s]
[INFO] kapua-device ....................................... SUCCESS [  0.650 s]
[INFO] kapua-device-api ................................... SUCCESS [  0.063 s]
[INFO] kapua-device-registry .............................. SUCCESS [  0.252 s]
[INFO] kapua-device-registry-api .......................... SUCCESS [  0.095 s]
[INFO] kapua-job .......................................... SUCCESS [  0.151 s]
[INFO] kapua-job-api ...................................... SUCCESS [  0.081 s]
[INFO] kapua-job-engine ................................... SUCCESS [  0.155 s]
[INFO] kapua-job-engine-commons ........................... SUCCESS [  0.065 s]
[INFO] kapua-broker ....................................... SUCCESS [  0.261 s]
[INFO] kapua-broker-api ................................... SUCCESS [  0.701 s]
[INFO] kapua-plug-ins ..................................... SUCCESS [  0.051 s]
[INFO] kapua-sso .......................................... SUCCESS [  0.053 s]
[INFO] kapua-openid-connect ............................... SUCCESS [  0.070 s]
[INFO] kapua-openid-api ................................... SUCCESS [  0.050 s]
[INFO] kapua-openid-provider .............................. SUCCESS [  0.055 s]
[INFO] kapua-security-registration ........................ SUCCESS [  0.044 s]
[INFO] kapua-security-registration-api .................... SUCCESS [  0.081 s]
[INFO] kapua-security-certificate ......................... SUCCESS [  0.046 s]
[INFO] kapua-security-certificate-api ..................... SUCCESS [  0.053 s]
[INFO] kapua-security-shiro ............................... SUCCESS [ 27.038 s]
[INFO] kapua-datastore .................................... SUCCESS [  0.265 s]
[INFO] kapua-datastore-api ................................ SUCCESS [  0.080 s]
[INFO] kapua-message-internal ............................. SUCCESS [  2.810 s]
[INFO] kapua-datastore-internal ........................... SUCCESS [  0.208 s]
[INFO] kapua-transport .................................... SUCCESS [  0.080 s]
[INFO] kapua-transport-api ................................ SUCCESS [  0.875 s]
[INFO] kapua-device-call .................................. SUCCESS [  0.135 s]
[INFO] kapua-device-call-api .............................. SUCCESS [  0.068 s]
[INFO] kapua-translator ................................... SUCCESS [  0.128 s]
[INFO] kapua-translator-api ............................... SUCCESS [  0.048 s]
[INFO] kapua-device-call-kura ............................. SUCCESS [  0.773 s]
[INFO] kapua-device-management ............................ SUCCESS [  0.318 s]
[INFO] kapua-device-management-api ........................ SUCCESS [  0.053 s]
[INFO] kapua-device-management-registry ................... SUCCESS [  0.056 s]
[INFO] kapua-device-management-registry-api ............... SUCCESS [  0.062 s]
[INFO] kapua-job-engine-api ............................... SUCCESS [  0.058 s]
[INFO] kapua-scheduler .................................... SUCCESS [  0.095 s]
[INFO] kapua-scheduler-api ................................ SUCCESS [  0.063 s]
[INFO] kapua-device-management-job ........................ SUCCESS [  0.041 s]
[INFO] kapua-device-management-job-api .................... SUCCESS [  0.045 s]
[INFO] kapua-tag .......................................... SUCCESS [  0.043 s]
[INFO] kapua-tag-api ...................................... SUCCESS [  0.037 s]
[INFO] kapua-transport-jms ................................ SUCCESS [  0.038 s]
[INFO] kapua-device-commons ............................... SUCCESS [  0.845 s]
[INFO] kapua-device-management-request .................... SUCCESS [  0.035 s]
[INFO] kapua-device-management-request-api ................ SUCCESS [  0.042 s]
[INFO] kapua-endpoint ..................................... SUCCESS [  0.088 s]
[INFO] kapua-endpoint-api ................................. SUCCESS [  0.036 s]
[INFO] kapua-rest-api ..................................... SUCCESS [  0.283 s]
[INFO] kapua-rest-api-core ................................ SUCCESS [  2.084 s]
[INFO] kapua-job-engine-client ............................ SUCCESS [  0.048 s]
[INFO] kapua-broker-core .................................. SUCCESS [  6.069 s]
[INFO] kapua-simulator-kura ............................... SUCCESS [  7.820 s]
[INFO] kapua-stream ....................................... SUCCESS [  0.026 s]
[INFO] kapua-stream-api ................................... SUCCESS [  0.814 s]
[INFO] kapua-device-management-asset ...................... SUCCESS [  0.042 s]
[INFO] kapua-device-management-asset-api .................. SUCCESS [  0.063 s]
[INFO] kapua-device-management-asset-internal ............. SUCCESS [  0.059 s]
[INFO] kapua-device-management-bundle ..................... SUCCESS [  0.044 s]
[INFO] kapua-device-management-bundle-api ................. SUCCESS [  0.039 s]
[INFO] kapua-device-management-bundle-internal ............ SUCCESS [  0.053 s]
[INFO] kapua-device-management-command .................... SUCCESS [  0.036 s]
[INFO] kapua-device-management-command-api ................ SUCCESS [  0.039 s]
[INFO] kapua-device-management-command-internal ........... SUCCESS [  0.060 s]
[INFO] kapua-device-management-configuration .............. SUCCESS [  0.073 s]
[INFO] kapua-device-management-configuration-api .......... SUCCESS [  0.069 s]
[INFO] kapua-device-management-configuration-internal ..... SUCCESS [  0.112 s]
[INFO] kapua-device-management-inventory .................. SUCCESS [  0.044 s]
[INFO] kapua-device-management-inventory-api .............. SUCCESS [  0.050 s]
[INFO] kapua-device-management-inventory-internal ......... SUCCESS [  0.126 s]
[INFO] kapua-device-management-packages ................... SUCCESS [  0.074 s]
[INFO] kapua-device-management-packages-api ............... SUCCESS [  0.061 s]
[INFO] kapua-device-management-packages-internal .......... SUCCESS [  0.081 s]
[INFO] kapua-device-management-request-internal ........... SUCCESS [  0.056 s]
[INFO] kapua-device-management-all ........................ SUCCESS [  0.019 s]
[INFO] kapua-device-management-all-internal ............... SUCCESS [  0.029 s]
[INFO] kapua-translator-kapua ............................. SUCCESS [  0.091 s]
[INFO] kapua-translator-kapua-kura ........................ SUCCESS [  0.123 s]
[INFO] kapua-transport-mqtt ............................... SUCCESS [  1.106 s]
[INFO] kapua-translator-kura .............................. SUCCESS [  0.033 s]
[INFO] kapua-translator-kura-mqtt ......................... SUCCESS [  0.068 s]
[INFO] kapua-translator-kura-jms .......................... SUCCESS [  0.043 s]
[INFO] kapua-qa-common .................................... SUCCESS [  0.346 s]
[INFO] kapua-account-test-steps ........................... SUCCESS [  0.066 s]
[INFO] kapua-account-test ................................. SUCCESS [ 17.798 s]
[INFO] kapua-datastore-test-steps ......................... SUCCESS [  0.175 s]
[INFO] kapua-datastore-test ............................... SUCCESS [  1.349 s]
[INFO] kapua-device-registry-internal ..................... SUCCESS [  0.872 s]
[INFO] kapua-device-registry-test-steps ................... SUCCESS [  0.155 s]
[INFO] kapua-device-registry-test ......................... SUCCESS [ 41.809 s]
[INFO] kapua-device-management-asset-job .................. SUCCESS [  0.062 s]
[INFO] kapua-device-management-bundle-job ................. SUCCESS [  0.042 s]
[INFO] kapua-device-management-command-job ................ SUCCESS [  0.041 s]
[INFO] kapua-device-management-configuration-job .......... SUCCESS [  0.041 s]
[INFO] kapua-device-management-packages-job ............... SUCCESS [  0.059 s]
[INFO] kapua-device-management-registry-internal .......... SUCCESS [  0.063 s]
[INFO] kapua-device-management-job-internal ............... SUCCESS [  0.053 s]
[INFO] kapua-device-management-all-api .................... SUCCESS [  0.026 s]
[INFO] kapua-device-management-all-job .................... SUCCESS [  0.027 s]
[INFO] kapua-endpoint-internal ............................ SUCCESS [  0.055 s]
[INFO] kapua-endpoint-test-steps .......................... SUCCESS [  0.060 s]
[INFO] kapua-job-internal ................................. SUCCESS [  0.113 s]
[INFO] kapua-job-test-steps ............................... SUCCESS [  0.092 s]
[INFO] kapua-scheduler-quartz ............................. SUCCESS [  0.115 s]
[INFO] kapua-job-test ..................................... SUCCESS [ 38.897 s]
[INFO] kapua-scheduler-test-steps ......................... SUCCESS [  0.063 s]
[INFO] kapua-scheduler-test ............................... SUCCESS [ 23.042 s]
[INFO] kapua-security-certificate-internal ................ SUCCESS [  0.050 s]
[INFO] kapua-user-internal ................................ SUCCESS [  0.064 s]
[INFO] kapua-security-registration-simple ................. SUCCESS [  0.044 s]
[INFO] kapua-security-test-steps .......................... SUCCESS [  0.113 s]
[INFO] kapua-security-test ................................ SUCCESS [ 38.311 s]
[INFO] kapua-stream-internal .............................. SUCCESS [  0.036 s]
[INFO] kapua-tag-internal ................................. SUCCESS [  0.046 s]
[INFO] kapua-tag-test-steps ............................... SUCCESS [  0.055 s]
[INFO] kapua-tag-test ..................................... SUCCESS [ 37.339 s]
[INFO] kapua-user-test-steps .............................. SUCCESS [  0.109 s]
[INFO] kapua-user-test .................................... SUCCESS [ 19.732 s]
[INFO] kapua-translator-test-steps ........................ SUCCESS [  0.071 s]
[INFO] kapua-translator-test .............................. SUCCESS [ 19.039 s]
[INFO] kapua-rest-api-resources ........................... SUCCESS [  0.239 s]
[INFO] kapua-rest-api-web ................................. SUCCESS [  7.498 s]
[INFO] kapua-qa-integration-steps ......................... SUCCESS [  0.118 s]
[INFO] kapua-job-engine-jbatch ............................ SUCCESS [  0.136 s]
[INFO] kapua-qa-integration ............................... SUCCESS [  01:35 h]
[INFO] kapua-openid-provider-generic ...................... SUCCESS [  0.071 s]
[INFO] kapua-openid-provider-keycloak ..................... SUCCESS [  0.041 s]
[INFO] kapua-extras ....................................... SUCCESS [  0.051 s]
[INFO] kapua-foreignkeys .................................. SUCCESS [  0.033 s]
[INFO] kapua-es-migrator .................................. SUCCESS [  4.284 s]
[INFO] kapua-job-engine-app ............................... SUCCESS [  0.150 s]
[INFO] kapua-job-engine-app-core .......................... SUCCESS [  0.147 s]
[INFO] kapua-job-engine-app-resources ..................... SUCCESS [  0.035 s]
[INFO] kapua-job-engine-app-web ........................... SUCCESS [  0.910 s]
[INFO] kapua-client ....................................... SUCCESS [  0.285 s]
[INFO] kapua-client-gateway ............................... SUCCESS [  1.526 s]
[INFO] Eclipse Kapua :: Gateway Client :: API ............. SUCCESS [  1.915 s]
[INFO] Eclipse Kapua :: Gateway Client :: SPI ............. SUCCESS [  6.641 s]
[INFO] Eclipse Kapua :: Gateway Client :: Provider ........ SUCCESS [  0.080 s]
[INFO] Eclipse Kapua :: Gateway Client :: Provider :: Core MQTT SUCCESS [  1.237 s]
[INFO] Eclipse Kapua :: Gateway Client :: Provider :: FUSE MQTT SUCCESS [  1.663 s]
[INFO] Eclipse Kapua :: Gateway Client :: Provider :: Eclipse Paho SUCCESS [  1.195 s]
[INFO] Eclipse Kapua :: Gateway Client :: Profile :: Eclipse Kura SUCCESS [  1.963 s]
[INFO] Eclipse Kapua :: Gateway Client :: Features ........ SUCCESS [  0.029 s]
[INFO] Eclipse Kapua :: Gateway Client :: Features :: Karaf SUCCESS [  1.131 s]
[INFO] kapua-assembly ..................................... SUCCESS [  0.080 s]
[INFO] kapua-assembly-java-base ........................... SUCCESS [  0.018 s]
[INFO] kapua-assembly-jetty-base .......................... SUCCESS [  0.018 s]
[INFO] kapua-assembly-sql ................................. SUCCESS [  0.018 s]
[INFO] kapua-assembly-events-broker ....................... SUCCESS [  0.025 s]
[INFO] kapua-assembly-broker .............................. SUCCESS [ 12.573 s]
[INFO] kapua-assembly-api ................................. SUCCESS [  8.543 s]
[INFO] kapua-assembly-job-engine .......................... SUCCESS [  1.842 s]
[INFO] kapua-dev-tools .................................... SUCCESS [  0.051 s]
[INFO] kapua-cucumber-reports ............................. SUCCESS [  0.295 s]
[INFO] kapua-dev-tools-vagrant ............................ SUCCESS [  0.019 s]
[INFO] kapua-deployment ................................... SUCCESS [  0.018 s]
[INFO] kapua-docker ....................................... SUCCESS [  0.019 s]
[INFO] kapua-minishift .................................... SUCCESS [  0.019 s]
[INFO] kapua-openshift .................................... SUCCESS [  0.022 s]
[INFO] kapua-deployment-commons ........................... SUCCESS [  0.017 s]
[INFO] ------------------------------------------------------------------------
[INFO] BUILD FAILURE
[INFO] ------------------------------------------------------------------------
[INFO] Total time:  01:42 h
[INFO] Finished at: 2021-06-07T11:46:32Z
[INFO] ------------------------------------------------------------------------
[ERROR] Failed to execute goal org.sonarsource.scanner.maven:sonar-maven-plugin:3.9.0.2155:sonar (default-cli) on project kapua: Execution default-cli of goal org.sonarsource.scanner.maven:sonar-maven-plugin:3.9.0.2155:sonar failed: Plugin org.codehaus.mojo:sonar-maven-plugin:3.9.0.2155 or one of its dependencies could not be resolved: Failed to collect dependencies at org.sonarsource.scanner.maven:sonar-maven-plugin:jar:3.9.0.2155 -> org.codehaus.plexus:plexus-utils:jar:3.2.1: Failed to read artifact descriptor for org.codehaus.plexus:plexus-utils:jar:3.2.1: Could not transfer artifact org.codehaus.plexus:plexus-utils:pom:3.2.1 from/to eclipse.maven.central.mirror (https://repo.eclipse.org/content/repositories/maven_central/): Failed to transfer file: https://repo.eclipse.org/content/repositories/maven_central/org/codehaus/plexus/plexus-utils/3.2.1/plexus-utils-3.2.1.pom. Return code is: 503 , ReasonPhrase:Service Unavailable. -> [Help 1]
[ERROR] 
[ERROR] To see the full stack trace of the errors, re-run Maven with the -e switch.
[ERROR] Re-run Maven using the -X switch to enable full debug logging.
[ERROR] 
[ERROR] For more information about the errors and possible solutions, please read the following articles:
[ERROR] [Help 1] http://cwiki.apache.org/confluence/display/MAVEN/PluginResolutionException
[ERROR] 
[ERROR] After correcting the problems, you can resume the build with the command
[ERROR]   mvn <args> -rf :kapua
Build step 'Invoke top-level Maven targets' marked build as failure
WARN: Unable to locate 'report-task.txt' in the workspace. Did the SonarScanner succeed?
[htmlpublisher] Archiving HTML reports...
[htmlpublisher] Archiving at PROJECT level /home/jenkins/agent/workspace/develop/dev-tools/cucumber-reports/target/kapua-cucumber-report to /var/jenkins/jobs/develop/htmlreports/Cucumber_20reports
Recording test results
[Checks API] No suitable checks publisher found.
Finished: FAILURE