UnstableConsole Output

Skipping 740 KB.. Full Log
9b85aBtbiIQSmjNKU4P0+vJLE4u1gvPjexLDVPzxdEGvvmZ+X75ZekLlOVfvTjc8FPJgaGiiIGKaiG5Py84vycVD1nCA1SyAABjCCFBQCV27OjYAAAAA==[INFO] --- tycho-pack200a-plugin:0.24.0:normalize (pack200-normalize) @ org.eclipse.jwt.transformations.baseTransformation ---
[INFO] Pack200 normalizing jar /home/hudson/genie.jwt/.jenkins/jobs/soa-jwt-integration/workspace/org.eclipse.jwt/transformations/jwt-transformation-base/target/org.eclipse.jwt.transformations.baseTransformation-1.6.0-SNAPSHOT.jar
[INFO] 
[INFO] --- eclipse-jarsigner-plugin:1.0.4:sign (sign) @ org.eclipse.jwt.transformations.baseTransformation ---
[INFO] Signed org.eclipse.jwt:org.eclipse.jwt.transformations.baseTransformation:eclipse-plugin:1.6.0-SNAPSHOT in 1 seconds.
[INFO] 
[INFO] --- tycho-pack200b-plugin:0.24.0:pack (pack200-pack) @ org.eclipse.jwt.transformations.baseTransformation ---
[INFO] Pack200 packing jar /home/hudson/genie.jwt/.jenkins/jobs/soa-jwt-integration/workspace/org.eclipse.jwt/transformations/jwt-transformation-base/target/org.eclipse.jwt.transformations.baseTransformation-1.6.0-SNAPSHOT.jar
[INFO] 
[INFO] --- tycho-p2-plugin:0.24.0:p2-metadata (p2-metadata) @ org.eclipse.jwt.transformations.baseTransformation ---
[INFO] 
[INFO] --- maven-install-plugin:2.3.1:install (default-install) @ org.eclipse.jwt.transformations.baseTransformation ---
[INFO] Installing /home/hudson/genie.jwt/.jenkins/jobs/soa-jwt-integration/workspace/org.eclipse.jwt/transformations/jwt-transformation-base/target/org.eclipse.jwt.transformations.baseTransformation-1.6.0-SNAPSHOT.jar to /home/hudson/genie.jwt/.jenkins/jobs/soa-jwt-integration/workspace/.repository/org/eclipse/jwt/org.eclipse.jwt.transformations.baseTransformation/1.6.0-SNAPSHOT/org.eclipse.jwt.transformations.baseTransformation-1.6.0-SNAPSHOT.jar
[INFO] Installing /home/hudson/genie.jwt/.jenkins/jobs/soa-jwt-integration/workspace/org.eclipse.jwt/transformations/jwt-transformation-base/pom.xml to /home/hudson/genie.jwt/.jenkins/jobs/soa-jwt-integration/workspace/.repository/org/eclipse/jwt/org.eclipse.jwt.transformations.baseTransformation/1.6.0-SNAPSHOT/org.eclipse.jwt.transformations.baseTransformation-1.6.0-SNAPSHOT.pom
[INFO] Installing /home/hudson/genie.jwt/.jenkins/jobs/soa-jwt-integration/workspace/org.eclipse.jwt/transformations/jwt-transformation-base/target/org.eclipse.jwt.transformations.baseTransformation-1.6.0-SNAPSHOT.jar.pack.gz to /home/hudson/genie.jwt/.jenkins/jobs/soa-jwt-integration/workspace/.repository/org/eclipse/jwt/org.eclipse.jwt.transformations.baseTransformation/1.6.0-SNAPSHOT/org.eclipse.jwt.transformations.baseTransformation-1.6.0-SNAPSHOT-pack200.jar.pack.gz
[INFO] Installing /home/hudson/genie.jwt/.jenkins/jobs/soa-jwt-integration/workspace/org.eclipse.jwt/transformations/jwt-transformation-base/target/p2content.xml to /home/hudson/genie.jwt/.jenkins/jobs/soa-jwt-integration/workspace/.repository/org/eclipse/jwt/org.eclipse.jwt.transformations.baseTransformation/1.6.0-SNAPSHOT/org.eclipse.jwt.transformations.baseTransformation-1.6.0-SNAPSHOT-p2metadata.xml
[INFO] Installing /home/hudson/genie.jwt/.jenkins/jobs/soa-jwt-integration/workspace/org.eclipse.jwt/transformations/jwt-transformation-base/target/p2artifacts.xml to /home/hudson/genie.jwt/.jenkins/jobs/soa-jwt-integration/workspace/.repository/org/eclipse/jwt/org.eclipse.jwt.transformations.baseTransformation/1.6.0-SNAPSHOT/org.eclipse.jwt.transformations.baseTransformation-1.6.0-SNAPSHOT-p2artifacts.xml
[INFO] 
[INFO] --- tycho-p2-plugin:0.24.0:update-local-index (default-update-local-index) @ org.eclipse.jwt.transformations.baseTransformation ---
[INFO]                                                                         
[INFO] ------------------------------------------------------------------------
[INFO] Building org.eclipse.jwt.transformation.stpim 1.6.0-SNAPSHOT
[INFO] ------------------------------------------------------------------------
[INFO] 
[INFO] --- maven-clean-plugin:2.5:clean (default-clean) @ org.eclipse.jwt.transformation.stpim ---
[INFO] Deleting /home/hudson/genie.jwt/.jenkins/jobs/soa-jwt-integration/workspace/org.eclipse.jwt/transformations/jwt-transformation-stpim/target
[INFO] 
[INFO] --- tycho-packaging-plugin:0.24.0:build-qualifier (default-build-qualifier) @ org.eclipse.jwt.transformation.stpim ---
[INFO] The project's OSGi version is 1.6.0.201710302203
[INFO] 
[INFO] --- tycho-packaging-plugin:0.24.0:validate-id (default-validate-id) @ org.eclipse.jwt.transformation.stpim ---
[INFO] 
[INFO] --- tycho-packaging-plugin:0.24.0:validate-version (default-validate-version) @ org.eclipse.jwt.transformation.stpim ---
[INFO] 
[INFO] --- maven-resources-plugin:2.4.3:resources (default-resources) @ org.eclipse.jwt.transformation.stpim ---
[WARNING] Using platform encoding (UTF-8 actually) to copy filtered resources, i.e. build is platform dependent!
[INFO] skip non existing resourceDirectory /home/hudson/genie.jwt/.jenkins/jobs/soa-jwt-integration/workspace/org.eclipse.jwt/transformations/jwt-transformation-stpim/src/main/resources
[INFO] 
[INFO] --- tycho-compiler-plugin:0.24.0:compile (default-compile) @ org.eclipse.jwt.transformation.stpim ---
[INFO] Compiling 2 source files to /home/hudson/genie.jwt/.jenkins/jobs/soa-jwt-integration/workspace/org.eclipse.jwt/transformations/jwt-transformation-stpim/target/classes
[INFO] 
[INFO] --- maven-resources-plugin:2.4.3:testResources (default-testResources) @ org.eclipse.jwt.transformation.stpim ---
[WARNING] Using platform encoding (UTF-8 actually) to copy filtered resources, i.e. build is platform dependent!
[INFO] skip non existing resourceDirectory /home/hudson/genie.jwt/.jenkins/jobs/soa-jwt-integration/workspace/org.eclipse.jwt/transformations/jwt-transformation-stpim/src/test/resources
[INFO] 
[INFO] --- target-platform-configuration:0.24.0:target-platform (default-target-platform) @ org.eclipse.jwt.transformation.stpim ---
[INFO] 
[INFO] --- tycho-packaging-plugin:0.24.0:package-plugin (default-package-plugin) @ org.eclipse.jwt.transformation.stpim ---
[INFO] Building jar: /home/hudson/genie.jwt/.jenkins/jobs/soa-jwt-integration/workspace/org.eclipse.jwt/transformations/jwt-transformation-stpim/target/org.eclipse.jwt.transformation.stpim-1.6.0-SNAPSHOT.jar
[INFO] 
[INFO] --- tycho-p2-plugin:0.24.0:p2-metadata-default (default-p2-metadata-default) @ org.eclipse.jwt.transformation.stpim ---
[INFO] 
[INFO] --- tycho-pack200a-plugin:0.24.0:normalize (pack200-normalize) @ org.eclipse.jwt.transformation.stpim ---
[INFO] Pack200 normalizing jar /home/hudson/genie.jwt/.jenkins/jobs/soa-jwt-integration/workspace/org.eclipse.jwt/transformations/jwt-transformation-stpim/target/org.eclipse.jwt.transformation.stpim-1.6.0-SNAPSHOT.jar
[INFO] 
[INFO] --- eclipse-jarsigner-plugin:1.0.4:sign (sign) @ org.eclipse.jwt.transformation.stpim ---
[INFO] Signed org.eclipse.jwt:org.eclipse.jwt.transformation.stpim:eclipse-plugin:1.6.0-SNAPSHOT in 0 seconds.
[INFO] 
[INFO] --- tycho-pack200b-plugin:0.24.0:pack (pack200-pack) @ org.eclipse.jwt.transformation.stpim ---
[INFO] Pack200 packing jar /home/hudson/genie.jwt/.jenkins/jobs/soa-jwt-integration/workspace/org.eclipse.jwt/transformations/jwt-transformation-stpim/target/org.eclipse.jwt.transformation.stpim-1.6.0-SNAPSHOT.jar
[INFO] 
[INFO] --- tycho-p2-plugin:0.24.0:p2-metadata (p2-metadata) @ org.eclipse.jwt.transformation.stpim ---
[INFO] 
[INFO] --- maven-install-plugin:2.3.1:install (default-install) @ org.eclipse.jwt.transformation.stpim ---
[INFO] Installing /home/hudson/genie.jwt/.jenkins/jobs/soa-jwt-integration/workspace/org.eclipse.jwt/transformations/jwt-transformation-stpim/target/org.eclipse.jwt.transformation.stpim-1.6.0-SNAPSHOT.jar to /home/hudson/genie.jwt/.jenkins/jobs/soa-jwt-integration/workspace/.repository/org/eclipse/jwt/org.eclipse.jwt.transformation.stpim/1.6.0-SNAPSHOT/org.eclipse.jwt.transformation.stpim-1.6.0-SNAPSHOT.jar
[INFO] Installing /home/hudson/genie.jwt/.jenkins/jobs/soa-jwt-integration/workspace/org.eclipse.jwt/transformations/jwt-transformation-stpim/pom.xml to /home/hudson/genie.jwt/.jenkins/jobs/soa-jwt-integration/workspace/.repository/org/eclipse/jwt/org.eclipse.jwt.transformation.stpim/1.6.0-SNAPSHOT/org.eclipse.jwt.transformation.stpim-1.6.0-SNAPSHOT.pom
[INFO] Installing /home/hudson/genie.jwt/.jenkins/jobs/soa-jwt-integration/workspace/org.eclipse.jwt/transformations/jwt-transformation-stpim/target/org.eclipse.jwt.transformation.stpim-1.6.0-SNAPSHOT.jar.pack.gz to /home/hudson/genie.jwt/.jenkins/jobs/soa-jwt-integration/workspace/.repository/org/eclipse/jwt/org.eclipse.jwt.transformation.stpim/1.6.0-SNAPSHOT/org.eclipse.jwt.transformation.stpim-1.6.0-SNAPSHOT-pack200.jar.pack.gz
[INFO] Installing /home/hudson/genie.jwt/.jenkins/jobs/soa-jwt-integration/workspace/org.eclipse.jwt/transformations/jwt-transformation-stpim/target/p2content.xml to /home/hudson/genie.jwt/.jenkins/jobs/soa-jwt-integration/workspace/.repository/org/eclipse/jwt/org.eclipse.jwt.transformation.stpim/1.6.0-SNAPSHOT/org.eclipse.jwt.transformation.stpim-1.6.0-SNAPSHOT-p2metadata.xml
[INFO] Installing /home/hudson/genie.jwt/.jenkins/jobs/soa-jwt-integration/workspace/org.eclipse.jwt/transformations/jwt-transformation-stpim/target/p2artifacts.xml to /home/hudson/genie.jwt/.jenkins/jobs/soa-jwt-integration/workspace/.repository/org/eclipse/jwt/org.eclipse.jwt.transformation.stpim/1.6.0-SNAPSHOT/org.eclipse.jwt.transformation.stpim-1.6.0-SNAPSHOT-p2artifacts.xml
[INFO] 
[INFO] --- tycho-p2-plugin:0.24.0:update-local-index (default-update-local-index) @ org.eclipse.jwt.transformation.stpim ---
[INFO]                                                                         
[INFO] ------------------------------------------------------------------------
[INFO] Building org.eclipse.jwt.transformations.bpmn 1.6.0-SNAPSHOT
[INFO] ------------------------------------------------------------------------
[INFO] 
[INFO] --- maven-clean-plugin:2.5:clean (default-clean) @ org.eclipse.jwt.transformations.bpmn ---
[INFO] Deleting /home/hudson/genie.jwt/.jenkins/jobs/soa-jwt-integration/workspace/org.eclipse.jwt/transformations/jwt-transformation-bpmn/target
[INFO] 
[INFO] --- tycho-packaging-plugin:0.24.0:build-qualifier (default-build-qualifier) @ org.eclipse.jwt.transformations.bpmn ---
[INFO] The project's OSGi version is 1.6.0.201710302203
[INFO] 
[INFO] --- tycho-packaging-plugin:0.24.0:validate-id (default-validate-id) @ org.eclipse.jwt.transformations.bpmn ---
[INFO] 
[INFO] --- tycho-packaging-plugin:0.24.0:validate-version (default-validate-version) @ org.eclipse.jwt.transformations.bpmn ---
[INFO] 
[INFO] --- maven-resources-plugin:2.4.3:resources (default-resources) @ org.eclipse.jwt.transformations.bpmn ---
[WARNING] Using platform encoding (UTF-8 actually) to copy filtered resources, i.e. build is platform dependent!
[INFO] skip non existing resourceDirectory /home/hudson/genie.jwt/.jenkins/jobs/soa-jwt-integration/workspace/org.eclipse.jwt/transformations/jwt-transformation-bpmn/src/main/resources
[INFO] 
[INFO] --- tycho-compiler-plugin:0.24.0:compile (default-compile) @ org.eclipse.jwt.transformations.bpmn ---
[INFO] Compiling 3 source files to /home/hudson/genie.jwt/.jenkins/jobs/soa-jwt-integration/workspace/org.eclipse.jwt/transformations/jwt-transformation-bpmn/target/classes
[INFO] 
[INFO] --- maven-resources-plugin:2.4.3:testResources (default-testResources) @ org.eclipse.jwt.transformations.bpmn ---
[WARNING] Using platform encoding (UTF-8 actually) to copy filtered resources, i.e. build is platform dependent!
[INFO] skip non existing resourceDirectory /home/hudson/genie.jwt/.jenkins/jobs/soa-jwt-integration/workspace/org.eclipse.jwt/transformations/jwt-transformation-bpmn/src/test/resources
[INFO] 
[INFO] --- target-platform-configuration:0.24.0:target-platform (default-target-platform) @ org.eclipse.jwt.transformations.bpmn ---
[INFO] 
[INFO] --- tycho-packaging-plugin:0.24.0:package-plugin (default-package-plugin) @ org.eclipse.jwt.transformations.bpmn ---
[INFO] Building jar: /home/hudson/genie.jwt/.jenkins/jobs/soa-jwt-integration/workspace/org.eclipse.jwt/transformations/jwt-transformation-bpmn/target/org.eclipse.jwt.transformations.bpmn-1.6.0-SNAPSHOT.jar
[INFO] 
[INFO] --- tycho-p2-plugin:0.24.0:p2-metadata-default (default-p2-metadata-default) @ org.eclipse.jwt.transformations.bpmn ---
[INFO] 
[INFO] --- tycho-pack200a-plugin:0.24.0:normalize (pack200-normalize) @ org.eclipse.jwt.transformations.bpmn ---
[INFO] Pack200 normalizing jar /home/hudson/genie.jwt/.jenkins/jobs/soa-jwt-integration/workspace/org.eclipse.jwt/transformations/jwt-transformation-bpmn/target/org.eclipse.jwt.transformations.bpmn-1.6.0-SNAPSHOT.jar
[INFO] 
[INFO] --- eclipse-jarsigner-plugin:1.0.4:sign (sign) @ org.eclipse.jwt.transformations.bpmn ---
[INFO] Signed org.eclipse.jwt:org.eclipse.jwt.transformations.bpmn:eclipse-plugin:1.6.0-SNAPSHOT in 0 seconds.
[INFO] 
[INFO] --- tycho-pack200b-plugin:0.24.0:pack (pack200-pack) @ org.eclipse.jwt.transformations.bpmn ---
[INFO] Pack200 packing jar /home/hudson/genie.jwt/.jenkins/jobs/soa-jwt-integration/workspace/org.eclipse.jwt/transformations/jwt-transformation-bpmn/target/org.eclipse.jwt.transformations.bpmn-1.6.0-SNAPSHOT.jar
[INFO] 
[INFO] --- tycho-p2-plugin:0.24.0:p2-metadata (p2-metadata) @ org.eclipse.jwt.transformations.bpmn ---
[INFO] 
[INFO] --- maven-install-plugin:2.3.1:install (default-install) @ org.eclipse.jwt.transformations.bpmn ---
[INFO] Installing /home/hudson/genie.jwt/.jenkins/jobs/soa-jwt-integration/workspace/org.eclipse.jwt/transformations/jwt-transformation-bpmn/target/org.eclipse.jwt.transformations.bpmn-1.6.0-SNAPSHOT.jar to /home/hudson/genie.jwt/.jenkins/jobs/soa-jwt-integration/workspace/.repository/org/eclipse/jwt/org.eclipse.jwt.transformations.bpmn/1.6.0-SNAPSHOT/org.eclipse.jwt.transformations.bpmn-1.6.0-SNAPSHOT.jar
[INFO] Installing /home/hudson/genie.jwt/.jenkins/jobs/soa-jwt-integration/workspace/org.eclipse.jwt/transformations/jwt-transformation-bpmn/pom.xml to /home/hudson/genie.jwt/.jenkins/jobs/soa-jwt-integration/workspace/.repository/org/eclipse/jwt/org.eclipse.jwt.transformations.bpmn/1.6.0-SNAPSHOT/org.eclipse.jwt.transformations.bpmn-1.6.0-SNAPSHOT.pom
[INFO] Installing /home/hudson/genie.jwt/.jenkins/jobs/soa-jwt-integration/workspace/org.eclipse.jwt/transformations/jwt-transformation-bpmn/target/org.eclipse.jwt.transformations.bpmn-1.6.0-SNAPSHOT.jar.pack.gz to /home/hudson/genie.jwt/.jenkins/jobs/soa-jwt-integration/workspace/.repository/org/eclipse/jwt/org.eclipse.jwt.transformations.bpmn/1.6.0-SNAPSHOT/org.eclipse.jwt.transformations.bpmn-1.6.0-SNAPSHOT-pack200.jar.pack.gz
[INFO] Installing /home/hudson/genie.jwt/.jenkins/jobs/soa-jwt-integration/workspace/org.eclipse.jwt/transformations/jwt-transformation-bpmn/target/p2content.xml to /home/hudson/genie.jwt/.jenkins/jobs/soa-jwt-integration/workspace/.repository/org/eclipse/jwt/org.eclipse.jwt.transformations.bpmn/1.6.0-SNAPSHOT/org.eclipse.jwt.transformations.bpmn-1.6.0-SNAPSHOT-p2metadata.xml
[INFO] Installing /home/hudson/genie.jwt/.jenkins/jobs/soa-jwt-integration/workspace/org.eclipse.jwt/transformations/jwt-transformation-bpmn/target/p2artifacts.xml to /home/hudson/genie.jwt/.jenkins/jobs/soa-jwt-integration/workspace/.repository/org/eclipse/jwt/org.eclipse.jwt.transformations.bpmn/1.6.0-SNAPSHOT/org.eclipse.jwt.transformations.bpmn-1.6.0-SNAPSHOT-p2artifacts.xml
[INFO] 
[INFO] --- tycho-p2-plugin:0.24.0:update-local-index (default-update-local-index) @ org.eclipse.jwt.transformations.bpmn ---
[INFO]                                                                         
[INFO] ------------------------------------------------------------------------
[INFO] Building org.eclipse.jwt.transformations.properties 1.6.0-SNAPSHOT
[INFO] ------------------------------------------------------------------------
[INFO] 
[INFO] --- maven-clean-plugin:2.5:clean (default-clean) @ org.eclipse.jwt.transformations.properties ---
[INFO] Deleting /home/hudson/genie.jwt/.jenkins/jobs/soa-jwt-integration/workspace/org.eclipse.jwt/transformations/jwt-transformation-properties/target
[INFO] 
[INFO] --- tycho-packaging-plugin:0.24.0:build-qualifier (default-build-qualifier) @ org.eclipse.jwt.transformations.properties ---
[INFO] The project's OSGi version is 1.6.0.201710302203
[INFO] 
[INFO] --- tycho-packaging-plugin:0.24.0:validate-id (default-validate-id) @ org.eclipse.jwt.transformations.properties ---
[INFO] 
[INFO] --- tycho-packaging-plugin:0.24.0:validate-version (default-validate-version) @ org.eclipse.jwt.transformations.properties ---
[INFO] 
[INFO] --- maven-resources-plugin:2.4.3:resources (default-resources) @ org.eclipse.jwt.transformations.properties ---
[WARNING] Using platform encoding (UTF-8 actually) to copy filtered resources, i.e. build is platform dependent!
[INFO] skip non existing resourceDirectory /home/hudson/genie.jwt/.jenkins/jobs/soa-jwt-integration/workspace/org.eclipse.jwt/transformations/jwt-transformation-properties/src/main/resources
[INFO] 
[INFO] --- tycho-compiler-plugin:0.24.0:compile (default-compile) @ org.eclipse.jwt.transformations.properties ---
[INFO] Compiling 9 source files to /home/hudson/genie.jwt/.jenkins/jobs/soa-jwt-integration/workspace/org.eclipse.jwt/transformations/jwt-transformation-properties/target/classes
[INFO] 
[INFO] --- maven-resources-plugin:2.4.3:testResources (default-testResources) @ org.eclipse.jwt.transformations.properties ---
[WARNING] Using platform encoding (UTF-8 actually) to copy filtered resources, i.e. build is platform dependent!
[INFO] skip non existing resourceDirectory /home/hudson/genie.jwt/.jenkins/jobs/soa-jwt-integration/workspace/org.eclipse.jwt/transformations/jwt-transformation-properties/src/test/resources
[INFO] 
[INFO] --- target-platform-configuration:0.24.0:target-platform (default-target-platform) @ org.eclipse.jwt.transformations.properties ---
[INFO] 
[INFO] --- tycho-packaging-plugin:0.24.0:package-plugin (default-package-plugin) @ org.eclipse.jwt.transformations.properties ---
[INFO] Building jar: /home/hudson/genie.jwt/.jenkins/jobs/soa-jwt-integration/workspace/org.eclipse.jwt/transformations/jwt-transformation-properties/target/org.eclipse.jwt.transformations.properties-1.6.0-SNAPSHOT.jar
[INFO] 
[INFO] --- tycho-p2-plugin:0.24.0:p2-metadata-default (default-p2-metadata-default) @ org.eclipse.jwt.transformations.properties ---
[INFO] 
[INFO] --- tycho-pack200a-plugin:0.24.0:normalize (pack200-normalize) @ org.eclipse.jwt.transformations.properties ---
[INFO] Pack200 normalizing jar /home/hudson/genie.jwt/.jenkins/jobs/soa-jwt-integration/workspace/org.eclipse.jwt/transformations/jwt-transformation-properties/target/org.eclipse.jwt.transformations.properties-1.6.0-SNAPSHOT.jar
[INFO] 
[INFO] --- eclipse-jarsigner-plugin:1.0.4:sign (sign) @ org.eclipse.jwt.transformations.properties ---
[INFO] Signed org.eclipse.jwt:org.eclipse.jwt.transformations.properties:eclipse-plugin:1.6.0-SNAPSHOT in 0 seconds.
[INFO] 
[INFO] --- tycho-pack200b-plugin:0.24.0:pack (pack200-pack) @ org.eclipse.jwt.transformations.properties ---
[INFO] Pack200 packing jar /home/hudson/genie.jwt/.jenkins/jobs/soa-jwt-integration/workspace/org.eclipse.jwt/transformations/jwt-transformation-properties/target/org.eclipse.jwt.transformations.properties-1.6.0-SNAPSHOT.jar
[INFO] 
[INFO] --- tycho-p2-plugin:0.24.0:p2-metadata (p2-metadata) @ org.eclipse.jwt.transformations.properties ---
[INFO] 
[INFO] --- maven-install-plugin:2.3.1:install (default-install) @ org.eclipse.jwt.transformations.properties ---
[INFO] Installing /home/hudson/genie.jwt/.jenkins/jobs/soa-jwt-integration/workspace/org.eclipse.jwt/transformations/jwt-transformation-properties/target/org.eclipse.jwt.transformations.properties-1.6.0-SNAPSHOT.jar to /home/hudson/genie.jwt/.jenkins/jobs/soa-jwt-integration/workspace/.repository/org/eclipse/jwt/org.eclipse.jwt.transformations.properties/1.6.0-SNAPSHOT/org.eclipse.jwt.transformations.properties-1.6.0-SNAPSHOT.jar
[INFO] Installing /home/hudson/genie.jwt/.jenkins/jobs/soa-jwt-integration/workspace/org.eclipse.jwt/transformations/jwt-transformation-properties/pom.xml to /home/hudson/genie.jwt/.jenkins/jobs/soa-jwt-integration/workspace/.repository/org/eclipse/jwt/org.eclipse.jwt.transformations.properties/1.6.0-SNAPSHOT/org.eclipse.jwt.transformations.properties-1.6.0-SNAPSHOT.pom
[INFO] Installing /home/hudson/genie.jwt/.jenkins/jobs/soa-jwt-integration/workspace/org.eclipse.jwt/transformations/jwt-transformation-properties/target/org.eclipse.jwt.transformations.properties-1.6.0-SNAPSHOT.jar.pack.gz to /home/hudson/genie.jwt/.jenkins/jobs/soa-jwt-integration/workspace/.repository/org/eclipse/jwt/org.eclipse.jwt.transformations.properties/1.6.0-SNAPSHOT/org.eclipse.jwt.transformations.properties-1.6.0-SNAPSHOT-pack200.jar.pack.gz
[INFO] Installing /home/hudson/genie.jwt/.jenkins/jobs/soa-jwt-integration/workspace/org.eclipse.jwt/transformations/jwt-transformation-properties/target/p2content.xml to /home/hudson/genie.jwt/.jenkins/jobs/soa-jwt-integration/workspace/.repository/org/eclipse/jwt/org.eclipse.jwt.transformations.properties/1.6.0-SNAPSHOT/org.eclipse.jwt.transformations.properties-1.6.0-SNAPSHOT-p2metadata.xml
[INFO] Installing /home/hudson/genie.jwt/.jenkins/jobs/soa-jwt-integration/workspace/org.eclipse.jwt/transformations/jwt-transformation-properties/target/p2artifacts.xml to /home/hudson/genie.jwt/.jenkins/jobs/soa-jwt-integration/workspace/.repository/org/eclipse/jwt/org.eclipse.jwt.transformations.properties/1.6.0-SNAPSHOT/org.eclipse.jwt.transformations.properties-1.6.0-SNAPSHOT-p2artifacts.xml
[INFO] 
[INFO] --- tycho-p2-plugin:0.24.0:update-local-index (default-update-local-index) @ org.eclipse.jwt.transformations.properties ---
[INFO]                                                                         
[INFO] ------------------------------------------------------------------------
[INFO] Building org.eclipse.jwt.transformations.xslt.tools 1.6.0-SNAPSHOT
[INFO] ------------------------------------------------------------------------
[INFO] 
[INFO] --- maven-clean-plugin:2.5:clean (default-clean) @ org.eclipse.jwt.transformations.xslt.tools ---
[INFO] Deleting /home/hudson/genie.jwt/.jenkins/jobs/soa-jwt-integration/workspace/org.eclipse.jwt/transformations/jwt-transformation-xslt-tools/target
[INFO] 
[INFO] --- tycho-packaging-plugin:0.24.0:build-qualifier (default-build-qualifier) @ org.eclipse.jwt.transformations.xslt.tools ---
[INFO] The project's OSGi version is 1.6.0.201710302203
[INFO] 
[INFO] --- tycho-packaging-plugin:0.24.0:validate-id (default-validate-id) @ org.eclipse.jwt.transformations.xslt.tools ---
[INFO] 
[INFO] --- tycho-packaging-plugin:0.24.0:validate-version (default-validate-version) @ org.eclipse.jwt.transformations.xslt.tools ---
[INFO] 
[INFO] --- maven-resources-plugin:2.4.3:resources (default-resources) @ org.eclipse.jwt.transformations.xslt.tools ---
[WARNING] Using platform encoding (UTF-8 actually) to copy filtered resources, i.e. build is platform dependent!
[INFO] skip non existing resourceDirectory /home/hudson/genie.jwt/.jenkins/jobs/soa-jwt-integration/workspace/org.eclipse.jwt/transformations/jwt-transformation-xslt-tools/src/main/resources
[INFO] 
[INFO] --- tycho-compiler-plugin:0.24.0:compile (default-compile) @ org.eclipse.jwt.transformations.xslt.tools ---
[INFO] Compiling 3 source files to /home/hudson/genie.jwt/.jenkins/jobs/soa-jwt-integration/workspace/org.eclipse.jwt/transformations/jwt-transformation-xslt-tools/target/classes
[INFO] 
[INFO] --- maven-resources-plugin:2.4.3:testResources (default-testResources) @ org.eclipse.jwt.transformations.xslt.tools ---
[WARNING] Using platform encoding (UTF-8 actually) to copy filtered resources, i.e. build is platform dependent!
[INFO] skip non existing resourceDirectory /home/hudson/genie.jwt/.jenkins/jobs/soa-jwt-integration/workspace/org.eclipse.jwt/transformations/jwt-transformation-xslt-tools/src/test/resources
[INFO] 
[INFO] --- target-platform-configuration:0.24.0:target-platform (default-target-platform) @ org.eclipse.jwt.transformations.xslt.tools ---
[INFO] 
[INFO] --- tycho-packaging-plugin:0.24.0:package-plugin (default-package-plugin) @ org.eclipse.jwt.transformations.xslt.tools ---
[INFO] Building jar: /home/hudson/genie.jwt/.jenkins/jobs/soa-jwt-integration/workspace/org.eclipse.jwt/transformations/jwt-transformation-xslt-tools/target/org.eclipse.jwt.transformations.xslt.tools-1.6.0-SNAPSHOT.jar
[INFO] 
[INFO] --- tycho-p2-plugin:0.24.0:p2-metadata-default (default-p2-metadata-default) @ org.eclipse.jwt.transformations.xslt.tools ---
[INFO] 
[INFO] --- tycho-pack200a-plugin:0.24.0:normalize (pack200-normalize) @ org.eclipse.jwt.transformations.xslt.tools ---
[INFO] Pack200 normalizing jar /home/hudson/genie.jwt/.jenkins/jobs/soa-jwt-integration/workspace/org.eclipse.jwt/transformations/jwt-transformation-xslt-tools/target/org.eclipse.jwt.transformations.xslt.tools-1.6.0-SNAPSHOT.jar
[INFO] 
[INFO] --- eclipse-jarsigner-plugin:1.0.4:sign (sign) @ org.eclipse.jwt.transformations.xslt.tools ---
[INFO] Signed org.eclipse.jwt:org.eclipse.jwt.transformations.xslt.tools:eclipse-plugin:1.6.0-SNAPSHOT in 0 seconds.
[INFO] 
[INFO] --- tycho-pack200b-plugin:0.24.0:pack (pack200-pack) @ org.eclipse.jwt.transformations.xslt.tools ---
[INFO] Pack200 packing jar /home/hudson/genie.jwt/.jenkins/jobs/soa-jwt-integration/workspace/org.eclipse.jwt/transformations/jwt-transformation-xslt-tools/target/org.eclipse.jwt.transformations.xslt.tools-1.6.0-SNAPSHOT.jar
[INFO] 
[INFO] --- tycho-p2-plugin:0.24.0:p2-metadata (p2-metadata) @ org.eclipse.jwt.transformations.xslt.tools ---
[INFO] 
[INFO] --- maven-install-plugin:2.3.1:install (default-install) @ org.eclipse.jwt.transformations.xslt.tools ---
[INFO] Installing /home/hudson/genie.jwt/.jenkins/jobs/soa-jwt-integration/workspace/org.eclipse.jwt/transformations/jwt-transformation-xslt-tools/target/org.eclipse.jwt.transformations.xslt.tools-1.6.0-SNAPSHOT.jar to /home/hudson/genie.jwt/.jenkins/jobs/soa-jwt-integration/workspace/.repository/org/eclipse/jwt/org.eclipse.jwt.transformations.xslt.tools/1.6.0-SNAPSHOT/org.eclipse.jwt.transformations.xslt.tools-1.6.0-SNAPSHOT.jar
[INFO] Installing /home/hudson/genie.jwt/.jenkins/jobs/soa-jwt-integration/workspace/org.eclipse.jwt/transformations/jwt-transformation-xslt-tools/pom.xml to /home/hudson/genie.jwt/.jenkins/jobs/soa-jwt-integration/workspace/.repository/org/eclipse/jwt/org.eclipse.jwt.transformations.xslt.tools/1.6.0-SNAPSHOT/org.eclipse.jwt.transformations.xslt.tools-1.6.0-SNAPSHOT.pom
[INFO] Installing /home/hudson/genie.jwt/.jenkins/jobs/soa-jwt-integration/workspace/org.eclipse.jwt/transformations/jwt-transformation-xslt-tools/target/org.eclipse.jwt.transformations.xslt.tools-1.6.0-SNAPSHOT.jar.pack.gz to /home/hudson/genie.jwt/.jenkins/jobs/soa-jwt-integration/workspace/.repository/org/eclipse/jwt/org.eclipse.jwt.transformations.xslt.tools/1.6.0-SNAPSHOT/org.eclipse.jwt.transformations.xslt.tools-1.6.0-SNAPSHOT-pack200.jar.pack.gz
[INFO] Installing /home/hudson/genie.jwt/.jenkins/jobs/soa-jwt-integration/workspace/org.eclipse.jwt/transformations/jwt-transformation-xslt-tools/target/p2content.xml to /home/hudson/genie.jwt/.jenkins/jobs/soa-jwt-integration/workspace/.repository/org/eclipse/jwt/org.eclipse.jwt.transformations.xslt.tools/1.6.0-SNAPSHOT/org.eclipse.jwt.transformations.xslt.tools-1.6.0-SNAPSHOT-p2metadata.xml
[INFO] Installing /home/hudson/genie.jwt/.jenkins/jobs/soa-jwt-integration/workspace/org.eclipse.jwt/transformations/jwt-transformation-xslt-tools/target/p2artifacts.xml to /home/hudson/genie.jwt/.jenkins/jobs/soa-jwt-integration/workspace/.repository/org/eclipse/jwt/org.eclipse.jwt.transformations.xslt.tools/1.6.0-SNAPSHOT/org.eclipse.jwt.transformations.xslt.tools-1.6.0-SNAPSHOT-p2artifacts.xml
[INFO] 
[INFO] --- tycho-p2-plugin:0.24.0:update-local-index (default-update-local-index) @ org.eclipse.jwt.transformations.xslt.tools ---
[INFO]                                                                         
[INFO] ------------------------------------------------------------------------
[INFO] Building org.eclipse.jwt.transformations.xpdl 1.6.0-SNAPSHOT
[INFO] ------------------------------------------------------------------------
[INFO] 
[INFO] --- maven-clean-plugin:2.5:clean (default-clean) @ org.eclipse.jwt.transformations.xpdl ---
[INFO] Deleting /home/hudson/genie.jwt/.jenkins/jobs/soa-jwt-integration/workspace/org.eclipse.jwt/transformations/jwt-transformation-xpdl/target
[INFO] 
[INFO] --- tycho-packaging-plugin:0.24.0:build-qualifier (default-build-qualifier) @ org.eclipse.jwt.transformations.xpdl ---
[INFO] The project's OSGi version is 1.6.0.201710302203
[INFO] 
[INFO] --- tycho-packaging-plugin:0.24.0:validate-id (default-validate-id) @ org.eclipse.jwt.transformations.xpdl ---
[INFO] 
[INFO] --- tycho-packaging-plugin:0.24.0:validate-version (default-validate-version) @ org.eclipse.jwt.transformations.xpdl ---
[INFO] 
[INFO] --- maven-resources-plugin:2.4.3:resources (default-resources) @ org.eclipse.jwt.transformations.xpdl ---
[WARNING] Using platform encoding (UTF-8 actually) to copy filtered resources, i.e. build is platform dependent!
[INFO] skip non existing resourceDirectory /home/hudson/genie.jwt/.jenkins/jobs/soa-jwt-integration/workspace/org.eclipse.jwt/transformations/jwt-transformation-xpdl/src/main/resources
[INFO] 
[INFO] --- tycho-compiler-plugin:0.24.0:compile (default-compile) @ org.eclipse.jwt.transformations.xpdl ---
[INFO] Compiling 1 source file to /home/hudson/genie.jwt/.jenkins/jobs/soa-jwt-integration/workspace/org.eclipse.jwt/transformations/jwt-transformation-xpdl/target/classes
[INFO] 
[INFO] --- maven-resources-plugin:2.4.3:testResources (default-testResources) @ org.eclipse.jwt.transformations.xpdl ---
[WARNING] Using platform encoding (UTF-8 actually) to copy filtered resources, i.e. build is platform dependent!
[INFO] skip non existing resourceDirectory /home/hudson/genie.jwt/.jenkins/jobs/soa-jwt-integration/workspace/org.eclipse.jwt/transformations/jwt-transformation-xpdl/src/test/resources
[INFO] 
[INFO] --- target-platform-configuration:0.24.0:target-platform (default-target-platform) @ org.eclipse.jwt.transformations.xpdl ---
[INFO] 
[INFO] --- tycho-packaging-plugin:0.24.0:package-plugin (default-package-plugin) @ org.eclipse.jwt.transformations.xpdl ---
[INFO] Building jar: /home/hudson/genie.jwt/.jenkins/jobs/soa-jwt-integration/workspace/org.eclipse.jwt/transformations/jwt-transformation-xpdl/target/org.eclipse.jwt.transformations.xpdl-1.6.0-SNAPSHOT.jar
[INFO] 
[INFO] --- tycho-p2-plugin:0.24.0:p2-metadata-default (default-p2-metadata-default) @ org.eclipse.jwt.transformations.xpdl ---
[INFO] 
[INFO] --- tycho-pack200a-plugin:0.24.0:normalize (pack200-normalize) @ org.eclipse.jwt.transformations.xpdl ---
[INFO] Pack200 normalizing jar /home/hudson/genie.jwt/.jenkins/jobs/soa-jwt-integration/workspace/org.eclipse.jwt/transformations/jwt-transformation-xpdl/target/org.eclipse.jwt.transformations.xpdl-1.6.0-SNAPSHOT.jar
[INFO] 
[INFO] --- eclipse-jarsigner-plugin:1.0.4:sign (sign) @ org.eclipse.jwt.transformations.xpdl ---
[INFO] Signed org.eclipse.jwt:org.eclipse.jwt.transformations.xpdl:eclipse-plugin:1.6.0-SNAPSHOT in 0 seconds.
[INFO] 
[INFO] --- tycho-pack200b-plugin:0.24.0:pack (pack200-pack) @ org.eclipse.jwt.transformations.xpdl ---
[INFO] Pack200 packing jar /home/hudson/genie.jwt/.jenkins/jobs/soa-jwt-integration/workspace/org.eclipse.jwt/transformations/jwt-transformation-xpdl/target/org.eclipse.jwt.transformations.xpdl-1.6.0-SNAPSHOT.jar
[INFO] 
[INFO] --- tycho-p2-plugin:0.24.0:p2-metadata (p2-metadata) @ org.eclipse.jwt.transformations.xpdl ---
[INFO] 
[INFO] --- maven-install-plugin:2.3.1:install (default-install) @ org.eclipse.jwt.transformations.xpdl ---
[INFO] Installing /home/hudson/genie.jwt/.jenkins/jobs/soa-jwt-integration/workspace/org.eclipse.jwt/transformations/jwt-transformation-xpdl/target/org.eclipse.jwt.transformations.xpdl-1.6.0-SNAPSHOT.jar to /home/hudson/genie.jwt/.jenkins/jobs/soa-jwt-integration/workspace/.repository/org/eclipse/jwt/org.eclipse.jwt.transformations.xpdl/1.6.0-SNAPSHOT/org.eclipse.jwt.transformations.xpdl-1.6.0-SNAPSHOT.jar
[INFO] Installing /home/hudson/genie.jwt/.jenkins/jobs/soa-jwt-integration/workspace/org.eclipse.jwt/transformations/jwt-transformation-xpdl/pom.xml to /home/hudson/genie.jwt/.jenkins/jobs/soa-jwt-integration/workspace/.repository/org/eclipse/jwt/org.eclipse.jwt.transformations.xpdl/1.6.0-SNAPSHOT/org.eclipse.jwt.transformations.xpdl-1.6.0-SNAPSHOT.pom
[INFO] Installing /home/hudson/genie.jwt/.jenkins/jobs/soa-jwt-integration/workspace/org.eclipse.jwt/transformations/jwt-transformation-xpdl/target/org.eclipse.jwt.transformations.xpdl-1.6.0-SNAPSHOT.jar.pack.gz to /home/hudson/genie.jwt/.jenkins/jobs/soa-jwt-integration/workspace/.repository/org/eclipse/jwt/org.eclipse.jwt.transformations.xpdl/1.6.0-SNAPSHOT/org.eclipse.jwt.transformations.xpdl-1.6.0-SNAPSHOT-pack200.jar.pack.gz
[INFO] Installing /home/hudson/genie.jwt/.jenkins/jobs/soa-jwt-integration/workspace/org.eclipse.jwt/transformations/jwt-transformation-xpdl/target/p2content.xml to /home/hudson/genie.jwt/.jenkins/jobs/soa-jwt-integration/workspace/.repository/org/eclipse/jwt/org.eclipse.jwt.transformations.xpdl/1.6.0-SNAPSHOT/org.eclipse.jwt.transformations.xpdl-1.6.0-SNAPSHOT-p2metadata.xml
[INFO] Installing /home/hudson/genie.jwt/.jenkins/jobs/soa-jwt-integration/workspace/org.eclipse.jwt/transformations/jwt-transformation-xpdl/target/p2artifacts.xml to /home/hudson/genie.jwt/.jenkins/jobs/soa-jwt-integration/workspace/.repository/org/eclipse/jwt/org.eclipse.jwt.transformations.xpdl/1.6.0-SNAPSHOT/org.eclipse.jwt.transformations.xpdl-1.6.0-SNAPSHOT-p2artifacts.xml
[INFO] 
[INFO] --- tycho-p2-plugin:0.24.0:update-local-index (default-update-local-index) @ org.eclipse.jwt.transformations.xpdl ---
[INFO]                                                                         
[INFO] ------------------------------------------------------------------------
[INFO] Building org.eclipse.jwt.tests 1.6.0-SNAPSHOT
[INFO] ------------------------------------------------------------------------
[INFO] 
[INFO] --- maven-clean-plugin:2.5:clean (default-clean) @ org.eclipse.jwt.tests ---
[INFO] Deleting /home/hudson/genie.jwt/.jenkins/jobs/soa-jwt-integration/workspace/org.eclipse.jwt/releng/jwt-tests-plugin/target
[INFO] 
[INFO] --- tycho-packaging-plugin:0.24.0:build-qualifier (default-build-qualifier) @ org.eclipse.jwt.tests ---
[INFO] The project's OSGi version is 1.6.0.201710302203
[INFO] 
[INFO] --- tycho-packaging-plugin:0.24.0:validate-id (default-validate-id) @ org.eclipse.jwt.tests ---
[INFO] 
[INFO] --- tycho-packaging-plugin:0.24.0:validate-version (default-validate-version) @ org.eclipse.jwt.tests ---
[INFO] 
[INFO] --- maven-resources-plugin:2.4.3:resources (default-resources) @ org.eclipse.jwt.tests ---
[WARNING] Using platform encoding (UTF-8 actually) to copy filtered resources, i.e. build is platform dependent!
[INFO] skip non existing resourceDirectory /home/hudson/genie.jwt/.jenkins/jobs/soa-jwt-integration/workspace/org.eclipse.jwt/releng/jwt-tests-plugin/src/main/resources
[INFO] 
[INFO] --- tycho-compiler-plugin:0.24.0:compile (default-compile) @ org.eclipse.jwt.tests ---
[INFO] Compiling 11 source files to /home/hudson/genie.jwt/.jenkins/jobs/soa-jwt-integration/workspace/org.eclipse.jwt/releng/jwt-tests-plugin/target/classes
[INFO] 
[INFO] --- maven-resources-plugin:2.4.3:testResources (default-testResources) @ org.eclipse.jwt.tests ---
[WARNING] Using platform encoding (UTF-8 actually) to copy filtered resources, i.e. build is platform dependent!
[INFO] skip non existing resourceDirectory /home/hudson/genie.jwt/.jenkins/jobs/soa-jwt-integration/workspace/org.eclipse.jwt/releng/jwt-tests-plugin/src/test/resources
[INFO] 
[INFO] --- target-platform-configuration:0.24.0:target-platform (default-target-platform) @ org.eclipse.jwt.tests ---
[INFO] 
[INFO] --- tycho-packaging-plugin:0.24.0:package-plugin (default-package-plugin) @ org.eclipse.jwt.tests ---
[INFO] Building jar: /home/hudson/genie.jwt/.jenkins/jobs/soa-jwt-integration/workspace/org.eclipse.jwt/releng/jwt-tests-plugin/target/org.eclipse.jwt.tests-1.6.0-SNAPSHOT.jar
[INFO] 
[INFO] --- tycho-p2-plugin:0.24.0:p2-metadata-default (default-p2-metadata-default) @ org.eclipse.jwt.tests ---
[INFO] 
[INFO] --- tycho-surefire-plugin:0.24.0:test (default-test) @ org.eclipse.jwt.tests ---
[INFO] Expected eclipse log file: /home/hudson/genie.jwt/.jenkins/jobs/soa-jwt-integration/workspace/org.eclipse.jwt/releng/jwt-tests-plugin/target/work/data/.metadata/.log
[INFO] Command line:
	[/opt/public/common/jdk1.8.0_131.x64/jre/bin/java, -Dosgi.noShutdown=false, -Dosgi.os=linux, -Dosgi.ws=gtk, -Dosgi.arch=x86_64, -Dosgi.clean=true, -jar, /jobs/genie.jwt/soa-jwt-integration/workspace/.repository/p2/osgi/bundle/org.eclipse.equinox.launcher/1.3.201.v20161025-1711/org.eclipse.equinox.launcher-1.3.201.v20161025-1711.jar, -data, /home/hudson/genie.jwt/.jenkins/jobs/soa-jwt-integration/workspace/org.eclipse.jwt/releng/jwt-tests-plugin/target/work/data, -install, /home/hudson/genie.jwt/.jenkins/jobs/soa-jwt-integration/workspace/org.eclipse.jwt/releng/jwt-tests-plugin/target/work, -configuration, /home/hudson/genie.jwt/.jenkins/jobs/soa-jwt-integration/workspace/org.eclipse.jwt/releng/jwt-tests-plugin/target/work/configuration, -application, org.eclipse.tycho.surefire.osgibooter.uitest, -testproperties, /home/hudson/genie.jwt/.jenkins/jobs/soa-jwt-integration/workspace/org.eclipse.jwt/releng/jwt-tests-plugin/target/surefire.properties]

-------------------------------------------------------
 T E S T S
-------------------------------------------------------
Running org.eclipse.jwt.tests.we.AllTests
Tests run: 4, Failures: 0, Errors: 0, Skipped: 0, Time elapsed: 0.04 sec - in org.eclipse.jwt.tests.we.AllTests
testBug259476(org.eclipse.jwt.tests.we.TestVersion)  Time elapsed: 0.02 sec
testSimpleProperty(org.eclipse.jwt.tests.we.TestProperties)  Time elapsed: 0 sec
testMissingProperty(org.eclipse.jwt.tests.we.TestProperties)  Time elapsed: 0.001 sec
testDereferenceProperty(org.eclipse.jwt.tests.we.TestProperties)  Time elapsed: 0 sec
Running org.eclipse.jwt.tests.AllTests
2017-10-30 18:04:43.494 org.eclipse.jwt.we.conf.model.resource.internal.ConfModelResourceManagerImpl handleResourceLoadingError
  SEVERE: ConfModel resource doesn't exist for ConfModel file file:/tmp/testBug259290_8081359376326051903.workflow_conf while looking for expected ConfModel of model file:/tmp/testBug259290_8081359376326051903.workflow
Oct 30, 2017 6:04:43 PM org.eclipse.jwt.we.conf.model.resource.internal.ConfModelResourceManagerImpl handleResourceLoadingError
SEVERE: ConfModel resource doesn't exist for ConfModel file file:/tmp/testBug259290_8081359376326051903.workflow_conf while looking for expected ConfModel of model file:/tmp/testBug259290_8081359376326051903.workflow
Compiler warnings:
  line 103: Attribute 'name' outside of element.
2017-10-30 18:04:44.001 org.eclipse.jwt.we.conf.model.resource.internal.ConfModelResourceManagerImpl handleResourceLoadingError
  SEVERE: ConfModel resource doesn't exist for ConfModel file file:/tmp/testBug259290_2311451197149739490.workflow_conf while looking for expected ConfModel of model file:/tmp/testBug259290_2311451197149739490.workflow
Oct 30, 2017 6:04:44 PM org.eclipse.jwt.we.conf.model.resource.internal.ConfModelResourceManagerImpl handleResourceLoadingError
SEVERE: ConfModel resource doesn't exist for ConfModel file file:/tmp/testBug259290_2311451197149739490.workflow_conf while looking for expected ConfModel of model file:/tmp/testBug259290_2311451197149739490.workflow
Compiler warnings:
  line 103: Attribute 'name' outside of element.
Cannot overload Ecore
metamodel contains several classifiers with same name: EAttribute
metamodel contains several classifiers with same name: ecore::EAttribute
metamodel contains several classifiers with same name: EAnnotation
metamodel contains several classifiers with same name: ecore::EAnnotation
metamodel contains several classifiers with same name: EClass
metamodel contains several classifiers with same name: ecore::EClass
metamodel contains several classifiers with same name: EClassifier
metamodel contains several classifiers with same name: ecore::EClassifier
metamodel contains several classifiers with same name: EDataType
metamodel contains several classifiers with same name: ecore::EDataType
metamodel contains several classifiers with same name: EEnum
metamodel contains several classifiers with same name: ecore::EEnum
metamodel contains several classifiers with same name: EEnumLiteral
metamodel contains several classifiers with same name: ecore::EEnumLiteral
metamodel contains several classifiers with same name: EFactory
metamodel contains several classifiers with same name: ecore::EFactory
metamodel contains several classifiers with same name: EModelElement
metamodel contains several classifiers with same name: ecore::EModelElement
metamodel contains several classifiers with same name: ENamedElement
metamodel contains several classifiers with same name: ecore::ENamedElement
metamodel contains several classifiers with same name: EObject
metamodel contains several classifiers with same name: ecore::EObject
metamodel contains several classifiers with same name: EOperation
metamodel contains several classifiers with same name: ecore::EOperation
metamodel contains several classifiers with same name: EPackage
metamodel contains several classifiers with same name: ecore::EPackage
metamodel contains several classifiers with same name: EParameter
metamodel contains several classifiers with same name: ecore::EParameter
metamodel contains several classifiers with same name: EReference
metamodel contains several classifiers with same name: ecore::EReference
metamodel contains several classifiers with same name: EStructuralFeature
metamodel contains several classifiers with same name: ecore::EStructuralFeature
metamodel contains several classifiers with same name: ETypedElement
metamodel contains several classifiers with same name: ecore::ETypedElement
metamodel contains several classifiers with same name: EBigDecimal
metamodel contains several classifiers with same name: ecore::EBigDecimal
metamodel contains several classifiers with same name: EBigInteger
metamodel contains several classifiers with same name: ecore::EBigInteger
metamodel contains several classifiers with same name: EBoolean
metamodel contains several classifiers with same name: ecore::EBoolean
metamodel contains several classifiers with same name: EBooleanObject
metamodel contains several classifiers with same name: ecore::EBooleanObject
metamodel contains several classifiers with same name: EByte
metamodel contains several classifiers with same name: ecore::EByte
metamodel contains several classifiers with same name: EByteArray
metamodel contains several classifiers with same name: ecore::EByteArray
metamodel contains several classifiers with same name: EByteObject
metamodel contains several classifiers with same name: ecore::EByteObject
metamodel contains several classifiers with same name: EChar
metamodel contains several classifiers with same name: ecore::EChar
metamodel contains several classifiers with same name: ECharacterObject
metamodel contains several classifiers with same name: ecore::ECharacterObject
metamodel contains several classifiers with same name: EDate
metamodel contains several classifiers with same name: ecore::EDate
metamodel contains several classifiers with same name: EDiagnosticChain
metamodel contains several classifiers with same name: ecore::EDiagnosticChain
metamodel contains several classifiers with same name: EDouble
metamodel contains several classifiers with same name: ecore::EDouble
metamodel contains several classifiers with same name: EDoubleObject
metamodel contains several classifiers with same name: ecore::EDoubleObject
metamodel contains several classifiers with same name: EEList
metamodel contains several classifiers with same name: ecore::EEList
metamodel contains several classifiers with same name: EEnumerator
metamodel contains several classifiers with same name: ecore::EEnumerator
metamodel contains several classifiers with same name: EFeatureMap
metamodel contains several classifiers with same name: ecore::EFeatureMap
metamodel contains several classifiers with same name: EFeatureMapEntry
metamodel contains several classifiers with same name: ecore::EFeatureMapEntry
metamodel contains several classifiers with same name: EFloat
metamodel contains several classifiers with same name: ecore::EFloat
metamodel contains several classifiers with same name: EFloatObject
metamodel contains several classifiers with same name: ecore::EFloatObject
metamodel contains several classifiers with same name: EInt
metamodel contains several classifiers with same name: ecore::EInt
metamodel contains several classifiers with same name: EIntegerObject
metamodel contains several classifiers with same name: ecore::EIntegerObject
metamodel contains several classifiers with same name: EJavaClass
metamodel contains several classifiers with same name: ecore::EJavaClass
metamodel contains several classifiers with same name: EJavaObject
metamodel contains several classifiers with same name: ecore::EJavaObject
metamodel contains several classifiers with same name: ELong
metamodel contains several classifiers with same name: ecore::ELong
metamodel contains several classifiers with same name: ELongObject
metamodel contains several classifiers with same name: ecore::ELongObject
metamodel contains several classifiers with same name: EMap
metamodel contains several classifiers with same name: ecore::EMap
metamodel contains several classifiers with same name: EResource
metamodel contains several classifiers with same name: ecore::EResource
metamodel contains several classifiers with same name: EResourceSet
metamodel contains several classifiers with same name: ecore::EResourceSet
metamodel contains several classifiers with same name: EShort
metamodel contains several classifiers with same name: ecore::EShort
metamodel contains several classifiers with same name: EShortObject
metamodel contains several classifiers with same name: ecore::EShortObject
metamodel contains several classifiers with same name: EString
metamodel contains several classifiers with same name: ecore::EString
metamodel contains several classifiers with same name: EStringToStringMapEntry
metamodel contains several classifiers with same name: ecore::EStringToStringMapEntry
metamodel contains several classifiers with same name: ETreeIterator
metamodel contains several classifiers with same name: ecore::ETreeIterator
metamodel contains several classifiers with same name: EGenericType
metamodel contains several classifiers with same name: ecore::EGenericType
metamodel contains several classifiers with same name: ETypeParameter
metamodel contains several classifiers with same name: ecore::ETypeParameter
metamodel contains several classifiers with same name: EInvocationTargetException
metamodel contains several classifiers with same name: ecore::EInvocationTargetException
Oct 30, 2017 6:04:44 PM org.eclipse.jwt.converter.Converter updateModel
INFO: converter: source model version 0.6.0, target model version 1.2.0
Oct 30, 2017 6:04:44 PM org.eclipse.jwt.converter.Converter updateModel
SEVERE: the update of the workflow file file:/tmp/testBug296235_7114497994392307717.workflow failed because of an unknown error
org.eclipse.m2m.atl.engine.vm.VMException
NativeOperation public static void org.eclipse.m2m.atl.engine.vm.nativelib.ASMTransientLink.addTargetElement(org.eclipse.m2m.atl.engine.vm.StackFrame,org.eclipse.m2m.atl.engine.vm.nativelib.ASMTransientLink,org.eclipse.m2m.atl.engine.vm.nativelib.ASMString,org.eclipse.m2m.atl.engine.vm.nativelib.ASMOclAny)
	args = [TransientLink {rule = 'Model2Model', sourceElements = {input = IN!ITIL}, targetElements = {model = OUT!<notnamedyet>}, variables = {}}, TransientLink {rule = 'Model2Model', sourceElements = {input = IN!ITIL}, targetElements = {model = OUT!<notnamedyet>}, variables = {}}, 'output2']
Java Stack:
org.eclipse.m2m.atl.engine.vm.VMException
	at org.eclipse.m2m.atl.engine.vm.SimpleDebugger.error(SimpleDebugger.java:167)
	at org.eclipse.m2m.atl.engine.vm.StackFrame.printStackTrace(StackFrame.java:95)
	at org.eclipse.m2m.atl.engine.vm.StackFrame.printStackTrace(StackFrame.java:87)
	at org.eclipse.m2m.atl.engine.vm.ClassNativeOperation.exec(ClassNativeOperation.java:73)
	at org.eclipse.m2m.atl.engine.vm.nativelib.ASMOclAny.invoke(ASMOclAny.java:130)
	at org.eclipse.m2m.atl.engine.vm.nativelib.ASMOclAny.invoke(ASMOclAny.java:78)
	at org.eclipse.m2m.atl.engine.vm.ASMOperation.realExec(ASMOperation.java:251)
	at org.eclipse.m2m.atl.engine.vm.ASMOperation.realExec(ASMOperation.java:357)
	at org.eclipse.m2m.atl.engine.vm.ASMOperation.exec(ASMOperation.java:173)
	at org.eclipse.m2m.atl.engine.vm.nativelib.ASMOclAny.invoke(ASMOclAny.java:130)
	at org.eclipse.m2m.atl.engine.vm.nativelib.ASMOclAny.invoke(ASMOclAny.java:78)
	at org.eclipse.m2m.atl.engine.vm.ASMOperation.realExec(ASMOperation.java:251)
	at org.eclipse.m2m.atl.engine.vm.ASMOperation.exec(ASMOperation.java:173)
	at org.eclipse.m2m.atl.engine.vm.nativelib.ASMOclAny.invoke(ASMOclAny.java:130)
	at org.eclipse.m2m.atl.engine.vm.nativelib.ASMOclAny.invoke(ASMOclAny.java:78)
	at org.eclipse.m2m.atl.engine.vm.ASMOperation.realExec(ASMOperation.java:251)
	at org.eclipse.m2m.atl.engine.vm.ASMOperation.exec(ASMOperation.java:173)
	at org.eclipse.m2m.atl.engine.vm.ASMInterpreter.<init>(ASMInterpreter.java:346)
	at org.eclipse.m2m.atl.engine.vm.AtlLauncher.launch(AtlLauncher.java:216)
	at org.eclipse.m2m.atl.engine.vm.AtlLauncher.launch(AtlLauncher.java:127)
	at org.eclipse.m2m.atl.engine.vm.AtlLauncher.launch(AtlLauncher.java:92)
	at org.eclipse.jwt.converter.internal.ATLTransformation.jwt2jwt(ATLTransformation.java:179)
	at org.eclipse.jwt.converter.internal.ConverterManager.convert(ConverterManager.java:223)
	at org.eclipse.jwt.converter.internal.ConverterManager.convert(ConverterManager.java:137)
	at org.eclipse.jwt.converter.Converter.updateModel(Converter.java:169)
	at org.eclipse.jwt.tests.converter.Convert060ToCurrentTests.testBug296235(Convert060ToCurrentTests.java:59)
	at sun.reflect.NativeMethodAccessorImpl.invoke0(Native Method)
	at sun.reflect.NativeMethodAccessorImpl.invoke(NativeMethodAccessorImpl.java:62)
	at sun.reflect.DelegatingMethodAccessorImpl.invoke(DelegatingMethodAccessorImpl.java:43)
	at java.lang.reflect.Method.invoke(Method.java:498)
	at junit.framework.TestCase.runTest(TestCase.java:176)
	at junit.framework.TestCase.runBare(TestCase.java:141)
	at junit.framework.TestResult$1.protect(TestResult.java:122)
	at junit.framework.TestResult.runProtected(TestResult.java:142)
	at junit.framework.TestResult.run(TestResult.java:125)
	at junit.framework.TestCase.run(TestCase.java:129)
	at junit.framework.TestSuite.runTest(TestSuite.java:252)
	at junit.framework.TestSuite.run(TestSuite.java:247)
	at junit.framework.TestSuite.runTest(TestSuite.java:252)
	at junit.framework.TestSuite.run(TestSuite.java:247)
	at org.junit.internal.runners.JUnit38ClassRunner.run(JUnit38ClassRunner.java:86)
	at org.apache.maven.surefire.junit4.JUnit4Provider.execute(JUnit4Provider.java:264)
	at org.apache.maven.surefire.junit4.JUnit4Provider.executeTestSet(JUnit4Provider.java:153)
	at org.apache.maven.surefire.junit4.JUnit4Provider.invoke(JUnit4Provider.java:124)
	at sun.reflect.NativeMethodAccessorImpl.invoke0(Native Method)
	at sun.reflect.NativeMethodAccessorImpl.invoke(NativeMethodAccessorImpl.java:62)
	at sun.reflect.DelegatingMethodAccessorImpl.invoke(DelegatingMethodAccessorImpl.java:43)
	at java.lang.reflect.Method.invoke(Method.java:498)
	at org.apache.maven.surefire.util.ReflectionUtils.invokeMethodWithArray2(ReflectionUtils.java:208)
	at org.apache.maven.surefire.booter.ProviderFactory$ProviderProxy.invoke(ProviderFactory.java:156)
	at org.apache.maven.surefire.booter.ProviderFactory.invokeProvider(ProviderFactory.java:82)
	at org.eclipse.tycho.surefire.osgibooter.OsgiSurefireBooter.run(OsgiSurefireBooter.java:91)
	at org.eclipse.tycho.surefire.osgibooter.AbstractUITestApplication$1.run(AbstractUITestApplication.java:35)
	at org.eclipse.swt.widgets.RunnableLock.run(RunnableLock.java:35)
	at org.eclipse.swt.widgets.Synchronizer.runAsyncMessages(Synchronizer.java:182)
	at org.eclipse.swt.widgets.Display.runAsyncMessages(Display.java:4536)
	at org.eclipse.swt.widgets.Display.readAndDispatch(Display.java:4154)
	at org.eclipse.e4.ui.internal.workbench.swt.PartRenderingEngine$4.run(PartRenderingEngine.java:1121)
	at org.eclipse.core.databinding.observable.Realm.runWithDefault(Realm.java:336)
	at org.eclipse.e4.ui.internal.workbench.swt.PartRenderingEngine.run(PartRenderingEngine.java:1022)
	at org.eclipse.e4.ui.internal.workbench.E4Workbench.createAndRunUI(E4Workbench.java:150)
	at org.eclipse.ui.internal.Workbench$5.run(Workbench.java:693)
	at org.eclipse.core.databinding.observable.Realm.runWithDefault(Realm.java:336)
	at org.eclipse.ui.internal.Workbench.createAndRunWorkbench(Workbench.java:610)
	at org.eclipse.ui.PlatformUI.createAndRunWorkbench(PlatformUI.java:148)
	at org.eclipse.ui.internal.ide.application.IDEApplication.start(IDEApplication.java:138)
	at org.eclipse.tycho.surefire.osgibooter.UITestApplication.runApplication(UITestApplication.java:31)
	at org.eclipse.tycho.surefire.osgibooter.AbstractUITestApplication.run(AbstractUITestApplication.java:120)
	at org.eclipse.tycho.surefire.osgibooter.UITestApplication.start(UITestApplication.java:37)
	at org.eclipse.equinox.internal.app.EclipseAppHandle.run(EclipseAppHandle.java:196)
	at org.eclipse.core.runtime.internal.adaptor.EclipseAppLauncher.runApplication(EclipseAppLauncher.java:134)
	at org.eclipse.core.runtime.internal.adaptor.EclipseAppLauncher.start(EclipseAppLauncher.java:104)
	at org.eclipse.core.runtime.adaptor.EclipseStarter.run(EclipseStarter.java:388)
	at org.eclipse.core.runtime.adaptor.EclipseStarter.run(EclipseStarter.java:243)
	at sun.reflect.NativeMethodAccessorImpl.invoke0(Native Method)
	at sun.reflect.NativeMethodAccessorImpl.invoke(NativeMethodAccessorImpl.java:62)
	at sun.reflect.DelegatingMethodAccessorImpl.invoke(DelegatingMethodAccessorImpl.java:43)
	at java.lang.reflect.Method.invoke(Method.java:498)
	at org.eclipse.equinox.launcher.Main.invokeFramework(Main.java:673)
	at org.eclipse.equinox.launcher.Main.basicRun(Main.java:610)
	at org.eclipse.equinox.launcher.Main.run(Main.java:1519)
	at org.eclipse.equinox.launcher.Main.main(Main.java:1492)
Caused by: java.lang.IllegalArgumentException: java.lang.ClassCastException@6e239337
	at sun.reflect.GeneratedMethodAccessor11.invoke(Unknown Source)
	at sun.reflect.DelegatingMethodAccessorImpl.invoke(DelegatingMethodAccessorImpl.java:43)
	at java.lang.reflect.Method.invoke(Method.java:498)
	at org.eclipse.m2m.atl.engine.vm.ClassNativeOperation.exec(ClassNativeOperation.java:69)
	... 78 more
Oct 30, 2017 6:04:44 PM org.eclipse.jwt.converter.Converter updateModel
INFO: converter: source model version 0.6.0, target model version 1.6.0
Oct 30, 2017 6:04:44 PM org.eclipse.jwt.converter.Converter updateModel
SEVERE: the update of the workflow file file:/tmp/testConverterNormal_7587647085837629393.workflow failed because of an unknown error
org.eclipse.m2m.atl.engine.vm.VMException
NativeOperation public static void org.eclipse.m2m.atl.engine.vm.nativelib.ASMTransientLink.addTargetElement(org.eclipse.m2m.atl.engine.vm.StackFrame,org.eclipse.m2m.atl.engine.vm.nativelib.ASMTransientLink,org.eclipse.m2m.atl.engine.vm.nativelib.ASMString,org.eclipse.m2m.atl.engine.vm.nativelib.ASMOclAny)
	args = [TransientLink {rule = 'Model2Model', sourceElements = {input = IN!ExternalApplicationTest}, targetElements = {model = OUT!<notnamedyet>}, variables = {}}, TransientLink {rule = 'Model2Model', sourceElements = {input = IN!ExternalApplicationTest}, targetElements = {model = OUT!<notnamedyet>}, variables = {}}, 'output2']
Java Stack:
org.eclipse.m2m.atl.engine.vm.VMException
	at org.eclipse.m2m.atl.engine.vm.SimpleDebugger.error(SimpleDebugger.java:167)
	at org.eclipse.m2m.atl.engine.vm.StackFrame.printStackTrace(StackFrame.java:95)
	at org.eclipse.m2m.atl.engine.vm.StackFrame.printStackTrace(StackFrame.java:87)
	at org.eclipse.m2m.atl.engine.vm.ClassNativeOperation.exec(ClassNativeOperation.java:73)
	at org.eclipse.m2m.atl.engine.vm.nativelib.ASMOclAny.invoke(ASMOclAny.java:130)
	at org.eclipse.m2m.atl.engine.vm.nativelib.ASMOclAny.invoke(ASMOclAny.java:78)
	at org.eclipse.m2m.atl.engine.vm.ASMOperation.realExec(ASMOperation.java:251)
	at org.eclipse.m2m.atl.engine.vm.ASMOperation.realExec(ASMOperation.java:357)
	at org.eclipse.m2m.atl.engine.vm.ASMOperation.exec(ASMOperation.java:173)
	at org.eclipse.m2m.atl.engine.vm.nativelib.ASMOclAny.invoke(ASMOclAny.java:130)
	at org.eclipse.m2m.atl.engine.vm.nativelib.ASMOclAny.invoke(ASMOclAny.java:78)
	at org.eclipse.m2m.atl.engine.vm.ASMOperation.realExec(ASMOperation.java:251)
	at org.eclipse.m2m.atl.engine.vm.ASMOperation.exec(ASMOperation.java:173)
	at org.eclipse.m2m.atl.engine.vm.nativelib.ASMOclAny.invoke(ASMOclAny.java:130)
	at org.eclipse.m2m.atl.engine.vm.nativelib.ASMOclAny.invoke(ASMOclAny.java:78)
	at org.eclipse.m2m.atl.engine.vm.ASMOperation.realExec(ASMOperation.java:251)
	at org.eclipse.m2m.atl.engine.vm.ASMOperation.exec(ASMOperation.java:173)
	at org.eclipse.m2m.atl.engine.vm.ASMInterpreter.<init>(ASMInterpreter.java:346)
	at org.eclipse.m2m.atl.engine.vm.AtlLauncher.launch(AtlLauncher.java:216)
	at org.eclipse.m2m.atl.engine.vm.AtlLauncher.launch(AtlLauncher.java:127)
	at org.eclipse.m2m.atl.engine.vm.AtlLauncher.launch(AtlLauncher.java:92)
	at org.eclipse.jwt.converter.internal.ATLTransformation.jwt2jwt(ATLTransformation.java:179)
	at org.eclipse.jwt.converter.internal.ConverterManager.convert(ConverterManager.java:223)
	at org.eclipse.jwt.converter.internal.ConverterManager.convert(ConverterManager.java:137)
	at org.eclipse.jwt.converter.Converter.updateModel(Converter.java:169)
	at org.eclipse.jwt.tests.converter.Convert060ToCurrentTests.testConverterNormal(Convert060ToCurrentTests.java:46)
	at sun.reflect.NativeMethodAccessorImpl.invoke0(Native Method)
	at sun.reflect.NativeMethodAccessorImpl.invoke(NativeMethodAccessorImpl.java:62)
	at sun.reflect.DelegatingMethodAccessorImpl.invoke(DelegatingMethodAccessorImpl.java:43)
	at java.lang.reflect.Method.invoke(Method.java:498)
	at junit.framework.TestCase.runTest(TestCase.java:176)
	at junit.framework.TestCase.runBare(TestCase.java:141)
	at junit.framework.TestResult$1.protect(TestResult.java:122)
	at junit.framework.TestResult.runProtected(TestResult.java:142)
	at junit.framework.TestResult.run(TestResult.java:125)
	at junit.framework.TestCase.run(TestCase.java:129)
	at junit.framework.TestSuite.runTest(TestSuite.java:252)
	at junit.framework.TestSuite.run(TestSuite.java:247)
	at junit.framework.TestSuite.runTest(TestSuite.java:252)
	at junit.framework.TestSuite.run(TestSuite.java:247)
	at org.junit.internal.runners.JUnit38ClassRunner.run(JUnit38ClassRunner.java:86)
	at org.apache.maven.surefire.junit4.JUnit4Provider.execute(JUnit4Provider.java:264)
	at org.apache.maven.surefire.junit4.JUnit4Provider.executeTestSet(JUnit4Provider.java:153)
	at org.apache.maven.surefire.junit4.JUnit4Provider.invoke(JUnit4Provider.java:124)
	at sun.reflect.NativeMethodAccessorImpl.invoke0(Native Method)
	at sun.reflect.NativeMethodAccessorImpl.invoke(NativeMethodAccessorImpl.java:62)
	at sun.reflect.DelegatingMethodAccessorImpl.invoke(DelegatingMethodAccessorImpl.java:43)
	at java.lang.reflect.Method.invoke(Method.java:498)
	at org.apache.maven.surefire.util.ReflectionUtils.invokeMethodWithArray2(ReflectionUtils.java:208)
	at org.apache.maven.surefire.booter.ProviderFactory$ProviderProxy.invoke(ProviderFactory.java:156)
	at org.apache.maven.surefire.booter.ProviderFactory.invokeProvider(ProviderFactory.java:82)
	at org.eclipse.tycho.surefire.osgibooter.OsgiSurefireBooter.run(OsgiSurefireBooter.java:91)
	at org.eclipse.tycho.surefire.osgibooter.AbstractUITestApplication$1.run(AbstractUITestApplication.java:35)
	at org.eclipse.swt.widgets.RunnableLock.run(RunnableLock.java:35)
	at org.eclipse.swt.widgets.Synchronizer.runAsyncMessages(Synchronizer.java:182)
	at org.eclipse.swt.widgets.Display.runAsyncMessages(Display.java:4536)
	at org.eclipse.swt.widgets.Display.readAndDispatch(Display.java:4154)
	at org.eclipse.e4.ui.internal.workbench.swt.PartRenderingEngine$4.run(PartRenderingEngine.java:1121)
	at org.eclipse.core.databinding.observable.Realm.runWithDefault(Realm.java:336)
	at org.eclipse.e4.ui.internal.workbench.swt.PartRenderingEngine.run(PartRenderingEngine.java:1022)
	at org.eclipse.e4.ui.internal.workbench.E4Workbench.createAndRunUI(E4Workbench.java:150)
	at org.eclipse.ui.internal.Workbench$5.run(Workbench.java:693)
	at org.eclipse.core.databinding.observable.Realm.runWithDefault(Realm.java:336)
	at org.eclipse.ui.internal.Workbench.createAndRunWorkbench(Workbench.java:610)
	at org.eclipse.ui.PlatformUI.createAndRunWorkbench(PlatformUI.java:148)
	at org.eclipse.ui.internal.ide.application.IDEApplication.start(IDEApplication.java:138)
	at org.eclipse.tycho.surefire.osgibooter.UITestApplication.runApplication(UITestApplication.java:31)
	at org.eclipse.tycho.surefire.osgibooter.AbstractUITestApplication.run(AbstractUITestApplication.java:120)
	at org.eclipse.tycho.surefire.osgibooter.UITestApplication.start(UITestApplication.java:37)
	at org.eclipse.equinox.internal.app.EclipseAppHandle.run(EclipseAppHandle.java:196)
	at org.eclipse.core.runtime.internal.adaptor.EclipseAppLauncher.runApplication(EclipseAppLauncher.java:134)
	at org.eclipse.core.runtime.internal.adaptor.EclipseAppLauncher.start(EclipseAppLauncher.java:104)
	at org.eclipse.core.runtime.adaptor.EclipseStarter.run(EclipseStarter.java:388)
	at org.eclipse.core.runtime.adaptor.EclipseStarter.run(EclipseStarter.java:243)
	at sun.reflect.NativeMethodAccessorImpl.invoke0(Native Method)
	at sun.reflect.NativeMethodAccessorImpl.invoke(NativeMethodAccessorImpl.java:62)
	at sun.reflect.DelegatingMethodAccessorImpl.invoke(DelegatingMethodAccessorImpl.java:43)
	at java.lang.reflect.Method.invoke(Method.java:498)
	at org.eclipse.equinox.launcher.Main.invokeFramework(Main.java:673)
	at org.eclipse.equinox.launcher.Main.basicRun(Main.java:610)
	at org.eclipse.equinox.launcher.Main.run(Main.java:1519)
	at org.eclipse.equinox.launcher.Main.main(Main.java:1492)
Caused by: java.lang.IllegalArgumentException: java.lang.ClassCastException@78545d40
	at sun.reflect.GeneratedMethodAccessor11.invoke(Unknown Source)
	at sun.reflect.DelegatingMethodAccessorImpl.invoke(DelegatingMethodAccessorImpl.java:43)
	at java.lang.reflect.Method.invoke(Method.java:498)
	at org.eclipse.m2m.atl.engine.vm.ClassNativeOperation.exec(ClassNativeOperation.java:69)
	... 78 more
testCategoriesExampleWizard
testOpenEditor
init resource
url:bundleresource://127.fwk542060780/org/eclipse/jwt/tests/integration/ExternalApplications.workflow
uri:file:/home/hudson/genie.jwt/.jenkins/jobs/soa-jwt-integration/workspace/org.eclipse.jwt/releng/jwt-tests-plugin/target/classes/org/eclipse/jwt/tests/integration/ExternalApplications.workflow
get expected version
get workbench page
open editor
testCategoriesExportWizards
testCategoriesImportWizards
testCategoriesNewWizard
Tests run: 21, Failures: 2, Errors: 2, Skipped: 0, Time elapsed: 1.747 sec <<< FAILURE! - in org.eclipse.jwt.tests.AllTests
testBug259476(org.eclipse.jwt.tests.we.TestVersion)  Time elapsed: 0.001 sec
testSimpleProperty(org.eclipse.jwt.tests.we.TestProperties)  Time elapsed: 0 sec
testMissingProperty(org.eclipse.jwt.tests.we.TestProperties)  Time elapsed: 0 sec
testDereferenceProperty(org.eclipse.jwt.tests.we.TestProperties)  Time elapsed: 0 sec
testBug259390(org.eclipse.jwt.tests.transformation.xpdl.TestXPDLTransformation)  Time elapsed: 0.552 sec
testBug266821(org.eclipse.jwt.tests.transformation.xpdl.TestXPDLTransformation)  Time elapsed: 0.126 sec
testHasXSLTransformer(org.eclipse.jwt.tests.transformation.xpdl.TestXPDLTransformation)  Time elapsed: 0 sec
testBug277085NoRole(org.eclipse.jwt.tests.transformation.bpmn.JWTtoBPMNTests)  Time elapsed: 0.223 sec
testBug249270Sequence(org.eclipse.jwt.tests.transformation.bpmn.JWTtoBPMNTests)  Time elapsed: 0.064 sec
testTransformationBPMNtoJWT(org.eclipse.jwt.tests.transformation.bpmn.BPMNtoJWTTests)  Time elapsed: 0.073 sec
testTransformationBPMNtoJWT_2lane(org.eclipse.jwt.tests.transformation.bpmn.BPMNtoJWTTests)  Time elapsed: 0.024 sec
testTransformationBPMNtoJWT_nolane(org.eclipse.jwt.tests.transformation.bpmn.BPMNtoJWTTests)  Time elapsed: 0.02 sec
testSTPIM(org.eclipse.jwt.tests.transformation.stpim.JWTtoSTPIMTests)  Time elapsed: 0.105 sec
testBug296235(org.eclipse.jwt.tests.converter.Convert060ToCurrentTests)  Time elapsed: 0.041 sec  <<< ERROR!
org.eclipse.m2m.atl.engine.vm.VMException: null
	at sun.reflect.GeneratedMethodAccessor11.invoke(Unknown Source)
	at sun.reflect.DelegatingMethodAccessorImpl.invoke(DelegatingMethodAccessorImpl.java:43)
	at java.lang.reflect.Method.invoke(Method.java:498)
	at org.eclipse.m2m.atl.engine.vm.ClassNativeOperation.exec(ClassNativeOperation.java:69)
	at org.eclipse.m2m.atl.engine.vm.nativelib.ASMOclAny.invoke(ASMOclAny.java:130)
	at org.eclipse.m2m.atl.engine.vm.nativelib.ASMOclAny.invoke(ASMOclAny.java:78)
	at org.eclipse.m2m.atl.engine.vm.ASMOperation.realExec(ASMOperation.java:251)
	at org.eclipse.m2m.atl.engine.vm.ASMOperation.realExec(ASMOperation.java:357)
	at org.eclipse.m2m.atl.engine.vm.ASMOperation.exec(ASMOperation.java:173)
	at org.eclipse.m2m.atl.engine.vm.nativelib.ASMOclAny.invoke(ASMOclAny.java:130)
	at org.eclipse.m2m.atl.engine.vm.nativelib.ASMOclAny.invoke(ASMOclAny.java:78)
	at org.eclipse.m2m.atl.engine.vm.ASMOperation.realExec(ASMOperation.java:251)
	at org.eclipse.m2m.atl.engine.vm.ASMOperation.exec(ASMOperation.java:173)
	at org.eclipse.m2m.atl.engine.vm.nativelib.ASMOclAny.invoke(ASMOclAny.java:130)
	at org.eclipse.m2m.atl.engine.vm.nativelib.ASMOclAny.invoke(ASMOclAny.java:78)
	at org.eclipse.m2m.atl.engine.vm.ASMOperation.realExec(ASMOperation.java:251)
	at org.eclipse.m2m.atl.engine.vm.ASMOperation.exec(ASMOperation.java:173)
	at org.eclipse.m2m.atl.engine.vm.ASMInterpreter.<init>(ASMInterpreter.java:346)
	at org.eclipse.m2m.atl.engine.vm.AtlLauncher.launch(AtlLauncher.java:216)
	at org.eclipse.m2m.atl.engine.vm.AtlLauncher.launch(AtlLauncher.java:127)
	at org.eclipse.m2m.atl.engine.vm.AtlLauncher.launch(AtlLauncher.java:92)
	at org.eclipse.jwt.converter.internal.ATLTransformation.jwt2jwt(ATLTransformation.java:179)
	at org.eclipse.jwt.converter.internal.ConverterManager.convert(ConverterManager.java:223)
	at org.eclipse.jwt.converter.internal.ConverterManager.convert(ConverterManager.java:137)
	at org.eclipse.jwt.converter.Converter.updateModel(Converter.java:169)
	at org.eclipse.jwt.tests.converter.Convert060ToCurrentTests.testBug296235(Convert060ToCurrentTests.java:59)

testConverterNormal(org.eclipse.jwt.tests.converter.Convert060ToCurrentTests)  Time elapsed: 0.028 sec  <<< ERROR!
org.eclipse.m2m.atl.engine.vm.VMException: null
	at sun.reflect.GeneratedMethodAccessor11.invoke(Unknown Source)
	at sun.reflect.DelegatingMethodAccessorImpl.invoke(DelegatingMethodAccessorImpl.java:43)
	at java.lang.reflect.Method.invoke(Method.java:498)
	at org.eclipse.m2m.atl.engine.vm.ClassNativeOperation.exec(ClassNativeOperation.java:69)
	at org.eclipse.m2m.atl.engine.vm.nativelib.ASMOclAny.invoke(ASMOclAny.java:130)
	at org.eclipse.m2m.atl.engine.vm.nativelib.ASMOclAny.invoke(ASMOclAny.java:78)
	at org.eclipse.m2m.atl.engine.vm.ASMOperation.realExec(ASMOperation.java:251)
	at org.eclipse.m2m.atl.engine.vm.ASMOperation.realExec(ASMOperation.java:357)
	at org.eclipse.m2m.atl.engine.vm.ASMOperation.exec(ASMOperation.java:173)
	at org.eclipse.m2m.atl.engine.vm.nativelib.ASMOclAny.invoke(ASMOclAny.java:130)
	at org.eclipse.m2m.atl.engine.vm.nativelib.ASMOclAny.invoke(ASMOclAny.java:78)
	at org.eclipse.m2m.atl.engine.vm.ASMOperation.realExec(ASMOperation.java:251)
	at org.eclipse.m2m.atl.engine.vm.ASMOperation.exec(ASMOperation.java:173)
	at org.eclipse.m2m.atl.engine.vm.nativelib.ASMOclAny.invoke(ASMOclAny.java:130)
	at org.eclipse.m2m.atl.engine.vm.nativelib.ASMOclAny.invoke(ASMOclAny.java:78)
	at org.eclipse.m2m.atl.engine.vm.ASMOperation.realExec(ASMOperation.java:251)
	at org.eclipse.m2m.atl.engine.vm.ASMOperation.exec(ASMOperation.java:173)
	at org.eclipse.m2m.atl.engine.vm.ASMInterpreter.<init>(ASMInterpreter.java:346)
	at org.eclipse.m2m.atl.engine.vm.AtlLauncher.launch(AtlLauncher.java:216)
	at org.eclipse.m2m.atl.engine.vm.AtlLauncher.launch(AtlLauncher.java:127)
	at org.eclipse.m2m.atl.engine.vm.AtlLauncher.launch(AtlLauncher.java:92)
	at org.eclipse.jwt.converter.internal.ATLTransformation.jwt2jwt(ATLTransformation.java:179)
	at org.eclipse.jwt.converter.internal.ConverterManager.convert(ConverterManager.java:223)
	at org.eclipse.jwt.converter.internal.ConverterManager.convert(ConverterManager.java:137)
	at org.eclipse.jwt.converter.Converter.updateModel(Converter.java:169)
	at org.eclipse.jwt.tests.converter.Convert060ToCurrentTests.testConverterNormal(Convert060ToCurrentTests.java:46)

testOpenEditor(org.eclipse.jwt.tests.conf.editor.TestConfEditor)  Time elapsed: 0.402 sec  <<< FAILURE!
junit.framework.AssertionFailedError: could not open editor: <null> instead of org.eclipse.jwt.we.conf.presentation.ConfEditor
	at junit.framework.Assert.fail(Assert.java:57)
	at junit.framework.TestCase.fail(TestCase.java:227)
	at org.eclipse.jwt.tests.conf.editor.TestConfEditor.testOpenEditor(TestConfEditor.java:50)

testCategoriesExampleWizard(org.eclipse.jwt.tests.integration.TestIntegrationInPlatform)  Time elapsed: 0.001 sec
testOpenEditor(org.eclipse.jwt.tests.integration.TestIntegrationInPlatform)  Time elapsed: 0.065 sec  <<< FAILURE!
junit.framework.AssertionFailedError: Workflow model is not opened with JWT Editor
	at junit.framework.Assert.fail(Assert.java:57)
	at junit.framework.Assert.assertTrue(Assert.java:22)
	at junit.framework.TestCase.assertTrue(TestCase.java:192)
	at org.eclipse.jwt.tests.integration.TestIntegrationInPlatform.testOpenEditor(TestIntegrationInPlatform.java:81)

testCategoriesExportWizards(org.eclipse.jwt.tests.integration.TestIntegrationInPlatform)  Time elapsed: 0 sec
testCategoriesImportWizards(org.eclipse.jwt.tests.integration.TestIntegrationInPlatform)  Time elapsed: 0 sec
testCategoriesNewWizard(org.eclipse.jwt.tests.integration.TestIntegrationInPlatform)  Time elapsed: 0 sec

Results :

Failed tests: 
  TestConfEditor.testOpenEditor:50 could not open editor: <null> instead of org.eclipse.jwt.we.conf.presentation.ConfEditor
  TestIntegrationInPlatform.testOpenEditor:81 Workflow model is not opened with JWT Editor

Tests in error: 
  Convert060ToCurrentTests.testBug296235:59 » VM
  Convert060ToCurrentTests.testConverterNormal:46 » VM

Tests run: 25, Failures: 2, Errors: 2, Skipped: 0

[ERROR] There are test failures.

Please refer to /home/hudson/genie.jwt/.jenkins/jobs/soa-jwt-integration/workspace/org.eclipse.jwt/releng/jwt-tests-plugin/target/surefire-reports for the individual test results.
[INFO] 
[INFO] --- tycho-pack200a-plugin:0.24.0:normalize (pack200-normalize) @ org.eclipse.jwt.tests ---
[INFO] Pack200 normalizing jar /home/hudson/genie.jwt/.jenkins/jobs/soa-jwt-integration/workspace/org.eclipse.jwt/releng/jwt-tests-plugin/target/org.eclipse.jwt.tests-1.6.0-SNAPSHOT.jar
[INFO] 
[INFO] --- eclipse-jarsigner-plugin:1.0.4:sign (sign) @ org.eclipse.jwt.tests ---
[INFO] Signed org.eclipse.jwt:org.eclipse.jwt.tests:eclipse-test-plugin:1.6.0-SNAPSHOT in 0 seconds.
[INFO] 
[INFO] --- tycho-pack200b-plugin:0.24.0:pack (pack200-pack) @ org.eclipse.jwt.tests ---
[INFO] Pack200 packing jar /home/hudson/genie.jwt/.jenkins/jobs/soa-jwt-integration/workspace/org.eclipse.jwt/releng/jwt-tests-plugin/target/org.eclipse.jwt.tests-1.6.0-SNAPSHOT.jar
[INFO] 
[INFO] --- tycho-p2-plugin:0.24.0:p2-metadata (p2-metadata) @ org.eclipse.jwt.tests ---
[INFO] 
[INFO] --- maven-install-plugin:2.3.1:install (default-install) @ org.eclipse.jwt.tests ---
[INFO] Installing /home/hudson/genie.jwt/.jenkins/jobs/soa-jwt-integration/workspace/org.eclipse.jwt/releng/jwt-tests-plugin/target/org.eclipse.jwt.tests-1.6.0-SNAPSHOT.jar to /home/hudson/genie.jwt/.jenkins/jobs/soa-jwt-integration/workspace/.repository/org/eclipse/jwt/org.eclipse.jwt.tests/1.6.0-SNAPSHOT/org.eclipse.jwt.tests-1.6.0-SNAPSHOT.jar
[INFO] Installing /home/hudson/genie.jwt/.jenkins/jobs/soa-jwt-integration/workspace/org.eclipse.jwt/releng/jwt-tests-plugin/pom.xml to /home/hudson/genie.jwt/.jenkins/jobs/soa-jwt-integration/workspace/.repository/org/eclipse/jwt/org.eclipse.jwt.tests/1.6.0-SNAPSHOT/org.eclipse.jwt.tests-1.6.0-SNAPSHOT.pom
[INFO] Installing /home/hudson/genie.jwt/.jenkins/jobs/soa-jwt-integration/workspace/org.eclipse.jwt/releng/jwt-tests-plugin/target/org.eclipse.jwt.tests-1.6.0-SNAPSHOT.jar.pack.gz to /home/hudson/genie.jwt/.jenkins/jobs/soa-jwt-integration/workspace/.repository/org/eclipse/jwt/org.eclipse.jwt.tests/1.6.0-SNAPSHOT/org.eclipse.jwt.tests-1.6.0-SNAPSHOT-pack200.jar.pack.gz
[INFO] Installing /home/hudson/genie.jwt/.jenkins/jobs/soa-jwt-integration/workspace/org.eclipse.jwt/releng/jwt-tests-plugin/target/p2content.xml to /home/hudson/genie.jwt/.jenkins/jobs/soa-jwt-integration/workspace/.repository/org/eclipse/jwt/org.eclipse.jwt.tests/1.6.0-SNAPSHOT/org.eclipse.jwt.tests-1.6.0-SNAPSHOT-p2metadata.xml
[INFO] Installing /home/hudson/genie.jwt/.jenkins/jobs/soa-jwt-integration/workspace/org.eclipse.jwt/releng/jwt-tests-plugin/target/p2artifacts.xml to /home/hudson/genie.jwt/.jenkins/jobs/soa-jwt-integration/workspace/.repository/org/eclipse/jwt/org.eclipse.jwt.tests/1.6.0-SNAPSHOT/org.eclipse.jwt.tests-1.6.0-SNAPSHOT-p2artifacts.xml
[INFO] 
[INFO] --- tycho-p2-plugin:0.24.0:update-local-index (default-update-local-index) @ org.eclipse.jwt.tests ---
[INFO]                                                                         
[INFO] ------------------------------------------------------------------------
[INFO] Building org.eclipse.jwt.feature 1.6.0-SNAPSHOT
[INFO] ------------------------------------------------------------------------
[INFO] 
[INFO] --- maven-clean-plugin:2.5:clean (default-clean) @ org.eclipse.jwt.feature ---
[INFO] Deleting /home/hudson/genie.jwt/.jenkins/jobs/soa-jwt-integration/workspace/org.eclipse.jwt/releng/org.eclipse.jwt.feature/target
[INFO] 
[INFO] --- tycho-packaging-plugin:0.24.0:build-qualifier-aggregator (default-build-qualifier-aggregator) @ org.eclipse.jwt.feature ---
[INFO] The project's OSGi version is 1.6.0.201710302203
[INFO] 
[INFO] --- tycho-packaging-plugin:0.24.0:validate-id (default-validate-id) @ org.eclipse.jwt.feature ---
[INFO] 
[INFO] --- tycho-packaging-plugin:0.24.0:validate-version (default-validate-version) @ org.eclipse.jwt.feature ---
[INFO] 
[INFO] --- target-platform-configuration:0.24.0:target-platform (default-target-platform) @ org.eclipse.jwt.feature ---
[INFO] 
[INFO] --- tycho-packaging-plugin:0.24.0:package-feature (default-package-feature) @ org.eclipse.jwt.feature ---
[INFO] Building jar: /home/hudson/genie.jwt/.jenkins/jobs/soa-jwt-integration/workspace/org.eclipse.jwt/releng/org.eclipse.jwt.feature/target/org.eclipse.jwt.feature-1.6.0-SNAPSHOT.jar
[INFO] 
[INFO] --- tycho-p2-plugin:0.24.0:p2-metadata-default (default-p2-metadata-default) @ org.eclipse.jwt.feature ---
[INFO] 
[INFO] --- tycho-p2-plugin:0.24.0:feature-p2-metadata (default-feature-p2-metadata) @ org.eclipse.jwt.feature ---
[INFO] 
[INFO] --- tycho-pack200a-plugin:0.24.0:normalize (pack200-normalize) @ org.eclipse.jwt.feature ---
[INFO] 
[INFO] --- eclipse-jarsigner-plugin:1.0.4:sign (sign) @ org.eclipse.jwt.feature ---
[INFO] Signed org.eclipse.jwt:org.eclipse.jwt.feature:eclipse-feature:1.6.0-SNAPSHOT in 0 seconds.
[INFO] 
[INFO] --- tycho-pack200b-plugin:0.24.0:pack (pack200-pack) @ org.eclipse.jwt.feature ---
[INFO] 
[INFO] --- tycho-p2-plugin:0.24.0:p2-metadata (p2-metadata) @ org.eclipse.jwt.feature ---
[INFO] 
[INFO] --- maven-install-plugin:2.3.1:install (default-install) @ org.eclipse.jwt.feature ---
[INFO] Installing /home/hudson/genie.jwt/.jenkins/jobs/soa-jwt-integration/workspace/org.eclipse.jwt/releng/org.eclipse.jwt.feature/target/org.eclipse.jwt.feature-1.6.0-SNAPSHOT.jar to /home/hudson/genie.jwt/.jenkins/jobs/soa-jwt-integration/workspace/.repository/org/eclipse/jwt/org.eclipse.jwt.feature/1.6.0-SNAPSHOT/org.eclipse.jwt.feature-1.6.0-SNAPSHOT.jar
[INFO] Installing /home/hudson/genie.jwt/.jenkins/jobs/soa-jwt-integration/workspace/org.eclipse.jwt/releng/org.eclipse.jwt.feature/pom.xml to /home/hudson/genie.jwt/.jenkins/jobs/soa-jwt-integration/workspace/.repository/org/eclipse/jwt/org.eclipse.jwt.feature/1.6.0-SNAPSHOT/org.eclipse.jwt.feature-1.6.0-SNAPSHOT.pom
[INFO] Installing /home/hudson/genie.jwt/.jenkins/jobs/soa-jwt-integration/workspace/org.eclipse.jwt/releng/org.eclipse.jwt.feature/target/p2content.xml to /home/hudson/genie.jwt/.jenkins/jobs/soa-jwt-integration/workspace/.repository/org/eclipse/jwt/org.eclipse.jwt.feature/1.6.0-SNAPSHOT/org.eclipse.jwt.feature-1.6.0-SNAPSHOT-p2metadata.xml
[INFO] Installing /home/hudson/genie.jwt/.jenkins/jobs/soa-jwt-integration/workspace/org.eclipse.jwt/releng/org.eclipse.jwt.feature/target/p2artifacts.xml to /home/hudson/genie.jwt/.jenkins/jobs/soa-jwt-integration/workspace/.repository/org/eclipse/jwt/org.eclipse.jwt.feature/1.6.0-SNAPSHOT/org.eclipse.jwt.feature-1.6.0-SNAPSHOT-p2artifacts.xml
[INFO] 
[INFO] --- tycho-p2-plugin:0.24.0:update-local-index (default-update-local-index) @ org.eclipse.jwt.feature ---
[INFO]                                                                         
[INFO] ------------------------------------------------------------------------
[INFO] Building org.eclipse.jwt.test.feature 1.6.0-SNAPSHOT
[INFO] ------------------------------------------------------------------------
[INFO] 
[INFO] --- maven-clean-plugin:2.5:clean (default-clean) @ org.eclipse.jwt.test.feature ---
[INFO] Deleting /home/hudson/genie.jwt/.jenkins/jobs/soa-jwt-integration/workspace/org.eclipse.jwt/releng/org.eclipse.jwt.test.feature/target
[INFO] 
[INFO] --- tycho-packaging-plugin:0.24.0:build-qualifier-aggregator (default-build-qualifier-aggregator) @ org.eclipse.jwt.test.feature ---
[INFO] The project's OSGi version is 1.6.0.201710302203
[INFO] 
[INFO] --- tycho-packaging-plugin:0.24.0:validate-id (default-validate-id) @ org.eclipse.jwt.test.feature ---
[INFO] 
[INFO] --- tycho-packaging-plugin:0.24.0:validate-version (default-validate-version) @ org.eclipse.jwt.test.feature ---
[INFO] 
[INFO] --- target-platform-configuration:0.24.0:target-platform (default-target-platform) @ org.eclipse.jwt.test.feature ---
[INFO] 
[INFO] --- tycho-packaging-plugin:0.24.0:package-feature (default-package-feature) @ org.eclipse.jwt.test.feature ---
[INFO] Building jar: /home/hudson/genie.jwt/.jenkins/jobs/soa-jwt-integration/workspace/org.eclipse.jwt/releng/org.eclipse.jwt.test.feature/target/org.eclipse.jwt.test.feature-1.6.0-SNAPSHOT.jar
[INFO] 
[INFO] --- tycho-p2-plugin:0.24.0:p2-metadata-default (default-p2-metadata-default) @ org.eclipse.jwt.test.feature ---
[INFO] 
[INFO] --- tycho-p2-plugin:0.24.0:feature-p2-metadata (default-feature-p2-metadata) @ org.eclipse.jwt.test.feature ---
[INFO] 
[INFO] --- tycho-pack200a-plugin:0.24.0:normalize (pack200-normalize) @ org.eclipse.jwt.test.feature ---
[INFO] 
[INFO] --- eclipse-jarsigner-plugin:1.0.4:sign (sign) @ org.eclipse.jwt.test.feature ---
[INFO] Signed org.eclipse.jwt:org.eclipse.jwt.test.feature:eclipse-feature:1.6.0-SNAPSHOT in 0 seconds.
[INFO] 
[INFO] --- tycho-pack200b-plugin:0.24.0:pack (pack200-pack) @ org.eclipse.jwt.test.feature ---
[INFO] 
[INFO] --- tycho-p2-plugin:0.24.0:p2-metadata (p2-metadata) @ org.eclipse.jwt.test.feature ---
[INFO] 
[INFO] --- maven-install-plugin:2.3.1:install (default-install) @ org.eclipse.jwt.test.feature ---
[INFO] Installing /home/hudson/genie.jwt/.jenkins/jobs/soa-jwt-integration/workspace/org.eclipse.jwt/releng/org.eclipse.jwt.test.feature/target/org.eclipse.jwt.test.feature-1.6.0-SNAPSHOT.jar to /home/hudson/genie.jwt/.jenkins/jobs/soa-jwt-integration/workspace/.repository/org/eclipse/jwt/org.eclipse.jwt.test.feature/1.6.0-SNAPSHOT/org.eclipse.jwt.test.feature-1.6.0-SNAPSHOT.jar
[INFO] Installing /home/hudson/genie.jwt/.jenkins/jobs/soa-jwt-integration/workspace/org.eclipse.jwt/releng/org.eclipse.jwt.test.feature/pom.xml to /home/hudson/genie.jwt/.jenkins/jobs/soa-jwt-integration/workspace/.repository/org/eclipse/jwt/org.eclipse.jwt.test.feature/1.6.0-SNAPSHOT/org.eclipse.jwt.test.feature-1.6.0-SNAPSHOT.pom
[INFO] Installing /home/hudson/genie.jwt/.jenkins/jobs/soa-jwt-integration/workspace/org.eclipse.jwt/releng/org.eclipse.jwt.test.feature/target/p2content.xml to /home/hudson/genie.jwt/.jenkins/jobs/soa-jwt-integration/workspace/.repository/org/eclipse/jwt/org.eclipse.jwt.test.feature/1.6.0-SNAPSHOT/org.eclipse.jwt.test.feature-1.6.0-SNAPSHOT-p2metadata.xml
[INFO] Installing /home/hudson/genie.jwt/.jenkins/jobs/soa-jwt-integration/workspace/org.eclipse.jwt/releng/org.eclipse.jwt.test.feature/target/p2artifacts.xml to /home/hudson/genie.jwt/.jenkins/jobs/soa-jwt-integration/workspace/.repository/org/eclipse/jwt/org.eclipse.jwt.test.feature/1.6.0-SNAPSHOT/org.eclipse.jwt.test.feature-1.6.0-SNAPSHOT-p2artifacts.xml
[INFO] 
[INFO] --- tycho-p2-plugin:0.24.0:update-local-index (default-update-local-index) @ org.eclipse.jwt.test.feature ---
[INFO]                                                                         
[INFO] ------------------------------------------------------------------------
[INFO] Building org.eclipse.jwt.p2updatesite 1.6.0-SNAPSHOT
[INFO] ------------------------------------------------------------------------
[INFO] 
[INFO] --- maven-clean-plugin:2.5:clean (default-clean) @ org.eclipse.jwt.p2updatesite ---
[INFO] Deleting /home/hudson/genie.jwt/.jenkins/jobs/soa-jwt-integration/workspace/org.eclipse.jwt/releng/org.eclipse.jwt.p2updatesite/target
[INFO] 
[INFO] --- tycho-packaging-plugin:0.24.0:build-qualifier-aggregator (default-build-qualifier-aggregator) @ org.eclipse.jwt.p2updatesite ---
[INFO] The project's OSGi version is 1.6.0.201710302203
[INFO] 
[INFO] --- maven-clean-plugin:2.5:clean (default-clean-1) @ org.eclipse.jwt.p2updatesite ---
[INFO] 
[INFO] --- maven-resources-plugin:2.4.3:resources (default-resources) @ org.eclipse.jwt.p2updatesite ---
[WARNING] Using platform encoding (UTF-8 actually) to copy filtered resources, i.e. build is platform dependent!
[INFO] skip non existing resourceDirectory /home/hudson/genie.jwt/.jenkins/jobs/soa-jwt-integration/workspace/org.eclipse.jwt/releng/org.eclipse.jwt.p2updatesite/src/main/resources
[INFO] 
[INFO] --- target-platform-configuration:0.24.0:target-platform (default-target-platform) @ org.eclipse.jwt.p2updatesite ---
[INFO] 
[INFO] --- tycho-p2-publisher-plugin:0.24.0:publish-products (default-publish-products) @ org.eclipse.jwt.p2updatesite ---
[INFO] 
[INFO] --- tycho-p2-publisher-plugin:0.24.0:publish-categories (default-publish-categories) @ org.eclipse.jwt.p2updatesite ---
[INFO] 
[INFO] --- tycho-p2-publisher-plugin:0.24.0:attach-artifacts (default-attach-artifacts) @ org.eclipse.jwt.p2updatesite ---
[INFO] 
[INFO] --- tycho-p2-repository-plugin:0.24.0:assemble-repository (default-assemble-repository) @ org.eclipse.jwt.p2updatesite ---
[INFO] 
[INFO] --- tycho-p2-repository-plugin:0.24.0:archive-repository (default-archive-repository) @ org.eclipse.jwt.p2updatesite ---
[INFO] Building zip: /home/hudson/genie.jwt/.jenkins/jobs/soa-jwt-integration/workspace/org.eclipse.jwt/releng/org.eclipse.jwt.p2updatesite/target/org.eclipse.jwt.p2updatesite-1.6.0-SNAPSHOT.zip
[INFO] 
[INFO] --- tycho-pack200a-plugin:0.24.0:normalize (pack200-normalize) @ org.eclipse.jwt.p2updatesite ---
[INFO] 
[INFO] --- eclipse-jarsigner-plugin:1.0.4:sign (sign) @ org.eclipse.jwt.p2updatesite ---
[INFO] 
[INFO] --- tycho-pack200b-plugin:0.24.0:pack (pack200-pack) @ org.eclipse.jwt.p2updatesite ---
[INFO] 
[INFO] --- tycho-p2-plugin:0.24.0:p2-metadata (p2-metadata) @ org.eclipse.jwt.p2updatesite ---
[INFO] 
[INFO] --- maven-install-plugin:2.3.1:install (default-install) @ org.eclipse.jwt.p2updatesite ---
[INFO] Installing /home/hudson/genie.jwt/.jenkins/jobs/soa-jwt-integration/workspace/org.eclipse.jwt/releng/org.eclipse.jwt.p2updatesite/target/org.eclipse.jwt.p2updatesite-1.6.0-SNAPSHOT.zip to /home/hudson/genie.jwt/.jenkins/jobs/soa-jwt-integration/workspace/.repository/org/eclipse/jwt/org.eclipse.jwt.p2updatesite/1.6.0-SNAPSHOT/org.eclipse.jwt.p2updatesite-1.6.0-SNAPSHOT.zip
[INFO] Installing /home/hudson/genie.jwt/.jenkins/jobs/soa-jwt-integration/workspace/org.eclipse.jwt/releng/org.eclipse.jwt.p2updatesite/pom.xml to /home/hudson/genie.jwt/.jenkins/jobs/soa-jwt-integration/workspace/.repository/org/eclipse/jwt/org.eclipse.jwt.p2updatesite/1.6.0-SNAPSHOT/org.eclipse.jwt.p2updatesite-1.6.0-SNAPSHOT.pom
[INFO] Installing /home/hudson/genie.jwt/.jenkins/jobs/soa-jwt-integration/workspace/org.eclipse.jwt/releng/org.eclipse.jwt.p2updatesite/target/p2content.xml to /home/hudson/genie.jwt/.jenkins/jobs/soa-jwt-integration/workspace/.repository/org/eclipse/jwt/org.eclipse.jwt.p2updatesite/1.6.0-SNAPSHOT/org.eclipse.jwt.p2updatesite-1.6.0-SNAPSHOT-p2metadata.xml
[INFO] Installing /home/hudson/genie.jwt/.jenkins/jobs/soa-jwt-integration/workspace/org.eclipse.jwt/releng/org.eclipse.jwt.p2updatesite/target/p2artifacts.xml to /home/hudson/genie.jwt/.jenkins/jobs/soa-jwt-integration/workspace/.repository/org/eclipse/jwt/org.eclipse.jwt.p2updatesite/1.6.0-SNAPSHOT/org.eclipse.jwt.p2updatesite-1.6.0-SNAPSHOT-p2artifacts.xml
[INFO] 
[INFO] --- tycho-p2-plugin:0.24.0:update-local-index (default-update-local-index) @ org.eclipse.jwt.p2updatesite ---
[INFO] 
[INFO] --- maven-antrun-plugin:1.3:run (deploy) @ org.eclipse.jwt.p2updatesite ---
Downloading: https://repo.eclipse.org/content/groups/tycho/org/apache/maven/maven-plugin-api/2.0.4/maven-plugin-api-2.0.4.pom
               
Downloading: https://repo.eclipse.org/content/repositories/cbi-releases/org/apache/maven/maven-plugin-api/2.0.4/maven-plugin-api-2.0.4.pom
               
Downloading: https://repo.eclipse.org/content/repositories/maven_central/org/apache/maven/maven-plugin-api/2.0.4/maven-plugin-api-2.0.4.pom
643/643 B      
            
Downloaded: https://repo.eclipse.org/content/repositories/maven_central/org/apache/maven/maven-plugin-api/2.0.4/maven-plugin-api-2.0.4.pom (643 B at 17.9 KB/sec)
Downloading: https://repo.eclipse.org/content/groups/tycho/org/apache/maven/maven/2.0.4/maven-2.0.4.pom
            
Downloading: https://repo.eclipse.org/content/repositories/cbi-releases/org/apache/maven/maven/2.0.4/maven-2.0.4.pom
            
Downloading: https://repo.eclipse.org/content/repositories/maven_central/org/apache/maven/maven/2.0.4/maven-2.0.4.pom
4/12 KB     
8/12 KB   
12/12 KB   
12/12 KB   
           
Downloaded: https://repo.eclipse.org/content/repositories/maven_central/org/apache/maven/maven/2.0.4/maven-2.0.4.pom (12 KB at 411.4 KB/sec)
Downloading: https://repo.eclipse.org/content/groups/tycho/org/apache/maven/maven-project/2.0.4/maven-project-2.0.4.pom
           
Downloading: https://repo.eclipse.org/content/repositories/cbi-releases/org/apache/maven/maven-project/2.0.4/maven-project-2.0.4.pom
           
Downloading: https://repo.eclipse.org/content/repositories/maven_central/org/apache/maven/maven-project/2.0.4/maven-project-2.0.4.pom
2/2 KB     
         
Downloaded: https://repo.eclipse.org/content/repositories/maven_central/org/apache/maven/maven-project/2.0.4/maven-project-2.0.4.pom (2 KB at 64.2 KB/sec)
Downloading: https://repo.eclipse.org/content/groups/tycho/org/apache/maven/maven-settings/2.0.4/maven-settings-2.0.4.pom
         
Downloading: https://repo.eclipse.org/content/repositories/cbi-releases/org/apache/maven/maven-settings/2.0.4/maven-settings-2.0.4.pom
         
Downloading: https://repo.eclipse.org/content/repositories/maven_central/org/apache/maven/maven-settings/2.0.4/maven-settings-2.0.4.pom
2/2 KB   
         
Downloaded: https://repo.eclipse.org/content/repositories/maven_central/org/apache/maven/maven-settings/2.0.4/maven-settings-2.0.4.pom (2 KB at 54.8 KB/sec)
Downloading: https://repo.eclipse.org/content/groups/tycho/org/apache/maven/maven-model/2.0.4/maven-model-2.0.4.pom
         
Downloading: https://repo.eclipse.org/content/repositories/cbi-releases/org/apache/maven/maven-model/2.0.4/maven-model-2.0.4.pom
         
Downloading: https://repo.eclipse.org/content/repositories/maven_central/org/apache/maven/maven-model/2.0.4/maven-model-2.0.4.pom
3/3 KB   
         
Downloaded: https://repo.eclipse.org/content/repositories/maven_central/org/apache/maven/maven-model/2.0.4/maven-model-2.0.4.pom (3 KB at 80.2 KB/sec)
Downloading: https://repo.eclipse.org/content/groups/tycho/org/codehaus/plexus/plexus-utils/1.1/plexus-utils-1.1.pom
         
Downloading: https://repo.eclipse.org/content/repositories/cbi-releases/org/codehaus/plexus/plexus-utils/1.1/plexus-utils-1.1.pom
         
Downloading: https://repo.eclipse.org/content/repositories/maven_central/org/codehaus/plexus/plexus-utils/1.1/plexus-utils-1.1.pom
767/767 B   
            
Downloaded: https://repo.eclipse.org/content/repositories/maven_central/org/codehaus/plexus/plexus-utils/1.1/plexus-utils-1.1.pom (767 B at 26.8 KB/sec)
Downloading: https://repo.eclipse.org/content/groups/tycho/org/codehaus/plexus/plexus-container-default/1.0-alpha-9/plexus-container-default-1.0-alpha-9.pom
            
Downloading: https://repo.eclipse.org/content/repositories/cbi-releases/org/codehaus/plexus/plexus-container-default/1.0-alpha-9/plexus-container-default-1.0-alpha-9.pom
            
Downloading: https://repo.eclipse.org/content/repositories/maven_central/org/codehaus/plexus/plexus-container-default/1.0-alpha-9/plexus-container-default-1.0-alpha-9.pom
2/2 KB      
         
Downloaded: https://repo.eclipse.org/content/repositories/maven_central/org/codehaus/plexus/plexus-container-default/1.0-alpha-9/plexus-container-default-1.0-alpha-9.pom (2 KB at 60.4 KB/sec)
Downloading: https://repo.eclipse.org/content/groups/tycho/org/apache/maven/maven-profile/2.0.4/maven-profile-2.0.4.pom
         
Downloading: https://repo.eclipse.org/content/repositories/cbi-releases/org/apache/maven/maven-profile/2.0.4/maven-profile-2.0.4.pom
         
Downloading: https://repo.eclipse.org/content/repositories/maven_central/org/apache/maven/maven-profile/2.0.4/maven-profile-2.0.4.pom
2/2 KB   
         
Downloaded: https://repo.eclipse.org/content/repositories/maven_central/org/apache/maven/maven-profile/2.0.4/maven-profile-2.0.4.pom (2 KB at 51.0 KB/sec)
Downloading: https://repo.eclipse.org/content/groups/tycho/org/apache/maven/maven-artifact-manager/2.0.4/maven-artifact-manager-2.0.4.pom
         
Downloading: https://repo.eclipse.org/content/repositories/cbi-releases/org/apache/maven/maven-artifact-manager/2.0.4/maven-artifact-manager-2.0.4.pom
         
Downloading: https://repo.eclipse.org/content/repositories/maven_central/org/apache/maven/maven-artifact-manager/2.0.4/maven-artifact-manager-2.0.4.pom
2/2 KB   
         
Downloaded: https://repo.eclipse.org/content/repositories/maven_central/org/apache/maven/maven-artifact-manager/2.0.4/maven-artifact-manager-2.0.4.pom (2 KB at 45.7 KB/sec)
Downloading: https://repo.eclipse.org/content/groups/tycho/org/apache/maven/maven-repository-metadata/2.0.4/maven-repository-metadata-2.0.4.pom
         
Downloading: https://repo.eclipse.org/content/repositories/cbi-releases/org/apache/maven/maven-repository-metadata/2.0.4/maven-repository-metadata-2.0.4.pom
         
Downloading: https://repo.eclipse.org/content/repositories/maven_central/org/apache/maven/maven-repository-metadata/2.0.4/maven-repository-metadata-2.0.4.pom
2/2 KB   
         
Downloaded: https://repo.eclipse.org/content/repositories/maven_central/org/apache/maven/maven-repository-metadata/2.0.4/maven-repository-metadata-2.0.4.pom (2 KB at 50.1 KB/sec)
Downloading: https://repo.eclipse.org/content/groups/tycho/org/apache/maven/maven-artifact/2.0.4/maven-artifact-2.0.4.pom
         
Downloading: https://repo.eclipse.org/content/repositories/cbi-releases/org/apache/maven/maven-artifact/2.0.4/maven-artifact-2.0.4.pom
         
Downloading: https://repo.eclipse.org/content/repositories/maven_central/org/apache/maven/maven-artifact/2.0.4/maven-artifact-2.0.4.pom
765/765 B   
            
Downloaded: https://repo.eclipse.org/content/repositories/maven_central/org/apache/maven/maven-artifact/2.0.4/maven-artifact-2.0.4.pom (765 B at 27.7 KB/sec)
Downloading: https://repo.eclipse.org/content/groups/tycho/org/codehaus/plexus/plexus-utils/1.5.6/plexus-utils-1.5.6.pom
            
Downloading: https://repo.eclipse.org/content/repositories/cbi-releases/org/codehaus/plexus/plexus-utils/1.5.6/plexus-utils-1.5.6.pom
            
Downloading: https://repo.eclipse.org/content/repositories/maven_central/org/codehaus/plexus/plexus-utils/1.5.6/plexus-utils-1.5.6.pom
4/6 KB      
6/6 KB   
         
Downloaded: https://repo.eclipse.org/content/repositories/maven_central/org/codehaus/plexus/plexus-utils/1.5.6/plexus-utils-1.5.6.pom (6 KB at 258.9 KB/sec)
Downloading: https://repo.eclipse.org/content/groups/tycho/org/codehaus/plexus/plexus/1.0.12/plexus-1.0.12.pom
         
Downloading: https://repo.eclipse.org/content/repositories/cbi-releases/org/codehaus/plexus/plexus/1.0.12/plexus-1.0.12.pom
         
Downloading: https://repo.eclipse.org/content/repositories/maven_central/org/codehaus/plexus/plexus/1.0.12/plexus-1.0.12.pom
4/10 KB   
8/10 KB   
10/10 KB   
           
Downloaded: https://repo.eclipse.org/content/repositories/maven_central/org/codehaus/plexus/plexus/1.0.12/plexus-1.0.12.pom (10 KB at 531.7 KB/sec)
Downloading: https://repo.eclipse.org/content/groups/tycho/org/apache/ant/ant-launcher/1.7.1/ant-launcher-1.7.1.pom
           
Downloading: https://repo.eclipse.org/content/repositories/cbi-releases/org/apache/ant/ant-launcher/1.7.1/ant-launcher-1.7.1.pom
           
Downloading: https://repo.eclipse.org/content/repositories/maven_central/org/apache/ant/ant-launcher/1.7.1/ant-launcher-1.7.1.pom
3/3 KB     
         
Downloaded: https://repo.eclipse.org/content/repositories/maven_central/org/apache/ant/ant-launcher/1.7.1/ant-launcher-1.7.1.pom (3 KB at 70.5 KB/sec)
Downloading: https://repo.eclipse.org/content/groups/tycho/org/apache/ant/ant-parent/1.7.1/ant-parent-1.7.1.pom
         
Downloading: https://repo.eclipse.org/content/repositories/cbi-releases/org/apache/ant/ant-parent/1.7.1/ant-parent-1.7.1.pom
         
Downloading: https://repo.eclipse.org/content/repositories/maven_central/org/apache/ant/ant-parent/1.7.1/ant-parent-1.7.1.pom
4/5 KB   
5/5 KB   
         
Downloaded: https://repo.eclipse.org/content/repositories/maven_central/org/apache/ant/ant-parent/1.7.1/ant-parent-1.7.1.pom (5 KB at 152.7 KB/sec)
Downloading: https://repo.eclipse.org/content/groups/tycho/org/apache/ant/ant/1.7.1/ant-1.7.1.pom
         
Downloading: https://repo.eclipse.org/content/repositories/cbi-releases/org/apache/ant/ant/1.7.1/ant-1.7.1.pom
         
Downloading: https://repo.eclipse.org/content/repositories/maven_central/org/apache/ant/ant/1.7.1/ant-1.7.1.pom
4/10 KB   
8/10 KB   
10/10 KB   
           
Downloaded: https://repo.eclipse.org/content/repositories/maven_central/org/apache/ant/ant/1.7.1/ant-1.7.1.pom (10 KB at 352.9 KB/sec)
Downloading: https://repo.eclipse.org/content/groups/tycho/org/apache/maven/maven-plugin-api/2.0.4/maven-plugin-api-2.0.4.jar
Downloading: https://repo.eclipse.org/content/groups/tycho/org/apache/maven/maven-project/2.0.4/maven-project-2.0.4.jar
Downloading: https://repo.eclipse.org/content/groups/tycho/org/apache/maven/maven-settings/2.0.4/maven-settings-2.0.4.jar
Downloading: https://repo.eclipse.org/content/groups/tycho/org/apache/maven/maven-profile/2.0.4/maven-profile-2.0.4.jar
Downloading: https://repo.eclipse.org/content/groups/tycho/org/apache/maven/maven-model/2.0.4/maven-model-2.0.4.jar
           
Downloading: https://repo.eclipse.org/content/groups/tycho/org/apache/maven/maven-artifact-manager/2.0.4/maven-artifact-manager-2.0.4.jar
           
Downloading: https://repo.eclipse.org/content/groups/tycho/org/apache/maven/maven-repository-metadata/2.0.4/maven-repository-metadata-2.0.4.jar
           
Downloading: https://repo.eclipse.org/content/groups/tycho/org/codehaus/plexus/plexus-container-default/1.0-alpha-9/plexus-container-default-1.0-alpha-9.jar
           
Downloading: https://repo.eclipse.org/content/groups/tycho/org/apache/maven/maven-artifact/2.0.4/maven-artifact-2.0.4.jar
           
Downloading: https://repo.eclipse.org/content/groups/tycho/org/codehaus/plexus/plexus-utils/1.5.6/plexus-utils-1.5.6.jar
           
Downloading: https://repo.eclipse.org/content/groups/tycho/org/apache/ant/ant-launcher/1.7.1/ant-launcher-1.7.1.jar
           
Downloading: https://repo.eclipse.org/content/groups/tycho/org/apache/ant/ant/1.7.1/ant-1.7.1.jar
           
           
           
           
           
Downloading: https://repo.eclipse.org/content/repositories/cbi-releases/org/apache/maven/maven-plugin-api/2.0.4/maven-plugin-api-2.0.4.jar
Downloading: https://repo.eclipse.org/content/repositories/cbi-releases/org/apache/maven/maven-project/2.0.4/maven-project-2.0.4.jar
Downloading: https://repo.eclipse.org/content/repositories/cbi-releases/org/apache/maven/maven-settings/2.0.4/maven-settings-2.0.4.jar
Downloading: https://repo.eclipse.org/content/repositories/cbi-releases/org/apache/maven/maven-profile/2.0.4/maven-profile-2.0.4.jar
Downloading: https://repo.eclipse.org/content/repositories/cbi-releases/org/apache/maven/maven-model/2.0.4/maven-model-2.0.4.jar
           
Downloading: https://repo.eclipse.org/content/repositories/cbi-releases/org/apache/maven/maven-artifact-manager/2.0.4/maven-artifact-manager-2.0.4.jar
           
Downloading: https://repo.eclipse.org/content/repositories/cbi-releases/org/apache/maven/maven-repository-metadata/2.0.4/maven-repository-metadata-2.0.4.jar
           
Downloading: https://repo.eclipse.org/content/repositories/cbi-releases/org/codehaus/plexus/plexus-container-default/1.0-alpha-9/plexus-container-default-1.0-alpha-9.jar
           
Downloading: https://repo.eclipse.org/content/repositories/cbi-releases/org/apache/maven/maven-artifact/2.0.4/maven-artifact-2.0.4.jar
           
Downloading: https://repo.eclipse.org/content/repositories/cbi-releases/org/codehaus/plexus/plexus-utils/1.5.6/plexus-utils-1.5.6.jar
           
Downloading: https://repo.eclipse.org/content/repositories/cbi-releases/org/apache/ant/ant-launcher/1.7.1/ant-launcher-1.7.1.jar
           
Downloading: https://repo.eclipse.org/content/repositories/cbi-releases/org/apache/ant/ant/1.7.1/ant-1.7.1.jar
           
           
           
           
           
Downloading: https://repo.eclipse.org/content/repositories/maven_central/org/apache/maven/maven-plugin-api/2.0.4/maven-plugin-api-2.0.4.jar
Downloading: https://repo.eclipse.org/content/repositories/maven_central/org/apache/maven/maven-project/2.0.4/maven-project-2.0.4.jar
Downloading: https://repo.eclipse.org/content/repositories/maven_central/org/apache/maven/maven-settings/2.0.4/maven-settings-2.0.4.jar
Downloading: https://repo.eclipse.org/content/repositories/maven_central/org/apache/maven/maven-profile/2.0.4/maven-profile-2.0.4.jar
Downloading: https://repo.eclipse.org/content/repositories/maven_central/org/apache/maven/maven-model/2.0.4/maven-model-2.0.4.jar
4/107 KB   
8/107 KB   
12/107 KB   
16/107 KB   
4/79 KB   16/107 KB   
8/79 KB   16/107 KB   
8/79 KB   20/107 KB   
8/79 KB   24/107 KB   
12/79 KB   24/107 KB   
16/79 KB   24/107 KB   
16/79 KB   28/107 KB   
16/79 KB   31/107 KB   
20/79 KB   31/107 KB   
24/79 KB   31/107 KB   
24/79 KB   35/107 KB   
24/79 KB   39/107 KB   
4/30 KB   24/79 KB   39/107 KB   
4/30 KB   24/79 KB   43/107 KB   
8/30 KB   24/79 KB   43/107 KB   
8/30 KB   24/79 KB   47/107 KB   
12/30 KB   24/79 KB   47/107 KB   
16/30 KB   24/79 KB   47/107 KB   
16/30 KB   24/79 KB   51/107 KB   
16/30 KB   24/79 KB   4/9 KB   51/107 KB   
20/30 KB   24/79 KB   4/9 KB   51/107 KB   
20/30 KB   24/79 KB   4/9 KB   55/107 KB   
20/30 KB   24/79 KB   8/9 KB   55/107 KB   
24/30 KB   24/79 KB   8/9 KB   55/107 KB   
24/30 KB   24/79 KB   9/9 KB   55/107 KB   
28/30 KB   24/79 KB   9/9 KB   55/107 KB   
30/30 KB   24/79 KB   9/9 KB   55/107 KB   
30/30 KB   24/79 KB   9/9 KB   59/107 KB   
30/30 KB   24/79 KB   9/9 KB   63/107 KB   
30/30 KB   24/79 KB   9/9 KB   64/107 KB   
30/30 KB   28/79 KB   9/9 KB   64/107 KB   
30/30 KB   31/79 KB   9/9 KB   64/107 KB   
30/30 KB   32/79 KB   9/9 KB   64/107 KB   
30/30 KB   36/79 KB   9/9 KB   64/107 KB   
30/30 KB   36/79 KB   9/9 KB   68/107 KB   
30/30 KB   40/79 KB   9/9 KB   68/107 KB   
30/30 KB   40/79 KB   9/9 KB   72/107 KB   
30/30 KB   44/79 KB   9/9 KB   72/107 KB   
30/30 KB   48/79 KB   9/9 KB   72/107 KB   
30/30 KB   52/79 KB   9/9 KB   72/107 KB   
30/30 KB   52/79 KB   4/43 KB   9/9 KB   76/107 KB   
30/30 KB   56/79 KB   4/43 KB   9/9 KB   76/107 KB   
30/30 KB   52/79 KB   4/43 KB   9/9 KB   76/107 KB   
30/30 KB   56/79 KB   4/43 KB   9/9 KB   80/107 KB   
30/30 KB   56/79 KB   8/43 KB   9/9 KB   80/107 KB   
30/30 KB   60/79 KB   8/43 KB   9/9 KB   80/107 KB   
30/30 KB   64/79 KB   8/43 KB   9/9 KB   80/107 KB   
30/30 KB   64/79 KB   8/43 KB   9/9 KB   80/107 KB   
30/30 KB   64/79 KB   8/43 KB   9/9 KB   84/107 KB   
30/30 KB   64/79 KB   12/43 KB   9/9 KB   84/107 KB   
30/30 KB   64/79 KB   12/43 KB   9/9 KB   88/107 KB   
30/30 KB   64/79 KB   16/43 KB   9/9 KB   88/107 KB   
30/30 KB   68/79 KB   16/43 KB   9/9 KB   88/107 KB   
30/30 KB   68/79 KB   16/43 KB   9/9 KB   92/107 KB   
30/30 KB   68/79 KB   20/43 KB   9/9 KB   92/107 KB   
30/30 KB   72/79 KB   20/43 KB   9/9 KB   92/107 KB   
30/30 KB   72/79 KB   20/43 KB   9/9 KB   96/107 KB   
30/30 KB   72/79 KB   24/43 KB   9/9 KB   96/107 KB   
30/30 KB   72/79 KB   28/43 KB   9/9 KB   96/107 KB   
30/30 KB   72/79 KB   28/43 KB   9/9 KB   100/107 KB   
30/30 KB   76/79 KB   28/43 KB   9/9 KB   100/107 KB   
30/30 KB   76/79 KB   31/43 KB   9/9 KB   100/107 KB   
30/30 KB   79/79 KB   31/43 KB   9/9 KB   100/107 KB   
30/30 KB   79/79 KB   31/43 KB   9/9 KB   104/107 KB   
30/30 KB   79/79 KB   35/43 KB   9/9 KB   104/107 KB   
30/30 KB   79/79 KB   35/43 KB   9/9 KB   107/107 KB   
30/30 KB   79/79 KB   39/43 KB   9/9 KB   107/107 KB   
30/30 KB   79/79 KB   43/43 KB   9/9 KB   107/107 KB   
30/30 KB   79/79 KB   43/43 KB   9/9 KB   107/107 KB   
                                                       
Downloaded: https://repo.eclipse.org/content/repositories/maven_central/org/apache/maven/maven-plugin-api/2.0.4/maven-plugin-api-2.0.4.jar (9 KB at 135.6 KB/sec)
Downloading: https://repo.eclipse.org/content/repositories/maven_central/org/apache/maven/maven-artifact-manager/2.0.4/maven-artifact-manager-2.0.4.jar
30/30 KB   79/79 KB   43/43 KB   4/48 KB   107/107 KB   
30/30 KB   79/79 KB   43/43 KB   8/48 KB   107/107 KB   
30/30 KB   79/79 KB   43/43 KB   12/48 KB   107/107 KB   
30/30 KB   79/79 KB   43/43 KB   16/48 KB   107/107 KB   
30/30 KB   79/79 KB   43/43 KB   20/48 KB   107/107 KB   
30/30 KB   79/79 KB   43/43 KB   24/48 KB   107/107 KB   
30/30 KB   79/79 KB   43/43 KB   28/48 KB   107/107 KB   
30/30 KB   79/79 KB   43/43 KB   31/48 KB   107/107 KB   
30/30 KB   79/79 KB   43/43 KB   32/48 KB   107/107 KB   
30/30 KB   79/79 KB   43/43 KB   36/48 KB   107/107 KB   
30/30 KB   79/79 KB   43/43 KB   40/48 KB   107/107 KB   
30/30 KB   79/79 KB   43/43 KB   44/48 KB   107/107 KB   
30/30 KB   79/79 KB   43/43 KB   48/48 KB   107/107 KB   
30/30 KB   79/79 KB   43/43 KB   48/48 KB   107/107 KB   
                                                         
                                                         
                                                         
Downloaded: https://repo.eclipse.org/content/repositories/maven_central/org/apache/maven/maven-profile/2.0.4/maven-profile-2.0.4.jar (30 KB at 130.6 KB/sec)
Downloading: https://repo.eclipse.org/content/repositories/maven_central/org/apache/maven/maven-repository-metadata/2.0.4/maven-repository-metadata-2.0.4.jar
Downloaded: https://repo.eclipse.org/content/repositories/maven_central/org/apache/maven/maven-model/2.0.4/maven-model-2.0.4.jar (79 KB at 346.5 KB/sec)
Downloaded: https://repo.eclipse.org/content/repositories/maven_central/org/apache/maven/maven-project/2.0.4/maven-project-2.0.4.jar (107 KB at 471.0 KB/sec)
Downloading: https://repo.eclipse.org/content/repositories/maven_central/org/codehaus/plexus/plexus-container-default/1.0-alpha-9/plexus-container-default-1.0-alpha-9.jar
Downloading: https://repo.eclipse.org/content/repositories/maven_central/org/apache/maven/maven-artifact/2.0.4/maven-artifact-2.0.4.jar
                                                         
Downloaded: https://repo.eclipse.org/content/repositories/maven_central/org/apache/maven/maven-artifact-manager/2.0.4/maven-artifact-manager-2.0.4.jar (48 KB at 195.4 KB/sec)
Downloading: https://repo.eclipse.org/content/repositories/maven_central/org/codehaus/plexus/plexus-utils/1.5.6/plexus-utils-1.5.6.jar
4/20 KB   43/43 KB                                       
8/20 KB   43/43 KB   
12/20 KB   43/43 KB   
16/20 KB   43/43 KB   
20/20 KB   43/43 KB   
20/20 KB   43/43 KB   4/191 KB   
20/20 KB   43/43 KB   8/191 KB   
20/20 KB   43/43 KB   12/191 KB   
20/20 KB   43/43 KB   16/191 KB   
20/20 KB   43/43 KB   20/191 KB   
20/20 KB   43/43 KB   24/191 KB   
20/20 KB   43/43 KB   28/191 KB   
20/20 KB   43/43 KB   31/191 KB   
20/20 KB   43/43 KB   35/191 KB   
20/20 KB   43/43 KB   39/191 KB   
20/20 KB   43/43 KB   39/191 KB   4/245 KB   
20/20 KB   43/43 KB   39/191 KB   8/245 KB   
20/20 KB   43/43 KB   43/191 KB   8/245 KB   
20/20 KB   43/43 KB   47/191 KB   8/245 KB   
20/20 KB   43/43 KB   47/191 KB   12/245 KB   
20/20 KB   43/43 KB   47/191 KB   16/245 KB   
20/20 KB   43/43 KB   51/191 KB   16/245 KB   
20/20 KB   43/43 KB   55/191 KB   16/245 KB   
20/20 KB   43/43 KB   55/191 KB   20/245 KB   
20/20 KB   43/43 KB   55/191 KB   24/245 KB   
20/20 KB   43/43 KB   59/191 KB   24/245 KB   
20/20 KB   43/43 KB   59/191 KB   28/245 KB   
20/20 KB   43/43 KB   63/191 KB   28/245 KB   
20/20 KB   43/43 KB   63/191 KB   31/245 KB   
20/20 KB   43/43 KB   63/191 KB   32/245 KB   
20/20 KB   43/43 KB   64/191 KB   32/245 KB   
20/20 KB   43/43 KB   64/191 KB   36/245 KB   
20/20 KB   43/43 KB   64/191 KB   40/245 KB   
20/20 KB   43/43 KB   68/191 KB   40/245 KB   
20/20 KB   43/43 KB   72/191 KB   40/245 KB   
20/20 KB   43/43 KB   72/191 KB   44/245 KB   
20/20 KB   43/43 KB   72/191 KB   48/245 KB   
20/20 KB   43/43 KB   76/191 KB   48/245 KB   
20/20 KB   4/79 KB   43/43 KB   76/191 KB   48/245 KB   
20/20 KB   4/79 KB   43/43 KB   80/191 KB   48/245 KB   
20/20 KB   8/79 KB   43/43 KB   80/191 KB   52/245 KB   
20/20 KB   8/79 KB   43/43 KB   80/191 KB   52/245 KB   
20/20 KB   8/79 KB   43/43 KB   80/191 KB   56/245 KB   
20/20 KB   8/79 KB   43/43 KB   84/191 KB   56/245 KB   
20/20 KB   12/79 KB   43/43 KB   84/191 KB   56/245 KB   
20/20 KB   12/79 KB   43/43 KB   88/191 KB   60/245 KB   
20/20 KB   12/79 KB   43/43 KB   88/191 KB   60/245 KB   
20/20 KB   16/79 KB   43/43 KB   88/191 KB   60/245 KB   
20/20 KB   16/79 KB   43/43 KB   88/191 KB   64/245 KB   
20/20 KB   16/79 KB   43/43 KB   88/191 KB   64/245 KB   
20/20 KB   16/79 KB   43/43 KB   92/191 KB   64/245 KB   
20/20 KB   20/79 KB   43/43 KB   92/191 KB   68/245 KB   
20/20 KB   20/79 KB   43/43 KB   92/191 KB   68/245 KB   
20/20 KB   20/79 KB   43/43 KB   96/191 KB   68/245 KB   
20/20 KB   20/79 KB   43/43 KB   96/191 KB   72/245 KB   
20/20 KB   24/79 KB   43/43 KB   96/191 KB   72/245 KB   
20/20 KB   24/79 KB   43/43 KB   96/191 KB   76/245 KB   
20/20 KB   28/79 KB   43/43 KB   96/191 KB   76/245 KB   
20/20 KB   28/79 KB   43/43 KB   100/191 KB   80/245 KB   
20/20 KB   28/79 KB   43/43 KB   96/191 KB   80/245 KB   
20/20 KB   31/79 KB   43/43 KB   100/191 KB   80/245 KB   
20/20 KB   31/79 KB   43/43 KB   104/191 KB   80/245 KB   
20/20 KB   32/79 KB   43/43 KB   104/191 KB   80/245 KB   
20/20 KB   32/79 KB   43/43 KB   104/191 KB   84/245 KB   
20/20 KB   32/79 KB   43/43 KB   104/191 KB   88/245 KB   
20/20 KB   32/79 KB   43/43 KB   108/191 KB   88/245 KB   
20/20 KB   36/79 KB   43/43 KB   108/191 KB   88/245 KB   
20/20 KB   36/79 KB   43/43 KB   111/191 KB   88/245 KB   
20/20 KB   40/79 KB   43/43 KB   111/191 KB   88/245 KB   
20/20 KB   40/79 KB   43/43 KB   111/191 KB   92/245 KB   
20/20 KB   40/79 KB   43/43 KB   111/191 KB   96/245 KB   
20/20 KB   44/79 KB   43/43 KB   111/191 KB   96/245 KB   
20/20 KB   44/79 KB   43/43 KB   115/191 KB   96/245 KB   
20/20 KB   48/79 KB   43/43 KB   115/191 KB   96/245 KB   
20/20 KB   48/79 KB   43/43 KB   119/191 KB   96/245 KB   
20/20 KB   48/79 KB   43/43 KB   119/191 KB   100/245 KB   
20/20 KB   48/79 KB   43/43 KB   119/191 KB   104/245 KB   
20/20 KB   52/79 KB   43/43 KB   119/191 KB   104/245 KB   
20/20 KB   56/79 KB   43/43 KB   119/191 KB   104/245 KB   
20/20 KB   56/79 KB   43/43 KB   123/191 KB   104/245 KB   
20/20 KB   56/79 KB   43/43 KB   123/191 KB   108/245 KB   
20/20 KB   56/79 KB   43/43 KB   127/191 KB   108/245 KB   
20/20 KB   56/79 KB   43/43 KB   127/191 KB   111/245 KB   
20/20 KB   60/79 KB   43/43 KB   127/191 KB   111/245 KB   
20/20 KB   60/79 KB   43/43 KB   127/191 KB   115/245 KB   
20/20 KB   64/79 KB   43/43 KB   127/191 KB   115/245 KB   
20/20 KB   64/79 KB   43/43 KB   131/191 KB   115/245 KB   
20/20 KB   64/79 KB   43/43 KB   131/191 KB   119/245 KB   
20/20 KB   64/79 KB   43/43 KB   135/191 KB   119/245 KB   
20/20 KB   68/79 KB   43/43 KB   135/191 KB   119/245 KB   
20/20 KB   68/79 KB   43/43 KB   135/191 KB   123/245 KB   
20/20 KB   72/79 KB   43/43 KB   135/191 KB   123/245 KB   
20/20 KB   72/79 KB   43/43 KB   135/191 KB   127/245 KB   
20/20 KB   72/79 KB   43/43 KB   139/191 KB   127/245 KB   
20/20 KB   72/79 KB   43/43 KB   143/191 KB   127/245 KB   
20/20 KB   76/79 KB   43/43 KB   143/191 KB   127/245 KB   
20/20 KB   76/79 KB   43/43 KB   143/191 KB   131/245 KB   
20/20 KB   79/79 KB   43/43 KB   143/191 KB   131/245 KB   
20/20 KB   79/79 KB   43/43 KB   143/191 KB   135/245 KB   
20/20 KB   79/79 KB   43/43 KB   147/191 KB   135/245 KB   
20/20 KB   79/79 KB   43/43 KB   150/191 KB   135/245 KB   
20/20 KB   79/79 KB   43/43 KB   150/191 KB   139/245 KB   
20/20 KB   79/79 KB   43/43 KB   150/191 KB   143/245 KB   
20/20 KB   79/79 KB   43/43 KB   154/191 KB   143/245 KB   
20/20 KB   79/79 KB   158/191 KB   143/245 KB              
                                                           
20/20 KB   79/79 KB   158/191 KB   147/245 KB   
20/20 KB   79/79 KB   158/191 KB   150/245 KB   
20/20 KB   79/79 KB   162/191 KB   150/245 KB   
20/20 KB   79/79 KB   166/191 KB   150/245 KB   
Downloaded: https://repo.eclipse.org/content/repositories/maven_central/org/apache/maven/maven-settings/2.0.4/maven-settings-2.0.4.jar (43 KB at 162.0 KB/sec)
20/20 KB   79/79 KB   166/191 KB   154/245 KB   
Downloading: https://repo.eclipse.org/content/repositories/maven_central/org/apache/ant/ant-launcher/1.7.1/ant-launcher-1.7.1.jar
20/20 KB   79/79 KB   166/191 KB   158/245 KB   
20/20 KB   79/79 KB   170/191 KB   158/245 KB   
20/20 KB   79/79 KB   174/191 KB   158/245 KB   
20/20 KB   79/79 KB   174/191 KB   162/245 KB   
20/20 KB   79/79 KB   174/191 KB   166/245 KB   
20/20 KB   79/79 KB   178/191 KB   166/245 KB   
20/20 KB   79/79 KB   182/191 KB   166/245 KB   
20/20 KB   79/79 KB   182/191 KB   170/245 KB   
20/20 KB   79/79 KB   182/191 KB   174/245 KB   
20/20 KB   79/79 KB   186/191 KB   174/245 KB   
20/20 KB   79/79 KB   189/191 KB   174/245 KB   
20/20 KB   79/79 KB   191/191 KB   174/245 KB   
20/20 KB   79/79 KB   191/191 KB   178/245 KB   
20/20 KB   79/79 KB   191/191 KB   182/245 KB   
20/20 KB   79/79 KB   191/191 KB   186/245 KB   
20/20 KB   79/79 KB   191/191 KB   189/245 KB   
20/20 KB   79/79 KB   191/191 KB   193/245 KB   
20/20 KB   79/79 KB   191/191 KB   197/245 KB   
20/20 KB   79/79 KB   191/191 KB   201/245 KB   
20/20 KB   79/79 KB   191/191 KB   205/245 KB   
20/20 KB   79/79 KB   191/191 KB   209/245 KB   
20/20 KB   79/79 KB   191/191 KB   213/245 KB   
20/20 KB   79/79 KB   191/191 KB   217/245 KB   
20/20 KB   79/79 KB   191/191 KB   221/245 KB   
20/20 KB   79/79 KB   191/191 KB   225/245 KB   
20/20 KB   79/79 KB   191/191 KB   229/245 KB   
20/20 KB   79/79 KB   191/191 KB   233/245 KB   
20/20 KB   79/79 KB   191/191 KB   236/245 KB   
20/20 KB   79/79 KB   191/191 KB   240/245 KB   
20/20 KB   79/79 KB   191/191 KB   244/245 KB   
20/20 KB   79/79 KB   191/191 KB   245/245 KB   
                                                
Downloaded: https://repo.eclipse.org/content/repositories/maven_central/org/apache/maven/maven-repository-metadata/2.0.4/maven-repository-metadata-2.0.4.jar (20 KB at 71.0 KB/sec)
Downloading: https://repo.eclipse.org/content/repositories/maven_central/org/apache/ant/ant/1.7.1/ant-1.7.1.jar
                                                
Downloaded: https://repo.eclipse.org/content/repositories/maven_central/org/codehaus/plexus/plexus-container-default/1.0-alpha-9/plexus-container-default-1.0-alpha-9.jar (191 KB at 701.5 KB/sec)
                                                
Downloaded: https://repo.eclipse.org/content/repositories/maven_central/org/apache/maven/maven-artifact/2.0.4/maven-artifact-2.0.4.jar (79 KB at 285.0 KB/sec)
245/245 KB   4/12 KB                            
245/245 KB   8/12 KB   
245/245 KB   12/12 KB   
245/245 KB   12/12 KB   
                        
Downloaded: https://repo.eclipse.org/content/repositories/maven_central/org/codehaus/plexus/plexus-utils/1.5.6/plexus-utils-1.5.6.jar (245 KB at 861.5 KB/sec)
4/1292 KB   12/12 KB    
8/1292 KB   12/12 KB   
12/1292 KB   12/12 KB   
16/1292 KB   12/12 KB   
20/1292 KB   12/12 KB   
24/1292 KB   12/12 KB   
28/1292 KB   12/12 KB   
31/1292 KB   12/12 KB   
32/1292 KB   12/12 KB   
36/1292 KB   12/12 KB   
40/1292 KB   12/12 KB   
44/1292 KB   12/12 KB   
48/1292 KB   12/12 KB   
52/1292 KB   12/12 KB   
56/1292 KB   12/12 KB   
60/1292 KB   12/12 KB   
64/1292 KB   12/12 KB   
64/1292 KB   12/12 KB   
68/1292 KB   12/12 KB   
72/1292 KB   12/12 KB   
76/1292 KB   12/12 KB   
80/1292 KB   12/12 KB   
84/1292 KB   12/12 KB   
88/1292 KB   12/12 KB   
92/1292 KB   12/12 KB   
96/1292 KB   12/12 KB   
96/1292 KB   12/12 KB   
100/1292 KB   12/12 KB   
104/1292 KB   12/12 KB   
108/1292 KB   12/12 KB   
112/1292 KB   12/12 KB   
116/1292 KB   12/12 KB   
120/1292 KB   12/12 KB   
124/1292 KB   12/12 KB   
128/1292 KB   12/12 KB   
132/1292 KB   12/12 KB   
136/1292 KB   12/12 KB   
140/1292 KB   12/12 KB   
143/1292 KB   12/12 KB   
147/1292 KB   12/12 KB   
151/1292 KB   12/12 KB   
                         
Downloaded: https://repo.eclipse.org/content/repositories/maven_central/org/apache/ant/ant-launcher/1.7.1/ant-launcher-1.7.1.jar (12 KB at 40.6 KB/sec)
155/1292 KB              
159/1292 KB   
163/1292 KB   
167/1292 KB   
171/1292 KB   
175/1292 KB   
179/1292 KB   
182/1292 KB   
186/1292 KB   
190/1292 KB   
194/1292 KB   
198/1292 KB   
202/1292 KB   
206/1292 KB   
210/1292 KB   
214/1292 KB   
218/1292 KB   
221/1292 KB   
225/1292 KB   
229/1292 KB   
233/1292 KB   
237/1292 KB   
241/1292 KB   
245/1292 KB   
249/1292 KB   
253/1292 KB   
257/1292 KB   
261/1292 KB   
265/1292 KB   
268/1292 KB   
272/1292 KB   
276/1292 KB   
280/1292 KB   
284/1292 KB   
288/1292 KB   
292/1292 KB   
296/1292 KB   
300/1292 KB   
304/1292 KB   
307/1292 KB   
311/1292 KB   
315/1292 KB   
319/1292 KB   
323/1292 KB   
327/1292 KB   
331/1292 KB   
335/1292 KB   
339/1292 KB   
343/1292 KB   
346/1292 KB   
350/1292 KB   
354/1292 KB   
358/1292 KB   
362/1292 KB   
366/1292 KB   
370/1292 KB   
374/1292 KB   
378/1292 KB   
382/1292 KB   
386/1292 KB   
390/1292 KB   
393/1292 KB   
397/1292 KB   
401/1292 KB   
405/1292 KB   
409/1292 KB   
413/1292 KB   
417/1292 KB   
421/1292 KB   
425/1292 KB   
429/1292 KB   
432/1292 KB   
436/1292 KB   
440/1292 KB   
444/1292 KB   
448/1292 KB   
452/1292 KB   
456/1292 KB   
460/1292 KB   
464/1292 KB   
468/1292 KB   
471/1292 KB   
475/1292 KB   
479/1292 KB   
483/1292 KB   
487/1292 KB   
491/1292 KB   
495/1292 KB   
499/1292 KB   
503/1292 KB   
507/1292 KB   
511/1292 KB   
515/1292 KB   
518/1292 KB   
522/1292 KB   
526/1292 KB   
530/1292 KB   
534/1292 KB   
538/1292 KB   
542/1292 KB   
546/1292 KB   
550/1292 KB   
554/1292 KB   
557/1292 KB   
561/1292 KB   
565/1292 KB   
569/1292 KB   
573/1292 KB   
577/1292 KB   
581/1292 KB   
585/1292 KB   
589/1292 KB   
593/1292 KB   
596/1292 KB   
600/1292 KB   
604/1292 KB   
608/1292 KB   
612/1292 KB   
616/1292 KB   
620/1292 KB   
624/1292 KB   
628/1292 KB   
632/1292 KB   
636/1292 KB   
640/1292 KB   
643/1292 KB   
647/1292 KB   
651/1292 KB   
655/1292 KB   
659/1292 KB   
663/1292 KB   
667/1292 KB   
671/1292 KB   
675/1292 KB   
679/1292 KB   
682/1292 KB   
686/1292 KB   
690/1292 KB   
694/1292 KB   
698/1292 KB   
702/1292 KB   
706/1292 KB   
710/1292 KB   
714/1292 KB   
718/1292 KB   
721/1292 KB   
725/1292 KB   
729/1292 KB   
733/1292 KB   
737/1292 KB   
741/1292 KB   
745/1292 KB   
749/1292 KB   
753/1292 KB   
757/1292 KB   
761/1292 KB   
765/1292 KB   
768/1292 KB   
772/1292 KB   
776/1292 KB   
780/1292 KB   
784/1292 KB   
788/1292 KB   
792/1292 KB   
796/1292 KB   
800/1292 KB   
804/1292 KB   
807/1292 KB   
811/1292 KB   
815/1292 KB   
819/1292 KB   
823/1292 KB   
827/1292 KB   
831/1292 KB   
835/1292 KB   
839/1292 KB   
843/1292 KB   
846/1292 KB   
850/1292 KB   
854/1292 KB   
858/1292 KB   
862/1292 KB   
866/1292 KB   
870/1292 KB   
874/1292 KB   
878/1292 KB   
882/1292 KB   
886/1292 KB   
890/1292 KB   
893/1292 KB   
897/1292 KB   
901/1292 KB   
905/1292 KB   
909/1292 KB   
913/1292 KB   
917/1292 KB   
921/1292 KB   
925/1292 KB   
929/1292 KB   
932/1292 KB   
936/1292 KB   
940/1292 KB   
944/1292 KB   
948/1292 KB   
952/1292 KB   
956/1292 KB   
960/1292 KB   
964/1292 KB   
968/1292 KB   
971/1292 KB   
975/1292 KB   
979/1292 KB   
983/1292 KB   
987/1292 KB   
991/1292 KB   
995/1292 KB   
999/1292 KB   
1003/1292 KB   
1007/1292 KB   
1011/1292 KB   
1015/1292 KB   
1018/1292 KB   
1022/1292 KB   
1026/1292 KB   
1030/1292 KB   
1034/1292 KB   
1038/1292 KB   
1042/1292 KB   
1046/1292 KB   
1050/1292 KB   
1054/1292 KB   
1057/1292 KB   
1061/1292 KB   
1065/1292 KB   
1069/1292 KB   
1073/1292 KB   
1077/1292 KB   
1081/1292 KB   
1085/1292 KB   
1089/1292 KB   
1093/1292 KB   
1096/1292 KB   
1100/1292 KB   
1104/1292 KB   
1108/1292 KB   
1112/1292 KB   
1116/1292 KB   
1120/1292 KB   
1124/1292 KB   
1128/1292 KB   
1132/1292 KB   
1136/1292 KB   
1140/1292 KB   
1143/1292 KB   
1147/1292 KB   
1151/1292 KB   
1155/1292 KB   
1159/1292 KB   
1163/1292 KB   
1167/1292 KB   
1171/1292 KB   
1175/1292 KB   
1179/1292 KB   
1182/1292 KB   
1186/1292 KB   
1190/1292 KB   
1194/1292 KB   
1198/1292 KB   
1202/1292 KB   
1206/1292 KB   
1210/1292 KB   
1214/1292 KB   
1218/1292 KB   
1221/1292 KB   
1225/1292 KB   
1229/1292 KB   
1233/1292 KB   
1237/1292 KB   
1241/1292 KB   
1245/1292 KB   
1249/1292 KB   
1253/1292 KB   
1257/1292 KB   
1261/1292 KB   
1265/1292 KB   
1268/1292 KB   
1272/1292 KB   
1276/1292 KB   
1280/1292 KB   
1284/1292 KB   
1288/1292 KB   
1292/1292 KB   
1292/1292 KB   
               
Downloaded: https://repo.eclipse.org/content/repositories/maven_central/org/apache/ant/ant/1.7.1/ant-1.7.1.jar (1292 KB at 3915.1 KB/sec)
[INFO] Executing tasks
     [copy] Copying 27 files to /home/data/httpd/download.eclipse.org/jwt/integration-update-site
[INFO] Executed tasks
[INFO] ------------------------------------------------------------------------
[INFO] Reactor Summary:
[INFO] 
[INFO] parent ............................................. SUCCESS [ 14.438 s]
[INFO] org.eclipse.jwt.converter .......................... SUCCESS [ 11.635 s]
[INFO] org.eclipse.jwt.we.conf.model ...................... SUCCESS [  1.801 s]
[INFO] org.eclipse.jwt.we.conf.edit ....................... SUCCESS [  1.694 s]
[INFO] org.eclipse.jwt.meta ............................... SUCCESS [  2.635 s]
[INFO] org.eclipse.jwt.we ................................. SUCCESS [  4.305 s]
[INFO] org.eclipse.jwt.we.conf.model.editor ............... SUCCESS [  1.363 s]
[INFO] org.eclipse.jwt.we.conf.property.model ............. SUCCESS [  1.332 s]
[INFO] org.eclipse.jwt.we.conf.property.edit .............. SUCCESS [  1.053 s]
[INFO] org.eclipse.jwt.we.conf.we ......................... SUCCESS [  1.341 s]
[INFO] org.eclipse.jwt.we_view_editor ..................... SUCCESS [  1.076 s]
[INFO] org.eclipse.jwt.we.helpers.application ............. SUCCESS [  1.244 s]
[INFO] org.eclipse.jwt.we.helpers.files ................... SUCCESS [  0.977 s]
[INFO] org.eclipse.jwt.we.plugins.doc ..................... SUCCESS [  2.350 s]
[INFO] org.eclipse.jwt.we.plugins.viewepc ................. SUCCESS [  1.824 s]
[INFO] org.eclipse.jwt.we.plugins.viewuml ................. SUCCESS [  1.162 s]
[INFO] org.eclipse.jwt.we.plugins.viewbpmn ................ SUCCESS [  1.691 s]
[INFO] org.eclipse.jwt.branding ........................... SUCCESS [  1.062 s]
[INFO] org.eclipse.jwt.we.example ......................... SUCCESS [  1.220 s]
[INFO] org.eclipse.jwt.transformations.baseTransformation . SUCCESS [  2.164 s]
[INFO] org.eclipse.jwt.transformation.stpim ............... SUCCESS [  1.414 s]
[INFO] org.eclipse.jwt.transformations.bpmn ............... SUCCESS [  1.750 s]
[INFO] org.eclipse.jwt.transformations.properties ......... SUCCESS [  1.056 s]
[INFO] org.eclipse.jwt.transformations.xslt.tools ......... SUCCESS [  1.146 s]
[INFO] org.eclipse.jwt.transformations.xpdl ............... SUCCESS [  1.116 s]
[INFO] org.eclipse.jwt.tests .............................. SUCCESS [  8.842 s]
[INFO] org.eclipse.jwt.feature ............................ SUCCESS [  2.795 s]
[INFO] org.eclipse.jwt.test.feature ....................... SUCCESS [  1.204 s]
[INFO] org.eclipse.jwt.p2updatesite ....................... SUCCESS [  8.370 s]
[INFO] ------------------------------------------------------------------------
[INFO] BUILD SUCCESS
[INFO] ------------------------------------------------------------------------
[INFO] Total time: 02:12 min
[INFO] Finished at: 2017-10-30T18:04:59-04:00
[INFO] Final Memory: 267M/5861M
[INFO] ------------------------------------------------------------------------
Terminating xvnc.
Failed to send e-mail to chsaad because no e-mail address is known, and no default e-mail domain is configured
Sending e-mails to: marc.dutoo@openwide.fr christian.saad@informatik.uni-augsburg.de
Recording test results
Build step 'Publish JUnit test result report' changed build result to UNSTABLE
Archiving artifacts
Started calculate disk usage of build
Finished Calculation of disk usage of build in 0 seconds
Started calculate disk usage of workspace
Finished Calculation of disk usage of workspace in 0 seconds
Finished: UNSTABLE