FailedConsole Output

Skipping 436 KB.. Full Log
h2.command.Parser.parseSelectUnion(Parser.java:1350)
	at org.h2.command.Parser.parseSelect(Parser.java:1338)
	at org.h2.command.Parser.readCondition(Parser.java:1727)
	at org.h2.command.Parser.readAnd(Parser.java:1665)
	at org.h2.command.Parser.readExpression(Parser.java:1655)
	at org.h2.command.Parser.readTerm(Parser.java:2304)
	at org.h2.command.Parser.readFactor(Parser.java:1852)
	at org.h2.command.Parser.readSum(Parser.java:1839)
	at org.h2.command.Parser.readConcat(Parser.java:1812)
	at org.h2.command.Parser.readCondition(Parser.java:1683)
	at org.h2.command.Parser.readAnd(Parser.java:1663)
	at org.h2.command.Parser.readExpression(Parser.java:1655)
	at org.h2.command.Parser.parseSelectSimple(Parser.java:1612)
	at org.h2.command.Parser.parseSelectSub(Parser.java:1505)
	at org.h2.command.Parser.parseSelectUnion(Parser.java:1350)
	at org.h2.command.Parser.parseSelect(Parser.java:1338)
	at org.h2.command.Parser.parsePrepared(Parser.java:395)
	at org.h2.command.Parser.parse(Parser.java:291)
	at org.h2.command.Parser.parse(Parser.java:263)
	at org.h2.command.Parser.prepareCommand(Parser.java:235)
	at org.h2.engine.Session.prepareLocal(Session.java:415)
	at org.h2.engine.Session.prepareCommand(Session.java:376)
	at org.h2.jdbc.JdbcConnection.prepareCommand(JdbcConnection.java:1049)
	at org.h2.jdbc.JdbcStatement.executeQuery(JdbcStatement.java:70)
	at org.apache.commons.dbcp.DelegatingStatement.executeQuery(DelegatingStatement.java:208)
	at org.apache.commons.dbcp.DelegatingStatement.executeQuery(DelegatingStatement.java:208)
	at org.apache.commons.dbcp.DelegatingStatement.executeQuery(DelegatingStatement.java:208)
	at org.geotools.jdbc.JDBCDataStore.getAggregateValue(JDBCDataStore.java:1483)
	at org.geotools.jdbc.JDBCDataStore.getCount(JDBCDataStore.java:1432)
	at org.geotools.jdbc.JDBCFeatureSource.getCountInternal(JDBCFeatureSource.java:463)
	at org.geotools.data.store.ContentFeatureSource.getCount(ContentFeatureSource.java:498)
	at org.geotools.jdbc.JDBCFeatureStore.getCountInternal(JDBCFeatureStore.java:184)
	at org.geotools.data.store.ContentFeatureSource.getCount(ContentFeatureSource.java:498)
	at org.geotools.data.store.ContentFeatureCollection.size(ContentFeatureCollection.java:236)
	at org.geotools.jdbc.JDBCFeatureSourceOnlineTest.testGetFeaturesWithLogicFilter(JDBCFeatureSourceOnlineTest.java:169)
	at sun.reflect.NativeMethodAccessorImpl.invoke0(Native Method)
	at sun.reflect.NativeMethodAccessorImpl.invoke(NativeMethodAccessorImpl.java:62)
	at sun.reflect.DelegatingMethodAccessorImpl.invoke(DelegatingMethodAccessorImpl.java:43)
	at java.lang.reflect.Method.invoke(Method.java:498)
	at junit.framework.TestCase.runTest(TestCase.java:176)
	at junit.framework.TestCase.runBare(TestCase.java:141)
	at junit.framework.TestResult$1.protect(TestResult.java:122)
	at junit.framework.TestResult.runProtected(TestResult.java:142)
	at junit.framework.TestResult.run(TestResult.java:125)
	at junit.framework.TestCase.run(TestCase.java:129)
	at org.geotools.test.OnlineTestCase.run(OnlineTestCase.java:123)
	at junit.framework.TestSuite.runTest(TestSuite.java:255)
	at junit.framework.TestSuite.run(TestSuite.java:250)
	at org.junit.internal.runners.JUnit38ClassRunner.run(JUnit38ClassRunner.java:84)
	at org.apache.maven.surefire.junit4.JUnit4Provider.execute(JUnit4Provider.java:264)
	at org.apache.maven.surefire.junit4.JUnit4Provider.executeTestSet(JUnit4Provider.java:153)
	at org.apache.maven.surefire.junit4.JUnit4Provider.invoke(JUnit4Provider.java:124)
	at org.apache.maven.surefire.booter.ForkedBooter.invokeProviderInSameClassLoader(ForkedBooter.java:200)
	at org.apache.maven.surefire.booter.ForkedBooter.runSuitesInProcess(ForkedBooter.java:153)
	at org.apache.maven.surefire.booter.ForkedBooter.main(ForkedBooter.java:103)

Running org.geotools.data.h2.H2FeatureSourceTest
java.lang.IllegalArgumentException: Property 'invalidAttribute' could not be found in ft1
	at org.geotools.filter.visitor.PostPreProcessFilterSplittingVisitor.visit(PostPreProcessFilterSplittingVisitor.java:788)
	at org.geotools.filter.AttributeExpressionImpl.accept(AttributeExpressionImpl.java:340)
	at org.geotools.filter.visitor.PostPreProcessFilterSplittingVisitor.visitBinaryComparisonOperator(PostPreProcessFilterSplittingVisitor.java:445)
	at org.geotools.filter.visitor.PostPreProcessFilterSplittingVisitor.visit(PostPreProcessFilterSplittingVisitor.java:403)
	at org.geotools.filter.IsEqualsToImpl.accept(IsEqualsToImpl.java:157)
	at org.geotools.jdbc.SQLDialect.splitFilter(SQLDialect.java:1453)
	at org.geotools.jdbc.JDBCFeatureSource.splitFilter(JDBCFeatureSource.java:399)
	at org.geotools.jdbc.JDBCFeatureSource.splitFilter(JDBCFeatureSource.java:385)
	at org.geotools.jdbc.JDBCFeatureSource.getReaderInternal(JDBCFeatureSource.java:572)
	at org.geotools.jdbc.JDBCFeatureStore.getReaderInternal(JDBCFeatureStore.java:226)
	at org.geotools.data.store.ContentFeatureSource.getReader(ContentFeatureSource.java:647)
	at org.geotools.data.store.ContentFeatureCollection.features(ContentFeatureCollection.java:173)
	at org.geotools.jdbc.JDBCFeatureSourceOnlineTest.testGetFeaturesWithInvalidFilter(JDBCFeatureSourceOnlineTest.java:154)
	at sun.reflect.NativeMethodAccessorImpl.invoke0(Native Method)
	at sun.reflect.NativeMethodAccessorImpl.invoke(NativeMethodAccessorImpl.java:62)
	at sun.reflect.DelegatingMethodAccessorImpl.invoke(DelegatingMethodAccessorImpl.java:43)
	at java.lang.reflect.Method.invoke(Method.java:498)
	at junit.framework.TestCase.runTest(TestCase.java:176)
	at junit.framework.TestCase.runBare(TestCase.java:141)
	at junit.framework.TestResult$1.protect(TestResult.java:122)
	at junit.framework.TestResult.runProtected(TestResult.java:142)
	at junit.framework.TestResult.run(TestResult.java:125)
	at junit.framework.TestCase.run(TestCase.java:129)
	at org.geotools.test.OnlineTestCase.run(OnlineTestCase.java:123)
	at junit.framework.TestSuite.runTest(TestSuite.java:255)
	at junit.framework.TestSuite.run(TestSuite.java:250)
	at org.junit.internal.runners.JUnit38ClassRunner.run(JUnit38ClassRunner.java:84)
	at org.apache.maven.surefire.junit4.JUnit4Provider.execute(JUnit4Provider.java:264)
	at org.apache.maven.surefire.junit4.JUnit4Provider.executeTestSet(JUnit4Provider.java:153)
	at org.apache.maven.surefire.junit4.JUnit4Provider.invoke(JUnit4Provider.java:124)
	at org.apache.maven.surefire.booter.ForkedBooter.invokeProviderInSameClassLoader(ForkedBooter.java:200)
	at org.apache.maven.surefire.booter.ForkedBooter.runSuitesInProcess(ForkedBooter.java:153)
	at org.apache.maven.surefire.booter.ForkedBooter.main(ForkedBooter.java:103)
Tests run: 31, Failures: 0, Errors: 1, Skipped: 0, Time elapsed: 16.91 sec <<< FAILURE! - in org.geotools.data.h2.H2FeatureSourceTest
testGetFeaturesWithLogicFilter(org.geotools.data.h2.H2FeatureSourceTest)  Time elapsed: 0.531 sec  <<< ERROR!
java.lang.RuntimeException: java.io.IOException
	at org.geotools.data.store.ContentFeatureCollection.size(ContentFeatureCollection.java:259)
	at org.geotools.jdbc.JDBCFeatureSourceOnlineTest.testGetFeaturesWithLogicFilter(JDBCFeatureSourceOnlineTest.java:169)
	at sun.reflect.NativeMethodAccessorImpl.invoke0(Native Method)
	at sun.reflect.NativeMethodAccessorImpl.invoke(NativeMethodAccessorImpl.java:62)
	at sun.reflect.DelegatingMethodAccessorImpl.invoke(DelegatingMethodAccessorImpl.java:43)
	at java.lang.reflect.Method.invoke(Method.java:498)
	at junit.framework.TestCase.runTest(TestCase.java:176)
	at junit.framework.TestCase.runBare(TestCase.java:141)
	at junit.framework.TestResult$1.protect(TestResult.java:122)
	at junit.framework.TestResult.runProtected(TestResult.java:142)
	at junit.framework.TestResult.run(TestResult.java:125)
	at junit.framework.TestCase.run(TestCase.java:129)
	at org.geotools.test.OnlineTestCase.run(OnlineTestCase.java:123)
	at junit.framework.TestSuite.runTest(TestSuite.java:255)
	at junit.framework.TestSuite.run(TestSuite.java:250)
	at org.junit.internal.runners.JUnit38ClassRunner.run(JUnit38ClassRunner.java:84)
	at org.apache.maven.surefire.junit4.JUnit4Provider.execute(JUnit4Provider.java:264)
	at org.apache.maven.surefire.junit4.JUnit4Provider.executeTestSet(JUnit4Provider.java:153)
	at org.apache.maven.surefire.junit4.JUnit4Provider.invoke(JUnit4Provider.java:124)
	at org.apache.maven.surefire.booter.ForkedBooter.invokeProviderInSameClassLoader(ForkedBooter.java:200)
	at org.apache.maven.surefire.booter.ForkedBooter.runSuitesInProcess(ForkedBooter.java:153)
	at org.apache.maven.surefire.booter.ForkedBooter.main(ForkedBooter.java:103)
Caused by: java.io.IOException: null
	at org.geotools.jdbc.JDBCDataStore.getAggregateValue(JDBCDataStore.java:1508)
	at org.geotools.jdbc.JDBCDataStore.getCount(JDBCDataStore.java:1432)
	at org.geotools.jdbc.JDBCFeatureSource.getCountInternal(JDBCFeatureSource.java:463)
	at org.geotools.data.store.ContentFeatureSource.getCount(ContentFeatureSource.java:498)
	at org.geotools.jdbc.JDBCFeatureStore.getCountInternal(JDBCFeatureStore.java:184)
	at org.geotools.data.store.ContentFeatureSource.getCount(ContentFeatureSource.java:498)
	at org.geotools.data.store.ContentFeatureCollection.size(ContentFeatureCollection.java:236)
	at org.geotools.jdbc.JDBCFeatureSourceOnlineTest.testGetFeaturesWithLogicFilter(JDBCFeatureSourceOnlineTest.java:169)
	at sun.reflect.NativeMethodAccessorImpl.invoke0(Native Method)
	at sun.reflect.NativeMethodAccessorImpl.invoke(NativeMethodAccessorImpl.java:62)
	at sun.reflect.DelegatingMethodAccessorImpl.invoke(DelegatingMethodAccessorImpl.java:43)
	at java.lang.reflect.Method.invoke(Method.java:498)
	at junit.framework.TestCase.runTest(TestCase.java:176)
	at junit.framework.TestCase.runBare(TestCase.java:141)
	at junit.framework.TestResult$1.protect(TestResult.java:122)
	at junit.framework.TestResult.runProtected(TestResult.java:142)
	at junit.framework.TestResult.run(TestResult.java:125)
	at junit.framework.TestCase.run(TestCase.java:129)
	at org.geotools.test.OnlineTestCase.run(OnlineTestCase.java:123)
	at junit.framework.TestSuite.runTest(TestSuite.java:255)
	at junit.framework.TestSuite.run(TestSuite.java:250)
	at org.junit.internal.runners.JUnit38ClassRunner.run(JUnit38ClassRunner.java:84)
	at org.apache.maven.surefire.junit4.JUnit4Provider.execute(JUnit4Provider.java:264)
	at org.apache.maven.surefire.junit4.JUnit4Provider.executeTestSet(JUnit4Provider.java:153)
	at org.apache.maven.surefire.junit4.JUnit4Provider.invoke(JUnit4Provider.java:124)
	at org.apache.maven.surefire.booter.ForkedBooter.invokeProviderInSameClassLoader(ForkedBooter.java:200)
	at org.apache.maven.surefire.booter.ForkedBooter.runSuitesInProcess(ForkedBooter.java:153)
	at org.apache.maven.surefire.booter.ForkedBooter.main(ForkedBooter.java:103)
Caused by: org.h2.jdbc.JdbcSQLException: Function HATBOX_MBR_INTERSECTS_ENV not found; SQL statement:
SELECT count(*) FROM "geotools"."ft1" WHERE  ("stringProperty" = 'one' AND "stringProperty" IS NOT NULL  AND ST_Intersects("geometry",ST_GeomFromText('POLYGON ((-20 -20, -20 20, 20 20, 20 -20, -20 -20))', 4326)) AND "id" IN (SELECT CAST(HATBOX_JOIN_ID AS INT) FROM HATBOX_MBR_INTERSECTS_ENV('geotools', 'ft1', -20.0, 20.0, -20.0, 20.0))) [90022-119]
	at org.h2.message.Message.getSQLException(Message.java:106)
	at org.h2.message.Message.getSQLException(Message.java:117)
	at org.h2.message.Message.getSQLException(Message.java:76)
	at org.h2.command.Parser.readJavaFunction(Parser.java:1921)
	at org.h2.command.Parser.readFunction(Parser.java:1962)
	at org.h2.command.Parser.readTableFilter(Parser.java:972)
	at org.h2.command.Parser.parseSelectSimpleFromPart(Parser.java:1511)
	at org.h2.command.Parser.parseSelectSimple(Parser.java:1608)
	at org.h2.command.Parser.parseSelectSub(Parser.java:1505)
	at org.h2.command.Parser.parseSelectUnion(Parser.java:1350)
	at org.h2.command.Parser.parseSelect(Parser.java:1338)
	at org.h2.command.Parser.readCondition(Parser.java:1727)
	at org.h2.command.Parser.readAnd(Parser.java:1665)
	at org.h2.command.Parser.readExpression(Parser.java:1655)
	at org.h2.command.Parser.readTerm(Parser.java:2304)
	at org.h2.command.Parser.readFactor(Parser.java:1852)
	at org.h2.command.Parser.readSum(Parser.java:1839)
	at org.h2.command.Parser.readConcat(Parser.java:1812)
	at org.h2.command.Parser.readCondition(Parser.java:1683)
	at org.h2.command.Parser.readAnd(Parser.java:1663)
	at org.h2.command.Parser.readExpression(Parser.java:1655)
	at org.h2.command.Parser.parseSelectSimple(Parser.java:1612)
	at org.h2.command.Parser.parseSelectSub(Parser.java:1505)
	at org.h2.command.Parser.parseSelectUnion(Parser.java:1350)
	at org.h2.command.Parser.parseSelect(Parser.java:1338)
	at org.h2.command.Parser.parsePrepared(Parser.java:395)
	at org.h2.command.Parser.parse(Parser.java:291)
	at org.h2.command.Parser.parse(Parser.java:263)
	at org.h2.command.Parser.prepareCommand(Parser.java:235)
	at org.h2.engine.Session.prepareLocal(Session.java:415)
	at org.h2.engine.Session.prepareCommand(Session.java:376)
	at org.h2.jdbc.JdbcConnection.prepareCommand(JdbcConnection.java:1049)
	at org.h2.jdbc.JdbcStatement.executeQuery(JdbcStatement.java:70)
	at org.apache.commons.dbcp.DelegatingStatement.executeQuery(DelegatingStatement.java:208)
	at org.apache.commons.dbcp.DelegatingStatement.executeQuery(DelegatingStatement.java:208)
	at org.apache.commons.dbcp.DelegatingStatement.executeQuery(DelegatingStatement.java:208)
	at org.geotools.jdbc.JDBCDataStore.getAggregateValue(JDBCDataStore.java:1483)
	at org.geotools.jdbc.JDBCDataStore.getCount(JDBCDataStore.java:1432)
	at org.geotools.jdbc.JDBCFeatureSource.getCountInternal(JDBCFeatureSource.java:463)
	at org.geotools.data.store.ContentFeatureSource.getCount(ContentFeatureSource.java:498)
	at org.geotools.jdbc.JDBCFeatureStore.getCountInternal(JDBCFeatureStore.java:184)
	at org.geotools.data.store.ContentFeatureSource.getCount(ContentFeatureSource.java:498)
	at org.geotools.data.store.ContentFeatureCollection.size(ContentFeatureCollection.java:236)
	at org.geotools.jdbc.JDBCFeatureSourceOnlineTest.testGetFeaturesWithLogicFilter(JDBCFeatureSourceOnlineTest.java:169)
	at sun.reflect.NativeMethodAccessorImpl.invoke0(Native Method)
	at sun.reflect.NativeMethodAccessorImpl.invoke(NativeMethodAccessorImpl.java:62)
	at sun.reflect.DelegatingMethodAccessorImpl.invoke(DelegatingMethodAccessorImpl.java:43)
	at java.lang.reflect.Method.invoke(Method.java:498)
	at junit.framework.TestCase.runTest(TestCase.java:176)
	at junit.framework.TestCase.runBare(TestCase.java:141)
	at junit.framework.TestResult$1.protect(TestResult.java:122)
	at junit.framework.TestResult.runProtected(TestResult.java:142)
	at junit.framework.TestResult.run(TestResult.java:125)
	at junit.framework.TestCase.run(TestCase.java:129)
	at org.geotools.test.OnlineTestCase.run(OnlineTestCase.java:123)
	at junit.framework.TestSuite.runTest(TestSuite.java:255)
	at junit.framework.TestSuite.run(TestSuite.java:250)
	at org.junit.internal.runners.JUnit38ClassRunner.run(JUnit38ClassRunner.java:84)
	at org.apache.maven.surefire.junit4.JUnit4Provider.execute(JUnit4Provider.java:264)
	at org.apache.maven.surefire.junit4.JUnit4Provider.executeTestSet(JUnit4Provider.java:153)
	at org.apache.maven.surefire.junit4.JUnit4Provider.invoke(JUnit4Provider.java:124)
	at org.apache.maven.surefire.booter.ForkedBooter.invokeProviderInSameClassLoader(ForkedBooter.java:200)
	at org.apache.maven.surefire.booter.ForkedBooter.runSuitesInProcess(ForkedBooter.java:153)
	at org.apache.maven.surefire.booter.ForkedBooter.main(ForkedBooter.java:103)

Running org.geotools.data.h2.H2FeatureStoreExposedPkTest
Tests run: 16, Failures: 0, Errors: 0, Skipped: 0, Time elapsed: 10.372 sec - in org.geotools.data.h2.H2FeatureStoreExposedPkTest
Running org.geotools.data.h2.H2FeatureStoreTest
Tests run: 15, Failures: 0, Errors: 0, Skipped: 0, Time elapsed: 10.755 sec - in org.geotools.data.h2.H2FeatureStoreTest
Running org.geotools.data.h2.H2GeometryTest
Tests run: 9, Failures: 0, Errors: 0, Skipped: 0, Time elapsed: 3.953 sec - in org.geotools.data.h2.H2GeometryTest
Running org.geotools.data.h2.H2GeometrylessTest
Tests run: 5, Failures: 0, Errors: 0, Skipped: 0, Time elapsed: 1.065 sec - in org.geotools.data.h2.H2GeometrylessTest
Running org.geotools.data.h2.H2JDBCTransactionTest
Tests run: 4, Failures: 0, Errors: 0, Skipped: 0, Time elapsed: 2.231 sec - in org.geotools.data.h2.H2JDBCTransactionTest
Running org.geotools.data.h2.H2JNDIDataSourceTest
Tests run: 2, Failures: 0, Errors: 0, Skipped: 0, Time elapsed: 0.988 sec - in org.geotools.data.h2.H2JNDIDataSourceTest
Running org.geotools.data.h2.H2JoinTest
2018-06-28T18:36:56.888-0400  SEVERE  There's code using JDBC based datastore and not disposing them. This may lead to temporary loss of database connections. Please make sure all data access code calls DataStore.dispose() before freeing all references to it
Tests run: 15, Failures: 0, Errors: 0, Skipped: 0, Time elapsed: 13.316 sec - in org.geotools.data.h2.H2JoinTest
Running org.geotools.data.h2.H2LobTest
Tests run: 4, Failures: 0, Errors: 0, Skipped: 0, Time elapsed: 2.226 sec - in org.geotools.data.h2.H2LobTest
Running org.geotools.data.h2.H2NoPrimaryKeyTest
Tests run: 4, Failures: 0, Errors: 0, Skipped: 0, Time elapsed: 2.123 sec - in org.geotools.data.h2.H2NoPrimaryKeyTest
Running org.geotools.data.h2.H2PrimaryKeyFinderTest
Tests run: 3, Failures: 0, Errors: 0, Skipped: 0, Time elapsed: 1.441 sec - in org.geotools.data.h2.H2PrimaryKeyFinderTest
Running org.geotools.data.h2.H2PrimaryKeyTest
Tests run: 8, Failures: 0, Errors: 0, Skipped: 0, Time elapsed: 4.191 sec - in org.geotools.data.h2.H2PrimaryKeyTest
Running org.geotools.data.h2.H2SkipColumnTest
2018-06-28T18:37:20.432-0400  WARNING  Could not find mapping for 'weird', ignoring the column and setting the feature type read only
2018-06-28T18:37:20.902-0400  WARNING  Could not find mapping for 'weird', ignoring the column and setting the feature type read only
2018-06-28T18:37:22.250-0400  WARNING  Could not find mapping for 'weird', ignoring the column and setting the feature type read only
Tests run: 3, Failures: 0, Errors: 0, Skipped: 0, Time elapsed: 2.258 sec - in org.geotools.data.h2.H2SkipColumnTest
Running org.geotools.data.h2.H2SpatialFiltersTest
Tests run: 11, Failures: 0, Errors: 10, Skipped: 0, Time elapsed: 12.272 sec <<< FAILURE! - in org.geotools.data.h2.H2SpatialFiltersTest
testContainsFilter(org.geotools.data.h2.H2SpatialFiltersTest)  Time elapsed: 0.594 sec  <<< ERROR!
java.lang.RuntimeException: java.io.IOException
	at org.geotools.data.store.ContentFeatureCollection.size(ContentFeatureCollection.java:259)
	at org.geotools.jdbc.JDBCSpatialFiltersOnlineTest.checkSingleResult(JDBCSpatialFiltersOnlineTest.java:202)
	at org.geotools.jdbc.JDBCSpatialFiltersOnlineTest.testContainsFilter(JDBCSpatialFiltersOnlineTest.java:157)
	at sun.reflect.NativeMethodAccessorImpl.invoke0(Native Method)
	at sun.reflect.NativeMethodAccessorImpl.invoke(NativeMethodAccessorImpl.java:62)
	at sun.reflect.DelegatingMethodAccessorImpl.invoke(DelegatingMethodAccessorImpl.java:43)
	at java.lang.reflect.Method.invoke(Method.java:498)
	at junit.framework.TestCase.runTest(TestCase.java:176)
	at junit.framework.TestCase.runBare(TestCase.java:141)
	at junit.framework.TestResult$1.protect(TestResult.java:122)
	at junit.framework.TestResult.runProtected(TestResult.java:142)
	at junit.framework.TestResult.run(TestResult.java:125)
	at junit.framework.TestCase.run(TestCase.java:129)
	at org.geotools.test.OnlineTestCase.run(OnlineTestCase.java:123)
	at junit.framework.TestSuite.runTest(TestSuite.java:255)
	at junit.framework.TestSuite.run(TestSuite.java:250)
	at org.junit.internal.runners.JUnit38ClassRunner.run(JUnit38ClassRunner.java:84)
	at org.apache.maven.surefire.junit4.JUnit4Provider.execute(JUnit4Provider.java:264)
	at org.apache.maven.surefire.junit4.JUnit4Provider.executeTestSet(JUnit4Provider.java:153)
	at org.apache.maven.surefire.junit4.JUnit4Provider.invoke(JUnit4Provider.java:124)
	at org.apache.maven.surefire.booter.ForkedBooter.invokeProviderInSameClassLoader(ForkedBooter.java:200)
	at org.apache.maven.surefire.booter.ForkedBooter.runSuitesInProcess(ForkedBooter.java:153)
	at org.apache.maven.surefire.booter.ForkedBooter.main(ForkedBooter.java:103)
Caused by: java.io.IOException: null
	at org.geotools.jdbc.JDBCDataStore.getAggregateValue(JDBCDataStore.java:1508)
	at org.geotools.jdbc.JDBCDataStore.getCount(JDBCDataStore.java:1432)
	at org.geotools.jdbc.JDBCFeatureSource.getCountInternal(JDBCFeatureSource.java:463)
	at org.geotools.data.store.ContentFeatureSource.getCount(ContentFeatureSource.java:498)
	at org.geotools.jdbc.JDBCFeatureStore.getCountInternal(JDBCFeatureStore.java:184)
	at org.geotools.data.store.ContentFeatureSource.getCount(ContentFeatureSource.java:498)
	at org.geotools.data.store.ContentFeatureCollection.size(ContentFeatureCollection.java:236)
	at org.geotools.jdbc.JDBCSpatialFiltersOnlineTest.checkSingleResult(JDBCSpatialFiltersOnlineTest.java:202)
	at org.geotools.jdbc.JDBCSpatialFiltersOnlineTest.testContainsFilter(JDBCSpatialFiltersOnlineTest.java:157)
	at sun.reflect.NativeMethodAccessorImpl.invoke0(Native Method)
	at sun.reflect.NativeMethodAccessorImpl.invoke(NativeMethodAccessorImpl.java:62)
	at sun.reflect.DelegatingMethodAccessorImpl.invoke(DelegatingMethodAccessorImpl.java:43)
	at java.lang.reflect.Method.invoke(Method.java:498)
	at junit.framework.TestCase.runTest(TestCase.java:176)
	at junit.framework.TestCase.runBare(TestCase.java:141)
	at junit.framework.TestResult$1.protect(TestResult.java:122)
	at junit.framework.TestResult.runProtected(TestResult.java:142)
	at junit.framework.TestResult.run(TestResult.java:125)
	at junit.framework.TestCase.run(TestCase.java:129)
	at org.geotools.test.OnlineTestCase.run(OnlineTestCase.java:123)
	at junit.framework.TestSuite.runTest(TestSuite.java:255)
	at junit.framework.TestSuite.run(TestSuite.java:250)
	at org.junit.internal.runners.JUnit38ClassRunner.run(JUnit38ClassRunner.java:84)
	at org.apache.maven.surefire.junit4.JUnit4Provider.execute(JUnit4Provider.java:264)
	at org.apache.maven.surefire.junit4.JUnit4Provider.executeTestSet(JUnit4Provider.java:153)
	at org.apache.maven.surefire.junit4.JUnit4Provider.invoke(JUnit4Provider.java:124)
	at org.apache.maven.surefire.booter.ForkedBooter.invokeProviderInSameClassLoader(ForkedBooter.java:200)
	at org.apache.maven.surefire.booter.ForkedBooter.runSuitesInProcess(ForkedBooter.java:153)
	at org.apache.maven.surefire.booter.ForkedBooter.main(ForkedBooter.java:103)
Caused by: org.h2.jdbc.JdbcSQLException: Function HATBOX_MBR_INTERSECTS_ENV not found; SQL statement:
SELECT count(*) FROM "road" WHERE  ST_Contains(ST_GeomFromText('POLYGON ((2 -1, 2 5, 4 5, 4 -1, 2 -1))', 4326), "geom") AND "fid" IN (SELECT CAST(HATBOX_JOIN_ID AS INT) FROM HATBOX_MBR_INTERSECTS_ENV('PUBLIC', 'road', 2.0, 4.0, -1.0, 5.0)) [90022-119]
	at org.h2.message.Message.getSQLException(Message.java:106)
	at org.h2.message.Message.getSQLException(Message.java:117)
	at org.h2.message.Message.getSQLException(Message.java:76)
	at org.h2.command.Parser.readJavaFunction(Parser.java:1921)
	at org.h2.command.Parser.readFunction(Parser.java:1962)
	at org.h2.command.Parser.readTableFilter(Parser.java:972)
	at org.h2.command.Parser.parseSelectSimpleFromPart(Parser.java:1511)
	at org.h2.command.Parser.parseSelectSimple(Parser.java:1608)
	at org.h2.command.Parser.parseSelectSub(Parser.java:1505)
	at org.h2.command.Parser.parseSelectUnion(Parser.java:1350)
	at org.h2.command.Parser.parseSelect(Parser.java:1338)
	at org.h2.command.Parser.readCondition(Parser.java:1727)
	at org.h2.command.Parser.readAnd(Parser.java:1665)
	at org.h2.command.Parser.readExpression(Parser.java:1655)
	at org.h2.command.Parser.parseSelectSimple(Parser.java:1612)
	at org.h2.command.Parser.parseSelectSub(Parser.java:1505)
	at org.h2.command.Parser.parseSelectUnion(Parser.java:1350)
	at org.h2.command.Parser.parseSelect(Parser.java:1338)
	at org.h2.command.Parser.parsePrepared(Parser.java:395)
	at org.h2.command.Parser.parse(Parser.java:291)
	at org.h2.command.Parser.parse(Parser.java:263)
	at org.h2.command.Parser.prepareCommand(Parser.java:235)
	at org.h2.engine.Session.prepareLocal(Session.java:415)
	at org.h2.engine.Session.prepareCommand(Session.java:376)
	at org.h2.jdbc.JdbcConnection.prepareCommand(JdbcConnection.java:1049)
	at org.h2.jdbc.JdbcStatement.executeQuery(JdbcStatement.java:70)
	at org.apache.commons.dbcp.DelegatingStatement.executeQuery(DelegatingStatement.java:208)
	at org.apache.commons.dbcp.DelegatingStatement.executeQuery(DelegatingStatement.java:208)
	at org.apache.commons.dbcp.DelegatingStatement.executeQuery(DelegatingStatement.java:208)
	at org.geotools.jdbc.JDBCDataStore.getAggregateValue(JDBCDataStore.java:1483)
	at org.geotools.jdbc.JDBCDataStore.getCount(JDBCDataStore.java:1432)
	at org.geotools.jdbc.JDBCFeatureSource.getCountInternal(JDBCFeatureSource.java:463)
	at org.geotools.data.store.ContentFeatureSource.getCount(ContentFeatureSource.java:498)
	at org.geotools.jdbc.JDBCFeatureStore.getCountInternal(JDBCFeatureStore.java:184)
	at org.geotools.data.store.ContentFeatureSource.getCount(ContentFeatureSource.java:498)
	at org.geotools.data.store.ContentFeatureCollection.size(ContentFeatureCollection.java:236)
	at org.geotools.jdbc.JDBCSpatialFiltersOnlineTest.checkSingleResult(JDBCSpatialFiltersOnlineTest.java:202)
	at org.geotools.jdbc.JDBCSpatialFiltersOnlineTest.testContainsFilter(JDBCSpatialFiltersOnlineTest.java:157)
	at sun.reflect.NativeMethodAccessorImpl.invoke0(Native Method)
	at sun.reflect.NativeMethodAccessorImpl.invoke(NativeMethodAccessorImpl.java:62)
	at sun.reflect.DelegatingMethodAccessorImpl.invoke(DelegatingMethodAccessorImpl.java:43)
	at java.lang.reflect.Method.invoke(Method.java:498)
	at junit.framework.TestCase.runTest(TestCase.java:176)
	at junit.framework.TestCase.runBare(TestCase.java:141)
	at junit.framework.TestResult$1.protect(TestResult.java:122)
	at junit.framework.TestResult.runProtected(TestResult.java:142)
	at junit.framework.TestResult.run(TestResult.java:125)
	at junit.framework.TestCase.run(TestCase.java:129)
	at org.geotools.test.OnlineTestCase.run(OnlineTestCase.java:123)
	at junit.framework.TestSuite.runTest(TestSuite.java:255)
	at junit.framework.TestSuite.run(TestSuite.java:250)
	at org.junit.internal.runners.JUnit38ClassRunner.run(JUnit38ClassRunner.java:84)
	at org.apache.maven.surefire.junit4.JUnit4Provider.execute(JUnit4Provider.java:264)
	at org.apache.maven.surefire.junit4.JUnit4Provider.executeTestSet(JUnit4Provider.java:153)
	at org.apache.maven.surefire.junit4.JUnit4Provider.invoke(JUnit4Provider.java:124)
	at org.apache.maven.surefire.booter.ForkedBooter.invokeProviderInSameClassLoader(ForkedBooter.java:200)
	at org.apache.maven.surefire.booter.ForkedBooter.runSuitesInProcess(ForkedBooter.java:153)
	at org.apache.maven.surefire.booter.ForkedBooter.main(ForkedBooter.java:103)

testGeometryCollection(org.geotools.data.h2.H2SpatialFiltersTest)  Time elapsed: 3.576 sec  <<< ERROR!
java.lang.RuntimeException: java.io.IOException
	at org.geotools.data.store.ContentFeatureCollection.size(ContentFeatureCollection.java:259)
	at org.geotools.jdbc.JDBCSpatialFiltersOnlineTest.testGeometryCollection(JDBCSpatialFiltersOnlineTest.java:233)
	at sun.reflect.NativeMethodAccessorImpl.invoke0(Native Method)
	at sun.reflect.NativeMethodAccessorImpl.invoke(NativeMethodAccessorImpl.java:62)
	at sun.reflect.DelegatingMethodAccessorImpl.invoke(DelegatingMethodAccessorImpl.java:43)
	at java.lang.reflect.Method.invoke(Method.java:498)
	at junit.framework.TestCase.runTest(TestCase.java:176)
	at junit.framework.TestCase.runBare(TestCase.java:141)
	at junit.framework.TestResult$1.protect(TestResult.java:122)
	at junit.framework.TestResult.runProtected(TestResult.java:142)
	at junit.framework.TestResult.run(TestResult.java:125)
	at junit.framework.TestCase.run(TestCase.java:129)
	at org.geotools.test.OnlineTestCase.run(OnlineTestCase.java:123)
	at junit.framework.TestSuite.runTest(TestSuite.java:255)
	at junit.framework.TestSuite.run(TestSuite.java:250)
	at org.junit.internal.runners.JUnit38ClassRunner.run(JUnit38ClassRunner.java:84)
	at org.apache.maven.surefire.junit4.JUnit4Provider.execute(JUnit4Provider.java:264)
	at org.apache.maven.surefire.junit4.JUnit4Provider.executeTestSet(JUnit4Provider.java:153)
	at org.apache.maven.surefire.junit4.JUnit4Provider.invoke(JUnit4Provider.java:124)
	at org.apache.maven.surefire.booter.ForkedBooter.invokeProviderInSameClassLoader(ForkedBooter.java:200)
	at org.apache.maven.surefire.booter.ForkedBooter.runSuitesInProcess(ForkedBooter.java:153)
	at org.apache.maven.surefire.booter.ForkedBooter.main(ForkedBooter.java:103)
Caused by: java.io.IOException: null
	at org.geotools.jdbc.JDBCDataStore.getAggregateValue(JDBCDataStore.java:1508)
	at org.geotools.jdbc.JDBCDataStore.getCount(JDBCDataStore.java:1432)
	at org.geotools.jdbc.JDBCFeatureSource.getCountInternal(JDBCFeatureSource.java:463)
	at org.geotools.data.store.ContentFeatureSource.getCount(ContentFeatureSource.java:498)
	at org.geotools.jdbc.JDBCFeatureStore.getCountInternal(JDBCFeatureStore.java:184)
	at org.geotools.data.store.ContentFeatureSource.getCount(ContentFeatureSource.java:498)
	at org.geotools.data.store.ContentFeatureCollection.size(ContentFeatureCollection.java:236)
	at org.geotools.jdbc.JDBCSpatialFiltersOnlineTest.testGeometryCollection(JDBCSpatialFiltersOnlineTest.java:233)
	at sun.reflect.NativeMethodAccessorImpl.invoke0(Native Method)
	at sun.reflect.NativeMethodAccessorImpl.invoke(NativeMethodAccessorImpl.java:62)
	at sun.reflect.DelegatingMethodAccessorImpl.invoke(DelegatingMethodAccessorImpl.java:43)
	at java.lang.reflect.Method.invoke(Method.java:498)
	at junit.framework.TestCase.runTest(TestCase.java:176)
	at junit.framework.TestCase.runBare(TestCase.java:141)
	at junit.framework.TestResult$1.protect(TestResult.java:122)
	at junit.framework.TestResult.runProtected(TestResult.java:142)
	at junit.framework.TestResult.run(TestResult.java:125)
	at junit.framework.TestCase.run(TestCase.java:129)
	at org.geotools.test.OnlineTestCase.run(OnlineTestCase.java:123)
	at junit.framework.TestSuite.runTest(TestSuite.java:255)
	at junit.framework.TestSuite.run(TestSuite.java:250)
	at org.junit.internal.runners.JUnit38ClassRunner.run(JUnit38ClassRunner.java:84)
	at org.apache.maven.surefire.junit4.JUnit4Provider.execute(JUnit4Provider.java:264)
	at org.apache.maven.surefire.junit4.JUnit4Provider.executeTestSet(JUnit4Provider.java:153)
	at org.apache.maven.surefire.junit4.JUnit4Provider.invoke(JUnit4Provider.java:124)
	at org.apache.maven.surefire.booter.ForkedBooter.invokeProviderInSameClassLoader(ForkedBooter.java:200)
	at org.apache.maven.surefire.booter.ForkedBooter.runSuitesInProcess(ForkedBooter.java:153)
	at org.apache.maven.surefire.booter.ForkedBooter.main(ForkedBooter.java:103)
Caused by: org.h2.jdbc.JdbcSQLException: Function HATBOX_MBR_INTERSECTS_ENV not found; SQL statement:
SELECT count(*) FROM "road" WHERE  ST_Distance("geom", ST_GeomFromText('GEOMETRYCOLLECTION (LINESTRING (30 40, 50 60), LINESTRING (40 30, 70 40))', 4326))<5.1350823507750884E-5 AND "fid" IN (SELECT CAST(HATBOX_JOIN_ID AS INT) FROM HATBOX_MBR_INTERSECTS_ENV('PUBLIC', 'road', 29.999948649176492, 70.00005135082351, 29.999948649176492, 60.000051350823504)) [90022-119]
	at org.h2.message.Message.getSQLException(Message.java:106)
	at org.h2.message.Message.getSQLException(Message.java:117)
	at org.h2.message.Message.getSQLException(Message.java:76)
	at org.h2.command.Parser.readJavaFunction(Parser.java:1921)
	at org.h2.command.Parser.readFunction(Parser.java:1962)
	at org.h2.command.Parser.readTableFilter(Parser.java:972)
	at org.h2.command.Parser.parseSelectSimpleFromPart(Parser.java:1511)
	at org.h2.command.Parser.parseSelectSimple(Parser.java:1608)
	at org.h2.command.Parser.parseSelectSub(Parser.java:1505)
	at org.h2.command.Parser.parseSelectUnion(Parser.java:1350)
	at org.h2.command.Parser.parseSelect(Parser.java:1338)
	at org.h2.command.Parser.readCondition(Parser.java:1727)
	at org.h2.command.Parser.readAnd(Parser.java:1665)
	at org.h2.command.Parser.readExpression(Parser.java:1655)
	at org.h2.command.Parser.parseSelectSimple(Parser.java:1612)
	at org.h2.command.Parser.parseSelectSub(Parser.java:1505)
	at org.h2.command.Parser.parseSelectUnion(Parser.java:1350)
	at org.h2.command.Parser.parseSelect(Parser.java:1338)
	at org.h2.command.Parser.parsePrepared(Parser.java:395)
	at org.h2.command.Parser.parse(Parser.java:291)
	at org.h2.command.Parser.parse(Parser.java:263)
	at org.h2.command.Parser.prepareCommand(Parser.java:235)
	at org.h2.engine.Session.prepareLocal(Session.java:415)
	at org.h2.engine.Session.prepareCommand(Session.java:376)
	at org.h2.jdbc.JdbcConnection.prepareCommand(JdbcConnection.java:1049)
	at org.h2.jdbc.JdbcStatement.executeQuery(JdbcStatement.java:70)
	at org.apache.commons.dbcp.DelegatingStatement.executeQuery(DelegatingStatement.java:208)
	at org.apache.commons.dbcp.DelegatingStatement.executeQuery(DelegatingStatement.java:208)
	at org.apache.commons.dbcp.DelegatingStatement.executeQuery(DelegatingStatement.java:208)
	at org.geotools.jdbc.JDBCDataStore.getAggregateValue(JDBCDataStore.java:1483)
	at org.geotools.jdbc.JDBCDataStore.getCount(JDBCDataStore.java:1432)
	at org.geotools.jdbc.JDBCFeatureSource.getCountInternal(JDBCFeatureSource.java:463)
	at org.geotools.data.store.ContentFeatureSource.getCount(ContentFeatureSource.java:498)
	at org.geotools.jdbc.JDBCFeatureStore.getCountInternal(JDBCFeatureStore.java:184)
	at org.geotools.data.store.ContentFeatureSource.getCount(ContentFeatureSource.java:498)
	at org.geotools.data.store.ContentFeatureCollection.size(ContentFeatureCollection.java:236)
	at org.geotools.jdbc.JDBCSpatialFiltersOnlineTest.testGeometryCollection(JDBCSpatialFiltersOnlineTest.java:233)
	at sun.reflect.NativeMethodAccessorImpl.invoke0(Native Method)
	at sun.reflect.NativeMethodAccessorImpl.invoke(NativeMethodAccessorImpl.java:62)
	at sun.reflect.DelegatingMethodAccessorImpl.invoke(DelegatingMethodAccessorImpl.java:43)
	at java.lang.reflect.Method.invoke(Method.java:498)
	at junit.framework.TestCase.runTest(TestCase.java:176)
	at junit.framework.TestCase.runBare(TestCase.java:141)
	at junit.framework.TestResult$1.protect(TestResult.java:122)
	at junit.framework.TestResult.runProtected(TestResult.java:142)
	at junit.framework.TestResult.run(TestResult.java:125)
	at junit.framework.TestCase.run(TestCase.java:129)
	at org.geotools.test.OnlineTestCase.run(OnlineTestCase.java:123)
	at junit.framework.TestSuite.runTest(TestSuite.java:255)
	at junit.framework.TestSuite.run(TestSuite.java:250)
	at org.junit.internal.runners.JUnit38ClassRunner.run(JUnit38ClassRunner.java:84)
	at org.apache.maven.surefire.junit4.JUnit4Provider.execute(JUnit4Provider.java:264)
	at org.apache.maven.surefire.junit4.JUnit4Provider.executeTestSet(JUnit4Provider.java:153)
	at org.apache.maven.surefire.junit4.JUnit4Provider.invoke(JUnit4Provider.java:124)
	at org.apache.maven.surefire.booter.ForkedBooter.invokeProviderInSameClassLoader(ForkedBooter.java:200)
	at org.apache.maven.surefire.booter.ForkedBooter.runSuitesInProcess(ForkedBooter.java:153)
	at org.apache.maven.surefire.booter.ForkedBooter.main(ForkedBooter.java:103)

testWithinFilter(org.geotools.data.h2.H2SpatialFiltersTest)  Time elapsed: 2.792 sec  <<< ERROR!
java.lang.RuntimeException: java.io.IOException
	at org.geotools.data.store.ContentFeatureCollection.size(ContentFeatureCollection.java:259)
	at org.geotools.jdbc.JDBCSpatialFiltersOnlineTest.checkSingleResult(JDBCSpatialFiltersOnlineTest.java:202)
	at org.geotools.jdbc.JDBCSpatialFiltersOnlineTest.testWithinFilter(JDBCSpatialFiltersOnlineTest.java:175)
	at sun.reflect.NativeMethodAccessorImpl.invoke0(Native Method)
	at sun.reflect.NativeMethodAccessorImpl.invoke(NativeMethodAccessorImpl.java:62)
	at sun.reflect.DelegatingMethodAccessorImpl.invoke(DelegatingMethodAccessorImpl.java:43)
	at java.lang.reflect.Method.invoke(Method.java:498)
	at junit.framework.TestCase.runTest(TestCase.java:176)
	at junit.framework.TestCase.runBare(TestCase.java:141)
	at junit.framework.TestResult$1.protect(TestResult.java:122)
	at junit.framework.TestResult.runProtected(TestResult.java:142)
	at junit.framework.TestResult.run(TestResult.java:125)
	at junit.framework.TestCase.run(TestCase.java:129)
	at org.geotools.test.OnlineTestCase.run(OnlineTestCase.java:123)
	at junit.framework.TestSuite.runTest(TestSuite.java:255)
	at junit.framework.TestSuite.run(TestSuite.java:250)
	at org.junit.internal.runners.JUnit38ClassRunner.run(JUnit38ClassRunner.java:84)
	at org.apache.maven.surefire.junit4.JUnit4Provider.execute(JUnit4Provider.java:264)
	at org.apache.maven.surefire.junit4.JUnit4Provider.executeTestSet(JUnit4Provider.java:153)
	at org.apache.maven.surefire.junit4.JUnit4Provider.invoke(JUnit4Provider.java:124)
	at org.apache.maven.surefire.booter.ForkedBooter.invokeProviderInSameClassLoader(ForkedBooter.java:200)
	at org.apache.maven.surefire.booter.ForkedBooter.runSuitesInProcess(ForkedBooter.java:153)
	at org.apache.maven.surefire.booter.ForkedBooter.main(ForkedBooter.java:103)
Caused by: java.io.IOException: null
	at org.geotools.jdbc.JDBCDataStore.getAggregateValue(JDBCDataStore.java:1508)
	at org.geotools.jdbc.JDBCDataStore.getCount(JDBCDataStore.java:1432)
	at org.geotools.jdbc.JDBCFeatureSource.getCountInternal(JDBCFeatureSource.java:463)
	at org.geotools.data.store.ContentFeatureSource.getCount(ContentFeatureSource.java:498)
	at org.geotools.jdbc.JDBCFeatureStore.getCountInternal(JDBCFeatureStore.java:184)
	at org.geotools.data.store.ContentFeatureSource.getCount(ContentFeatureSource.java:498)
	at org.geotools.data.store.ContentFeatureCollection.size(ContentFeatureCollection.java:236)
	at org.geotools.jdbc.JDBCSpatialFiltersOnlineTest.checkSingleResult(JDBCSpatialFiltersOnlineTest.java:202)
	at org.geotools.jdbc.JDBCSpatialFiltersOnlineTest.testWithinFilter(JDBCSpatialFiltersOnlineTest.java:175)
	at sun.reflect.NativeMethodAccessorImpl.invoke0(Native Method)
	at sun.reflect.NativeMethodAccessorImpl.invoke(NativeMethodAccessorImpl.java:62)
	at sun.reflect.DelegatingMethodAccessorImpl.invoke(DelegatingMethodAccessorImpl.java:43)
	at java.lang.reflect.Method.invoke(Method.java:498)
	at junit.framework.TestCase.runTest(TestCase.java:176)
	at junit.framework.TestCase.runBare(TestCase.java:141)
	at junit.framework.TestResult$1.protect(TestResult.java:122)
	at junit.framework.TestResult.runProtected(TestResult.java:142)
	at junit.framework.TestResult.run(TestResult.java:125)
	at junit.framework.TestCase.run(TestCase.java:129)
	at org.geotools.test.OnlineTestCase.run(OnlineTestCase.java:123)
	at junit.framework.TestSuite.runTest(TestSuite.java:255)
	at junit.framework.TestSuite.run(TestSuite.java:250)
	at org.junit.internal.runners.JUnit38ClassRunner.run(JUnit38ClassRunner.java:84)
	at org.apache.maven.surefire.junit4.JUnit4Provider.execute(JUnit4Provider.java:264)
	at org.apache.maven.surefire.junit4.JUnit4Provider.executeTestSet(JUnit4Provider.java:153)
	at org.apache.maven.surefire.junit4.JUnit4Provider.invoke(JUnit4Provider.java:124)
	at org.apache.maven.surefire.booter.ForkedBooter.invokeProviderInSameClassLoader(ForkedBooter.java:200)
	at org.apache.maven.surefire.booter.ForkedBooter.runSuitesInProcess(ForkedBooter.java:153)
	at org.apache.maven.surefire.booter.ForkedBooter.main(ForkedBooter.java:103)
Caused by: org.h2.jdbc.JdbcSQLException: Function HATBOX_MBR_INTERSECTS_ENV not found; SQL statement:
SELECT count(*) FROM "road" WHERE  ST_Within("geom", ST_GeomFromText('POLYGON ((2 -1, 2 5, 4 5, 4 -1, 2 -1))', 4326)) AND "fid" IN (SELECT CAST(HATBOX_JOIN_ID AS INT) FROM HATBOX_MBR_INTERSECTS_ENV('PUBLIC', 'road', 2.0, 4.0, -1.0, 5.0)) [90022-119]
	at org.h2.message.Message.getSQLException(Message.java:106)
	at org.h2.message.Message.getSQLException(Message.java:117)
	at org.h2.message.Message.getSQLException(Message.java:76)
	at org.h2.command.Parser.readJavaFunction(Parser.java:1921)
	at org.h2.command.Parser.readFunction(Parser.java:1962)
	at org.h2.command.Parser.readTableFilter(Parser.java:972)
	at org.h2.command.Parser.parseSelectSimpleFromPart(Parser.java:1511)
	at org.h2.command.Parser.parseSelectSimple(Parser.java:1608)
	at org.h2.command.Parser.parseSelectSub(Parser.java:1505)
	at org.h2.command.Parser.parseSelectUnion(Parser.java:1350)
	at org.h2.command.Parser.parseSelect(Parser.java:1338)
	at org.h2.command.Parser.readCondition(Parser.java:1727)
	at org.h2.command.Parser.readAnd(Parser.java:1665)
	at org.h2.command.Parser.readExpression(Parser.java:1655)
	at org.h2.command.Parser.parseSelectSimple(Parser.java:1612)
	at org.h2.command.Parser.parseSelectSub(Parser.java:1505)
	at org.h2.command.Parser.parseSelectUnion(Parser.java:1350)
	at org.h2.command.Parser.parseSelect(Parser.java:1338)
	at org.h2.command.Parser.parsePrepared(Parser.java:395)
	at org.h2.command.Parser.parse(Parser.java:291)
	at org.h2.command.Parser.parse(Parser.java:263)
	at org.h2.command.Parser.prepareCommand(Parser.java:235)
	at org.h2.engine.Session.prepareLocal(Session.java:415)
	at org.h2.engine.Session.prepareCommand(Session.java:376)
	at org.h2.jdbc.JdbcConnection.prepareCommand(JdbcConnection.java:1049)
	at org.h2.jdbc.JdbcStatement.executeQuery(JdbcStatement.java:70)
	at org.apache.commons.dbcp.DelegatingStatement.executeQuery(DelegatingStatement.java:208)
	at org.apache.commons.dbcp.DelegatingStatement.executeQuery(DelegatingStatement.java:208)
	at org.apache.commons.dbcp.DelegatingStatement.executeQuery(DelegatingStatement.java:208)
	at org.geotools.jdbc.JDBCDataStore.getAggregateValue(JDBCDataStore.java:1483)
	at org.geotools.jdbc.JDBCDataStore.getCount(JDBCDataStore.java:1432)
	at org.geotools.jdbc.JDBCFeatureSource.getCountInternal(JDBCFeatureSource.java:463)
	at org.geotools.data.store.ContentFeatureSource.getCount(ContentFeatureSource.java:498)
	at org.geotools.jdbc.JDBCFeatureStore.getCountInternal(JDBCFeatureStore.java:184)
	at org.geotools.data.store.ContentFeatureSource.getCount(ContentFeatureSource.java:498)
	at org.geotools.data.store.ContentFeatureCollection.size(ContentFeatureCollection.java:236)
	at org.geotools.jdbc.JDBCSpatialFiltersOnlineTest.checkSingleResult(JDBCSpatialFiltersOnlineTest.java:202)
	at org.geotools.jdbc.JDBCSpatialFiltersOnlineTest.testWithinFilter(JDBCSpatialFiltersOnlineTest.java:175)
	at sun.reflect.NativeMethodAccessorImpl.invoke0(Native Method)
	at sun.reflect.NativeMethodAccessorImpl.invoke(NativeMethodAccessorImpl.java:62)
	at sun.reflect.DelegatingMethodAccessorImpl.invoke(DelegatingMethodAccessorImpl.java:43)
	at java.lang.reflect.Method.invoke(Method.java:498)
	at junit.framework.TestCase.runTest(TestCase.java:176)
	at junit.framework.TestCase.runBare(TestCase.java:141)
	at junit.framework.TestResult$1.protect(TestResult.java:122)
	at junit.framework.TestResult.runProtected(TestResult.java:142)
	at junit.framework.TestResult.run(TestResult.java:125)
	at junit.framework.TestCase.run(TestCase.java:129)
	at org.geotools.test.OnlineTestCase.run(OnlineTestCase.java:123)
	at junit.framework.TestSuite.runTest(TestSuite.java:255)
	at junit.framework.TestSuite.run(TestSuite.java:250)
	at org.junit.internal.runners.JUnit38ClassRunner.run(JUnit38ClassRunner.java:84)
	at org.apache.maven.surefire.junit4.JUnit4Provider.execute(JUnit4Provider.java:264)
	at org.apache.maven.surefire.junit4.JUnit4Provider.executeTestSet(JUnit4Provider.java:153)
	at org.apache.maven.surefire.junit4.JUnit4Provider.invoke(JUnit4Provider.java:124)
	at org.apache.maven.surefire.booter.ForkedBooter.invokeProviderInSameClassLoader(ForkedBooter.java:200)
	at org.apache.maven.surefire.booter.ForkedBooter.runSuitesInProcess(ForkedBooter.java:153)
	at org.apache.maven.surefire.booter.ForkedBooter.main(ForkedBooter.java:103)

testIntersectsFilter(org.geotools.data.h2.H2SpatialFiltersTest)  Time elapsed: 0.557 sec  <<< ERROR!
java.lang.RuntimeException: java.io.IOException
	at org.geotools.data.store.ContentFeatureCollection.size(ContentFeatureCollection.java:259)
	at org.geotools.jdbc.JDBCSpatialFiltersOnlineTest.checkSingleResult(JDBCSpatialFiltersOnlineTest.java:202)
	at org.geotools.jdbc.JDBCSpatialFiltersOnlineTest.testIntersectsFilter(JDBCSpatialFiltersOnlineTest.java:122)
	at sun.reflect.NativeMethodAccessorImpl.invoke0(Native Method)
	at sun.reflect.NativeMethodAccessorImpl.invoke(NativeMethodAccessorImpl.java:62)
	at sun.reflect.DelegatingMethodAccessorImpl.invoke(DelegatingMethodAccessorImpl.java:43)
	at java.lang.reflect.Method.invoke(Method.java:498)
	at junit.framework.TestCase.runTest(TestCase.java:176)
	at junit.framework.TestCase.runBare(TestCase.java:141)
	at junit.framework.TestResult$1.protect(TestResult.java:122)
	at junit.framework.TestResult.runProtected(TestResult.java:142)
	at junit.framework.TestResult.run(TestResult.java:125)
	at junit.framework.TestCase.run(TestCase.java:129)
	at org.geotools.test.OnlineTestCase.run(OnlineTestCase.java:123)
	at junit.framework.TestSuite.runTest(TestSuite.java:255)
	at junit.framework.TestSuite.run(TestSuite.java:250)
	at org.junit.internal.runners.JUnit38ClassRunner.run(JUnit38ClassRunner.java:84)
	at org.apache.maven.surefire.junit4.JUnit4Provider.execute(JUnit4Provider.java:264)
	at org.apache.maven.surefire.junit4.JUnit4Provider.executeTestSet(JUnit4Provider.java:153)
	at org.apache.maven.surefire.junit4.JUnit4Provider.invoke(JUnit4Provider.java:124)
	at org.apache.maven.surefire.booter.ForkedBooter.invokeProviderInSameClassLoader(ForkedBooter.java:200)
	at org.apache.maven.surefire.booter.ForkedBooter.runSuitesInProcess(ForkedBooter.java:153)
	at org.apache.maven.surefire.booter.ForkedBooter.main(ForkedBooter.java:103)
Caused by: java.io.IOException: null
	at org.geotools.jdbc.JDBCDataStore.getAggregateValue(JDBCDataStore.java:1508)
	at org.geotools.jdbc.JDBCDataStore.getCount(JDBCDataStore.java:1432)
	at org.geotools.jdbc.JDBCFeatureSource.getCountInternal(JDBCFeatureSource.java:463)
	at org.geotools.data.store.ContentFeatureSource.getCount(ContentFeatureSource.java:498)
	at org.geotools.jdbc.JDBCFeatureStore.getCountInternal(JDBCFeatureStore.java:184)
	at org.geotools.data.store.ContentFeatureSource.getCount(ContentFeatureSource.java:498)
	at org.geotools.data.store.ContentFeatureCollection.size(ContentFeatureCollection.java:236)
	at org.geotools.jdbc.JDBCSpatialFiltersOnlineTest.checkSingleResult(JDBCSpatialFiltersOnlineTest.java:202)
	at org.geotools.jdbc.JDBCSpatialFiltersOnlineTest.testIntersectsFilter(JDBCSpatialFiltersOnlineTest.java:122)
	at sun.reflect.NativeMethodAccessorImpl.invoke0(Native Method)
	at sun.reflect.NativeMethodAccessorImpl.invoke(NativeMethodAccessorImpl.java:62)
	at sun.reflect.DelegatingMethodAccessorImpl.invoke(DelegatingMethodAccessorImpl.java:43)
	at java.lang.reflect.Method.invoke(Method.java:498)
	at junit.framework.TestCase.runTest(TestCase.java:176)
	at junit.framework.TestCase.runBare(TestCase.java:141)
	at junit.framework.TestResult$1.protect(TestResult.java:122)
	at junit.framework.TestResult.runProtected(TestResult.java:142)
	at junit.framework.TestResult.run(TestResult.java:125)
	at junit.framework.TestCase.run(TestCase.java:129)
	at org.geotools.test.OnlineTestCase.run(OnlineTestCase.java:123)
	at junit.framework.TestSuite.runTest(TestSuite.java:255)
	at junit.framework.TestSuite.run(TestSuite.java:250)
	at org.junit.internal.runners.JUnit38ClassRunner.run(JUnit38ClassRunner.java:84)
	at org.apache.maven.surefire.junit4.JUnit4Provider.execute(JUnit4Provider.java:264)
	at org.apache.maven.surefire.junit4.JUnit4Provider.executeTestSet(JUnit4Provider.java:153)
	at org.apache.maven.surefire.junit4.JUnit4Provider.invoke(JUnit4Provider.java:124)
	at org.apache.maven.surefire.booter.ForkedBooter.invokeProviderInSameClassLoader(ForkedBooter.java:200)
	at org.apache.maven.surefire.booter.ForkedBooter.runSuitesInProcess(ForkedBooter.java:153)
	at org.apache.maven.surefire.booter.ForkedBooter.main(ForkedBooter.java:103)
Caused by: org.h2.jdbc.JdbcSQLException: Function HATBOX_MBR_INTERSECTS_ENV not found; SQL statement:
SELECT count(*) FROM "road" WHERE  ST_Intersects("geom", ST_GeomFromText('LINESTRING (2 1, 2 3)', 4326)) AND "fid" IN (SELECT CAST(HATBOX_JOIN_ID AS INT) FROM HATBOX_MBR_INTERSECTS_ENV('PUBLIC', 'road', 2.0, 2.0, 1.0, 3.0)) [90022-119]
	at org.h2.message.Message.getSQLException(Message.java:106)
	at org.h2.message.Message.getSQLException(Message.java:117)
	at org.h2.message.Message.getSQLException(Message.java:76)
	at org.h2.command.Parser.readJavaFunction(Parser.java:1921)
	at org.h2.command.Parser.readFunction(Parser.java:1962)
	at org.h2.command.Parser.readTableFilter(Parser.java:972)
	at org.h2.command.Parser.parseSelectSimpleFromPart(Parser.java:1511)
	at org.h2.command.Parser.parseSelectSimple(Parser.java:1608)
	at org.h2.command.Parser.parseSelectSub(Parser.java:1505)
	at org.h2.command.Parser.parseSelectUnion(Parser.java:1350)
	at org.h2.command.Parser.parseSelect(Parser.java:1338)
	at org.h2.command.Parser.readCondition(Parser.java:1727)
	at org.h2.command.Parser.readAnd(Parser.java:1665)
	at org.h2.command.Parser.readExpression(Parser.java:1655)
	at org.h2.command.Parser.parseSelectSimple(Parser.java:1612)
	at org.h2.command.Parser.parseSelectSub(Parser.java:1505)
	at org.h2.command.Parser.parseSelectUnion(Parser.java:1350)
	at org.h2.command.Parser.parseSelect(Parser.java:1338)
	at org.h2.command.Parser.parsePrepared(Parser.java:395)
	at org.h2.command.Parser.parse(Parser.java:291)
	at org.h2.command.Parser.parse(Parser.java:263)
	at org.h2.command.Parser.prepareCommand(Parser.java:235)
	at org.h2.engine.Session.prepareLocal(Session.java:415)
	at org.h2.engine.Session.prepareCommand(Session.java:376)
	at org.h2.jdbc.JdbcConnection.prepareCommand(JdbcConnection.java:1049)
	at org.h2.jdbc.JdbcStatement.executeQuery(JdbcStatement.java:70)
	at org.apache.commons.dbcp.DelegatingStatement.executeQuery(DelegatingStatement.java:208)
	at org.apache.commons.dbcp.DelegatingStatement.executeQuery(DelegatingStatement.java:208)
	at org.apache.commons.dbcp.DelegatingStatement.executeQuery(DelegatingStatement.java:208)
	at org.geotools.jdbc.JDBCDataStore.getAggregateValue(JDBCDataStore.java:1483)
	at org.geotools.jdbc.JDBCDataStore.getCount(JDBCDataStore.java:1432)
	at org.geotools.jdbc.JDBCFeatureSource.getCountInternal(JDBCFeatureSource.java:463)
	at org.geotools.data.store.ContentFeatureSource.getCount(ContentFeatureSource.java:498)
	at org.geotools.jdbc.JDBCFeatureStore.getCountInternal(JDBCFeatureStore.java:184)
	at org.geotools.data.store.ContentFeatureSource.getCount(ContentFeatureSource.java:498)
	at org.geotools.data.store.ContentFeatureCollection.size(ContentFeatureCollection.java:236)
	at org.geotools.jdbc.JDBCSpatialFiltersOnlineTest.checkSingleResult(JDBCSpatialFiltersOnlineTest.java:202)
	at org.geotools.jdbc.JDBCSpatialFiltersOnlineTest.testIntersectsFilter(JDBCSpatialFiltersOnlineTest.java:122)
	at sun.reflect.NativeMethodAccessorImpl.invoke0(Native Method)
	at sun.reflect.NativeMethodAccessorImpl.invoke(NativeMethodAccessorImpl.java:62)
	at sun.reflect.DelegatingMethodAccessorImpl.invoke(DelegatingMethodAccessorImpl.java:43)
	at java.lang.reflect.Method.invoke(Method.java:498)
	at junit.framework.TestCase.runTest(TestCase.java:176)
	at junit.framework.TestCase.runBare(TestCase.java:141)
	at junit.framework.TestResult$1.protect(TestResult.java:122)
	at junit.framework.TestResult.runProtected(TestResult.java:142)
	at junit.framework.TestResult.run(TestResult.java:125)
	at junit.framework.TestCase.run(TestCase.java:129)
	at org.geotools.test.OnlineTestCase.run(OnlineTestCase.java:123)
	at junit.framework.TestSuite.runTest(TestSuite.java:255)
	at junit.framework.TestSuite.run(TestSuite.java:250)
	at org.junit.internal.runners.JUnit38ClassRunner.run(JUnit38ClassRunner.java:84)
	at org.apache.maven.surefire.junit4.JUnit4Provider.execute(JUnit4Provider.java:264)
	at org.apache.maven.surefire.junit4.JUnit4Provider.executeTestSet(JUnit4Provider.java:153)
	at org.apache.maven.surefire.junit4.JUnit4Provider.invoke(JUnit4Provider.java:124)
	at org.apache.maven.surefire.booter.ForkedBooter.invokeProviderInSameClassLoader(ForkedBooter.java:200)
	at org.apache.maven.surefire.booter.ForkedBooter.runSuitesInProcess(ForkedBooter.java:153)
	at org.apache.maven.surefire.booter.ForkedBooter.main(ForkedBooter.java:103)

testTouchesFilter(org.geotools.data.h2.H2SpatialFiltersTest)  Time elapsed: 0.706 sec  <<< ERROR!
java.lang.RuntimeException: java.io.IOException
	at org.geotools.data.store.ContentFeatureCollection.size(ContentFeatureCollection.java:259)
	at org.geotools.jdbc.JDBCSpatialFiltersOnlineTest.checkSingleResult(JDBCSpatialFiltersOnlineTest.java:202)
	at org.geotools.jdbc.JDBCSpatialFiltersOnlineTest.testTouchesFilter(JDBCSpatialFiltersOnlineTest.java:144)
	at sun.reflect.NativeMethodAccessorImpl.invoke0(Native Method)
	at sun.reflect.NativeMethodAccessorImpl.invoke(NativeMethodAccessorImpl.java:62)
	at sun.reflect.DelegatingMethodAccessorImpl.invoke(DelegatingMethodAccessorImpl.java:43)
	at java.lang.reflect.Method.invoke(Method.java:498)
	at junit.framework.TestCase.runTest(TestCase.java:176)
	at junit.framework.TestCase.runBare(TestCase.java:141)
	at junit.framework.TestResult$1.protect(TestResult.java:122)
	at junit.framework.TestResult.runProtected(TestResult.java:142)
	at junit.framework.TestResult.run(TestResult.java:125)
	at junit.framework.TestCase.run(TestCase.java:129)
	at org.geotools.test.OnlineTestCase.run(OnlineTestCase.java:123)
	at junit.framework.TestSuite.runTest(TestSuite.java:255)
	at junit.framework.TestSuite.run(TestSuite.java:250)
	at org.junit.internal.runners.JUnit38ClassRunner.run(JUnit38ClassRunner.java:84)
	at org.apache.maven.surefire.junit4.JUnit4Provider.execute(JUnit4Provider.java:264)
	at org.apache.maven.surefire.junit4.JUnit4Provider.executeTestSet(JUnit4Provider.java:153)
	at org.apache.maven.surefire.junit4.JUnit4Provider.invoke(JUnit4Provider.java:124)
	at org.apache.maven.surefire.booter.ForkedBooter.invokeProviderInSameClassLoader(ForkedBooter.java:200)
	at org.apache.maven.surefire.booter.ForkedBooter.runSuitesInProcess(ForkedBooter.java:153)
	at org.apache.maven.surefire.booter.ForkedBooter.main(ForkedBooter.java:103)
Caused by: java.io.IOException: null
	at org.geotools.jdbc.JDBCDataStore.getAggregateValue(JDBCDataStore.java:1508)
	at org.geotools.jdbc.JDBCDataStore.getCount(JDBCDataStore.java:1432)
	at org.geotools.jdbc.JDBCFeatureSource.getCountInternal(JDBCFeatureSource.java:463)
	at org.geotools.data.store.ContentFeatureSource.getCount(ContentFeatureSource.java:498)
	at org.geotools.jdbc.JDBCFeatureStore.getCountInternal(JDBCFeatureStore.java:184)
	at org.geotools.data.store.ContentFeatureSource.getCount(ContentFeatureSource.java:498)
	at org.geotools.data.store.ContentFeatureCollection.size(ContentFeatureCollection.java:236)
	at org.geotools.jdbc.JDBCSpatialFiltersOnlineTest.checkSingleResult(JDBCSpatialFiltersOnlineTest.java:202)
	at org.geotools.jdbc.JDBCSpatialFiltersOnlineTest.testTouchesFilter(JDBCSpatialFiltersOnlineTest.java:144)
	at sun.reflect.NativeMethodAccessorImpl.invoke0(Native Method)
	at sun.reflect.NativeMethodAccessorImpl.invoke(NativeMethodAccessorImpl.java:62)
	at sun.reflect.DelegatingMethodAccessorImpl.invoke(DelegatingMethodAccessorImpl.java:43)
	at java.lang.reflect.Method.invoke(Method.java:498)
	at junit.framework.TestCase.runTest(TestCase.java:176)
	at junit.framework.TestCase.runBare(TestCase.java:141)
	at junit.framework.TestResult$1.protect(TestResult.java:122)
	at junit.framework.TestResult.runProtected(TestResult.java:142)
	at junit.framework.TestResult.run(TestResult.java:125)
	at junit.framework.TestCase.run(TestCase.java:129)
	at org.geotools.test.OnlineTestCase.run(OnlineTestCase.java:123)
	at junit.framework.TestSuite.runTest(TestSuite.java:255)
	at junit.framework.TestSuite.run(TestSuite.java:250)
	at org.junit.internal.runners.JUnit38ClassRunner.run(JUnit38ClassRunner.java:84)
	at org.apache.maven.surefire.junit4.JUnit4Provider.execute(JUnit4Provider.java:264)
	at org.apache.maven.surefire.junit4.JUnit4Provider.executeTestSet(JUnit4Provider.java:153)
	at org.apache.maven.surefire.junit4.JUnit4Provider.invoke(JUnit4Provider.java:124)
	at org.apache.maven.surefire.booter.ForkedBooter.invokeProviderInSameClassLoader(ForkedBooter.java:200)
	at org.apache.maven.surefire.booter.ForkedBooter.runSuitesInProcess(ForkedBooter.java:153)
	at org.apache.maven.surefire.booter.ForkedBooter.main(ForkedBooter.java:103)
Caused by: org.h2.jdbc.JdbcSQLException: Function HATBOX_MBR_INTERSECTS_ENV not found; SQL statement:
SELECT count(*) FROM "road" WHERE  ST_Touches("geom", ST_GeomFromText('LINESTRING (1 1, 1 3)', 4326)) AND "fid" IN (SELECT CAST(HATBOX_JOIN_ID AS INT) FROM HATBOX_MBR_INTERSECTS_ENV('PUBLIC', 'road', 1.0, 1.0, 1.0, 3.0)) [90022-119]
	at org.h2.message.Message.getSQLException(Message.java:106)
	at org.h2.message.Message.getSQLException(Message.java:117)
	at org.h2.message.Message.getSQLException(Message.java:76)
	at org.h2.command.Parser.readJavaFunction(Parser.java:1921)
	at org.h2.command.Parser.readFunction(Parser.java:1962)
	at org.h2.command.Parser.readTableFilter(Parser.java:972)
	at org.h2.command.Parser.parseSelectSimpleFromPart(Parser.java:1511)
	at org.h2.command.Parser.parseSelectSimple(Parser.java:1608)
	at org.h2.command.Parser.parseSelectSub(Parser.java:1505)
	at org.h2.command.Parser.parseSelectUnion(Parser.java:1350)
	at org.h2.command.Parser.parseSelect(Parser.java:1338)
	at org.h2.command.Parser.readCondition(Parser.java:1727)
	at org.h2.command.Parser.readAnd(Parser.java:1665)
	at org.h2.command.Parser.readExpression(Parser.java:1655)
	at org.h2.command.Parser.parseSelectSimple(Parser.java:1612)
	at org.h2.command.Parser.parseSelectSub(Parser.java:1505)
	at org.h2.command.Parser.parseSelectUnion(Parser.java:1350)
	at org.h2.command.Parser.parseSelect(Parser.java:1338)
	at org.h2.command.Parser.parsePrepared(Parser.java:395)
	at org.h2.command.Parser.parse(Parser.java:291)
	at org.h2.command.Parser.parse(Parser.java:263)
	at org.h2.command.Parser.prepareCommand(Parser.java:235)
	at org.h2.engine.Session.prepareLocal(Session.java:415)
	at org.h2.engine.Session.prepareCommand(Session.java:376)
	at org.h2.jdbc.JdbcConnection.prepareCommand(JdbcConnection.java:1049)
	at org.h2.jdbc.JdbcStatement.executeQuery(JdbcStatement.java:70)
	at org.apache.commons.dbcp.DelegatingStatement.executeQuery(DelegatingStatement.java:208)
	at org.apache.commons.dbcp.DelegatingStatement.executeQuery(DelegatingStatement.java:208)
	at org.apache.commons.dbcp.DelegatingStatement.executeQuery(DelegatingStatement.java:208)
	at org.geotools.jdbc.JDBCDataStore.getAggregateValue(JDBCDataStore.java:1483)
	at org.geotools.jdbc.JDBCDataStore.getCount(JDBCDataStore.java:1432)
	at org.geotools.jdbc.JDBCFeatureSource.getCountInternal(JDBCFeatureSource.java:463)
	at org.geotools.data.store.ContentFeatureSource.getCount(ContentFeatureSource.java:498)
	at org.geotools.jdbc.JDBCFeatureStore.getCountInternal(JDBCFeatureStore.java:184)
	at org.geotools.data.store.ContentFeatureSource.getCount(ContentFeatureSource.java:498)
	at org.geotools.data.store.ContentFeatureCollection.size(ContentFeatureCollection.java:236)
	at org.geotools.jdbc.JDBCSpatialFiltersOnlineTest.checkSingleResult(JDBCSpatialFiltersOnlineTest.java:202)
	at org.geotools.jdbc.JDBCSpatialFiltersOnlineTest.testTouchesFilter(JDBCSpatialFiltersOnlineTest.java:144)
	at sun.reflect.NativeMethodAccessorImpl.invoke0(Native Method)
	at sun.reflect.NativeMethodAccessorImpl.invoke(NativeMethodAccessorImpl.java:62)
	at sun.reflect.DelegatingMethodAccessorImpl.invoke(DelegatingMethodAccessorImpl.java:43)
	at java.lang.reflect.Method.invoke(Method.java:498)
	at junit.framework.TestCase.runTest(TestCase.java:176)
	at junit.framework.TestCase.runBare(TestCase.java:141)
	at junit.framework.TestResult$1.protect(TestResult.java:122)
	at junit.framework.TestResult.runProtected(TestResult.java:142)
	at junit.framework.TestResult.run(TestResult.java:125)
	at junit.framework.TestCase.run(TestCase.java:129)
	at org.geotools.test.OnlineTestCase.run(OnlineTestCase.java:123)
	at junit.framework.TestSuite.runTest(TestSuite.java:255)
	at junit.framework.TestSuite.run(TestSuite.java:250)
	at org.junit.internal.runners.JUnit38ClassRunner.run(JUnit38ClassRunner.java:84)
	at org.apache.maven.surefire.junit4.JUnit4Provider.execute(JUnit4Provider.java:264)
	at org.apache.maven.surefire.junit4.JUnit4Provider.executeTestSet(JUnit4Provider.java:153)
	at org.apache.maven.surefire.junit4.JUnit4Provider.invoke(JUnit4Provider.java:124)
	at org.apache.maven.surefire.booter.ForkedBooter.invokeProviderInSameClassLoader(ForkedBooter.java:200)
	at org.apache.maven.surefire.booter.ForkedBooter.runSuitesInProcess(ForkedBooter.java:153)
	at org.apache.maven.surefire.booter.ForkedBooter.main(ForkedBooter.java:103)

testEqualsFilter(org.geotools.data.h2.H2SpatialFiltersTest)  Time elapsed: 0.825 sec  <<< ERROR!
java.lang.RuntimeException: java.io.IOException
	at org.geotools.data.store.ContentFeatureCollection.size(ContentFeatureCollection.java:259)
	at org.geotools.jdbc.JDBCSpatialFiltersOnlineTest.checkSingleResult(JDBCSpatialFiltersOnlineTest.java:202)
	at org.geotools.jdbc.JDBCSpatialFiltersOnlineTest.testEqualsFilter(JDBCSpatialFiltersOnlineTest.java:198)
	at sun.reflect.NativeMethodAccessorImpl.invoke0(Native Method)
	at sun.reflect.NativeMethodAccessorImpl.invoke(NativeMethodAccessorImpl.java:62)
	at sun.reflect.DelegatingMethodAccessorImpl.invoke(DelegatingMethodAccessorImpl.java:43)
	at java.lang.reflect.Method.invoke(Method.java:498)
	at junit.framework.TestCase.runTest(TestCase.java:176)
	at junit.framework.TestCase.runBare(TestCase.java:141)
	at junit.framework.TestResult$1.protect(TestResult.java:122)
	at junit.framework.TestResult.runProtected(TestResult.java:142)
	at junit.framework.TestResult.run(TestResult.java:125)
	at junit.framework.TestCase.run(TestCase.java:129)
	at org.geotools.test.OnlineTestCase.run(OnlineTestCase.java:123)
	at junit.framework.TestSuite.runTest(TestSuite.java:255)
	at junit.framework.TestSuite.run(TestSuite.java:250)
	at org.junit.internal.runners.JUnit38ClassRunner.run(JUnit38ClassRunner.java:84)
	at org.apache.maven.surefire.junit4.JUnit4Provider.execute(JUnit4Provider.java:264)
	at org.apache.maven.surefire.junit4.JUnit4Provider.executeTestSet(JUnit4Provider.java:153)
	at org.apache.maven.surefire.junit4.JUnit4Provider.invoke(JUnit4Provider.java:124)
	at org.apache.maven.surefire.booter.ForkedBooter.invokeProviderInSameClassLoader(ForkedBooter.java:200)
	at org.apache.maven.surefire.booter.ForkedBooter.runSuitesInProcess(ForkedBooter.java:153)
	at org.apache.maven.surefire.booter.ForkedBooter.main(ForkedBooter.java:103)
Caused by: java.io.IOException: null
	at org.geotools.jdbc.JDBCDataStore.getAggregateValue(JDBCDataStore.java:1508)
	at org.geotools.jdbc.JDBCDataStore.getCount(JDBCDataStore.java:1432)
	at org.geotools.jdbc.JDBCFeatureSource.getCountInternal(JDBCFeatureSource.java:463)
	at org.geotools.data.store.ContentFeatureSource.getCount(ContentFeatureSource.java:498)
	at org.geotools.jdbc.JDBCFeatureStore.getCountInternal(JDBCFeatureStore.java:184)
	at org.geotools.data.store.ContentFeatureSource.getCount(ContentFeatureSource.java:498)
	at org.geotools.data.store.ContentFeatureCollection.size(ContentFeatureCollection.java:236)
	at org.geotools.jdbc.JDBCSpatialFiltersOnlineTest.checkSingleResult(JDBCSpatialFiltersOnlineTest.java:202)
	at org.geotools.jdbc.JDBCSpatialFiltersOnlineTest.testEqualsFilter(JDBCSpatialFiltersOnlineTest.java:198)
	at sun.reflect.NativeMethodAccessorImpl.invoke0(Native Method)
	at sun.reflect.NativeMethodAccessorImpl.invoke(NativeMethodAccessorImpl.java:62)
	at sun.reflect.DelegatingMethodAccessorImpl.invoke(DelegatingMethodAccessorImpl.java:43)
	at java.lang.reflect.Method.invoke(Method.java:498)
	at junit.framework.TestCase.runTest(TestCase.java:176)
	at junit.framework.TestCase.runBare(TestCase.java:141)
	at junit.framework.TestResult$1.protect(TestResult.java:122)
	at junit.framework.TestResult.runProtected(TestResult.java:142)
	at junit.framework.TestResult.run(TestResult.java:125)
	at junit.framework.TestCase.run(TestCase.java:129)
	at org.geotools.test.OnlineTestCase.run(OnlineTestCase.java:123)
	at junit.framework.TestSuite.runTest(TestSuite.java:255)
	at junit.framework.TestSuite.run(TestSuite.java:250)
	at org.junit.internal.runners.JUnit38ClassRunner.run(JUnit38ClassRunner.java:84)
	at org.apache.maven.surefire.junit4.JUnit4Provider.execute(JUnit4Provider.java:264)
	at org.apache.maven.surefire.junit4.JUnit4Provider.executeTestSet(JUnit4Provider.java:153)
	at org.apache.maven.surefire.junit4.JUnit4Provider.invoke(JUnit4Provider.java:124)
	at org.apache.maven.surefire.booter.ForkedBooter.invokeProviderInSameClassLoader(ForkedBooter.java:200)
	at org.apache.maven.surefire.booter.ForkedBooter.runSuitesInProcess(ForkedBooter.java:153)
	at org.apache.maven.surefire.booter.ForkedBooter.main(ForkedBooter.java:103)
Caused by: org.h2.jdbc.JdbcSQLException: Function HATBOX_MBR_INTERSECTS_ENV not found; SQL statement:
SELECT count(*) FROM "road" WHERE  ST_Equals(ST_GeomFromText('LINESTRING (3 2, 4 2, 5 3)', 4326), "geom") AND "fid" IN (SELECT CAST(HATBOX_JOIN_ID AS INT) FROM HATBOX_MBR_INTERSECTS_ENV('PUBLIC', 'road', 3.0, 5.0, 2.0, 3.0)) [90022-119]
	at org.h2.message.Message.getSQLException(Message.java:106)
	at org.h2.message.Message.getSQLException(Message.java:117)
	at org.h2.message.Message.getSQLException(Message.java:76)
	at org.h2.command.Parser.readJavaFunction(Parser.java:1921)
	at org.h2.command.Parser.readFunction(Parser.java:1962)
	at org.h2.command.Parser.readTableFilter(Parser.java:972)
	at org.h2.command.Parser.parseSelectSimpleFromPart(Parser.java:1511)
	at org.h2.command.Parser.parseSelectSimple(Parser.java:1608)
	at org.h2.command.Parser.parseSelectSub(Parser.java:1505)
	at org.h2.command.Parser.parseSelectUnion(Parser.java:1350)
	at org.h2.command.Parser.parseSelect(Parser.java:1338)
	at org.h2.command.Parser.readCondition(Parser.java:1727)
	at org.h2.command.Parser.readAnd(Parser.java:1665)
	at org.h2.command.Parser.readExpression(Parser.java:1655)
	at org.h2.command.Parser.parseSelectSimple(Parser.java:1612)
	at org.h2.command.Parser.parseSelectSub(Parser.java:1505)
	at org.h2.command.Parser.parseSelectUnion(Parser.java:1350)
	at org.h2.command.Parser.parseSelect(Parser.java:1338)
	at org.h2.command.Parser.parsePrepared(Parser.java:395)
	at org.h2.command.Parser.parse(Parser.java:291)
	at org.h2.command.Parser.parse(Parser.java:263)
	at org.h2.command.Parser.prepareCommand(Parser.java:235)
	at org.h2.engine.Session.prepareLocal(Session.java:415)
	at org.h2.engine.Session.prepareCommand(Session.java:376)
	at org.h2.jdbc.JdbcConnection.prepareCommand(JdbcConnection.java:1049)
	at org.h2.jdbc.JdbcStatement.executeQuery(JdbcStatement.java:70)
	at org.apache.commons.dbcp.DelegatingStatement.executeQuery(DelegatingStatement.java:208)
	at org.apache.commons.dbcp.DelegatingStatement.executeQuery(DelegatingStatement.java:208)
	at org.apache.commons.dbcp.DelegatingStatement.executeQuery(DelegatingStatement.java:208)
	at org.geotools.jdbc.JDBCDataStore.getAggregateValue(JDBCDataStore.java:1483)
	at org.geotools.jdbc.JDBCDataStore.getCount(JDBCDataStore.java:1432)
	at org.geotools.jdbc.JDBCFeatureSource.getCountInternal(JDBCFeatureSource.java:463)
	at org.geotools.data.store.ContentFeatureSource.getCount(ContentFeatureSource.java:498)
	at org.geotools.jdbc.JDBCFeatureStore.getCountInternal(JDBCFeatureStore.java:184)
	at org.geotools.data.store.ContentFeatureSource.getCount(ContentFeatureSource.java:498)
	at org.geotools.data.store.ContentFeatureCollection.size(ContentFeatureCollection.java:236)
	at org.geotools.jdbc.JDBCSpatialFiltersOnlineTest.checkSingleResult(JDBCSpatialFiltersOnlineTest.java:202)
	at org.geotools.jdbc.JDBCSpatialFiltersOnlineTest.testEqualsFilter(JDBCSpatialFiltersOnlineTest.java:198)
	at sun.reflect.NativeMethodAccessorImpl.invoke0(Native Method)
	at sun.reflect.NativeMethodAccessorImpl.invoke(NativeMethodAccessorImpl.java:62)
	at sun.reflect.DelegatingMethodAccessorImpl.invoke(DelegatingMethodAccessorImpl.java:43)
	at java.lang.reflect.Method.invoke(Method.java:498)
	at junit.framework.TestCase.runTest(TestCase.java:176)
	at junit.framework.TestCase.runBare(TestCase.java:141)
	at junit.framework.TestResult$1.protect(TestResult.java:122)
	at junit.framework.TestResult.runProtected(TestResult.java:142)
	at junit.framework.TestResult.run(TestResult.java:125)
	at junit.framework.TestCase.run(TestCase.java:129)
	at org.geotools.test.OnlineTestCase.run(OnlineTestCase.java:123)
	at junit.framework.TestSuite.runTest(TestSuite.java:255)
	at junit.framework.TestSuite.run(TestSuite.java:250)
	at org.junit.internal.runners.JUnit38ClassRunner.run(JUnit38ClassRunner.java:84)
	at org.apache.maven.surefire.junit4.JUnit4Provider.execute(JUnit4Provider.java:264)
	at org.apache.maven.surefire.junit4.JUnit4Provider.executeTestSet(JUnit4Provider.java:153)
	at org.apache.maven.surefire.junit4.JUnit4Provider.invoke(JUnit4Provider.java:124)
	at org.apache.maven.surefire.booter.ForkedBooter.invokeProviderInSameClassLoader(ForkedBooter.java:200)
	at org.apache.maven.surefire.booter.ForkedBooter.runSuitesInProcess(ForkedBooter.java:153)
	at org.apache.maven.surefire.booter.ForkedBooter.main(ForkedBooter.java:103)

testBboxFilterDefault(org.geotools.data.h2.H2SpatialFiltersTest)  Time elapsed: 0.632 sec  <<< ERROR!
java.lang.RuntimeException: java.io.IOException
	at org.geotools.data.store.ContentFeatureCollection.size(ContentFeatureCollection.java:259)
	at org.geotools.jdbc.JDBCSpatialFiltersOnlineTest.checkSingleResult(JDBCSpatialFiltersOnlineTest.java:202)
	at org.geotools.jdbc.JDBCSpatialFiltersOnlineTest.testBboxFilterDefault(JDBCSpatialFiltersOnlineTest.java:100)
	at sun.reflect.NativeMethodAccessorImpl.invoke0(Native Method)
	at sun.reflect.NativeMethodAccessorImpl.invoke(NativeMethodAccessorImpl.java:62)
	at sun.reflect.DelegatingMethodAccessorImpl.invoke(DelegatingMethodAccessorImpl.java:43)
	at java.lang.reflect.Method.invoke(Method.java:498)
	at junit.framework.TestCase.runTest(TestCase.java:176)
	at junit.framework.TestCase.runBare(TestCase.java:141)
	at junit.framework.TestResult$1.protect(TestResult.java:122)
	at junit.framework.TestResult.runProtected(TestResult.java:142)
	at junit.framework.TestResult.run(TestResult.java:125)
	at junit.framework.TestCase.run(TestCase.java:129)
	at org.geotools.test.OnlineTestCase.run(OnlineTestCase.java:123)
	at junit.framework.TestSuite.runTest(TestSuite.java:255)
	at junit.framework.TestSuite.run(TestSuite.java:250)
	at org.junit.internal.runners.JUnit38ClassRunner.run(JUnit38ClassRunner.java:84)
	at org.apache.maven.surefire.junit4.JUnit4Provider.execute(JUnit4Provider.java:264)
	at org.apache.maven.surefire.junit4.JUnit4Provider.executeTestSet(JUnit4Provider.java:153)
	at org.apache.maven.surefire.junit4.JUnit4Provider.invoke(JUnit4Provider.java:124)
	at org.apache.maven.surefire.booter.ForkedBooter.invokeProviderInSameClassLoader(ForkedBooter.java:200)
	at org.apache.maven.surefire.booter.ForkedBooter.runSuitesInProcess(ForkedBooter.java:153)
	at org.apache.maven.surefire.booter.ForkedBooter.main(ForkedBooter.java:103)
Caused by: java.io.IOException: null
	at org.geotools.jdbc.JDBCDataStore.getAggregateValue(JDBCDataStore.java:1508)
	at org.geotools.jdbc.JDBCDataStore.getCount(JDBCDataStore.java:1432)
	at org.geotools.jdbc.JDBCFeatureSource.getCountInternal(JDBCFeatureSource.java:463)
	at org.geotools.data.store.ContentFeatureSource.getCount(ContentFeatureSource.java:498)
	at org.geotools.jdbc.JDBCFeatureStore.getCountInternal(JDBCFeatureStore.java:184)
	at org.geotools.data.store.ContentFeatureSource.getCount(ContentFeatureSource.java:498)
	at org.geotools.data.store.ContentFeatureCollection.size(ContentFeatureCollection.java:236)
	at org.geotools.jdbc.JDBCSpatialFiltersOnlineTest.checkSingleResult(JDBCSpatialFiltersOnlineTest.java:202)
	at org.geotools.jdbc.JDBCSpatialFiltersOnlineTest.testBboxFilterDefault(JDBCSpatialFiltersOnlineTest.java:100)
	at sun.reflect.NativeMethodAccessorImpl.invoke0(Native Method)
	at sun.reflect.NativeMethodAccessorImpl.invoke(NativeMethodAccessorImpl.java:62)
	at sun.reflect.DelegatingMethodAccessorImpl.invoke(DelegatingMethodAccessorImpl.java:43)
	at java.lang.reflect.Method.invoke(Method.java:498)
	at junit.framework.TestCase.runTest(TestCase.java:176)
	at junit.framework.TestCase.runBare(TestCase.java:141)
	at junit.framework.TestResult$1.protect(TestResult.java:122)
	at junit.framework.TestResult.runProtected(TestResult.java:142)
	at junit.framework.TestResult.run(TestResult.java:125)
	at junit.framework.TestCase.run(TestCase.java:129)
	at org.geotools.test.OnlineTestCase.run(OnlineTestCase.java:123)
	at junit.framework.TestSuite.runTest(TestSuite.java:255)
	at junit.framework.TestSuite.run(TestSuite.java:250)
	at org.junit.internal.runners.JUnit38ClassRunner.run(JUnit38ClassRunner.java:84)
	at org.apache.maven.surefire.junit4.JUnit4Provider.execute(JUnit4Provider.java:264)
	at org.apache.maven.surefire.junit4.JUnit4Provider.executeTestSet(JUnit4Provider.java:153)
	at org.apache.maven.surefire.junit4.JUnit4Provider.invoke(JUnit4Provider.java:124)
	at org.apache.maven.surefire.booter.ForkedBooter.invokeProviderInSameClassLoader(ForkedBooter.java:200)
	at org.apache.maven.surefire.booter.ForkedBooter.runSuitesInProcess(ForkedBooter.java:153)
	at org.apache.maven.surefire.booter.ForkedBooter.main(ForkedBooter.java:103)
Caused by: org.h2.jdbc.JdbcSQLException: Function HATBOX_MBR_INTERSECTS_ENV not found; SQL statement:
SELECT count(*) FROM "road" WHERE  ST_Intersects("geom",ST_GeomFromText('POLYGON ((2 3, 2 5, 4 5, 4 3, 2 3))', 4326)) AND "fid" IN (SELECT CAST(HATBOX_JOIN_ID AS INT) FROM HATBOX_MBR_INTERSECTS_ENV('PUBLIC', 'road', 2.0, 4.0, 3.0, 5.0)) [90022-119]
	at org.h2.message.Message.getSQLException(Message.java:106)
	at org.h2.message.Message.getSQLException(Message.java:117)
	at org.h2.message.Message.getSQLException(Message.java:76)
	at org.h2.command.Parser.readJavaFunction(Parser.java:1921)
	at org.h2.command.Parser.readFunction(Parser.java:1962)
	at org.h2.command.Parser.readTableFilter(Parser.java:972)
	at org.h2.command.Parser.parseSelectSimpleFromPart(Parser.java:1511)
	at org.h2.command.Parser.parseSelectSimple(Parser.java:1608)
	at org.h2.command.Parser.parseSelectSub(Parser.java:1505)
	at org.h2.command.Parser.parseSelectUnion(Parser.java:1350)
	at org.h2.command.Parser.parseSelect(Parser.java:1338)
	at org.h2.command.Parser.readCondition(Parser.java:1727)
	at org.h2.command.Parser.readAnd(Parser.java:1665)
	at org.h2.command.Parser.readExpression(Parser.java:1655)
	at org.h2.command.Parser.parseSelectSimple(Parser.java:1612)
	at org.h2.command.Parser.parseSelectSub(Parser.java:1505)
	at org.h2.command.Parser.parseSelectUnion(Parser.java:1350)
	at org.h2.command.Parser.parseSelect(Parser.java:1338)
	at org.h2.command.Parser.parsePrepared(Parser.java:395)
	at org.h2.command.Parser.parse(Parser.java:291)
	at org.h2.command.Parser.parse(Parser.java:263)
	at org.h2.command.Parser.prepareCommand(Parser.java:235)
	at org.h2.engine.Session.prepareLocal(Session.java:415)
	at org.h2.engine.Session.prepareCommand(Session.java:376)
	at org.h2.jdbc.JdbcConnection.prepareCommand(JdbcConnection.java:1049)
	at org.h2.jdbc.JdbcStatement.executeQuery(JdbcStatement.java:70)
	at org.apache.commons.dbcp.DelegatingStatement.executeQuery(DelegatingStatement.java:208)
	at org.apache.commons.dbcp.DelegatingStatement.executeQuery(DelegatingStatement.java:208)
	at org.apache.commons.dbcp.DelegatingStatement.executeQuery(DelegatingStatement.java:208)
	at org.geotools.jdbc.JDBCDataStore.getAggregateValue(JDBCDataStore.java:1483)
	at org.geotools.jdbc.JDBCDataStore.getCount(JDBCDataStore.java:1432)
	at org.geotools.jdbc.JDBCFeatureSource.getCountInternal(JDBCFeatureSource.java:463)
	at org.geotools.data.store.ContentFeatureSource.getCount(ContentFeatureSource.java:498)
	at org.geotools.jdbc.JDBCFeatureStore.getCountInternal(JDBCFeatureStore.java:184)
	at org.geotools.data.store.ContentFeatureSource.getCount(ContentFeatureSource.java:498)
	at org.geotools.data.store.ContentFeatureCollection.size(ContentFeatureCollection.java:236)
	at org.geotools.jdbc.JDBCSpatialFiltersOnlineTest.checkSingleResult(JDBCSpatialFiltersOnlineTest.java:202)
	at org.geotools.jdbc.JDBCSpatialFiltersOnlineTest.testBboxFilterDefault(JDBCSpatialFiltersOnlineTest.java:100)
	at sun.reflect.NativeMethodAccessorImpl.invoke0(Native Method)
	at sun.reflect.NativeMethodAccessorImpl.invoke(NativeMethodAccessorImpl.java:62)
	at sun.reflect.DelegatingMethodAccessorImpl.invoke(DelegatingMethodAccessorImpl.java:43)
	at java.lang.reflect.Method.invoke(Method.java:498)
	at junit.framework.TestCase.runTest(TestCase.java:176)
	at junit.framework.TestCase.runBare(TestCase.java:141)
	at junit.framework.TestResult$1.protect(TestResult.java:122)
	at junit.framework.TestResult.runProtected(TestResult.java:142)
	at junit.framework.TestResult.run(TestResult.java:125)
	at junit.framework.TestCase.run(TestCase.java:129)
	at org.geotools.test.OnlineTestCase.run(OnlineTestCase.java:123)
	at junit.framework.TestSuite.runTest(TestSuite.java:255)
	at junit.framework.TestSuite.run(TestSuite.java:250)
	at org.junit.internal.runners.JUnit38ClassRunner.run(JUnit38ClassRunner.java:84)
	at org.apache.maven.surefire.junit4.JUnit4Provider.execute(JUnit4Provider.java:264)
	at org.apache.maven.surefire.junit4.JUnit4Provider.executeTestSet(JUnit4Provider.java:153)
	at org.apache.maven.surefire.junit4.JUnit4Provider.invoke(JUnit4Provider.java:124)
	at org.apache.maven.surefire.booter.ForkedBooter.invokeProviderInSameClassLoader(ForkedBooter.java:200)
	at org.apache.maven.surefire.booter.ForkedBooter.runSuitesInProcess(ForkedBooter.java:153)
	at org.apache.maven.surefire.booter.ForkedBooter.main(ForkedBooter.java:103)

testIntersectsRingFilter(org.geotools.data.h2.H2SpatialFiltersTest)  Time elapsed: 0.653 sec  <<< ERROR!
java.lang.RuntimeException: java.io.IOException
	at org.geotools.data.store.ContentFeatureCollection.size(ContentFeatureCollection.java:259)
	at org.geotools.jdbc.JDBCSpatialFiltersOnlineTest.checkSingleResult(JDBCSpatialFiltersOnlineTest.java:202)
	at org.geotools.jdbc.JDBCSpatialFiltersOnlineTest.testIntersectsRingFilter(JDBCSpatialFiltersOnlineTest.java:133)
	at sun.reflect.NativeMethodAccessorImpl.invoke0(Native Method)
	at sun.reflect.NativeMethodAccessorImpl.invoke(NativeMethodAccessorImpl.java:62)
	at sun.reflect.DelegatingMethodAccessorImpl.invoke(DelegatingMethodAccessorImpl.java:43)
	at java.lang.reflect.Method.invoke(Method.java:498)
	at junit.framework.TestCase.runTest(TestCase.java:176)
	at junit.framework.TestCase.runBare(TestCase.java:141)
	at junit.framework.TestResult$1.protect(TestResult.java:122)
	at junit.framework.TestResult.runProtected(TestResult.java:142)
	at junit.framework.TestResult.run(TestResult.java:125)
	at junit.framework.TestCase.run(TestCase.java:129)
	at org.geotools.test.OnlineTestCase.run(OnlineTestCase.java:123)
	at junit.framework.TestSuite.runTest(TestSuite.java:255)
	at junit.framework.TestSuite.run(TestSuite.java:250)
	at org.junit.internal.runners.JUnit38ClassRunner.run(JUnit38ClassRunner.java:84)
	at org.apache.maven.surefire.junit4.JUnit4Provider.execute(JUnit4Provider.java:264)
	at org.apache.maven.surefire.junit4.JUnit4Provider.executeTestSet(JUnit4Provider.java:153)
	at org.apache.maven.surefire.junit4.JUnit4Provider.invoke(JUnit4Provider.java:124)
	at org.apache.maven.surefire.booter.ForkedBooter.invokeProviderInSameClassLoader(ForkedBooter.java:200)
	at org.apache.maven.surefire.booter.ForkedBooter.runSuitesInProcess(ForkedBooter.java:153)
	at org.apache.maven.surefire.booter.ForkedBooter.main(ForkedBooter.java:103)
Caused by: java.io.IOException: null
	at org.geotools.jdbc.JDBCDataStore.getAggregateValue(JDBCDataStore.java:1508)
	at org.geotools.jdbc.JDBCDataStore.getCount(JDBCDataStore.java:1432)
	at org.geotools.jdbc.JDBCFeatureSource.getCountInternal(JDBCFeatureSource.java:463)
	at org.geotools.data.store.ContentFeatureSource.getCount(ContentFeatureSource.java:498)
	at org.geotools.jdbc.JDBCFeatureStore.getCountInternal(JDBCFeatureStore.java:184)
	at org.geotools.data.store.ContentFeatureSource.getCount(ContentFeatureSource.java:498)
	at org.geotools.data.store.ContentFeatureCollection.size(ContentFeatureCollection.java:236)
	at org.geotools.jdbc.JDBCSpatialFiltersOnlineTest.checkSingleResult(JDBCSpatialFiltersOnlineTest.java:202)
	at org.geotools.jdbc.JDBCSpatialFiltersOnlineTest.testIntersectsRingFilter(JDBCSpatialFiltersOnlineTest.java:133)
	at sun.reflect.NativeMethodAccessorImpl.invoke0(Native Method)
	at sun.reflect.NativeMethodAccessorImpl.invoke(NativeMethodAccessorImpl.java:62)
	at sun.reflect.DelegatingMethodAccessorImpl.invoke(DelegatingMethodAccessorImpl.java:43)
	at java.lang.reflect.Method.invoke(Method.java:498)
	at junit.framework.TestCase.runTest(TestCase.java:176)
	at junit.framework.TestCase.runBare(TestCase.java:141)
	at junit.framework.TestResult$1.protect(TestResult.java:122)
	at junit.framework.TestResult.runProtected(TestResult.java:142)
	at junit.framework.TestResult.run(TestResult.java:125)
	at junit.framework.TestCase.run(TestCase.java:129)
	at org.geotools.test.OnlineTestCase.run(OnlineTestCase.java:123)
	at junit.framework.TestSuite.runTest(TestSuite.java:255)
	at junit.framework.TestSuite.run(TestSuite.java:250)
	at org.junit.internal.runners.JUnit38ClassRunner.run(JUnit38ClassRunner.java:84)
	at org.apache.maven.surefire.junit4.JUnit4Provider.execute(JUnit4Provider.java:264)
	at org.apache.maven.surefire.junit4.JUnit4Provider.executeTestSet(JUnit4Provider.java:153)
	at org.apache.maven.surefire.junit4.JUnit4Provider.invoke(JUnit4Provider.java:124)
	at org.apache.maven.surefire.booter.ForkedBooter.invokeProviderInSameClassLoader(ForkedBooter.java:200)
	at org.apache.maven.surefire.booter.ForkedBooter.runSuitesInProcess(ForkedBooter.java:153)
	at org.apache.maven.surefire.booter.ForkedBooter.main(ForkedBooter.java:103)
Caused by: org.h2.jdbc.JdbcSQLException: Function HATBOX_MBR_INTERSECTS_ENV not found; SQL statement:
SELECT count(*) FROM "road" WHERE  ST_Intersects("geom", ST_GeomFromText('LINESTRING (2 1, 2 3, 0 3, 2 1)', 4326)) AND "fid" IN (SELECT CAST(HATBOX_JOIN_ID AS INT) FROM HATBOX_MBR_INTERSECTS_ENV('PUBLIC', 'road', 0.0, 2.0, 1.0, 3.0)) [90022-119]
	at org.h2.message.Message.getSQLException(Message.java:106)
	at org.h2.message.Message.getSQLException(Message.java:117)
	at org.h2.message.Message.getSQLException(Message.java:76)
	at org.h2.command.Parser.readJavaFunction(Parser.java:1921)
	at org.h2.command.Parser.readFunction(Parser.java:1962)
	at org.h2.command.Parser.readTableFilter(Parser.java:972)
	at org.h2.command.Parser.parseSelectSimpleFromPart(Parser.java:1511)
	at org.h2.command.Parser.parseSelectSimple(Parser.java:1608)
	at org.h2.command.Parser.parseSelectSub(Parser.java:1505)
	at org.h2.command.Parser.parseSelectUnion(Parser.java:1350)
	at org.h2.command.Parser.parseSelect(Parser.java:1338)
	at org.h2.command.Parser.readCondition(Parser.java:1727)
	at org.h2.command.Parser.readAnd(Parser.java:1665)
	at org.h2.command.Parser.readExpression(Parser.java:1655)
	at org.h2.command.Parser.parseSelectSimple(Parser.java:1612)
	at org.h2.command.Parser.parseSelectSub(Parser.java:1505)
	at org.h2.command.Parser.parseSelectUnion(Parser.java:1350)
	at org.h2.command.Parser.parseSelect(Parser.java:1338)
	at org.h2.command.Parser.parsePrepared(Parser.java:395)
	at org.h2.command.Parser.parse(Parser.java:291)
	at org.h2.command.Parser.parse(Parser.java:263)
	at org.h2.command.Parser.prepareCommand(Parser.java:235)
	at org.h2.engine.Session.prepareLocal(Session.java:415)
	at org.h2.engine.Session.prepareCommand(Session.java:376)
	at org.h2.jdbc.JdbcConnection.prepareCommand(JdbcConnection.java:1049)
	at org.h2.jdbc.JdbcStatement.executeQuery(JdbcStatement.java:70)
	at org.apache.commons.dbcp.DelegatingStatement.executeQuery(DelegatingStatement.java:208)
	at org.apache.commons.dbcp.DelegatingStatement.executeQuery(DelegatingStatement.java:208)
	at org.apache.commons.dbcp.DelegatingStatement.executeQuery(DelegatingStatement.java:208)
	at org.geotools.jdbc.JDBCDataStore.getAggregateValue(JDBCDataStore.java:1483)
	at org.geotools.jdbc.JDBCDataStore.getCount(JDBCDataStore.java:1432)
	at org.geotools.jdbc.JDBCFeatureSource.getCountInternal(JDBCFeatureSource.java:463)
	at org.geotools.data.store.ContentFeatureSource.getCount(ContentFeatureSource.java:498)
	at org.geotools.jdbc.JDBCFeatureStore.getCountInternal(JDBCFeatureStore.java:184)
	at org.geotools.data.store.ContentFeatureSource.getCount(ContentFeatureSource.java:498)
	at org.geotools.data.store.ContentFeatureCollection.size(ContentFeatureCollection.java:236)
	at org.geotools.jdbc.JDBCSpatialFiltersOnlineTest.checkSingleResult(JDBCSpatialFiltersOnlineTest.java:202)
	at org.geotools.jdbc.JDBCSpatialFiltersOnlineTest.testIntersectsRingFilter(JDBCSpatialFiltersOnlineTest.java:133)
	at sun.reflect.NativeMethodAccessorImpl.invoke0(Native Method)
	at sun.reflect.NativeMethodAccessorImpl.invoke(NativeMethodAccessorImpl.java:62)
	at sun.reflect.DelegatingMethodAccessorImpl.invoke(DelegatingMethodAccessorImpl.java:43)
	at java.lang.reflect.Method.invoke(Method.java:498)
	at junit.framework.TestCase.runTest(TestCase.java:176)
	at junit.framework.TestCase.runBare(TestCase.java:141)
	at junit.framework.TestResult$1.protect(TestResult.java:122)
	at junit.framework.TestResult.runProtected(TestResult.java:142)
	at junit.framework.TestResult.run(TestResult.java:125)
	at junit.framework.TestCase.run(TestCase.java:129)
	at org.geotools.test.OnlineTestCase.run(OnlineTestCase.java:123)
	at junit.framework.TestSuite.runTest(TestSuite.java:255)
	at junit.framework.TestSuite.run(TestSuite.java:250)
	at org.junit.internal.runners.JUnit38ClassRunner.run(JUnit38ClassRunner.java:84)
	at org.apache.maven.surefire.junit4.JUnit4Provider.execute(JUnit4Provider.java:264)
	at org.apache.maven.surefire.junit4.JUnit4Provider.executeTestSet(JUnit4Provider.java:153)
	at org.apache.maven.surefire.junit4.JUnit4Provider.invoke(JUnit4Provider.java:124)
	at org.apache.maven.surefire.booter.ForkedBooter.invokeProviderInSameClassLoader(ForkedBooter.java:200)
	at org.apache.maven.surefire.booter.ForkedBooter.runSuitesInProcess(ForkedBooter.java:153)
	at org.apache.maven.surefire.booter.ForkedBooter.main(ForkedBooter.java:103)

testCrossesFilter(org.geotools.data.h2.H2SpatialFiltersTest)  Time elapsed: 0.669 sec  <<< ERROR!
java.lang.RuntimeException: java.io.IOException
	at org.geotools.data.store.ContentFeatureCollection.size(ContentFeatureCollection.java:259)
	at org.geotools.jdbc.JDBCSpatialFiltersOnlineTest.checkSingleResult(JDBCSpatialFiltersOnlineTest.java:202)
	at org.geotools.jdbc.JDBCSpatialFiltersOnlineTest.testCrossesFilter(JDBCSpatialFiltersOnlineTest.java:111)
	at sun.reflect.NativeMethodAccessorImpl.invoke0(Native Method)
	at sun.reflect.NativeMethodAccessorImpl.invoke(NativeMethodAccessorImpl.java:62)
	at sun.reflect.DelegatingMethodAccessorImpl.invoke(DelegatingMethodAccessorImpl.java:43)
	at java.lang.reflect.Method.invoke(Method.java:498)
	at junit.framework.TestCase.runTest(TestCase.java:176)
	at junit.framework.TestCase.runBare(TestCase.java:141)
	at junit.framework.TestResult$1.protect(TestResult.java:122)
	at junit.framework.TestResult.runProtected(TestResult.java:142)
	at junit.framework.TestResult.run(TestResult.java:125)
	at junit.framework.TestCase.run(TestCase.java:129)
	at org.geotools.test.OnlineTestCase.run(OnlineTestCase.java:123)
	at junit.framework.TestSuite.runTest(TestSuite.java:255)
	at junit.framework.TestSuite.run(TestSuite.java:250)
	at org.junit.internal.runners.JUnit38ClassRunner.run(JUnit38ClassRunner.java:84)
	at org.apache.maven.surefire.junit4.JUnit4Provider.execute(JUnit4Provider.java:264)
	at org.apache.maven.surefire.junit4.JUnit4Provider.executeTestSet(JUnit4Provider.java:153)
	at org.apache.maven.surefire.junit4.JUnit4Provider.invoke(JUnit4Provider.java:124)
	at org.apache.maven.surefire.booter.ForkedBooter.invokeProviderInSameClassLoader(ForkedBooter.java:200)
	at org.apache.maven.surefire.booter.ForkedBooter.runSuitesInProcess(ForkedBooter.java:153)
	at org.apache.maven.surefire.booter.ForkedBooter.main(ForkedBooter.java:103)
Caused by: java.io.IOException: null
	at org.geotools.jdbc.JDBCDataStore.getAggregateValue(JDBCDataStore.java:1508)
	at org.geotools.jdbc.JDBCDataStore.getCount(JDBCDataStore.java:1432)
	at org.geotools.jdbc.JDBCFeatureSource.getCountInternal(JDBCFeatureSource.java:463)
	at org.geotools.data.store.ContentFeatureSource.getCount(ContentFeatureSource.java:498)
	at org.geotools.jdbc.JDBCFeatureStore.getCountInternal(JDBCFeatureStore.java:184)
	at org.geotools.data.store.ContentFeatureSource.getCount(ContentFeatureSource.java:498)
	at org.geotools.data.store.ContentFeatureCollection.size(ContentFeatureCollection.java:236)
	at org.geotools.jdbc.JDBCSpatialFiltersOnlineTest.checkSingleResult(JDBCSpatialFiltersOnlineTest.java:202)
	at org.geotools.jdbc.JDBCSpatialFiltersOnlineTest.testCrossesFilter(JDBCSpatialFiltersOnlineTest.java:111)
	at sun.reflect.NativeMethodAccessorImpl.invoke0(Native Method)
	at sun.reflect.NativeMethodAccessorImpl.invoke(NativeMethodAccessorImpl.java:62)
	at sun.reflect.DelegatingMethodAccessorImpl.invoke(DelegatingMethodAccessorImpl.java:43)
	at java.lang.reflect.Method.invoke(Method.java:498)
	at junit.framework.TestCase.runTest(TestCase.java:176)
	at junit.framework.TestCase.runBare(TestCase.java:141)
	at junit.framework.TestResult$1.protect(TestResult.java:122)
	at junit.framework.TestResult.runProtected(TestResult.java:142)
	at junit.framework.TestResult.run(TestResult.java:125)
	at junit.framework.TestCase.run(TestCase.java:129)
	at org.geotools.test.OnlineTestCase.run(OnlineTestCase.java:123)
	at junit.framework.TestSuite.runTest(TestSuite.java:255)
	at junit.framework.TestSuite.run(TestSuite.java:250)
	at org.junit.internal.runners.JUnit38ClassRunner.run(JUnit38ClassRunner.java:84)
	at org.apache.maven.surefire.junit4.JUnit4Provider.execute(JUnit4Provider.java:264)
	at org.apache.maven.surefire.junit4.JUnit4Provider.executeTestSet(JUnit4Provider.java:153)
	at org.apache.maven.surefire.junit4.JUnit4Provider.invoke(JUnit4Provider.java:124)
	at org.apache.maven.surefire.booter.ForkedBooter.invokeProviderInSameClassLoader(ForkedBooter.java:200)
	at org.apache.maven.surefire.booter.ForkedBooter.runSuitesInProcess(ForkedBooter.java:153)
	at org.apache.maven.surefire.booter.ForkedBooter.main(ForkedBooter.java:103)
Caused by: org.h2.jdbc.JdbcSQLException: Function HATBOX_MBR_INTERSECTS_ENV not found; SQL statement:
SELECT count(*) FROM "road" WHERE  ST_Crosses("geom", ST_GeomFromText('LINESTRING (2 3, 4 3)', 4326)) AND "fid" IN (SELECT CAST(HATBOX_JOIN_ID AS INT) FROM HATBOX_MBR_INTERSECTS_ENV('PUBLIC', 'road', 2.0, 4.0, 3.0, 3.0)) [90022-119]
	at org.h2.message.Message.getSQLException(Message.java:106)
	at org.h2.message.Message.getSQLException(Message.java:117)
	at org.h2.message.Message.getSQLException(Message.java:76)
	at org.h2.command.Parser.readJavaFunction(Parser.java:1921)
	at org.h2.command.Parser.readFunction(Parser.java:1962)
	at org.h2.command.Parser.readTableFilter(Parser.java:972)
	at org.h2.command.Parser.parseSelectSimpleFromPart(Parser.java:1511)
	at org.h2.command.Parser.parseSelectSimple(Parser.java:1608)
	at org.h2.command.Parser.parseSelectSub(Parser.java:1505)
	at org.h2.command.Parser.parseSelectUnion(Parser.java:1350)
	at org.h2.command.Parser.parseSelect(Parser.java:1338)
	at org.h2.command.Parser.readCondition(Parser.java:1727)
	at org.h2.command.Parser.readAnd(Parser.java:1665)
	at org.h2.command.Parser.readExpression(Parser.java:1655)
	at org.h2.command.Parser.parseSelectSimple(Parser.java:1612)
	at org.h2.command.Parser.parseSelectSub(Parser.java:1505)
	at org.h2.command.Parser.parseSelectUnion(Parser.java:1350)
	at org.h2.command.Parser.parseSelect(Parser.java:1338)
	at org.h2.command.Parser.parsePrepared(Parser.java:395)
	at org.h2.command.Parser.parse(Parser.java:291)
	at org.h2.command.Parser.parse(Parser.java:263)
	at org.h2.command.Parser.prepareCommand(Parser.java:235)
	at org.h2.engine.Session.prepareLocal(Session.java:415)
	at org.h2.engine.Session.prepareCommand(Session.java:376)
	at org.h2.jdbc.JdbcConnection.prepareCommand(JdbcConnection.java:1049)
	at org.h2.jdbc.JdbcStatement.executeQuery(JdbcStatement.java:70)
	at org.apache.commons.dbcp.DelegatingStatement.executeQuery(DelegatingStatement.java:208)
	at org.apache.commons.dbcp.DelegatingStatement.executeQuery(DelegatingStatement.java:208)
	at org.apache.commons.dbcp.DelegatingStatement.executeQuery(DelegatingStatement.java:208)
	at org.geotools.jdbc.JDBCDataStore.getAggregateValue(JDBCDataStore.java:1483)
	at org.geotools.jdbc.JDBCDataStore.getCount(JDBCDataStore.java:1432)
	at org.geotools.jdbc.JDBCFeatureSource.getCountInternal(JDBCFeatureSource.java:463)
	at org.geotools.data.store.ContentFeatureSource.getCount(ContentFeatureSource.java:498)
	at org.geotools.jdbc.JDBCFeatureStore.getCountInternal(JDBCFeatureStore.java:184)
	at org.geotools.data.store.ContentFeatureSource.getCount(ContentFeatureSource.java:498)
	at org.geotools.data.store.ContentFeatureCollection.size(ContentFeatureCollection.java:236)
	at org.geotools.jdbc.JDBCSpatialFiltersOnlineTest.checkSingleResult(JDBCSpatialFiltersOnlineTest.java:202)
	at org.geotools.jdbc.JDBCSpatialFiltersOnlineTest.testCrossesFilter(JDBCSpatialFiltersOnlineTest.java:111)
	at sun.reflect.NativeMethodAccessorImpl.invoke0(Native Method)
	at sun.reflect.NativeMethodAccessorImpl.invoke(NativeMethodAccessorImpl.java:62)
	at sun.reflect.DelegatingMethodAccessorImpl.invoke(DelegatingMethodAccessorImpl.java:43)
	at java.lang.reflect.Method.invoke(Method.java:498)
	at junit.framework.TestCase.runTest(TestCase.java:176)
	at junit.framework.TestCase.runBare(TestCase.java:141)
	at junit.framework.TestResult$1.protect(TestResult.java:122)
	at junit.framework.TestResult.runProtected(TestResult.java:142)
	at junit.framework.TestResult.run(TestResult.java:125)
	at junit.framework.TestCase.run(TestCase.java:129)
	at org.geotools.test.OnlineTestCase.run(OnlineTestCase.java:123)
	at junit.framework.TestSuite.runTest(TestSuite.java:255)
	at junit.framework.TestSuite.run(TestSuite.java:250)
	at org.junit.internal.runners.JUnit38ClassRunner.run(JUnit38ClassRunner.java:84)
	at org.apache.maven.surefire.junit4.JUnit4Provider.execute(JUnit4Provider.java:264)
	at org.apache.maven.surefire.junit4.JUnit4Provider.executeTestSet(JUnit4Provider.java:153)
	at org.apache.maven.surefire.junit4.JUnit4Provider.invoke(JUnit4Provider.java:124)
	at org.apache.maven.surefire.booter.ForkedBooter.invokeProviderInSameClassLoader(ForkedBooter.java:200)
	at org.apache.maven.surefire.booter.ForkedBooter.runSuitesInProcess(ForkedBooter.java:153)
	at org.apache.maven.surefire.booter.ForkedBooter.main(ForkedBooter.java:103)

testBboxFilter(org.geotools.data.h2.H2SpatialFiltersTest)  Time elapsed: 0.663 sec  <<< ERROR!
java.lang.RuntimeException: java.io.IOException
	at org.geotools.data.store.ContentFeatureCollection.size(ContentFeatureCollection.java:259)
	at org.geotools.jdbc.JDBCSpatialFiltersOnlineTest.checkSingleResult(JDBCSpatialFiltersOnlineTest.java:202)
	at org.geotools.jdbc.JDBCSpatialFiltersOnlineTest.testBboxFilter(JDBCSpatialFiltersOnlineTest.java:92)
	at sun.reflect.NativeMethodAccessorImpl.invoke0(Native Method)
	at sun.reflect.NativeMethodAccessorImpl.invoke(NativeMethodAccessorImpl.java:62)
	at sun.reflect.DelegatingMethodAccessorImpl.invoke(DelegatingMethodAccessorImpl.java:43)
	at java.lang.reflect.Method.invoke(Method.java:498)
	at junit.framework.TestCase.runTest(TestCase.java:176)
	at junit.framework.TestCase.runBare(TestCase.java:141)
	at junit.framework.TestResult$1.protect(TestResult.java:122)
	at junit.framework.TestResult.runProtected(TestResult.java:142)
	at junit.framework.TestResult.run(TestResult.java:125)
	at junit.framework.TestCase.run(TestCase.java:129)
	at org.geotools.test.OnlineTestCase.run(OnlineTestCase.java:123)
	at junit.framework.TestSuite.runTest(TestSuite.java:255)
	at junit.framework.TestSuite.run(TestSuite.java:250)
	at org.junit.internal.runners.JUnit38ClassRunner.run(JUnit38ClassRunner.java:84)
	at org.apache.maven.surefire.junit4.JUnit4Provider.execute(JUnit4Provider.java:264)
	at org.apache.maven.surefire.junit4.JUnit4Provider.executeTestSet(JUnit4Provider.java:153)
	at org.apache.maven.surefire.junit4.JUnit4Provider.invoke(JUnit4Provider.java:124)
	at org.apache.maven.surefire.booter.ForkedBooter.invokeProviderInSameClassLoader(ForkedBooter.java:200)
	at org.apache.maven.surefire.booter.ForkedBooter.runSuitesInProcess(ForkedBooter.java:153)
	at org.apache.maven.surefire.booter.ForkedBooter.main(ForkedBooter.java:103)
Caused by: java.io.IOException: null
	at org.geotools.jdbc.JDBCDataStore.getAggregateValue(JDBCDataStore.java:1508)
	at org.geotools.jdbc.JDBCDataStore.getCount(JDBCDataStore.java:1432)
	at org.geotools.jdbc.JDBCFeatureSource.getCountInternal(JDBCFeatureSource.java:463)
	at org.geotools.data.store.ContentFeatureSource.getCount(ContentFeatureSource.java:498)
	at org.geotools.jdbc.JDBCFeatureStore.getCountInternal(JDBCFeatureStore.java:184)
	at org.geotools.data.store.ContentFeatureSource.getCount(ContentFeatureSource.java:498)
	at org.geotools.data.store.ContentFeatureCollection.size(ContentFeatureCollection.java:236)
	at org.geotools.jdbc.JDBCSpatialFiltersOnlineTest.checkSingleResult(JDBCSpatialFiltersOnlineTest.java:202)
	at org.geotools.jdbc.JDBCSpatialFiltersOnlineTest.testBboxFilter(JDBCSpatialFiltersOnlineTest.java:92)
	at sun.reflect.NativeMethodAccessorImpl.invoke0(Native Method)
	at sun.reflect.NativeMethodAccessorImpl.invoke(NativeMethodAccessorImpl.java:62)
	at sun.reflect.DelegatingMethodAccessorImpl.invoke(DelegatingMethodAccessorImpl.java:43)
	at java.lang.reflect.Method.invoke(Method.java:498)
	at junit.framework.TestCase.runTest(TestCase.java:176)
	at junit.framework.TestCase.runBare(TestCase.java:141)
	at junit.framework.TestResult$1.protect(TestResult.java:122)
	at junit.framework.TestResult.runProtected(TestResult.java:142)
	at junit.framework.TestResult.run(TestResult.java:125)
	at junit.framework.TestCase.run(TestCase.java:129)
	at org.geotools.test.OnlineTestCase.run(OnlineTestCase.java:123)
	at junit.framework.TestSuite.runTest(TestSuite.java:255)
	at junit.framework.TestSuite.run(TestSuite.java:250)
	at org.junit.internal.runners.JUnit38ClassRunner.run(JUnit38ClassRunner.java:84)
	at org.apache.maven.surefire.junit4.JUnit4Provider.execute(JUnit4Provider.java:264)
	at org.apache.maven.surefire.junit4.JUnit4Provider.executeTestSet(JUnit4Provider.java:153)
	at org.apache.maven.surefire.junit4.JUnit4Provider.invoke(JUnit4Provider.java:124)
	at org.apache.maven.surefire.booter.ForkedBooter.invokeProviderInSameClassLoader(ForkedBooter.java:200)
	at org.apache.maven.surefire.booter.ForkedBooter.runSuitesInProcess(ForkedBooter.java:153)
	at org.apache.maven.surefire.booter.ForkedBooter.main(ForkedBooter.java:103)
Caused by: org.h2.jdbc.JdbcSQLException: Function HATBOX_MBR_INTERSECTS_ENV not found; SQL statement:
SELECT count(*) FROM "road" WHERE  ST_Intersects("geom",ST_GeomFromText('POLYGON ((2 3, 2 5, 4 5, 4 3, 2 3))', 4326)) AND "fid" IN (SELECT CAST(HATBOX_JOIN_ID AS INT) FROM HATBOX_MBR_INTERSECTS_ENV('PUBLIC', 'road', 2.0, 4.0, 3.0, 5.0)) [90022-119]
	at org.h2.message.Message.getSQLException(Message.java:106)
	at org.h2.message.Message.getSQLException(Message.java:117)
	at org.h2.message.Message.getSQLException(Message.java:76)
	at org.h2.command.Parser.readJavaFunction(Parser.java:1921)
	at org.h2.command.Parser.readFunction(Parser.java:1962)
	at org.h2.command.Parser.readTableFilter(Parser.java:972)
	at org.h2.command.Parser.parseSelectSimpleFromPart(Parser.java:1511)
	at org.h2.command.Parser.parseSelectSimple(Parser.java:1608)
	at org.h2.command.Parser.parseSelectSub(Parser.java:1505)
	at org.h2.command.Parser.parseSelectUnion(Parser.java:1350)
	at org.h2.command.Parser.parseSelect(Parser.java:1338)
	at org.h2.command.Parser.readCondition(Parser.java:1727)
	at org.h2.command.Parser.readAnd(Parser.java:1665)
	at org.h2.command.Parser.readExpression(Parser.java:1655)
	at org.h2.command.Parser.parseSelectSimple(Parser.java:1612)
	at org.h2.command.Parser.parseSelectSub(Parser.java:1505)
	at org.h2.command.Parser.parseSelectUnion(Parser.java:1350)
	at org.h2.command.Parser.parseSelect(Parser.java:1338)
	at org.h2.command.Parser.parsePrepared(Parser.java:395)
	at org.h2.command.Parser.parse(Parser.java:291)
	at org.h2.command.Parser.parse(Parser.java:263)
	at org.h2.command.Parser.prepareCommand(Parser.java:235)
	at org.h2.engine.Session.prepareLocal(Session.java:415)
	at org.h2.engine.Session.prepareCommand(Session.java:376)
	at org.h2.jdbc.JdbcConnection.prepareCommand(JdbcConnection.java:1049)
	at org.h2.jdbc.JdbcStatement.executeQuery(JdbcStatement.java:70)
	at org.apache.commons.dbcp.DelegatingStatement.executeQuery(DelegatingStatement.java:208)
	at org.apache.commons.dbcp.DelegatingStatement.executeQuery(DelegatingStatement.java:208)
	at org.apache.commons.dbcp.DelegatingStatement.executeQuery(DelegatingStatement.java:208)
	at org.geotools.jdbc.JDBCDataStore.getAggregateValue(JDBCDataStore.java:1483)
	at org.geotools.jdbc.JDBCDataStore.getCount(JDBCDataStore.java:1432)
	at org.geotools.jdbc.JDBCFeatureSource.getCountInternal(JDBCFeatureSource.java:463)
	at org.geotools.data.store.ContentFeatureSource.getCount(ContentFeatureSource.java:498)
	at org.geotools.jdbc.JDBCFeatureStore.getCountInternal(JDBCFeatureStore.java:184)
	at org.geotools.data.store.ContentFeatureSource.getCount(ContentFeatureSource.java:498)
	at org.geotools.data.store.ContentFeatureCollection.size(ContentFeatureCollection.java:236)
	at org.geotools.jdbc.JDBCSpatialFiltersOnlineTest.checkSingleResult(JDBCSpatialFiltersOnlineTest.java:202)
	at org.geotools.jdbc.JDBCSpatialFiltersOnlineTest.testBboxFilter(JDBCSpatialFiltersOnlineTest.java:92)
	at sun.reflect.NativeMethodAccessorImpl.invoke0(Native Method)
	at sun.reflect.NativeMethodAccessorImpl.invoke(NativeMethodAccessorImpl.java:62)
	at sun.reflect.DelegatingMethodAccessorImpl.invoke(DelegatingMethodAccessorImpl.java:43)
	at java.lang.reflect.Method.invoke(Method.java:498)
	at junit.framework.TestCase.runTest(TestCase.java:176)
	at junit.framework.TestCase.runBare(TestCase.java:141)
	at junit.framework.TestResult$1.protect(TestResult.java:122)
	at junit.framework.TestResult.runProtected(TestResult.java:142)
	at junit.framework.TestResult.run(TestResult.java:125)
	at junit.framework.TestCase.run(TestCase.java:129)
	at org.geotools.test.OnlineTestCase.run(OnlineTestCase.java:123)
	at junit.framework.TestSuite.runTest(TestSuite.java:255)
	at junit.framework.TestSuite.run(TestSuite.java:250)
	at org.junit.internal.runners.JUnit38ClassRunner.run(JUnit38ClassRunner.java:84)
	at org.apache.maven.surefire.junit4.JUnit4Provider.execute(JUnit4Provider.java:264)
	at org.apache.maven.surefire.junit4.JUnit4Provider.executeTestSet(JUnit4Provider.java:153)
	at org.apache.maven.surefire.junit4.JUnit4Provider.invoke(JUnit4Provider.java:124)
	at org.apache.maven.surefire.booter.ForkedBooter.invokeProviderInSameClassLoader(ForkedBooter.java:200)
	at org.apache.maven.surefire.booter.ForkedBooter.runSuitesInProcess(ForkedBooter.java:153)
	at org.apache.maven.surefire.booter.ForkedBooter.main(ForkedBooter.java:103)

Running org.geotools.data.h2.H2TemporalFilterTest
Tests run: 12, Failures: 0, Errors: 0, Skipped: 0, Time elapsed: 3.756 sec - in org.geotools.data.h2.H2TemporalFilterTest
Running org.geotools.data.h2.H2ThreeValuedLogicTest
Tests run: 4, Failures: 0, Errors: 0, Skipped: 0, Time elapsed: 0.984 sec - in org.geotools.data.h2.H2ThreeValuedLogicTest
Running org.geotools.data.h2.H2TypeNamesTest
Tests run: 1, Failures: 0, Errors: 0, Skipped: 0, Time elapsed: 0.402 sec - in org.geotools.data.h2.H2TypeNamesTest
Running org.geotools.data.h2.H2UDTTest
Tests run: 3, Failures: 0, Errors: 0, Skipped: 0, Time elapsed: 1.023 sec - in org.geotools.data.h2.H2UDTTest
Running org.geotools.data.h2.H2UuidTest
Tests run: 6, Failures: 0, Errors: 0, Skipped: 0, Time elapsed: 1.733 sec - in org.geotools.data.h2.H2UuidTest
Running org.geotools.data.h2.H2ViewTest
Tests run: 5, Failures: 0, Errors: 0, Skipped: 0, Time elapsed: 3.077 sec - in org.geotools.data.h2.H2ViewTest
Running org.geotools.data.h2.H2VirtualTableTest
2018-06-28T18:37:45.880-0400  WARNING  Could not find mapping for 'geom', ignoring the column and setting the feature type read only
2018-06-28T18:37:46.471-0400  WARNING  Could not find mapping for 'geom', ignoring the column and setting the feature type read only
2018-06-28T18:37:47.068-0400  WARNING  Could not find mapping for 'geom', ignoring the column and setting the feature type read only
2018-06-28T18:37:47.382-0400  WARNING  Could not find mapping for 'geom', ignoring the column and setting the feature type read only
2018-06-28T18:37:47.918-0400  WARNING  Could not find mapping for 'geom', ignoring the column and setting the feature type read only
2018-06-28T18:37:48.342-0400  WARNING  Could not find mapping for 'geom', ignoring the column and setting the feature type read only
2018-06-28T18:37:48.348-0400  SEVERE  Invalid value for parameter mul
java.lang.IllegalArgumentException: Value abc does not match [\d\.e\+-]+
	at org.geotools.jdbc.RegexpValidator.validate(RegexpValidator.java:45)
	at org.geotools.jdbc.VirtualTable.expandParameters(VirtualTable.java:201)
	at org.geotools.jdbc.JDBCDataStore.encodeAliasedTableName(JDBCDataStore.java:4442)
	at org.geotools.jdbc.JDBCDataStore.encodeTableName(JDBCDataStore.java:4431)
	at org.geotools.jdbc.JDBCDataStore.selectSQL(JDBCDataStore.java:3271)
	at org.geotools.jdbc.JDBCFeatureSource.getReaderInternal(JDBCFeatureSource.java:614)
	at org.geotools.data.store.ContentFeatureSource.getReader(ContentFeatureSource.java:647)
	at org.geotools.data.store.ContentFeatureCollection.features(ContentFeatureCollection.java:173)
	at org.geotools.data.store.ContentFeatureCollection.features(ContentFeatureCollection.java:58)
	at org.geotools.jdbc.JDBCVirtualTableOnlineTest.testMulParamInvalid(JDBCVirtualTableOnlineTest.java:265)
	at sun.reflect.NativeMethodAccessorImpl.invoke0(Native Method)
	at sun.reflect.NativeMethodAccessorImpl.invoke(NativeMethodAccessorImpl.java:62)
	at sun.reflect.DelegatingMethodAccessorImpl.invoke(DelegatingMethodAccessorImpl.java:43)
	at java.lang.reflect.Method.invoke(Method.java:498)
	at junit.framework.TestCase.runTest(TestCase.java:176)
	at junit.framework.TestCase.runBare(TestCase.java:141)
	at junit.framework.TestResult$1.protect(TestResult.java:122)
	at junit.framework.TestResult.runProtected(TestResult.java:142)
	at junit.framework.TestResult.run(TestResult.java:125)
	at junit.framework.TestCase.run(TestCase.java:129)
	at org.geotools.test.OnlineTestCase.run(OnlineTestCase.java:123)
	at junit.framework.TestSuite.runTest(TestSuite.java:255)
	at junit.framework.TestSuite.run(TestSuite.java:250)
	at org.junit.internal.runners.JUnit38ClassRunner.run(JUnit38ClassRunner.java:84)
	at org.apache.maven.surefire.junit4.JUnit4Provider.execute(JUnit4Provider.java:264)
	at org.apache.maven.surefire.junit4.JUnit4Provider.executeTestSet(JUnit4Provider.java:153)
	at org.apache.maven.surefire.junit4.JUnit4Provider.invoke(JUnit4Provider.java:124)
	at org.apache.maven.surefire.booter.ForkedBooter.invokeProviderInSameClassLoader(ForkedBooter.java:200)
	at org.apache.maven.surefire.booter.ForkedBooter.runSuitesInProcess(ForkedBooter.java:153)
	at org.apache.maven.surefire.booter.ForkedBooter.main(ForkedBooter.java:103)

2018-06-28T18:37:49.236-0400  WARNING  Could not find mapping for 'geom', ignoring the column and setting the feature type read only
2018-06-28T18:37:49.769-0400  WARNING  Could not find mapping for 'geom', ignoring the column and setting the feature type read only
2018-06-28T18:37:50.222-0400  WARNING  Could not find mapping for 'geom', ignoring the column and setting the feature type read only
2018-06-28T18:37:50.651-0400  WARNING  Could not find mapping for 'geom', ignoring the column and setting the feature type read only
2018-06-28T18:37:51.083-0400  WARNING  Could not find mapping for 'geom', ignoring the column and setting the feature type read only
2018-06-28T18:37:52.012-0400  WARNING  Could not find mapping for 'geom', ignoring the column and setting the feature type read only
2018-06-28T18:37:52.576-0400  WARNING  Could not find mapping for 'geom', ignoring the column and setting the feature type read only
Tests run: 13, Failures: 0, Errors: 0, Skipped: 0, Time elapsed: 7 sec - in org.geotools.data.h2.H2VirtualTableTest
Running org.geotools.data.h2.jndi.H2DataStoreTest
Tests run: 14, Failures: 0, Errors: 0, Skipped: 0, Time elapsed: 9.104 sec - in org.geotools.data.h2.jndi.H2DataStoreTest

Results :

Tests in error: 
  H2DistanceFiltersTest>OnlineTestCase.run:123->JDBCDistanceFiltersTest.testDWithinGeographicFeet:61->JDBCDistanceFiltersTest.assertDWithinFilter:121 » Runtime
  H2DistanceFiltersTest>OnlineTestCase.run:123->JDBCDistanceFiltersTest.testDWithinGeographicMile:52->JDBCDistanceFiltersTest.assertDWithinFilter:121 » Runtime
  H2DistanceFiltersTest>OnlineTestCase.run:123->JDBCDistanceFiltersTest.testDWithinGeographicMeter:43->JDBCDistanceFiltersTest.assertDWithinFilter:121 » Runtime
  H2DistanceFiltersTest>OnlineTestCase.run:123->JDBCDistanceFiltersTest.testDWithinGeographicKm:34->JDBCDistanceFiltersTest.assertDWithinFilter:121 » Runtime
  H2FeatureSourceExposePkTest>OnlineTestCase.run:123->JDBCFeatureSourceOnlineTest.testGetFeaturesWithLogicFilter:169 » Runtime
  H2FeatureSourceTest>OnlineTestCase.run:123->JDBCFeatureSourceOnlineTest.testGetFeaturesWithLogicFilter:169 » Runtime
  H2SpatialFiltersTest>OnlineTestCase.run:123->JDBCSpatialFiltersOnlineTest.testContainsFilter:157->JDBCSpatialFiltersOnlineTest.checkSingleResult:202 » Runtime
  H2SpatialFiltersTest>OnlineTestCase.run:123->JDBCSpatialFiltersOnlineTest.testGeometryCollection:233 » Runtime
  H2SpatialFiltersTest>OnlineTestCase.run:123->JDBCSpatialFiltersOnlineTest.testWithinFilter:175->JDBCSpatialFiltersOnlineTest.checkSingleResult:202 » Runtime
  H2SpatialFiltersTest>OnlineTestCase.run:123->JDBCSpatialFiltersOnlineTest.testIntersectsFilter:122->JDBCSpatialFiltersOnlineTest.checkSingleResult:202 » Runtime
  H2SpatialFiltersTest>OnlineTestCase.run:123->JDBCSpatialFiltersOnlineTest.testTouchesFilter:144->JDBCSpatialFiltersOnlineTest.checkSingleResult:202 » Runtime
  H2SpatialFiltersTest>OnlineTestCase.run:123->JDBCSpatialFiltersOnlineTest.testEqualsFilter:198->JDBCSpatialFiltersOnlineTest.checkSingleResult:202 » Runtime
  H2SpatialFiltersTest>OnlineTestCase.run:123->JDBCSpatialFiltersOnlineTest.testBboxFilterDefault:100->JDBCSpatialFiltersOnlineTest.checkSingleResult:202 » Runtime
  H2SpatialFiltersTest>OnlineTestCase.run:123->JDBCSpatialFiltersOnlineTest.testIntersectsRingFilter:133->JDBCSpatialFiltersOnlineTest.checkSingleResult:202 » Runtime
  H2SpatialFiltersTest>OnlineTestCase.run:123->JDBCSpatialFiltersOnlineTest.testCrossesFilter:111->JDBCSpatialFiltersOnlineTest.checkSingleResult:202 » Runtime
  H2SpatialFiltersTest>OnlineTestCase.run:123->JDBCSpatialFiltersOnlineTest.testBboxFilter:92->JDBCSpatialFiltersOnlineTest.checkSingleResult:202 » Runtime

Tests run: 335, Failures: 0, Errors: 16, Skipped: 0

[JENKINS] Recording test results
Started calculate disk usage of build
Finished Calculation of disk usage of build in 0 seconds
Started calculate disk usage of workspace
Finished Calculation of disk usage of workspace in 0 seconds
[INFO] ------------------------------------------------------------------------
[INFO] Reactor Summary:
[INFO] 
[INFO] GeoTools 19-SNAPSHOT ............................... SUCCESS [  3.757 s]
[INFO] Build tools for Geotools 2 ......................... SUCCESS [  0.228 s]
[INFO] Maven plugins for Geotools 2 ....................... SUCCESS [  0.255 s]
[INFO] JAR files collector ................................ SUCCESS [ 15.471 s]
[INFO] Cross-modules javadoc .............................. SUCCESS [  6.472 s]
[INFO] JJTree and JavaCC compilers plugin ................. SUCCESS [  1.522 s]
[INFO] Geotools modules ................................... SUCCESS [  0.203 s]
[INFO] Geotools libraries ................................. SUCCESS [  0.227 s]
[INFO] Open GIS Interfaces ................................ SUCCESS [ 13.232 s]
[INFO] Metadata ........................................... SUCCESS [ 11.081 s]
[INFO] Sample data module ................................. SUCCESS [  4.805 s]
[INFO] Referencing services ............................... SUCCESS [ 18.447 s]
[INFO] API interfaces ..................................... SUCCESS [  5.425 s]
[INFO] Geotools plugins ................................... SUCCESS [  0.195 s]
[INFO] EPSG Authority Service using HSQL database ......... SUCCESS [ 19.748 s]
[INFO] Main module ........................................ SUCCESS [ 18.100 s]
[INFO] Geotools extensions ................................ SUCCESS [  0.229 s]
[INFO] XML Parsing ........................................ SUCCESS [  0.105 s]
[INFO] XML Parsing ........................................ SUCCESS [  7.090 s]
[INFO] Feature Based Graphs and Networks .................. SUCCESS [  4.413 s]
[INFO] XML Code Generation Support ........................ SUCCESS [ 13.209 s]
[INFO] EPSG Authority Service using WKT file .............. SUCCESS [  3.673 s]
[INFO] OGC CQL to Filter parser ........................... SUCCESS [  7.739 s]
[INFO] Grid Coverage module ............................... SUCCESS [ 30.491 s]
[INFO] DataStore Support .................................. SUCCESS [ 12.964 s]
[INFO] Property File DataStore ............................ SUCCESS [  3.478 s]
[INFO] GeoTIFF grid coverage exchange module .............. SUCCESS [ 10.422 s]
[INFO] JDBC DataStore Support ............................. SUCCESS [  4.690 s]
[INFO] JDBC DataStore Plugins ............................. SUCCESS [  0.228 s]
[INFO] H2 DataStore ....................................... FAILURE [03:27 min]
[INFO] Oracle DataStore ................................... SKIPPED
[INFO] PostGIS DataStore .................................. SKIPPED
[INFO] Shapefile module ................................... SKIPPED
[INFO] Feature transforming feature source wrapper ........ SKIPPED
[INFO] WorldImage datasource module ....................... SKIPPED
[INFO] imagemosaic datasource module ...................... SKIPPED
[INFO] ArcGrid datasource module .......................... SKIPPED
[INFO] GML2 XML Support ................................... SKIPPED
[INFO] GML3 XML Support ................................... SKIPPED
[INFO] Filter XML Support ................................. SKIPPED
[INFO] SLD XML Support .................................... SKIPPED
[INFO] Render ............................................. SKIPPED
[INFO] OGC Web Service Models ............................. SKIPPED
[INFO] Xlink Model ........................................ SKIPPED
[INFO] Open Web Services Model ............................ SKIPPED
[INFO] Filter Encoding Specification Model ................ SKIPPED
[INFO] Web Feature Service Model .......................... SKIPPED
[INFO] OWS XML Support .................................... SKIPPED
[INFO] Filter Encoding Specification XML Support .......... SKIPPED
[INFO] WFS XML Support .................................... SKIPPED
[INFO] XML Parsing Support ................................ SKIPPED
[INFO] Web Processing Service Model ....................... SKIPPED
[INFO] Web Coverage Service Model ......................... SKIPPED
[INFO] Catalog Services for the Web Model ................. SKIPPED
[INFO] Web Map Tile Service model ......................... SKIPPED
[INFO] ArcSDE plugin ...................................... SKIPPED
[INFO] ArcSDE dummy api ................................... SKIPPED
[INFO] ArcSDE support classes ............................. SKIPPED
[INFO] ArcSDE DataStore plugin ............................ SKIPPED
[INFO] Dynamic symbolizer module based on JFreeChart and Eastwood SKIPPED
[INFO] Extensions to EPSG authority factory ............... SKIPPED
[INFO] EPSG Authority Service using PostgreSQL database ... SKIPPED
[INFO] Feature-Pregeneralized ............................. SKIPPED
[INFO] grass raster datasource module ..................... SKIPPED
[INFO] GTopo30 datasource module .......................... SKIPPED
[INFO] ImageI/O-Ext based grid coverage readers ........... SKIPPED
[INFO] imagepyramid datasource module ..................... SKIPPED
[INFO] imagemosaic-jdbc module ............................ SKIPPED
[INFO] DB2 DataStore ...................................... SKIPPED
[INFO] MySQL DataStore .................................... SKIPPED
[INFO] SQL Server DataStore ............................... SKIPPED
[INFO] SpatiaLite DataStore ............................... SKIPPED
[INFO] Teradata DataStore ................................. SKIPPED
[INFO] JP2K based grid coverage readers ................... SKIPPED
[INFO] OGR DataStore Module ............................... SKIPPED
[INFO] Core OGR DataStore Module .......................... SKIPPED
[INFO] Bridj OGR DataStore Module ......................... SKIPPED
[INFO] JNI OGR DataStore Module ........................... SKIPPED
[INFO] Vertical coordinate transformations ................ SKIPPED
[INFO] Dynamic symbolizers for SVG symbols ................ SKIPPED
[INFO] Coverage Multidimensional Module ................... SKIPPED
[INFO] API interfaces ..................................... SKIPPED
[INFO] NetCDF gridcoverage module ......................... SKIPPED
[INFO] GRIB gridcoverage module ........................... SKIPPED
[INFO] GeoPackage Module .................................. SKIPPED
[INFO] Application Schema Support ......................... SKIPPED
[INFO] Application Schema Resolver ........................ SKIPPED
[INFO] Complex Features Support ........................... SKIPPED
[INFO] Application Schema DataAccess ...................... SKIPPED
[INFO] Sample DataAccess .................................. SKIPPED
[INFO] Brewer module ...................................... SKIPPED
[INFO] Vector grids ....................................... SKIPPED
[INFO] Validation Processor and Framework ................. SKIPPED
[INFO] Web Map Server client .............................. SKIPPED
[INFO] Geotools unsupported ............................... SKIPPED
[INFO] Process ............................................ SKIPPED
[INFO] Swing widgets ...................................... SKIPPED
[INFO] Tile Client ........................................ SKIPPED
[INFO] WMTS XML Support ................................... SKIPPED
[INFO] Web Map Tile Service Client ........................ SKIPPED
[INFO] KML XML Support .................................... SKIPPED
[INFO] WCS XML Support .................................... SKIPPED
[INFO] WPS XML Support .................................... SKIPPED
[INFO] WMS XML Support .................................... SKIPPED
[INFO] CSW XML Support .................................... SKIPPED
[INFO] Process Feature .................................... SKIPPED
[INFO] Process Raster ..................................... SKIPPED
[INFO] YSLD Parser/Encoder ................................ SKIPPED
[INFO] SWT widgets ........................................ SKIPPED
[INFO] GeoJSON Support .................................... SKIPPED
[INFO] Process Geometry ................................... SKIPPED
[INFO] MBTiles Module ..................................... SKIPPED
[INFO] WFS client module (NG) 19-SNAPSHOT ................. SKIPPED
[INFO] ------------------------------------------------------------------------
[INFO] BUILD FAILURE
[INFO] ------------------------------------------------------------------------
[INFO] Total time: 07:32 min
[INFO] Finished at: 2018-06-28T18:38:10-04:00
[INFO] ------------------------------------------------------------------------
Waiting for Jenkins to finish collecting data
[ERROR] Failed to execute goal org.apache.maven.plugins:maven-surefire-plugin:2.15:test (default-test) on project gt-jdbc-h2: There are test failures.
[ERROR] 
[ERROR] Please refer to /home/hudson/genie.jts/.jenkins/jobs/GeoTools/workspace/modules/plugin/jdbc/jdbc-h2/target/surefire-reports for the individual test results.
[ERROR] -> [Help 1]
[ERROR] 
[ERROR] To see the full stack trace of the errors, re-run Maven with the -e switch.
[ERROR] Re-run Maven using the -X switch to enable full debug logging.
[ERROR] 
[ERROR] For more information about the errors and possible solutions, please read the following articles:
[ERROR] [Help 1] http://cwiki.apache.org/confluence/display/MAVEN/MojoFailureException
[ERROR] 
[ERROR] After correcting the problems, you can resume the build with the command
[JENKINS] Archiving /home/hudson/genie.jts/.jenkins/jobs/GeoTools/workspace/modules/ogc/net.opengis.wcs/pom.xml to org.geotools.ogc/net.opengis.wcs/19-SNAPSHOT/net.opengis.wcs-19-SNAPSHOT.pom
[ERROR]   mvn <goals> -rf :gt-jdbc-h2
[JENKINS] Archiving /home/hudson/genie.jts/.jenkins/jobs/GeoTools/workspace/modules/plugin/ogr/ogr-core/pom.xml to org.geotools/gt-ogr-core/19-SNAPSHOT/gt-ogr-core-19-SNAPSHOT.pom
[JENKINS] Archiving /home/hudson/genie.jts/.jenkins/jobs/GeoTools/workspace/build/maven/pom.xml to org.geotools.maven/maven/19-SNAPSHOT/maven-19-SNAPSHOT.pom
[JENKINS] Archiving /home/hudson/genie.jts/.jenkins/jobs/GeoTools/workspace/modules/plugin/referencing3D/pom.xml to org.geotools/gt-referencing3D/19-SNAPSHOT/gt-referencing3D-19-SNAPSHOT.pom
[JENKINS] Archiving /home/hudson/genie.jts/.jenkins/jobs/GeoTools/workspace/modules/ogc/org.w3.xlink/pom.xml to org.geotools.ogc/org.w3.xlink/19-SNAPSHOT/org.w3.xlink-19-SNAPSHOT.pom
[JENKINS] Archiving /home/hudson/genie.jts/.jenkins/jobs/GeoTools/workspace/modules/plugin/arcsde/common/pom.xml to org.geotools/gt-arcsde-common/19-SNAPSHOT/gt-arcsde-common-19-SNAPSHOT.pom
[JENKINS] Archiving /home/hudson/genie.jts/.jenkins/jobs/GeoTools/workspace/modules/plugin/imagemosaic-jdbc/pom.xml to org.geotools/gt-imagemosaic-jdbc/19-SNAPSHOT/gt-imagemosaic-jdbc-19-SNAPSHOT.pom
[JENKINS] Archiving /home/hudson/genie.jts/.jenkins/jobs/GeoTools/workspace/modules/library/xml/pom.xml to org.geotools/gt-xml/19-SNAPSHOT/gt-xml-19-SNAPSHOT.pom
[JENKINS] Archiving /home/hudson/genie.jts/.jenkins/jobs/GeoTools/workspace/build/maven/javadoc/pom.xml to org.geotools.maven/javadoc/19-SNAPSHOT/javadoc-19-SNAPSHOT.pom
[JENKINS] Archiving /home/hudson/genie.jts/.jenkins/jobs/GeoTools/workspace/build/maven/javadoc/target/javadoc-19-SNAPSHOT.jar to org.geotools.maven/javadoc/19-SNAPSHOT/javadoc-19-SNAPSHOT.jar
[JENKINS] Archiving /home/hudson/genie.jts/.jenkins/jobs/GeoTools/workspace/build/maven/javadoc/target/javadoc-19-SNAPSHOT-sources.jar to org.geotools.maven/javadoc/19-SNAPSHOT/javadoc-19-SNAPSHOT-sources.jar
[JENKINS] Archiving /home/hudson/genie.jts/.jenkins/jobs/GeoTools/workspace/modules/library/api/pom.xml to org.geotools/gt-api/19-SNAPSHOT/gt-api-19-SNAPSHOT.pom
[JENKINS] Archiving /home/hudson/genie.jts/.jenkins/jobs/GeoTools/workspace/modules/library/api/target/gt-api-19-SNAPSHOT.jar to org.geotools/gt-api/19-SNAPSHOT/gt-api-19-SNAPSHOT.jar
[JENKINS] Archiving /home/hudson/genie.jts/.jenkins/jobs/GeoTools/workspace/modules/library/api/target/gt-api-19-SNAPSHOT-sources.jar to org.geotools/gt-api/19-SNAPSHOT/gt-api-19-SNAPSHOT-sources.jar
[JENKINS] Archiving /home/hudson/genie.jts/.jenkins/jobs/GeoTools/workspace/modules/extension/xsd/xsd-sld/pom.xml to org.geotools.xsd/gt-xsd-sld/19-SNAPSHOT/gt-xsd-sld-19-SNAPSHOT.pom
[JENKINS] Archiving /home/hudson/genie.jts/.jenkins/jobs/GeoTools/workspace/modules/plugin/jdbc/jdbc-teradata/pom.xml to org.geotools.jdbc/gt-jdbc-teradata/19-SNAPSHOT/gt-jdbc-teradata-19-SNAPSHOT.pom
[JENKINS] Archiving /home/hudson/genie.jts/.jenkins/jobs/GeoTools/workspace/modules/extension/xsd/xsd-core/pom.xml to org.geotools.xsd/gt-xsd-core/19-SNAPSHOT/gt-xsd-core-19-SNAPSHOT.pom
[JENKINS] Archiving /home/hudson/genie.jts/.jenkins/jobs/GeoTools/workspace/modules/extension/xsd/xsd-core/target/gt-xsd-core-19-SNAPSHOT.jar to org.geotools.xsd/gt-xsd-core/19-SNAPSHOT/gt-xsd-core-19-SNAPSHOT.jar
[JENKINS] Archiving /home/hudson/genie.jts/.jenkins/jobs/GeoTools/workspace/modules/extension/xsd/xsd-core/target/gt-xsd-core-19-SNAPSHOT-sources.jar to org.geotools.xsd/gt-xsd-core/19-SNAPSHOT/gt-xsd-core-19-SNAPSHOT-sources.jar
[JENKINS] Archiving /home/hudson/genie.jts/.jenkins/jobs/GeoTools/workspace/modules/plugin/epsg-hsql/pom.xml to org.geotools/gt-epsg-hsql/19-SNAPSHOT/gt-epsg-hsql-19-SNAPSHOT.pom
[JENKINS] Archiving /home/hudson/genie.jts/.jenkins/jobs/GeoTools/workspace/modules/plugin/epsg-hsql/target/gt-epsg-hsql-19-SNAPSHOT.jar to org.geotools/gt-epsg-hsql/19-SNAPSHOT/gt-epsg-hsql-19-SNAPSHOT.jar
[JENKINS] Archiving /home/hudson/genie.jts/.jenkins/jobs/GeoTools/workspace/modules/plugin/epsg-hsql/target/gt-epsg-hsql-19-SNAPSHOT-sources.jar to org.geotools/gt-epsg-hsql/19-SNAPSHOT/gt-epsg-hsql-19-SNAPSHOT-sources.jar
[JENKINS] Archiving /home/hudson/genie.jts/.jenkins/jobs/GeoTools/workspace/modules/extension/xsd/xsd-wcs/pom.xml to org.geotools.xsd/gt-xsd-wcs/19-SNAPSHOT/gt-xsd-wcs-19-SNAPSHOT.pom
[JENKINS] Archiving /home/hudson/genie.jts/.jenkins/jobs/GeoTools/workspace/modules/extension/tile-client/pom.xml to org.geotools/gt-tile-client/19-SNAPSHOT/gt-tile-client-19-SNAPSHOT.pom
[JENKINS] Archiving /home/hudson/genie.jts/.jenkins/jobs/GeoTools/workspace/modules/plugin/jdbc/jdbc-spatialite/pom.xml to org.geotools.jdbc/gt-jdbc-spatialite/19-SNAPSHOT/gt-jdbc-spatialite-19-SNAPSHOT.pom
[JENKINS] Archiving /home/hudson/genie.jts/.jenkins/jobs/GeoTools/workspace/modules/unsupported/process-feature/pom.xml to org.geotools/gt-process-feature/19-SNAPSHOT/gt-process-feature-19-SNAPSHOT.pom
[JENKINS] Archiving /home/hudson/genie.jts/.jenkins/jobs/GeoTools/workspace/modules/ogc/net.opengis.csw/pom.xml to org.geotools.ogc/net.opengis.csw/19-SNAPSHOT/net.opengis.csw-19-SNAPSHOT.pom
[JENKINS] Archiving /home/hudson/genie.jts/.jenkins/jobs/GeoTools/workspace/modules/plugin/jdbc/jdbc-db2/pom.xml to org.geotools.jdbc/gt-jdbc-db2/19-SNAPSHOT/gt-jdbc-db2-19-SNAPSHOT.pom
[JENKINS] Archiving /home/hudson/genie.jts/.jenkins/jobs/GeoTools/workspace/modules/extension/xsd/xsd-gml2/pom.xml to org.geotools.xsd/gt-xsd-gml2/19-SNAPSHOT/gt-xsd-gml2-19-SNAPSHOT.pom
[JENKINS] Archiving /home/hudson/genie.jts/.jenkins/jobs/GeoTools/workspace/modules/plugin/coverage-multidim/coverage-api/pom.xml to org.geotools/gt-coverage-api/19-SNAPSHOT/gt-coverage-api-19-SNAPSHOT.pom
[JENKINS] Archiving /home/hudson/genie.jts/.jenkins/jobs/GeoTools/workspace/modules/extension/xsd/xsd-gml3/pom.xml to org.geotools.xsd/gt-xsd-gml3/19-SNAPSHOT/gt-xsd-gml3-19-SNAPSHOT.pom
[JENKINS] Archiving /home/hudson/genie.jts/.jenkins/jobs/GeoTools/workspace/modules/unsupported/process-geometry/pom.xml to org.geotools/gt-process-geometry/19-SNAPSHOT/gt-process-geometry-19-SNAPSHOT.pom
[JENKINS] Archiving /home/hudson/genie.jts/.jenkins/jobs/GeoTools/workspace/modules/unsupported/mbtiles/pom.xml to org.geotools/gt-mbtiles/19-SNAPSHOT/gt-mbtiles-19-SNAPSHOT.pom
[JENKINS] Archiving /home/hudson/genie.jts/.jenkins/jobs/GeoTools/workspace/modules/plugin/ogr/ogr-jni/pom.xml to org.geotools/gt-ogr-jni/19-SNAPSHOT/gt-ogr-jni-19-SNAPSHOT.pom
[JENKINS] Archiving /home/hudson/genie.jts/.jenkins/jobs/GeoTools/workspace/modules/library/pom.xml to org.geotools/library/19-SNAPSHOT/library-19-SNAPSHOT.pom
[JENKINS] Archiving /home/hudson/genie.jts/.jenkins/jobs/GeoTools/workspace/modules/plugin/epsg-extension/pom.xml to org.geotools/gt-epsg-extension/19-SNAPSHOT/gt-epsg-extension-19-SNAPSHOT.pom
[JENKINS] Archiving /home/hudson/genie.jts/.jenkins/jobs/GeoTools/workspace/modules/extension/xsd/xsd-kml/pom.xml to org.geotools.xsd/gt-xsd-kml/19-SNAPSHOT/gt-xsd-kml-19-SNAPSHOT.pom
[JENKINS] Archiving /home/hudson/genie.jts/.jenkins/jobs/GeoTools/workspace/modules/extension/complex/pom.xml to org.geotools/gt-complex/19-SNAPSHOT/gt-complex-19-SNAPSHOT.pom
[JENKINS] Archiving /home/hudson/genie.jts/.jenkins/jobs/GeoTools/workspace/modules/plugin/image/pom.xml to org.geotools/gt-image/19-SNAPSHOT/gt-image-19-SNAPSHOT.pom
[JENKINS] Archiving /home/hudson/genie.jts/.jenkins/jobs/GeoTools/workspace/modules/extension/transform/pom.xml to org.geotools/gt-transform/19-SNAPSHOT/gt-transform-19-SNAPSHOT.pom
[JENKINS] Archiving /home/hudson/genie.jts/.jenkins/jobs/GeoTools/workspace/modules/extension/xsd/xsd-wmts/pom.xml to org.geotools.xsd/gt-xsd-wmts/19-SNAPSHOT/gt-xsd-wmts-19-SNAPSHOT.pom
[JENKINS] Archiving /home/hudson/genie.jts/.jenkins/jobs/GeoTools/workspace/modules/plugin/arcsde/pom.xml to org.geotools/arcsde-plugin/19-SNAPSHOT/arcsde-plugin-19-SNAPSHOT.pom
[JENKINS] Archiving /home/hudson/genie.jts/.jenkins/jobs/GeoTools/workspace/modules/unsupported/process/pom.xml to org.geotools/gt-process/19-SNAPSHOT/gt-process-19-SNAPSHOT.pom
[JENKINS] Archiving /home/hudson/genie.jts/.jenkins/jobs/GeoTools/workspace/modules/plugin/jdbc/jdbc-h2/pom.xml to org.geotools.jdbc/gt-jdbc-h2/19-SNAPSHOT/gt-jdbc-h2-19-SNAPSHOT.pom
[JENKINS] Archiving /home/hudson/genie.jts/.jenkins/jobs/GeoTools/workspace/modules/library/sample-data/pom.xml to org.geotools/gt-sample-data/19-SNAPSHOT/gt-sample-data-19-SNAPSHOT.pom
[JENKINS] Archiving /home/hudson/genie.jts/.jenkins/jobs/GeoTools/workspace/modules/library/sample-data/target/gt-sample-data-19-SNAPSHOT.jar to org.geotools/gt-sample-data/19-SNAPSHOT/gt-sample-data-19-SNAPSHOT.jar
[JENKINS] Archiving /home/hudson/genie.jts/.jenkins/jobs/GeoTools/workspace/modules/library/sample-data/target/gt-sample-data-19-SNAPSHOT-sources.jar to org.geotools/gt-sample-data/19-SNAPSHOT/gt-sample-data-19-SNAPSHOT-sources.jar
[JENKINS] Archiving /home/hudson/genie.jts/.jenkins/jobs/GeoTools/workspace/modules/plugin/geopkg/pom.xml to org.geotools/gt-geopkg/19-SNAPSHOT/gt-geopkg-19-SNAPSHOT.pom
[JENKINS] Archiving /home/hudson/genie.jts/.jenkins/jobs/GeoTools/workspace/modules/plugin/pom.xml to org.geotools/plugin/19-SNAPSHOT/plugin-19-SNAPSHOT.pom
[JENKINS] Archiving /home/hudson/genie.jts/.jenkins/jobs/GeoTools/workspace/modules/extension/app-schema/pom.xml to org.geotools/app-schema/19-SNAPSHOT/app-schema-19-SNAPSHOT.pom
[JENKINS] Archiving /home/hudson/genie.jts/.jenkins/jobs/GeoTools/workspace/modules/unsupported/geojson/pom.xml to org.geotools/gt-geojson/19-SNAPSHOT/gt-geojson-19-SNAPSHOT.pom
[JENKINS] Archiving /home/hudson/genie.jts/.jenkins/jobs/GeoTools/workspace/modules/plugin/coverage-multidim/grib/pom.xml to org.geotools/gt-grib/19-SNAPSHOT/gt-grib-19-SNAPSHOT.pom
[JENKINS] Archiving /home/hudson/genie.jts/.jenkins/jobs/GeoTools/workspace/modules/plugin/arcgrid/pom.xml to org.geotools/gt-arcgrid/19-SNAPSHOT/gt-arcgrid-19-SNAPSHOT.pom
[JENKINS] Archiving /home/hudson/genie.jts/.jenkins/jobs/GeoTools/workspace/modules/plugin/coverage-multidim/pom.xml to org.geotools/gt-coverage-multidim/19-SNAPSHOT/gt-coverage-multidim-19-SNAPSHOT.pom
[JENKINS] Archiving /home/hudson/genie.jts/.jenkins/jobs/GeoTools/workspace/modules/extension/grid/pom.xml to org.geotools/gt-grid/19-SNAPSHOT/gt-grid-19-SNAPSHOT.pom
[JENKINS] Archiving /home/hudson/genie.jts/.jenkins/jobs/GeoTools/workspace/build/maven/jar-collector/pom.xml to org.geotools.maven/jar-collector/19-SNAPSHOT/jar-collector-19-SNAPSHOT.pom
[JENKINS] Archiving /home/hudson/genie.jts/.jenkins/jobs/GeoTools/workspace/build/maven/jar-collector/target/jar-collector-19-SNAPSHOT.jar to org.geotools.maven/jar-collector/19-SNAPSHOT/jar-collector-19-SNAPSHOT.jar
[JENKINS] Archiving /home/hudson/genie.jts/.jenkins/jobs/GeoTools/workspace/build/maven/jar-collector/target/jar-collector-19-SNAPSHOT-sources.jar to org.geotools.maven/jar-collector/19-SNAPSHOT/jar-collector-19-SNAPSHOT-sources.jar
[JENKINS] Archiving /home/hudson/genie.jts/.jenkins/jobs/GeoTools/workspace/build/pom.xml to org.geotools.maven/build/19-SNAPSHOT/build-19-SNAPSHOT.pom
[JENKINS] Archiving /home/hudson/genie.jts/.jenkins/jobs/GeoTools/workspace/modules/unsupported/swing/pom.xml to org.geotools/gt-swing/19-SNAPSHOT/gt-swing-19-SNAPSHOT.pom
[JENKINS] Archiving /home/hudson/genie.jts/.jenkins/jobs/GeoTools/workspace/modules/ogc/net.opengis.wmts/pom.xml to org.geotools.ogc/net.opengis.wmts/19-SNAPSHOT/net.opengis.wmts-19-SNAPSHOT.pom
[JENKINS] Archiving /home/hudson/genie.jts/.jenkins/jobs/GeoTools/workspace/build/maven/xmlcodegen/pom.xml to org.geotools.maven/xmlcodegen/19-SNAPSHOT/xmlcodegen-19-SNAPSHOT.pom
[JENKINS] Archiving /home/hudson/genie.jts/.jenkins/jobs/GeoTools/workspace/build/maven/xmlcodegen/target/xmlcodegen-19-SNAPSHOT.jar to org.geotools.maven/xmlcodegen/19-SNAPSHOT/xmlcodegen-19-SNAPSHOT.jar
[JENKINS] Archiving /home/hudson/genie.jts/.jenkins/jobs/GeoTools/workspace/build/maven/xmlcodegen/target/xmlcodegen-19-SNAPSHOT-sources.jar to org.geotools.maven/xmlcodegen/19-SNAPSHOT/xmlcodegen-19-SNAPSHOT-sources.jar
[JENKINS] Archiving /home/hudson/genie.jts/.jenkins/jobs/GeoTools/workspace/modules/extension/xsd/xsd-csw/pom.xml to org.geotools.xsd/gt-xsd-csw/19-SNAPSHOT/gt-xsd-csw-19-SNAPSHOT.pom
[JENKINS] Archiving /home/hudson/genie.jts/.jenkins/jobs/GeoTools/workspace/modules/plugin/geotiff/pom.xml to org.geotools/gt-geotiff/19-SNAPSHOT/gt-geotiff-19-SNAPSHOT.pom
[JENKINS] Archiving /home/hudson/genie.jts/.jenkins/jobs/GeoTools/workspace/modules/plugin/geotiff/target/gt-geotiff-19-SNAPSHOT.jar to org.geotools/gt-geotiff/19-SNAPSHOT/gt-geotiff-19-SNAPSHOT.jar
[JENKINS] Archiving /home/hudson/genie.jts/.jenkins/jobs/GeoTools/workspace/modules/plugin/geotiff/target/gt-geotiff-19-SNAPSHOT-sources.jar to org.geotools/gt-geotiff/19-SNAPSHOT/gt-geotiff-19-SNAPSHOT-sources.jar
[JENKINS] Archiving /home/hudson/genie.jts/.jenkins/jobs/GeoTools/workspace/modules/plugin/jdbc/jdbc-oracle/pom.xml to org.geotools.jdbc/gt-jdbc-oracle/19-SNAPSHOT/gt-jdbc-oracle-19-SNAPSHOT.pom
[JENKINS] Archiving /home/hudson/genie.jts/.jenkins/jobs/GeoTools/workspace/modules/plugin/imagemosaic/pom.xml to org.geotools/gt-imagemosaic/19-SNAPSHOT/gt-imagemosaic-19-SNAPSHOT.pom
[JENKINS] Archiving /home/hudson/genie.jts/.jenkins/jobs/GeoTools/workspace/modules/plugin/jp2k/pom.xml to org.geotools/gt-jp2k/19-SNAPSHOT/gt-jp2k-19-SNAPSHOT.pom
[JENKINS] Archiving /home/hudson/genie.jts/.jenkins/jobs/GeoTools/workspace/modules/plugin/imagepyramid/pom.xml to org.geotools/gt-imagepyramid/19-SNAPSHOT/gt-imagepyramid-19-SNAPSHOT.pom
[JENKINS] Archiving /home/hudson/genie.jts/.jenkins/jobs/GeoTools/workspace/modules/library/referencing/pom.xml to org.geotools/gt-referencing/19-SNAPSHOT/gt-referencing-19-SNAPSHOT.pom
[JENKINS] Archiving /home/hudson/genie.jts/.jenkins/jobs/GeoTools/workspace/modules/library/referencing/target/gt-referencing-19-SNAPSHOT.jar to org.geotools/gt-referencing/19-SNAPSHOT/gt-referencing-19-SNAPSHOT.jar
[JENKINS] Archiving /home/hudson/genie.jts/.jenkins/jobs/GeoTools/workspace/modules/library/referencing/target/gt-referencing-19-SNAPSHOT-tests.jar to org.geotools/gt-referencing/19-SNAPSHOT/gt-referencing-19-SNAPSHOT-tests.jar
[JENKINS] Archiving /home/hudson/genie.jts/.jenkins/jobs/GeoTools/workspace/modules/library/referencing/target/gt-referencing-19-SNAPSHOT-sources.jar to org.geotools/gt-referencing/19-SNAPSHOT/gt-referencing-19-SNAPSHOT-sources.jar
[JENKINS] Archiving /home/hudson/genie.jts/.jenkins/jobs/GeoTools/workspace/modules/library/opengis/pom.xml to org.geotools/gt-opengis/19-SNAPSHOT/gt-opengis-19-SNAPSHOT.pom
[JENKINS] Archiving /home/hudson/genie.jts/.jenkins/jobs/GeoTools/workspace/modules/library/opengis/target/gt-opengis-19-SNAPSHOT.jar to org.geotools/gt-opengis/19-SNAPSHOT/gt-opengis-19-SNAPSHOT.jar
[JENKINS] Archiving /home/hudson/genie.jts/.jenkins/jobs/GeoTools/workspace/modules/library/opengis/target/gt-opengis-19-SNAPSHOT-sources.jar to org.geotools/gt-opengis/19-SNAPSHOT/gt-opengis-19-SNAPSHOT-sources.jar
[JENKINS] Archiving /home/hudson/genie.jts/.jenkins/jobs/GeoTools/workspace/modules/plugin/epsg-wkt/pom.xml to org.geotools/gt-epsg-wkt/19-SNAPSHOT/gt-epsg-wkt-19-SNAPSHOT.pom
[JENKINS] Archiving /home/hudson/genie.jts/.jenkins/jobs/GeoTools/workspace/modules/plugin/epsg-wkt/target/gt-epsg-wkt-19-SNAPSHOT.jar to org.geotools/gt-epsg-wkt/19-SNAPSHOT/gt-epsg-wkt-19-SNAPSHOT.jar
[JENKINS] Archiving /home/hudson/genie.jts/.jenkins/jobs/GeoTools/workspace/modules/plugin/epsg-wkt/target/gt-epsg-wkt-19-SNAPSHOT-sources.jar to org.geotools/gt-epsg-wkt/19-SNAPSHOT/gt-epsg-wkt-19-SNAPSHOT-sources.jar
[JENKINS] Archiving /home/hudson/genie.jts/.jenkins/jobs/GeoTools/workspace/modules/library/metadata/pom.xml to org.geotools/gt-metadata/19-SNAPSHOT/gt-metadata-19-SNAPSHOT.pom
[JENKINS] Archiving /home/hudson/genie.jts/.jenkins/jobs/GeoTools/workspace/modules/library/metadata/target/gt-metadata-19-SNAPSHOT.jar to org.geotools/gt-metadata/19-SNAPSHOT/gt-metadata-19-SNAPSHOT.jar
[JENKINS] Archiving /home/hudson/genie.jts/.jenkins/jobs/GeoTools/workspace/modules/library/metadata/target/gt-metadata-19-SNAPSHOT-sources.jar to org.geotools/gt-metadata/19-SNAPSHOT/gt-metadata-19-SNAPSHOT-sources.jar
[JENKINS] Archiving /home/hudson/genie.jts/.jenkins/jobs/GeoTools/workspace/modules/plugin/jdbc/pom.xml to org.geotools.jdbc/gt-jdbc/19-SNAPSHOT/gt-jdbc-19-SNAPSHOT.pom
[JENKINS] Archiving /home/hudson/genie.jts/.jenkins/jobs/GeoTools/workspace/modules/extension/validation/pom.xml to org.geotools/gt-validation/19-SNAPSHOT/gt-validation-19-SNAPSHOT.pom
[JENKINS] Archiving /home/hudson/genie.jts/.jenkins/jobs/GeoTools/workspace/modules/unsupported/wfs-ng/pom.xml to org.geotools/gt-wfs-ng/19-SNAPSHOT/gt-wfs-ng-19-SNAPSHOT.pom
[JENKINS] Archiving /home/hudson/genie.jts/.jenkins/jobs/GeoTools/workspace/modules/ogc/pom.xml to org.geotools/ogc/19-SNAPSHOT/ogc-19-SNAPSHOT.pom
[JENKINS] Archiving /home/hudson/genie.jts/.jenkins/jobs/GeoTools/workspace/modules/extension/xsd/xsd-fes/pom.xml to org.geotools.xsd/gt-xsd-fes/19-SNAPSHOT/gt-xsd-fes-19-SNAPSHOT.pom
[JENKINS] Archiving /home/hudson/genie.jts/.jenkins/jobs/GeoTools/workspace/modules/ogc/net.opengis.fes/pom.xml to org.geotools.ogc/net.opengis.fes/19-SNAPSHOT/net.opengis.fes-19-SNAPSHOT.pom
[JENKINS] Archiving /home/hudson/genie.jts/.jenkins/jobs/GeoTools/workspace/modules/plugin/arcsde/datastore/pom.xml to org.geotools/gt-arcsde/19-SNAPSHOT/gt-arcsde-19-SNAPSHOT.pom
[JENKINS] Archiving /home/hudson/genie.jts/.jenkins/jobs/GeoTools/workspace/modules/plugin/ogr/pom.xml to org.geotools/gt-ogr/19-SNAPSHOT/gt-ogr-19-SNAPSHOT.pom
[JENKINS] Archiving /home/hudson/genie.jts/.jenkins/jobs/GeoTools/workspace/modules/extension/xsd/xsd-filter/pom.xml to org.geotools.xsd/gt-xsd-filter/19-SNAPSHOT/gt-xsd-filter-19-SNAPSHOT.pom
[JENKINS] Archiving /home/hudson/genie.jts/.jenkins/jobs/GeoTools/workspace/modules/extension/app-schema/app-schema/pom.xml to org.geotools/gt-app-schema/19-SNAPSHOT/gt-app-schema-19-SNAPSHOT.pom
[JENKINS] Archiving /home/hudson/genie.jts/.jenkins/jobs/GeoTools/workspace/modules/ogc/net.opengis.ows/pom.xml to org.geotools.ogc/net.opengis.ows/19-SNAPSHOT/net.opengis.ows-19-SNAPSHOT.pom
[JENKINS] Archiving /home/hudson/genie.jts/.jenkins/jobs/GeoTools/workspace/modules/extension/wmts/pom.xml to org.geotools/gt-wmts/19-SNAPSHOT/gt-wmts-19-SNAPSHOT.pom
[JENKINS] Archiving /home/hudson/genie.jts/.jenkins/jobs/GeoTools/workspace/modules/extension/ysld/pom.xml to org.geotools/gt-ysld/19-SNAPSHOT/gt-ysld-19-SNAPSHOT.pom
[JENKINS] Archiving /home/hudson/genie.jts/.jenkins/jobs/GeoTools/workspace/modules/plugin/shapefile/pom.xml to org.geotools/gt-shapefile/19-SNAPSHOT/gt-shapefile-19-SNAPSHOT.pom
[JENKINS] Archiving /home/hudson/genie.jts/.jenkins/jobs/GeoTools/workspace/modules/ogc/net.opengis.wfs/pom.xml to org.geotools.ogc/net.opengis.wfs/19-SNAPSHOT/net.opengis.wfs-19-SNAPSHOT.pom
[JENKINS] Archiving /home/hudson/genie.jts/.jenkins/jobs/GeoTools/workspace/modules/library/coverage/pom.xml to org.geotools/gt-coverage/19-SNAPSHOT/gt-coverage-19-SNAPSHOT.pom
[JENKINS] Archiving /home/hudson/genie.jts/.jenkins/jobs/GeoTools/workspace/modules/library/coverage/target/gt-coverage-19-SNAPSHOT.jar to org.geotools/gt-coverage/19-SNAPSHOT/gt-coverage-19-SNAPSHOT.jar
[JENKINS] Archiving /home/hudson/genie.jts/.jenkins/jobs/GeoTools/workspace/modules/library/coverage/target/gt-coverage-19-SNAPSHOT-sources.jar to org.geotools/gt-coverage/19-SNAPSHOT/gt-coverage-19-SNAPSHOT-sources.jar
[JENKINS] Archiving /home/hudson/genie.jts/.jenkins/jobs/GeoTools/workspace/modules/extension/xsd/xsd-wps/pom.xml to org.geotools.xsd/gt-xsd-wps/19-SNAPSHOT/gt-xsd-wps-19-SNAPSHOT.pom
[JENKINS] Archiving /home/hudson/genie.jts/.jenkins/jobs/GeoTools/workspace/pom.xml to org.geotools/geotools/19-SNAPSHOT/geotools-19-SNAPSHOT.pom
[JENKINS] Archiving /home/hudson/genie.jts/.jenkins/jobs/GeoTools/workspace/modules/library/jdbc/pom.xml to org.geotools/gt-jdbc/19-SNAPSHOT/gt-jdbc-19-SNAPSHOT.pom
[JENKINS] Archiving /home/hudson/genie.jts/.jenkins/jobs/GeoTools/workspace/modules/library/jdbc/target/gt-jdbc-19-SNAPSHOT.jar to org.geotools/gt-jdbc/19-SNAPSHOT/gt-jdbc-19-SNAPSHOT.jar
[JENKINS] Archiving /home/hudson/genie.jts/.jenkins/jobs/GeoTools/workspace/modules/library/jdbc/target/gt-jdbc-19-SNAPSHOT-tests.jar to org.geotools/gt-jdbc/19-SNAPSHOT/gt-jdbc-19-SNAPSHOT-tests.jar
[JENKINS] Archiving /home/hudson/genie.jts/.jenkins/jobs/GeoTools/workspace/modules/library/jdbc/target/gt-jdbc-19-SNAPSHOT-sources.jar to org.geotools/gt-jdbc/19-SNAPSHOT/gt-jdbc-19-SNAPSHOT-sources.jar
[JENKINS] Archiving /home/hudson/genie.jts/.jenkins/jobs/GeoTools/workspace/modules/extension/xsd/pom.xml to org.geotools.xsd/xsd/19-SNAPSHOT/xsd-19-SNAPSHOT.pom
[JENKINS] Archiving /home/hudson/genie.jts/.jenkins/jobs/GeoTools/workspace/build/maven/jjtree-javacc/pom.xml to org.geotools.maven/jjtree-javacc/19-SNAPSHOT/jjtree-javacc-19-SNAPSHOT.pom
[JENKINS] Archiving /home/hudson/genie.jts/.jenkins/jobs/GeoTools/workspace/build/maven/jjtree-javacc/target/jjtree-javacc-19-SNAPSHOT.jar to org.geotools.maven/jjtree-javacc/19-SNAPSHOT/jjtree-javacc-19-SNAPSHOT.jar
[JENKINS] Archiving /home/hudson/genie.jts/.jenkins/jobs/GeoTools/workspace/build/maven/jjtree-javacc/target/jjtree-javacc-19-SNAPSHOT-sources.jar to org.geotools.maven/jjtree-javacc/19-SNAPSHOT/jjtree-javacc-19-SNAPSHOT-sources.jar
[JENKINS] Archiving /home/hudson/genie.jts/.jenkins/jobs/GeoTools/workspace/modules/extension/app-schema/sample-data-access/pom.xml to org.geotools/gt-sample-data-access/19-SNAPSHOT/gt-sample-data-access-19-SNAPSHOT.pom
[JENKINS] Archiving /home/hudson/genie.jts/.jenkins/jobs/GeoTools/workspace/modules/plugin/charts/pom.xml to org.geotools/gt-charts/19-SNAPSHOT/gt-charts-19-SNAPSHOT.pom
[JENKINS] Archiving /home/hudson/genie.jts/.jenkins/jobs/GeoTools/workspace/modules/library/cql/pom.xml to org.geotools/gt-cql/19-SNAPSHOT/gt-cql-19-SNAPSHOT.pom
[JENKINS] Archiving /home/hudson/genie.jts/.jenkins/jobs/GeoTools/workspace/modules/library/cql/target/gt-cql-19-SNAPSHOT.jar to org.geotools/gt-cql/19-SNAPSHOT/gt-cql-19-SNAPSHOT.jar
[JENKINS] Archiving /home/hudson/genie.jts/.jenkins/jobs/GeoTools/workspace/modules/library/cql/target/gt-cql-19-SNAPSHOT-sources.jar to org.geotools/gt-cql/19-SNAPSHOT/gt-cql-19-SNAPSHOT-sources.jar
[JENKINS] Archiving /home/hudson/genie.jts/.jenkins/jobs/GeoTools/workspace/modules/plugin/jdbc/jdbc-sqlserver/pom.xml to org.geotools.jdbc/gt-jdbc-sqlserver/19-SNAPSHOT/gt-jdbc-sqlserver-19-SNAPSHOT.pom
[JENKINS] Archiving /home/hudson/genie.jts/.jenkins/jobs/GeoTools/workspace/modules/extension/app-schema/app-schema-resolver/pom.xml to org.geotools/gt-app-schema-resolver/19-SNAPSHOT/gt-app-schema-resolver-19-SNAPSHOT.pom
[JENKINS] Archiving /home/hudson/genie.jts/.jenkins/jobs/GeoTools/workspace/modules/unsupported/pom.xml to org.geotools/unsupported/19-SNAPSHOT/unsupported-19-SNAPSHOT.pom
[JENKINS] Archiving /home/hudson/genie.jts/.jenkins/jobs/GeoTools/workspace/modules/plugin/jdbc/jdbc-postgis/pom.xml to org.geotools.jdbc/gt-jdbc-postgis/19-SNAPSHOT/gt-jdbc-postgis-19-SNAPSHOT.pom
[JENKINS] Archiving /home/hudson/genie.jts/.jenkins/jobs/GeoTools/workspace/modules/library/data/pom.xml to org.geotools/gt-data/19-SNAPSHOT/gt-data-19-SNAPSHOT.pom
[JENKINS] Archiving /home/hudson/genie.jts/.jenkins/jobs/GeoTools/workspace/modules/library/data/target/gt-data-19-SNAPSHOT.jar to org.geotools/gt-data/19-SNAPSHOT/gt-data-19-SNAPSHOT.jar
[JENKINS] Archiving /home/hudson/genie.jts/.jenkins/jobs/GeoTools/workspace/modules/library/data/target/gt-data-19-SNAPSHOT-sources.jar to org.geotools/gt-data/19-SNAPSHOT/gt-data-19-SNAPSHOT-sources.jar
[JENKINS] Archiving /home/hudson/genie.jts/.jenkins/jobs/GeoTools/workspace/modules/plugin/jdbc/jdbc-mysql/pom.xml to org.geotools.jdbc/gt-jdbc-mysql/19-SNAPSHOT/gt-jdbc-mysql-19-SNAPSHOT.pom
[JENKINS] Archiving /home/hudson/genie.jts/.jenkins/jobs/GeoTools/workspace/modules/plugin/svg/pom.xml to org.geotools/gt-svg/19-SNAPSHOT/gt-svg-19-SNAPSHOT.pom
[JENKINS] Archiving /home/hudson/genie.jts/.jenkins/jobs/GeoTools/workspace/modules/extension/xsd/xsd-wms/pom.xml to org.geotools.xsd/gt-xsd-wms/19-SNAPSHOT/gt-xsd-wms-19-SNAPSHOT.pom
[JENKINS] Archiving /home/hudson/genie.jts/.jenkins/jobs/GeoTools/workspace/modules/plugin/epsg-postgresql/pom.xml to org.geotools/gt-epsg-postgresql/19-SNAPSHOT/gt-epsg-postgresql-19-SNAPSHOT.pom
[JENKINS] Archiving /home/hudson/genie.jts/.jenkins/jobs/GeoTools/workspace/modules/extension/brewer/pom.xml to org.geotools/gt-brewer/19-SNAPSHOT/gt-brewer-19-SNAPSHOT.pom
[JENKINS] Archiving /home/hudson/genie.jts/.jenkins/jobs/GeoTools/workspace/modules/plugin/coverage-multidim/netcdf/pom.xml to org.geotools/gt-netcdf/19-SNAPSHOT/gt-netcdf-19-SNAPSHOT.pom
[JENKINS] Archiving /home/hudson/genie.jts/.jenkins/jobs/GeoTools/workspace/modules/plugin/imageio-ext-gdal/pom.xml to org.geotools/gt-imageio-ext-gdal/19-SNAPSHOT/gt-imageio-ext-gdal-19-SNAPSHOT.pom
[JENKINS] Archiving /home/hudson/genie.jts/.jenkins/jobs/GeoTools/workspace/modules/plugin/ogr/ogr-bridj/pom.xml to org.geotools/gt-ogr-bridj/19-SNAPSHOT/gt-ogr-bridj-19-SNAPSHOT.pom
[JENKINS] Archiving /home/hudson/genie.jts/.jenkins/jobs/GeoTools/workspace/modules/pom.xml to org.geotools/modules/19-SNAPSHOT/modules-19-SNAPSHOT.pom
[JENKINS] Archiving /home/hudson/genie.jts/.jenkins/jobs/GeoTools/workspace/modules/extension/graph/pom.xml to org.geotools/gt-graph/19-SNAPSHOT/gt-graph-19-SNAPSHOT.pom
[JENKINS] Archiving /home/hudson/genie.jts/.jenkins/jobs/GeoTools/workspace/modules/extension/graph/target/gt-graph-19-SNAPSHOT.jar to org.geotools/gt-graph/19-SNAPSHOT/gt-graph-19-SNAPSHOT.jar
[JENKINS] Archiving /home/hudson/genie.jts/.jenkins/jobs/GeoTools/workspace/modules/extension/graph/target/gt-graph-19-SNAPSHOT-sources.jar to org.geotools/gt-graph/19-SNAPSHOT/gt-graph-19-SNAPSHOT-sources.jar
[JENKINS] Archiving /home/hudson/genie.jts/.jenkins/jobs/GeoTools/workspace/modules/unsupported/process-raster/pom.xml to org.geotools/gt-process-raster/19-SNAPSHOT/gt-process-raster-19-SNAPSHOT.pom
[JENKINS] Archiving /home/hudson/genie.jts/.jenkins/jobs/GeoTools/workspace/modules/extension/wms/pom.xml to org.geotools/gt-wms/19-SNAPSHOT/gt-wms-19-SNAPSHOT.pom
[JENKINS] Archiving /home/hudson/genie.jts/.jenkins/jobs/GeoTools/workspace/modules/plugin/arcsde/sde-dummy/pom.xml to org.geotools/gt-sde-dummy/19-SNAPSHOT/gt-sde-dummy-19-SNAPSHOT.pom
[JENKINS] Archiving /home/hudson/genie.jts/.jenkins/jobs/GeoTools/workspace/modules/extension/pom.xml to org.geotools/extension/19-SNAPSHOT/extension-19-SNAPSHOT.pom
[JENKINS] Archiving /home/hudson/genie.jts/.jenkins/jobs/GeoTools/workspace/modules/plugin/grassraster/pom.xml to org.geotools/gt-grassraster/19-SNAPSHOT/gt-grassraster-19-SNAPSHOT.pom
[JENKINS] Archiving /home/hudson/genie.jts/.jenkins/jobs/GeoTools/workspace/modules/library/render/pom.xml to org.geotools/gt-render/19-SNAPSHOT/gt-render-19-SNAPSHOT.pom
[JENKINS] Archiving /home/hudson/genie.jts/.jenkins/jobs/GeoTools/workspace/modules/ogc/net.opengis.wps/pom.xml to org.geotools.ogc/net.opengis.wps/19-SNAPSHOT/net.opengis.wps-19-SNAPSHOT.pom
[JENKINS] Archiving /home/hudson/genie.jts/.jenkins/jobs/GeoTools/workspace/modules/unsupported/swt/pom.xml to org.geotools/gt-swt/19-SNAPSHOT/gt-swt-19-SNAPSHOT.pom
[JENKINS] Archiving /home/hudson/genie.jts/.jenkins/jobs/GeoTools/workspace/modules/plugin/feature-pregeneralized/pom.xml to org.geotools/gt-feature-pregeneralized/19-SNAPSHOT/gt-feature-pregeneralized-19-SNAPSHOT.pom
[JENKINS] Archiving /home/hudson/genie.jts/.jenkins/jobs/GeoTools/workspace/modules/plugin/gtopo30/pom.xml to org.geotools/gt-gtopo30/19-SNAPSHOT/gt-gtopo30-19-SNAPSHOT.pom
[JENKINS] Archiving /home/hudson/genie.jts/.jenkins/jobs/GeoTools/workspace/modules/plugin/property/pom.xml to org.geotools/gt-property/19-SNAPSHOT/gt-property-19-SNAPSHOT.pom
[JENKINS] Archiving /home/hudson/genie.jts/.jenkins/jobs/GeoTools/workspace/modules/plugin/property/target/gt-property-19-SNAPSHOT.jar to org.geotools/gt-property/19-SNAPSHOT/gt-property-19-SNAPSHOT.jar
[JENKINS] Archiving /home/hudson/genie.jts/.jenkins/jobs/GeoTools/workspace/modules/plugin/property/target/gt-property-19-SNAPSHOT-sources.jar to org.geotools/gt-property/19-SNAPSHOT/gt-property-19-SNAPSHOT-sources.jar
[JENKINS] Archiving /home/hudson/genie.jts/.jenkins/jobs/GeoTools/workspace/modules/extension/xsd/xsd-ows/pom.xml to org.geotools.xsd/gt-xsd-ows/19-SNAPSHOT/gt-xsd-ows-19-SNAPSHOT.pom
[JENKINS] Archiving /home/hudson/genie.jts/.jenkins/jobs/GeoTools/workspace/modules/library/main/pom.xml to org.geotools/gt-main/19-SNAPSHOT/gt-main-19-SNAPSHOT.pom
[JENKINS] Archiving /home/hudson/genie.jts/.jenkins/jobs/GeoTools/workspace/modules/library/main/target/gt-main-19-SNAPSHOT.jar to org.geotools/gt-main/19-SNAPSHOT/gt-main-19-SNAPSHOT.jar
[JENKINS] Archiving /home/hudson/genie.jts/.jenkins/jobs/GeoTools/workspace/modules/library/main/target/gt-main-19-SNAPSHOT-tests.jar to org.geotools/gt-main/19-SNAPSHOT/gt-main-19-SNAPSHOT-tests.jar
[JENKINS] Archiving /home/hudson/genie.jts/.jenkins/jobs/GeoTools/workspace/modules/library/main/target/gt-main-19-SNAPSHOT-sources.jar to org.geotools/gt-main/19-SNAPSHOT/gt-main-19-SNAPSHOT-sources.jar
[JENKINS] Archiving /home/hudson/genie.jts/.jenkins/jobs/GeoTools/workspace/modules/extension/xsd/xsd-wfs/pom.xml to org.geotools.xsd/gt-xsd-wfs/19-SNAPSHOT/gt-xsd-wfs-19-SNAPSHOT.pom
channel stopped
Started calculate disk usage of build
Finished Calculation of disk usage of build in 0 seconds
Started calculate disk usage of workspace
Finished Calculation of disk usage of workspace in 0 seconds
Finished: FAILURE