FailedConsole Output

Skipping 1,655 KB.. Full Log
.run(TestResult.java:125)
	at junit.framework.TestCase.run(TestCase.java:129)
	at org.geotools.test.OnlineTestCase.run(OnlineTestCase.java:123)
	at junit.framework.TestSuite.runTest(TestSuite.java:255)
	at junit.framework.TestSuite.run(TestSuite.java:250)
	at org.junit.internal.runners.JUnit38ClassRunner.run(JUnit38ClassRunner.java:84)
	at org.apache.maven.surefire.junit4.JUnit4Provider.execute(JUnit4Provider.java:264)
	at org.apache.maven.surefire.junit4.JUnit4Provider.executeTestSet(JUnit4Provider.java:153)
	at org.apache.maven.surefire.junit4.JUnit4Provider.invoke(JUnit4Provider.java:124)
	at org.apache.maven.surefire.booter.ForkedBooter.invokeProviderInSameClassLoader(ForkedBooter.java:200)
	at org.apache.maven.surefire.booter.ForkedBooter.runSuitesInProcess(ForkedBooter.java:153)
	at org.apache.maven.surefire.booter.ForkedBooter.main(ForkedBooter.java:103)

testRiverReducedSchema(org.geotools.data.h2.H2VirtualTableTest)  Time elapsed: 0.016 sec  <<< ERROR!
java.lang.NullPointerException: null
	at org.geotools.jdbc.JDBCVirtualTableOnlineTest.testRiverReducedSchema(JDBCVirtualTableOnlineTest.java:129)
	at sun.reflect.NativeMethodAccessorImpl.invoke0(Native Method)
	at sun.reflect.NativeMethodAccessorImpl.invoke(NativeMethodAccessorImpl.java:62)
	at sun.reflect.DelegatingMethodAccessorImpl.invoke(DelegatingMethodAccessorImpl.java:43)
	at java.lang.reflect.Method.invoke(Method.java:498)
	at junit.framework.TestCase.runTest(TestCase.java:176)
	at junit.framework.TestCase.runBare(TestCase.java:141)
	at junit.framework.TestResult$1.protect(TestResult.java:122)
	at junit.framework.TestResult.runProtected(TestResult.java:142)
	at junit.framework.TestResult.run(TestResult.java:125)
	at junit.framework.TestCase.run(TestCase.java:129)
	at org.geotools.test.OnlineTestCase.run(OnlineTestCase.java:123)
	at junit.framework.TestSuite.runTest(TestSuite.java:255)
	at junit.framework.TestSuite.run(TestSuite.java:250)
	at org.junit.internal.runners.JUnit38ClassRunner.run(JUnit38ClassRunner.java:84)
	at org.apache.maven.surefire.junit4.JUnit4Provider.execute(JUnit4Provider.java:264)
	at org.apache.maven.surefire.junit4.JUnit4Provider.executeTestSet(JUnit4Provider.java:153)
	at org.apache.maven.surefire.junit4.JUnit4Provider.invoke(JUnit4Provider.java:124)
	at org.apache.maven.surefire.booter.ForkedBooter.invokeProviderInSameClassLoader(ForkedBooter.java:200)
	at org.apache.maven.surefire.booter.ForkedBooter.runSuitesInProcess(ForkedBooter.java:153)
	at org.apache.maven.surefire.booter.ForkedBooter.main(ForkedBooter.java:103)

testJoinViews(org.geotools.data.h2.H2VirtualTableTest)  Time elapsed: 0.01 sec  <<< ERROR!
java.lang.NullPointerException: null
	at org.geotools.jdbc.JDBCVirtualTableOnlineTest.testJoinViews(JDBCVirtualTableOnlineTest.java:344)
	at sun.reflect.NativeMethodAccessorImpl.invoke0(Native Method)
	at sun.reflect.NativeMethodAccessorImpl.invoke(NativeMethodAccessorImpl.java:62)
	at sun.reflect.DelegatingMethodAccessorImpl.invoke(DelegatingMethodAccessorImpl.java:43)
	at java.lang.reflect.Method.invoke(Method.java:498)
	at junit.framework.TestCase.runTest(TestCase.java:176)
	at junit.framework.TestCase.runBare(TestCase.java:141)
	at junit.framework.TestResult$1.protect(TestResult.java:122)
	at junit.framework.TestResult.runProtected(TestResult.java:142)
	at junit.framework.TestResult.run(TestResult.java:125)
	at junit.framework.TestCase.run(TestCase.java:129)
	at org.geotools.test.OnlineTestCase.run(OnlineTestCase.java:123)
	at junit.framework.TestSuite.runTest(TestSuite.java:255)
	at junit.framework.TestSuite.run(TestSuite.java:250)
	at org.junit.internal.runners.JUnit38ClassRunner.run(JUnit38ClassRunner.java:84)
	at org.apache.maven.surefire.junit4.JUnit4Provider.execute(JUnit4Provider.java:264)
	at org.apache.maven.surefire.junit4.JUnit4Provider.executeTestSet(JUnit4Provider.java:153)
	at org.apache.maven.surefire.junit4.JUnit4Provider.invoke(JUnit4Provider.java:124)
	at org.apache.maven.surefire.booter.ForkedBooter.invokeProviderInSameClassLoader(ForkedBooter.java:200)
	at org.apache.maven.surefire.booter.ForkedBooter.runSuitesInProcess(ForkedBooter.java:153)
	at org.apache.maven.surefire.booter.ForkedBooter.main(ForkedBooter.java:103)

testGetFeatureId(org.geotools.data.h2.H2VirtualTableTest)  Time elapsed: 0.008 sec  <<< ERROR!
java.lang.NullPointerException: null
	at org.geotools.jdbc.JDBCVirtualTableOnlineTest.testGetFeatureId(JDBCVirtualTableOnlineTest.java:193)
	at sun.reflect.NativeMethodAccessorImpl.invoke0(Native Method)
	at sun.reflect.NativeMethodAccessorImpl.invoke(NativeMethodAccessorImpl.java:62)
	at sun.reflect.DelegatingMethodAccessorImpl.invoke(DelegatingMethodAccessorImpl.java:43)
	at java.lang.reflect.Method.invoke(Method.java:498)
	at junit.framework.TestCase.runTest(TestCase.java:176)
	at junit.framework.TestCase.runBare(TestCase.java:141)
	at junit.framework.TestResult$1.protect(TestResult.java:122)
	at junit.framework.TestResult.runProtected(TestResult.java:142)
	at junit.framework.TestResult.run(TestResult.java:125)
	at junit.framework.TestCase.run(TestCase.java:129)
	at org.geotools.test.OnlineTestCase.run(OnlineTestCase.java:123)
	at junit.framework.TestSuite.runTest(TestSuite.java:255)
	at junit.framework.TestSuite.run(TestSuite.java:250)
	at org.junit.internal.runners.JUnit38ClassRunner.run(JUnit38ClassRunner.java:84)
	at org.apache.maven.surefire.junit4.JUnit4Provider.execute(JUnit4Provider.java:264)
	at org.apache.maven.surefire.junit4.JUnit4Provider.executeTestSet(JUnit4Provider.java:153)
	at org.apache.maven.surefire.junit4.JUnit4Provider.invoke(JUnit4Provider.java:124)
	at org.apache.maven.surefire.booter.ForkedBooter.invokeProviderInSameClassLoader(ForkedBooter.java:200)
	at org.apache.maven.surefire.booter.ForkedBooter.runSuitesInProcess(ForkedBooter.java:153)
	at org.apache.maven.surefire.booter.ForkedBooter.main(ForkedBooter.java:103)

testBounds(org.geotools.data.h2.H2VirtualTableTest)  Time elapsed: 0.008 sec  <<< ERROR!
java.lang.NullPointerException: null
	at org.geotools.jdbc.JDBCVirtualTableOnlineTest.testBounds(JDBCVirtualTableOnlineTest.java:174)
	at sun.reflect.NativeMethodAccessorImpl.invoke0(Native Method)
	at sun.reflect.NativeMethodAccessorImpl.invoke(NativeMethodAccessorImpl.java:62)
	at sun.reflect.DelegatingMethodAccessorImpl.invoke(DelegatingMethodAccessorImpl.java:43)
	at java.lang.reflect.Method.invoke(Method.java:498)
	at junit.framework.TestCase.runTest(TestCase.java:176)
	at junit.framework.TestCase.runBare(TestCase.java:141)
	at junit.framework.TestResult$1.protect(TestResult.java:122)
	at junit.framework.TestResult.runProtected(TestResult.java:142)
	at junit.framework.TestResult.run(TestResult.java:125)
	at junit.framework.TestCase.run(TestCase.java:129)
	at org.geotools.test.OnlineTestCase.run(OnlineTestCase.java:123)
	at junit.framework.TestSuite.runTest(TestSuite.java:255)
	at junit.framework.TestSuite.run(TestSuite.java:250)
	at org.junit.internal.runners.JUnit38ClassRunner.run(JUnit38ClassRunner.java:84)
	at org.apache.maven.surefire.junit4.JUnit4Provider.execute(JUnit4Provider.java:264)
	at org.apache.maven.surefire.junit4.JUnit4Provider.executeTestSet(JUnit4Provider.java:153)
	at org.apache.maven.surefire.junit4.JUnit4Provider.invoke(JUnit4Provider.java:124)
	at org.apache.maven.surefire.booter.ForkedBooter.invokeProviderInSameClassLoader(ForkedBooter.java:200)
	at org.apache.maven.surefire.booter.ForkedBooter.runSuitesInProcess(ForkedBooter.java:153)
	at org.apache.maven.surefire.booter.ForkedBooter.main(ForkedBooter.java:103)

testInvalidQuery(org.geotools.data.h2.H2VirtualTableTest)  Time elapsed: 0.007 sec  <<< ERROR!
java.lang.NullPointerException: null
	at org.geotools.jdbc.JDBCVirtualTableOnlineTest.testInvalidQuery(JDBCVirtualTableOnlineTest.java:180)
	at sun.reflect.NativeMethodAccessorImpl.invoke0(Native Method)
	at sun.reflect.NativeMethodAccessorImpl.invoke(NativeMethodAccessorImpl.java:62)
	at sun.reflect.DelegatingMethodAccessorImpl.invoke(DelegatingMethodAccessorImpl.java:43)
	at java.lang.reflect.Method.invoke(Method.java:498)
	at junit.framework.TestCase.runTest(TestCase.java:176)
	at junit.framework.TestCase.runBare(TestCase.java:141)
	at junit.framework.TestResult$1.protect(TestResult.java:122)
	at junit.framework.TestResult.runProtected(TestResult.java:142)
	at junit.framework.TestResult.run(TestResult.java:125)
	at junit.framework.TestCase.run(TestCase.java:129)
	at org.geotools.test.OnlineTestCase.run(OnlineTestCase.java:123)
	at junit.framework.TestSuite.runTest(TestSuite.java:255)
	at junit.framework.TestSuite.run(TestSuite.java:250)
	at org.junit.internal.runners.JUnit38ClassRunner.run(JUnit38ClassRunner.java:84)
	at org.apache.maven.surefire.junit4.JUnit4Provider.execute(JUnit4Provider.java:264)
	at org.apache.maven.surefire.junit4.JUnit4Provider.executeTestSet(JUnit4Provider.java:153)
	at org.apache.maven.surefire.junit4.JUnit4Provider.invoke(JUnit4Provider.java:124)
	at org.apache.maven.surefire.booter.ForkedBooter.invokeProviderInSameClassLoader(ForkedBooter.java:200)
	at org.apache.maven.surefire.booter.ForkedBooter.runSuitesInProcess(ForkedBooter.java:153)
	at org.apache.maven.surefire.booter.ForkedBooter.main(ForkedBooter.java:103)

testGetFeatureById(org.geotools.data.h2.H2VirtualTableTest)  Time elapsed: 0.009 sec  <<< ERROR!
java.lang.NullPointerException: null
	at org.geotools.jdbc.JDBCVirtualTableOnlineTest.testGetFeatureById(JDBCVirtualTableOnlineTest.java:207)
	at sun.reflect.NativeMethodAccessorImpl.invoke0(Native Method)
	at sun.reflect.NativeMethodAccessorImpl.invoke(NativeMethodAccessorImpl.java:62)
	at sun.reflect.DelegatingMethodAccessorImpl.invoke(DelegatingMethodAccessorImpl.java:43)
	at java.lang.reflect.Method.invoke(Method.java:498)
	at junit.framework.TestCase.runTest(TestCase.java:176)
	at junit.framework.TestCase.runBare(TestCase.java:141)
	at junit.framework.TestResult$1.protect(TestResult.java:122)
	at junit.framework.TestResult.runProtected(TestResult.java:142)
	at junit.framework.TestResult.run(TestResult.java:125)
	at junit.framework.TestCase.run(TestCase.java:129)
	at org.geotools.test.OnlineTestCase.run(OnlineTestCase.java:123)
	at junit.framework.TestSuite.runTest(TestSuite.java:255)
	at junit.framework.TestSuite.run(TestSuite.java:250)
	at org.junit.internal.runners.JUnit38ClassRunner.run(JUnit38ClassRunner.java:84)
	at org.apache.maven.surefire.junit4.JUnit4Provider.execute(JUnit4Provider.java:264)
	at org.apache.maven.surefire.junit4.JUnit4Provider.executeTestSet(JUnit4Provider.java:153)
	at org.apache.maven.surefire.junit4.JUnit4Provider.invoke(JUnit4Provider.java:124)
	at org.apache.maven.surefire.booter.ForkedBooter.invokeProviderInSameClassLoader(ForkedBooter.java:200)
	at org.apache.maven.surefire.booter.ForkedBooter.runSuitesInProcess(ForkedBooter.java:153)
	at org.apache.maven.surefire.booter.ForkedBooter.main(ForkedBooter.java:103)

Running org.geotools.data.h2.jndi.H2DataStoreTest
org.h2.jdbc.JdbcSQLException: Exception calling user-defined function; SQL statement:
CALL CreateSpatialIndex('geotools', 'ft1', 'geometry', 4326) [90105-119]
	at org.h2.message.Message.getSQLException(Message.java:106)
	at org.h2.message.Message.convert(Message.java:279)
	at org.h2.engine.FunctionAlias$JavaMethod.getValue(FunctionAlias.java:306)
	at org.h2.expression.JavaFunction.getValue(JavaFunction.java:38)
	at org.h2.command.dml.Call.query(Call.java:61)
	at org.h2.command.CommandContainer.query(CommandContainer.java:82)
	at org.h2.command.Command.executeQueryLocal(Command.java:142)
	at org.h2.command.Command.executeQuery(Command.java:123)
	at org.h2.jdbc.JdbcStatement.execute(JdbcStatement.java:158)
	at org.apache.commons.dbcp.DelegatingStatement.execute(DelegatingStatement.java:264)
	at org.apache.commons.dbcp.DelegatingStatement.execute(DelegatingStatement.java:264)
	at org.apache.commons.dbcp.DelegatingStatement.execute(DelegatingStatement.java:264)
	at org.geotools.jdbc.JDBCTestSetup.run(JDBCTestSetup.java:156)
	at org.geotools.jdbc.JDBCTestSetup.run(JDBCTestSetup.java:127)
	at org.geotools.data.h2.H2TestSetup.setUpData(H2TestSetup.java:78)
	at org.geotools.jdbc.JDBCDelegatingTestSetup.setUpData(JDBCDelegatingTestSetup.java:72)
	at org.geotools.jdbc.JDBCTestSupport.connect(JDBCTestSupport.java:133)
	at org.geotools.test.OnlineTestCase.setUp(OnlineTestCase.java:243)
	at junit.framework.TestCase.runBare(TestCase.java:139)
	at junit.framework.TestResult$1.protect(TestResult.java:122)
	at junit.framework.TestResult.runProtected(TestResult.java:142)
	at junit.framework.TestResult.run(TestResult.java:125)
	at junit.framework.TestCase.run(TestCase.java:129)
	at org.geotools.test.OnlineTestCase.run(OnlineTestCase.java:123)
	at junit.framework.TestSuite.runTest(TestSuite.java:255)
	at junit.framework.TestSuite.run(TestSuite.java:250)
	at org.junit.internal.runners.JUnit38ClassRunner.run(JUnit38ClassRunner.java:84)
	at org.apache.maven.surefire.junit4.JUnit4Provider.execute(JUnit4Provider.java:264)
	at org.apache.maven.surefire.junit4.JUnit4Provider.executeTestSet(JUnit4Provider.java:153)
	at org.apache.maven.surefire.junit4.JUnit4Provider.invoke(JUnit4Provider.java:124)
	at org.apache.maven.surefire.booter.ForkedBooter.invokeProviderInSameClassLoader(ForkedBooter.java:200)
	at org.apache.maven.surefire.booter.ForkedBooter.runSuitesInProcess(ForkedBooter.java:153)
	at org.apache.maven.surefire.booter.ForkedBooter.main(ForkedBooter.java:103)
Caused by: java.lang.reflect.InvocationTargetException
	at sun.reflect.GeneratedMethodAccessor5.invoke(Unknown Source)
	at sun.reflect.DelegatingMethodAccessorImpl.invoke(DelegatingMethodAccessorImpl.java:43)
	at java.lang.reflect.Method.invoke(Method.java:498)
	at org.h2.engine.FunctionAlias$JavaMethod.getValue(FunctionAlias.java:299)
	... 30 more
Caused by: java.lang.NoClassDefFoundError: com/vividsolutions/jts/geom/Geometry
	at net.sourceforge.hatbox.tools.CmdLine.spatialize(CmdLine.java:249)
	at geodb.GeoDB.CreateSpatialIndex(GeoDB.java:1063)
	... 34 more
Caused by: java.lang.ClassNotFoundException: com.vividsolutions.jts.geom.Geometry
	at java.net.URLClassLoader.findClass(URLClassLoader.java:381)
	at java.lang.ClassLoader.loadClass(ClassLoader.java:424)
	at sun.misc.Launcher$AppClassLoader.loadClass(Launcher.java:338)
	at java.lang.ClassLoader.loadClass(ClassLoader.java:357)
	... 36 more
org.h2.jdbc.JdbcSQLException: Exception calling user-defined function; SQL statement:
CALL CreateSpatialIndex('geotools', 'ft1', 'geometry', 4326) [90105-119]
	at org.h2.message.Message.getSQLException(Message.java:106)
	at org.h2.message.Message.convert(Message.java:279)
	at org.h2.engine.FunctionAlias$JavaMethod.getValue(FunctionAlias.java:306)
	at org.h2.expression.JavaFunction.getValue(JavaFunction.java:38)
	at org.h2.command.dml.Call.query(Call.java:61)
	at org.h2.command.CommandContainer.query(CommandContainer.java:82)
	at org.h2.command.Command.executeQueryLocal(Command.java:142)
	at org.h2.command.Command.executeQuery(Command.java:123)
	at org.h2.jdbc.JdbcStatement.execute(JdbcStatement.java:158)
	at org.apache.commons.dbcp.DelegatingStatement.execute(DelegatingStatement.java:264)
	at org.apache.commons.dbcp.DelegatingStatement.execute(DelegatingStatement.java:264)
	at org.apache.commons.dbcp.DelegatingStatement.execute(DelegatingStatement.java:264)
	at org.geotools.jdbc.JDBCTestSetup.run(JDBCTestSetup.java:156)
	at org.geotools.jdbc.JDBCTestSetup.run(JDBCTestSetup.java:127)
	at org.geotools.data.h2.H2TestSetup.setUpData(H2TestSetup.java:78)
	at org.geotools.jdbc.JDBCDelegatingTestSetup.setUpData(JDBCDelegatingTestSetup.java:72)
	at org.geotools.jdbc.JDBCTestSupport.connect(JDBCTestSupport.java:133)
	at org.geotools.test.OnlineTestCase.setUp(OnlineTestCase.java:243)
	at junit.framework.TestCase.runBare(TestCase.java:139)
	at junit.framework.TestResult$1.protect(TestResult.java:122)
	at junit.framework.TestResult.runProtected(TestResult.java:142)
	at junit.framework.TestResult.run(TestResult.java:125)
	at junit.framework.TestCase.run(TestCase.java:129)
	at org.geotools.test.OnlineTestCase.run(OnlineTestCase.java:123)
	at junit.framework.TestSuite.runTest(TestSuite.java:255)
	at junit.framework.TestSuite.run(TestSuite.java:250)
	at org.junit.internal.runners.JUnit38ClassRunner.run(JUnit38ClassRunner.java:84)
	at org.apache.maven.surefire.junit4.JUnit4Provider.execute(JUnit4Provider.java:264)
	at org.apache.maven.surefire.junit4.JUnit4Provider.executeTestSet(JUnit4Provider.java:153)
	at org.apache.maven.surefire.junit4.JUnit4Provider.invoke(JUnit4Provider.java:124)
	at org.apache.maven.surefire.booter.ForkedBooter.invokeProviderInSameClassLoader(ForkedBooter.java:200)
	at org.apache.maven.surefire.booter.ForkedBooter.runSuitesInProcess(ForkedBooter.java:153)
	at org.apache.maven.surefire.booter.ForkedBooter.main(ForkedBooter.java:103)
Caused by: java.lang.reflect.InvocationTargetException
	at sun.reflect.GeneratedMethodAccessor5.invoke(Unknown Source)
	at sun.reflect.DelegatingMethodAccessorImpl.invoke(DelegatingMethodAccessorImpl.java:43)
	at java.lang.reflect.Method.invoke(Method.java:498)
	at org.h2.engine.FunctionAlias$JavaMethod.getValue(FunctionAlias.java:299)
	... 30 more
Caused by: java.lang.NoClassDefFoundError: com/vividsolutions/jts/geom/Geometry
	at net.sourceforge.hatbox.tools.CmdLine.spatialize(CmdLine.java:249)
	at geodb.GeoDB.CreateSpatialIndex(GeoDB.java:1063)
	... 34 more
Caused by: java.lang.ClassNotFoundException: com.vividsolutions.jts.geom.Geometry
	at java.net.URLClassLoader.findClass(URLClassLoader.java:381)
	at java.lang.ClassLoader.loadClass(ClassLoader.java:424)
	at sun.misc.Launcher$AppClassLoader.loadClass(Launcher.java:338)
	at java.lang.ClassLoader.loadClass(ClassLoader.java:357)
	... 36 more
org.h2.jdbc.JdbcSQLException: Exception calling user-defined function; SQL statement:
CALL CreateSpatialIndex('geotools', 'ft1', 'geometry', 4326) [90105-119]
	at org.h2.message.Message.getSQLException(Message.java:106)
	at org.h2.message.Message.convert(Message.java:279)
	at org.h2.engine.FunctionAlias$JavaMethod.getValue(FunctionAlias.java:306)
	at org.h2.expression.JavaFunction.getValue(JavaFunction.java:38)
	at org.h2.command.dml.Call.query(Call.java:61)
	at org.h2.command.CommandContainer.query(CommandContainer.java:82)
	at org.h2.command.Command.executeQueryLocal(Command.java:142)
	at org.h2.command.Command.executeQuery(Command.java:123)
	at org.h2.jdbc.JdbcStatement.execute(JdbcStatement.java:158)
	at org.apache.commons.dbcp.DelegatingStatement.execute(DelegatingStatement.java:264)
	at org.apache.commons.dbcp.DelegatingStatement.execute(DelegatingStatement.java:264)
	at org.apache.commons.dbcp.DelegatingStatement.execute(DelegatingStatement.java:264)
	at org.geotools.jdbc.JDBCTestSetup.run(JDBCTestSetup.java:156)
	at org.geotools.jdbc.JDBCTestSetup.run(JDBCTestSetup.java:127)
	at org.geotools.data.h2.H2TestSetup.setUpData(H2TestSetup.java:78)
	at org.geotools.jdbc.JDBCDelegatingTestSetup.setUpData(JDBCDelegatingTestSetup.java:72)
	at org.geotools.jdbc.JDBCTestSupport.connect(JDBCTestSupport.java:133)
	at org.geotools.test.OnlineTestCase.setUp(OnlineTestCase.java:243)
	at junit.framework.TestCase.runBare(TestCase.java:139)
	at junit.framework.TestResult$1.protect(TestResult.java:122)
	at junit.framework.TestResult.runProtected(TestResult.java:142)
	at junit.framework.TestResult.run(TestResult.java:125)
	at junit.framework.TestCase.run(TestCase.java:129)
	at org.geotools.test.OnlineTestCase.run(OnlineTestCase.java:123)
	at junit.framework.TestSuite.runTest(TestSuite.java:255)
	at junit.framework.TestSuite.run(TestSuite.java:250)
	at org.junit.internal.runners.JUnit38ClassRunner.run(JUnit38ClassRunner.java:84)
	at org.apache.maven.surefire.junit4.JUnit4Provider.execute(JUnit4Provider.java:264)
	at org.apache.maven.surefire.junit4.JUnit4Provider.executeTestSet(JUnit4Provider.java:153)
	at org.apache.maven.surefire.junit4.JUnit4Provider.invoke(JUnit4Provider.java:124)
	at org.apache.maven.surefire.booter.ForkedBooter.invokeProviderInSameClassLoader(ForkedBooter.java:200)
	at org.apache.maven.surefire.booter.ForkedBooter.runSuitesInProcess(ForkedBooter.java:153)
	at org.apache.maven.surefire.booter.ForkedBooter.main(ForkedBooter.java:103)
Caused by: java.lang.reflect.InvocationTargetException
	at sun.reflect.GeneratedMethodAccessor5.invoke(Unknown Source)
	at sun.reflect.DelegatingMethodAccessorImpl.invoke(DelegatingMethodAccessorImpl.java:43)
	at java.lang.reflect.Method.invoke(Method.java:498)
	at org.h2.engine.FunctionAlias$JavaMethod.getValue(FunctionAlias.java:299)
	... 30 more
Caused by: java.lang.NoClassDefFoundError: com/vividsolutions/jts/geom/Geometry
	at net.sourceforge.hatbox.tools.CmdLine.spatialize(CmdLine.java:249)
	at geodb.GeoDB.CreateSpatialIndex(GeoDB.java:1063)
	... 34 more
Caused by: java.lang.ClassNotFoundException: com.vividsolutions.jts.geom.Geometry
	at java.net.URLClassLoader.findClass(URLClassLoader.java:381)
	at java.lang.ClassLoader.loadClass(ClassLoader.java:424)
	at sun.misc.Launcher$AppClassLoader.loadClass(Launcher.java:338)
	at java.lang.ClassLoader.loadClass(ClassLoader.java:357)
	... 36 more
org.h2.jdbc.JdbcSQLException: Exception calling user-defined function; SQL statement:
CALL CreateSpatialIndex('geotools', 'ft1', 'geometry', 4326) [90105-119]
	at org.h2.message.Message.getSQLException(Message.java:106)
	at org.h2.message.Message.convert(Message.java:279)
	at org.h2.engine.FunctionAlias$JavaMethod.getValue(FunctionAlias.java:306)
	at org.h2.expression.JavaFunction.getValue(JavaFunction.java:38)
	at org.h2.command.dml.Call.query(Call.java:61)
	at org.h2.command.CommandContainer.query(CommandContainer.java:82)
	at org.h2.command.Command.executeQueryLocal(Command.java:142)
	at org.h2.command.Command.executeQuery(Command.java:123)
	at org.h2.jdbc.JdbcStatement.execute(JdbcStatement.java:158)
	at org.apache.commons.dbcp.DelegatingStatement.execute(DelegatingStatement.java:264)
	at org.apache.commons.dbcp.DelegatingStatement.execute(DelegatingStatement.java:264)
	at org.apache.commons.dbcp.DelegatingStatement.execute(DelegatingStatement.java:264)
	at org.geotools.jdbc.JDBCTestSetup.run(JDBCTestSetup.java:156)
	at org.geotools.jdbc.JDBCTestSetup.run(JDBCTestSetup.java:127)
	at org.geotools.data.h2.H2TestSetup.setUpData(H2TestSetup.java:78)
	at org.geotools.jdbc.JDBCDelegatingTestSetup.setUpData(JDBCDelegatingTestSetup.java:72)
	at org.geotools.jdbc.JDBCTestSupport.connect(JDBCTestSupport.java:133)
	at org.geotools.test.OnlineTestCase.setUp(OnlineTestCase.java:243)
	at junit.framework.TestCase.runBare(TestCase.java:139)
	at junit.framework.TestResult$1.protect(TestResult.java:122)
	at junit.framework.TestResult.runProtected(TestResult.java:142)
	at junit.framework.TestResult.run(TestResult.java:125)
	at junit.framework.TestCase.run(TestCase.java:129)
	at org.geotools.test.OnlineTestCase.run(OnlineTestCase.java:123)
	at junit.framework.TestSuite.runTest(TestSuite.java:255)
	at junit.framework.TestSuite.run(TestSuite.java:250)
	at org.junit.internal.runners.JUnit38ClassRunner.run(JUnit38ClassRunner.java:84)
	at org.apache.maven.surefire.junit4.JUnit4Provider.execute(JUnit4Provider.java:264)
	at org.apache.maven.surefire.junit4.JUnit4Provider.executeTestSet(JUnit4Provider.java:153)
	at org.apache.maven.surefire.junit4.JUnit4Provider.invoke(JUnit4Provider.java:124)
	at org.apache.maven.surefire.booter.ForkedBooter.invokeProviderInSameClassLoader(ForkedBooter.java:200)
	at org.apache.maven.surefire.booter.ForkedBooter.runSuitesInProcess(ForkedBooter.java:153)
	at org.apache.maven.surefire.booter.ForkedBooter.main(ForkedBooter.java:103)
Caused by: java.lang.reflect.InvocationTargetException
	at sun.reflect.GeneratedMethodAccessor5.invoke(Unknown Source)
	at sun.reflect.DelegatingMethodAccessorImpl.invoke(DelegatingMethodAccessorImpl.java:43)
	at java.lang.reflect.Method.invoke(Method.java:498)
	at org.h2.engine.FunctionAlias$JavaMethod.getValue(FunctionAlias.java:299)
	... 30 more
Caused by: java.lang.NoClassDefFoundError: com/vividsolutions/jts/geom/Geometry
	at net.sourceforge.hatbox.tools.CmdLine.spatialize(CmdLine.java:249)
	at geodb.GeoDB.CreateSpatialIndex(GeoDB.java:1063)
	... 34 more
Caused by: java.lang.ClassNotFoundException: com.vividsolutions.jts.geom.Geometry
	at java.net.URLClassLoader.findClass(URLClassLoader.java:381)
	at java.lang.ClassLoader.loadClass(ClassLoader.java:424)
	at sun.misc.Launcher$AppClassLoader.loadClass(Launcher.java:338)
	at java.lang.ClassLoader.loadClass(ClassLoader.java:357)
	... 36 more
org.h2.jdbc.JdbcSQLException: Exception calling user-defined function; SQL statement:
CALL CreateSpatialIndex('geotools', 'ft1', 'geometry', 4326) [90105-119]
	at org.h2.message.Message.getSQLException(Message.java:106)
	at org.h2.message.Message.convert(Message.java:279)
	at org.h2.engine.FunctionAlias$JavaMethod.getValue(FunctionAlias.java:306)
	at org.h2.expression.JavaFunction.getValue(JavaFunction.java:38)
	at org.h2.command.dml.Call.query(Call.java:61)
	at org.h2.command.CommandContainer.query(CommandContainer.java:82)
	at org.h2.command.Command.executeQueryLocal(Command.java:142)
	at org.h2.command.Command.executeQuery(Command.java:123)
	at org.h2.jdbc.JdbcStatement.execute(JdbcStatement.java:158)
	at org.apache.commons.dbcp.DelegatingStatement.execute(DelegatingStatement.java:264)
	at org.apache.commons.dbcp.DelegatingStatement.execute(DelegatingStatement.java:264)
	at org.apache.commons.dbcp.DelegatingStatement.execute(DelegatingStatement.java:264)
	at org.geotools.jdbc.JDBCTestSetup.run(JDBCTestSetup.java:156)
	at org.geotools.jdbc.JDBCTestSetup.run(JDBCTestSetup.java:127)
	at org.geotools.data.h2.H2TestSetup.setUpData(H2TestSetup.java:78)
	at org.geotools.jdbc.JDBCDelegatingTestSetup.setUpData(JDBCDelegatingTestSetup.java:72)
	at org.geotools.jdbc.JDBCTestSupport.connect(JDBCTestSupport.java:133)
	at org.geotools.test.OnlineTestCase.setUp(OnlineTestCase.java:243)
	at junit.framework.TestCase.runBare(TestCase.java:139)
	at junit.framework.TestResult$1.protect(TestResult.java:122)
	at junit.framework.TestResult.runProtected(TestResult.java:142)
	at junit.framework.TestResult.run(TestResult.java:125)
	at junit.framework.TestCase.run(TestCase.java:129)
	at org.geotools.test.OnlineTestCase.run(OnlineTestCase.java:123)
	at junit.framework.TestSuite.runTest(TestSuite.java:255)
	at junit.framework.TestSuite.run(TestSuite.java:250)
	at org.junit.internal.runners.JUnit38ClassRunner.run(JUnit38ClassRunner.java:84)
	at org.apache.maven.surefire.junit4.JUnit4Provider.execute(JUnit4Provider.java:264)
	at org.apache.maven.surefire.junit4.JUnit4Provider.executeTestSet(JUnit4Provider.java:153)
	at org.apache.maven.surefire.junit4.JUnit4Provider.invoke(JUnit4Provider.java:124)
	at org.apache.maven.surefire.booter.ForkedBooter.invokeProviderInSameClassLoader(ForkedBooter.java:200)
	at org.apache.maven.surefire.booter.ForkedBooter.runSuitesInProcess(ForkedBooter.java:153)
	at org.apache.maven.surefire.booter.ForkedBooter.main(ForkedBooter.java:103)
Caused by: java.lang.reflect.InvocationTargetException
	at sun.reflect.GeneratedMethodAccessor5.invoke(Unknown Source)
	at sun.reflect.DelegatingMethodAccessorImpl.invoke(DelegatingMethodAccessorImpl.java:43)
	at java.lang.reflect.Method.invoke(Method.java:498)
	at org.h2.engine.FunctionAlias$JavaMethod.getValue(FunctionAlias.java:299)
	... 30 more
Caused by: java.lang.NoClassDefFoundError: com/vividsolutions/jts/geom/Geometry
	at net.sourceforge.hatbox.tools.CmdLine.spatialize(CmdLine.java:249)
	at geodb.GeoDB.CreateSpatialIndex(GeoDB.java:1063)
	... 34 more
Caused by: java.lang.ClassNotFoundException: com.vividsolutions.jts.geom.Geometry
	at java.net.URLClassLoader.findClass(URLClassLoader.java:381)
	at java.lang.ClassLoader.loadClass(ClassLoader.java:424)
	at sun.misc.Launcher$AppClassLoader.loadClass(Launcher.java:338)
	at java.lang.ClassLoader.loadClass(ClassLoader.java:357)
	... 36 more
org.h2.jdbc.JdbcSQLException: Exception calling user-defined function; SQL statement:
CALL CreateSpatialIndex('geotools', 'ft1', 'geometry', 4326) [90105-119]
	at org.h2.message.Message.getSQLException(Message.java:106)
	at org.h2.message.Message.convert(Message.java:279)
	at org.h2.engine.FunctionAlias$JavaMethod.getValue(FunctionAlias.java:306)
	at org.h2.expression.JavaFunction.getValue(JavaFunction.java:38)
	at org.h2.command.dml.Call.query(Call.java:61)
	at org.h2.command.CommandContainer.query(CommandContainer.java:82)
	at org.h2.command.Command.executeQueryLocal(Command.java:142)
	at org.h2.command.Command.executeQuery(Command.java:123)
	at org.h2.jdbc.JdbcStatement.execute(JdbcStatement.java:158)
	at org.apache.commons.dbcp.DelegatingStatement.execute(DelegatingStatement.java:264)
	at org.apache.commons.dbcp.DelegatingStatement.execute(DelegatingStatement.java:264)
	at org.apache.commons.dbcp.DelegatingStatement.execute(DelegatingStatement.java:264)
	at org.geotools.jdbc.JDBCTestSetup.run(JDBCTestSetup.java:156)
	at org.geotools.jdbc.JDBCTestSetup.run(JDBCTestSetup.java:127)
	at org.geotools.data.h2.H2TestSetup.setUpData(H2TestSetup.java:78)
	at org.geotools.jdbc.JDBCDelegatingTestSetup.setUpData(JDBCDelegatingTestSetup.java:72)
	at org.geotools.jdbc.JDBCTestSupport.connect(JDBCTestSupport.java:133)
	at org.geotools.test.OnlineTestCase.setUp(OnlineTestCase.java:243)
	at junit.framework.TestCase.runBare(TestCase.java:139)
	at junit.framework.TestResult$1.protect(TestResult.java:122)
	at junit.framework.TestResult.runProtected(TestResult.java:142)
	at junit.framework.TestResult.run(TestResult.java:125)
	at junit.framework.TestCase.run(TestCase.java:129)
	at org.geotools.test.OnlineTestCase.run(OnlineTestCase.java:123)
	at junit.framework.TestSuite.runTest(TestSuite.java:255)
	at junit.framework.TestSuite.run(TestSuite.java:250)
	at org.junit.internal.runners.JUnit38ClassRunner.run(JUnit38ClassRunner.java:84)
	at org.apache.maven.surefire.junit4.JUnit4Provider.execute(JUnit4Provider.java:264)
	at org.apache.maven.surefire.junit4.JUnit4Provider.executeTestSet(JUnit4Provider.java:153)
	at org.apache.maven.surefire.junit4.JUnit4Provider.invoke(JUnit4Provider.java:124)
	at org.apache.maven.surefire.booter.ForkedBooter.invokeProviderInSameClassLoader(ForkedBooter.java:200)
	at org.apache.maven.surefire.booter.ForkedBooter.runSuitesInProcess(ForkedBooter.java:153)
	at org.apache.maven.surefire.booter.ForkedBooter.main(ForkedBooter.java:103)
Caused by: java.lang.reflect.InvocationTargetException
	at sun.reflect.GeneratedMethodAccessor5.invoke(Unknown Source)
	at sun.reflect.DelegatingMethodAccessorImpl.invoke(DelegatingMethodAccessorImpl.java:43)
	at java.lang.reflect.Method.invoke(Method.java:498)
	at org.h2.engine.FunctionAlias$JavaMethod.getValue(FunctionAlias.java:299)
	... 30 more
Caused by: java.lang.NoClassDefFoundError: com/vividsolutions/jts/geom/Geometry
	at net.sourceforge.hatbox.tools.CmdLine.spatialize(CmdLine.java:249)
	at geodb.GeoDB.CreateSpatialIndex(GeoDB.java:1063)
	... 34 more
Caused by: java.lang.ClassNotFoundException: com.vividsolutions.jts.geom.Geometry
	at java.net.URLClassLoader.findClass(URLClassLoader.java:381)
	at java.lang.ClassLoader.loadClass(ClassLoader.java:424)
	at sun.misc.Launcher$AppClassLoader.loadClass(Launcher.java:338)
	at java.lang.ClassLoader.loadClass(ClassLoader.java:357)
	... 36 more
org.h2.jdbc.JdbcSQLException: Exception calling user-defined function; SQL statement:
CALL CreateSpatialIndex('geotools', 'ft1', 'geometry', 4326) [90105-119]
	at org.h2.message.Message.getSQLException(Message.java:106)
	at org.h2.message.Message.convert(Message.java:279)
	at org.h2.engine.FunctionAlias$JavaMethod.getValue(FunctionAlias.java:306)
	at org.h2.expression.JavaFunction.getValue(JavaFunction.java:38)
	at org.h2.command.dml.Call.query(Call.java:61)
	at org.h2.command.CommandContainer.query(CommandContainer.java:82)
	at org.h2.command.Command.executeQueryLocal(Command.java:142)
	at org.h2.command.Command.executeQuery(Command.java:123)
	at org.h2.jdbc.JdbcStatement.execute(JdbcStatement.java:158)
	at org.apache.commons.dbcp.DelegatingStatement.execute(DelegatingStatement.java:264)
	at org.apache.commons.dbcp.DelegatingStatement.execute(DelegatingStatement.java:264)
	at org.apache.commons.dbcp.DelegatingStatement.execute(DelegatingStatement.java:264)
	at org.geotools.jdbc.JDBCTestSetup.run(JDBCTestSetup.java:156)
	at org.geotools.jdbc.JDBCTestSetup.run(JDBCTestSetup.java:127)
	at org.geotools.data.h2.H2TestSetup.setUpData(H2TestSetup.java:78)
	at org.geotools.jdbc.JDBCDelegatingTestSetup.setUpData(JDBCDelegatingTestSetup.java:72)
	at org.geotools.jdbc.JDBCTestSupport.connect(JDBCTestSupport.java:133)
	at org.geotools.test.OnlineTestCase.setUp(OnlineTestCase.java:243)
	at junit.framework.TestCase.runBare(TestCase.java:139)
	at junit.framework.TestResult$1.protect(TestResult.java:122)
	at junit.framework.TestResult.runProtected(TestResult.java:142)
	at junit.framework.TestResult.run(TestResult.java:125)
	at junit.framework.TestCase.run(TestCase.java:129)
	at org.geotools.test.OnlineTestCase.run(OnlineTestCase.java:123)
	at junit.framework.TestSuite.runTest(TestSuite.java:255)
	at junit.framework.TestSuite.run(TestSuite.java:250)
	at org.junit.internal.runners.JUnit38ClassRunner.run(JUnit38ClassRunner.java:84)
	at org.apache.maven.surefire.junit4.JUnit4Provider.execute(JUnit4Provider.java:264)
	at org.apache.maven.surefire.junit4.JUnit4Provider.executeTestSet(JUnit4Provider.java:153)
	at org.apache.maven.surefire.junit4.JUnit4Provider.invoke(JUnit4Provider.java:124)
	at org.apache.maven.surefire.booter.ForkedBooter.invokeProviderInSameClassLoader(ForkedBooter.java:200)
	at org.apache.maven.surefire.booter.ForkedBooter.runSuitesInProcess(ForkedBooter.java:153)
	at org.apache.maven.surefire.booter.ForkedBooter.main(ForkedBooter.java:103)
Caused by: java.lang.reflect.InvocationTargetException
	at sun.reflect.GeneratedMethodAccessor5.invoke(Unknown Source)
	at sun.reflect.DelegatingMethodAccessorImpl.invoke(DelegatingMethodAccessorImpl.java:43)
	at java.lang.reflect.Method.invoke(Method.java:498)
	at org.h2.engine.FunctionAlias$JavaMethod.getValue(FunctionAlias.java:299)
	... 30 more
Caused by: java.lang.NoClassDefFoundError: com/vividsolutions/jts/geom/Geometry
	at net.sourceforge.hatbox.tools.CmdLine.spatialize(CmdLine.java:249)
	at geodb.GeoDB.CreateSpatialIndex(GeoDB.java:1063)
	... 34 more
Caused by: java.lang.ClassNotFoundException: com.vividsolutions.jts.geom.Geometry
	at java.net.URLClassLoader.findClass(URLClassLoader.java:381)
	at java.lang.ClassLoader.loadClass(ClassLoader.java:424)
	at sun.misc.Launcher$AppClassLoader.loadClass(Launcher.java:338)
	at java.lang.ClassLoader.loadClass(ClassLoader.java:357)
	... 36 more
org.h2.jdbc.JdbcSQLException: Exception calling user-defined function; SQL statement:
CALL CreateSpatialIndex('geotools', 'ft1', 'geometry', 4326) [90105-119]
	at org.h2.message.Message.getSQLException(Message.java:106)
	at org.h2.message.Message.convert(Message.java:279)
	at org.h2.engine.FunctionAlias$JavaMethod.getValue(FunctionAlias.java:306)
	at org.h2.expression.JavaFunction.getValue(JavaFunction.java:38)
	at org.h2.command.dml.Call.query(Call.java:61)
	at org.h2.command.CommandContainer.query(CommandContainer.java:82)
	at org.h2.command.Command.executeQueryLocal(Command.java:142)
	at org.h2.command.Command.executeQuery(Command.java:123)
	at org.h2.jdbc.JdbcStatement.execute(JdbcStatement.java:158)
	at org.apache.commons.dbcp.DelegatingStatement.execute(DelegatingStatement.java:264)
	at org.apache.commons.dbcp.DelegatingStatement.execute(DelegatingStatement.java:264)
	at org.apache.commons.dbcp.DelegatingStatement.execute(DelegatingStatement.java:264)
	at org.geotools.jdbc.JDBCTestSetup.run(JDBCTestSetup.java:156)
	at org.geotools.jdbc.JDBCTestSetup.run(JDBCTestSetup.java:127)
	at org.geotools.data.h2.H2TestSetup.setUpData(H2TestSetup.java:78)
	at org.geotools.jdbc.JDBCDelegatingTestSetup.setUpData(JDBCDelegatingTestSetup.java:72)
	at org.geotools.jdbc.JDBCTestSupport.connect(JDBCTestSupport.java:133)
	at org.geotools.test.OnlineTestCase.setUp(OnlineTestCase.java:243)
	at junit.framework.TestCase.runBare(TestCase.java:139)
	at junit.framework.TestResult$1.protect(TestResult.java:122)
	at junit.framework.TestResult.runProtected(TestResult.java:142)
	at junit.framework.TestResult.run(TestResult.java:125)
	at junit.framework.TestCase.run(TestCase.java:129)
	at org.geotools.test.OnlineTestCase.run(OnlineTestCase.java:123)
	at junit.framework.TestSuite.runTest(TestSuite.java:255)
	at junit.framework.TestSuite.run(TestSuite.java:250)
	at org.junit.internal.runners.JUnit38ClassRunner.run(JUnit38ClassRunner.java:84)
	at org.apache.maven.surefire.junit4.JUnit4Provider.execute(JUnit4Provider.java:264)
	at org.apache.maven.surefire.junit4.JUnit4Provider.executeTestSet(JUnit4Provider.java:153)
	at org.apache.maven.surefire.junit4.JUnit4Provider.invoke(JUnit4Provider.java:124)
	at org.apache.maven.surefire.booter.ForkedBooter.invokeProviderInSameClassLoader(ForkedBooter.java:200)
	at org.apache.maven.surefire.booter.ForkedBooter.runSuitesInProcess(ForkedBooter.java:153)
	at org.apache.maven.surefire.booter.ForkedBooter.main(ForkedBooter.java:103)
Caused by: java.lang.reflect.InvocationTargetException
	at sun.reflect.GeneratedMethodAccessor5.invoke(Unknown Source)
	at sun.reflect.DelegatingMethodAccessorImpl.invoke(DelegatingMethodAccessorImpl.java:43)
	at java.lang.reflect.Method.invoke(Method.java:498)
	at org.h2.engine.FunctionAlias$JavaMethod.getValue(FunctionAlias.java:299)
	... 30 more
Caused by: java.lang.NoClassDefFoundError: com/vividsolutions/jts/geom/Geometry
	at net.sourceforge.hatbox.tools.CmdLine.spatialize(CmdLine.java:249)
	at geodb.GeoDB.CreateSpatialIndex(GeoDB.java:1063)
	... 34 more
Caused by: java.lang.ClassNotFoundException: com.vividsolutions.jts.geom.Geometry
	at java.net.URLClassLoader.findClass(URLClassLoader.java:381)
	at java.lang.ClassLoader.loadClass(ClassLoader.java:424)
	at sun.misc.Launcher$AppClassLoader.loadClass(Launcher.java:338)
	at java.lang.ClassLoader.loadClass(ClassLoader.java:357)
	... 36 more
org.h2.jdbc.JdbcSQLException: Exception calling user-defined function; SQL statement:
CALL CreateSpatialIndex('geotools', 'ft1', 'geometry', 4326) [90105-119]
	at org.h2.message.Message.getSQLException(Message.java:106)
	at org.h2.message.Message.convert(Message.java:279)
	at org.h2.engine.FunctionAlias$JavaMethod.getValue(FunctionAlias.java:306)
	at org.h2.expression.JavaFunction.getValue(JavaFunction.java:38)
	at org.h2.command.dml.Call.query(Call.java:61)
	at org.h2.command.CommandContainer.query(CommandContainer.java:82)
	at org.h2.command.Command.executeQueryLocal(Command.java:142)
	at org.h2.command.Command.executeQuery(Command.java:123)
	at org.h2.jdbc.JdbcStatement.execute(JdbcStatement.java:158)
	at org.apache.commons.dbcp.DelegatingStatement.execute(DelegatingStatement.java:264)
	at org.apache.commons.dbcp.DelegatingStatement.execute(DelegatingStatement.java:264)
	at org.apache.commons.dbcp.DelegatingStatement.execute(DelegatingStatement.java:264)
	at org.geotools.jdbc.JDBCTestSetup.run(JDBCTestSetup.java:156)
	at org.geotools.jdbc.JDBCTestSetup.run(JDBCTestSetup.java:127)
	at org.geotools.data.h2.H2TestSetup.setUpData(H2TestSetup.java:78)
	at org.geotools.jdbc.JDBCDelegatingTestSetup.setUpData(JDBCDelegatingTestSetup.java:72)
	at org.geotools.jdbc.JDBCTestSupport.connect(JDBCTestSupport.java:133)
	at org.geotools.test.OnlineTestCase.setUp(OnlineTestCase.java:243)
	at junit.framework.TestCase.runBare(TestCase.java:139)
	at junit.framework.TestResult$1.protect(TestResult.java:122)
	at junit.framework.TestResult.runProtected(TestResult.java:142)
	at junit.framework.TestResult.run(TestResult.java:125)
	at junit.framework.TestCase.run(TestCase.java:129)
	at org.geotools.test.OnlineTestCase.run(OnlineTestCase.java:123)
	at junit.framework.TestSuite.runTest(TestSuite.java:255)
	at junit.framework.TestSuite.run(TestSuite.java:250)
	at org.junit.internal.runners.JUnit38ClassRunner.run(JUnit38ClassRunner.java:84)
	at org.apache.maven.surefire.junit4.JUnit4Provider.execute(JUnit4Provider.java:264)
	at org.apache.maven.surefire.junit4.JUnit4Provider.executeTestSet(JUnit4Provider.java:153)
	at org.apache.maven.surefire.junit4.JUnit4Provider.invoke(JUnit4Provider.java:124)
	at org.apache.maven.surefire.booter.ForkedBooter.invokeProviderInSameClassLoader(ForkedBooter.java:200)
	at org.apache.maven.surefire.booter.ForkedBooter.runSuitesInProcess(ForkedBooter.java:153)
	at org.apache.maven.surefire.booter.ForkedBooter.main(ForkedBooter.java:103)
Caused by: java.lang.reflect.InvocationTargetException
	at sun.reflect.GeneratedMethodAccessor5.invoke(Unknown Source)
	at sun.reflect.DelegatingMethodAccessorImpl.invoke(DelegatingMethodAccessorImpl.java:43)
	at java.lang.reflect.Method.invoke(Method.java:498)
	at org.h2.engine.FunctionAlias$JavaMethod.getValue(FunctionAlias.java:299)
	... 30 more
Caused by: java.lang.NoClassDefFoundError: com/vividsolutions/jts/geom/Geometry
	at net.sourceforge.hatbox.tools.CmdLine.spatialize(CmdLine.java:249)
	at geodb.GeoDB.CreateSpatialIndex(GeoDB.java:1063)
	... 34 more
Caused by: java.lang.ClassNotFoundException: com.vividsolutions.jts.geom.Geometry
	at java.net.URLClassLoader.findClass(URLClassLoader.java:381)
	at java.lang.ClassLoader.loadClass(ClassLoader.java:424)
	at sun.misc.Launcher$AppClassLoader.loadClass(Launcher.java:338)
	at java.lang.ClassLoader.loadClass(ClassLoader.java:357)
	... 36 more
org.h2.jdbc.JdbcSQLException: Exception calling user-defined function; SQL statement:
CALL CreateSpatialIndex('geotools', 'ft1', 'geometry', 4326) [90105-119]
	at org.h2.message.Message.getSQLException(Message.java:106)
	at org.h2.message.Message.convert(Message.java:279)
	at org.h2.engine.FunctionAlias$JavaMethod.getValue(FunctionAlias.java:306)
	at org.h2.expression.JavaFunction.getValue(JavaFunction.java:38)
	at org.h2.command.dml.Call.query(Call.java:61)
	at org.h2.command.CommandContainer.query(CommandContainer.java:82)
	at org.h2.command.Command.executeQueryLocal(Command.java:142)
	at org.h2.command.Command.executeQuery(Command.java:123)
	at org.h2.jdbc.JdbcStatement.execute(JdbcStatement.java:158)
	at org.apache.commons.dbcp.DelegatingStatement.execute(DelegatingStatement.java:264)
	at org.apache.commons.dbcp.DelegatingStatement.execute(DelegatingStatement.java:264)
	at org.apache.commons.dbcp.DelegatingStatement.execute(DelegatingStatement.java:264)
	at org.geotools.jdbc.JDBCTestSetup.run(JDBCTestSetup.java:156)
	at org.geotools.jdbc.JDBCTestSetup.run(JDBCTestSetup.java:127)
	at org.geotools.data.h2.H2TestSetup.setUpData(H2TestSetup.java:78)
	at org.geotools.jdbc.JDBCDelegatingTestSetup.setUpData(JDBCDelegatingTestSetup.java:72)
	at org.geotools.jdbc.JDBCTestSupport.connect(JDBCTestSupport.java:133)
	at org.geotools.test.OnlineTestCase.setUp(OnlineTestCase.java:243)
	at junit.framework.TestCase.runBare(TestCase.java:139)
	at junit.framework.TestResult$1.protect(TestResult.java:122)
	at junit.framework.TestResult.runProtected(TestResult.java:142)
	at junit.framework.TestResult.run(TestResult.java:125)
	at junit.framework.TestCase.run(TestCase.java:129)
	at org.geotools.test.OnlineTestCase.run(OnlineTestCase.java:123)
	at junit.framework.TestSuite.runTest(TestSuite.java:255)
	at junit.framework.TestSuite.run(TestSuite.java:250)
	at org.junit.internal.runners.JUnit38ClassRunner.run(JUnit38ClassRunner.java:84)
	at org.apache.maven.surefire.junit4.JUnit4Provider.execute(JUnit4Provider.java:264)
	at org.apache.maven.surefire.junit4.JUnit4Provider.executeTestSet(JUnit4Provider.java:153)
	at org.apache.maven.surefire.junit4.JUnit4Provider.invoke(JUnit4Provider.java:124)
	at org.apache.maven.surefire.booter.ForkedBooter.invokeProviderInSameClassLoader(ForkedBooter.java:200)
	at org.apache.maven.surefire.booter.ForkedBooter.runSuitesInProcess(ForkedBooter.java:153)
	at org.apache.maven.surefire.booter.ForkedBooter.main(ForkedBooter.java:103)
Caused by: java.lang.reflect.InvocationTargetException
	at sun.reflect.GeneratedMethodAccessor5.invoke(Unknown Source)
	at sun.reflect.DelegatingMethodAccessorImpl.invoke(DelegatingMethodAccessorImpl.java:43)
	at java.lang.reflect.Method.invoke(Method.java:498)
	at org.h2.engine.FunctionAlias$JavaMethod.getValue(FunctionAlias.java:299)
	... 30 more
Caused by: java.lang.NoClassDefFoundError: com/vividsolutions/jts/geom/Geometry
	at net.sourceforge.hatbox.tools.CmdLine.spatialize(CmdLine.java:249)
	at geodb.GeoDB.CreateSpatialIndex(GeoDB.java:1063)
	... 34 more
Caused by: java.lang.ClassNotFoundException: com.vividsolutions.jts.geom.Geometry
	at java.net.URLClassLoader.findClass(URLClassLoader.java:381)
	at java.lang.ClassLoader.loadClass(ClassLoader.java:424)
	at sun.misc.Launcher$AppClassLoader.loadClass(Launcher.java:338)
	at java.lang.ClassLoader.loadClass(ClassLoader.java:357)
	... 36 more
org.h2.jdbc.JdbcSQLException: Exception calling user-defined function; SQL statement:
CALL CreateSpatialIndex('geotools', 'ft1', 'geometry', 4326) [90105-119]
	at org.h2.message.Message.getSQLException(Message.java:106)
	at org.h2.message.Message.convert(Message.java:279)
	at org.h2.engine.FunctionAlias$JavaMethod.getValue(FunctionAlias.java:306)
	at org.h2.expression.JavaFunction.getValue(JavaFunction.java:38)
	at org.h2.command.dml.Call.query(Call.java:61)
	at org.h2.command.CommandContainer.query(CommandContainer.java:82)
	at org.h2.command.Command.executeQueryLocal(Command.java:142)
	at org.h2.command.Command.executeQuery(Command.java:123)
	at org.h2.jdbc.JdbcStatement.execute(JdbcStatement.java:158)
	at org.apache.commons.dbcp.DelegatingStatement.execute(DelegatingStatement.java:264)
	at org.apache.commons.dbcp.DelegatingStatement.execute(DelegatingStatement.java:264)
	at org.apache.commons.dbcp.DelegatingStatement.execute(DelegatingStatement.java:264)
	at org.geotools.jdbc.JDBCTestSetup.run(JDBCTestSetup.java:156)
	at org.geotools.jdbc.JDBCTestSetup.run(JDBCTestSetup.java:127)
	at org.geotools.data.h2.H2TestSetup.setUpData(H2TestSetup.java:78)
	at org.geotools.jdbc.JDBCDelegatingTestSetup.setUpData(JDBCDelegatingTestSetup.java:72)
	at org.geotools.jdbc.JDBCTestSupport.connect(JDBCTestSupport.java:133)
	at org.geotools.test.OnlineTestCase.setUp(OnlineTestCase.java:243)
	at junit.framework.TestCase.runBare(TestCase.java:139)
	at junit.framework.TestResult$1.protect(TestResult.java:122)
	at junit.framework.TestResult.runProtected(TestResult.java:142)
	at junit.framework.TestResult.run(TestResult.java:125)
	at junit.framework.TestCase.run(TestCase.java:129)
	at org.geotools.test.OnlineTestCase.run(OnlineTestCase.java:123)
	at junit.framework.TestSuite.runTest(TestSuite.java:255)
	at junit.framework.TestSuite.run(TestSuite.java:250)
	at org.junit.internal.runners.JUnit38ClassRunner.run(JUnit38ClassRunner.java:84)
	at org.apache.maven.surefire.junit4.JUnit4Provider.execute(JUnit4Provider.java:264)
	at org.apache.maven.surefire.junit4.JUnit4Provider.executeTestSet(JUnit4Provider.java:153)
	at org.apache.maven.surefire.junit4.JUnit4Provider.invoke(JUnit4Provider.java:124)
	at org.apache.maven.surefire.booter.ForkedBooter.invokeProviderInSameClassLoader(ForkedBooter.java:200)
	at org.apache.maven.surefire.booter.ForkedBooter.runSuitesInProcess(ForkedBooter.java:153)
	at org.apache.maven.surefire.booter.ForkedBooter.main(ForkedBooter.java:103)
Caused by: java.lang.reflect.InvocationTargetException
	at sun.reflect.GeneratedMethodAccessor5.invoke(Unknown Source)
	at sun.reflect.DelegatingMethodAccessorImpl.invoke(DelegatingMethodAccessorImpl.java:43)
	at java.lang.reflect.Method.invoke(Method.java:498)
	at org.h2.engine.FunctionAlias$JavaMethod.getValue(FunctionAlias.java:299)
	... 30 more
Caused by: java.lang.NoClassDefFoundError: com/vividsolutions/jts/geom/Geometry
	at net.sourceforge.hatbox.tools.CmdLine.spatialize(CmdLine.java:249)
	at geodb.GeoDB.CreateSpatialIndex(GeoDB.java:1063)
	... 34 more
Caused by: java.lang.ClassNotFoundException: com.vividsolutions.jts.geom.Geometry
	at java.net.URLClassLoader.findClass(URLClassLoader.java:381)
	at java.lang.ClassLoader.loadClass(ClassLoader.java:424)
	at sun.misc.Launcher$AppClassLoader.loadClass(Launcher.java:338)
	at java.lang.ClassLoader.loadClass(ClassLoader.java:357)
	... 36 more
org.h2.jdbc.JdbcSQLException: Exception calling user-defined function; SQL statement:
CALL CreateSpatialIndex('geotools', 'ft1', 'geometry', 4326) [90105-119]
	at org.h2.message.Message.getSQLException(Message.java:106)
	at org.h2.message.Message.convert(Message.java:279)
	at org.h2.engine.FunctionAlias$JavaMethod.getValue(FunctionAlias.java:306)
	at org.h2.expression.JavaFunction.getValue(JavaFunction.java:38)
	at org.h2.command.dml.Call.query(Call.java:61)
	at org.h2.command.CommandContainer.query(CommandContainer.java:82)
	at org.h2.command.Command.executeQueryLocal(Command.java:142)
	at org.h2.command.Command.executeQuery(Command.java:123)
	at org.h2.jdbc.JdbcStatement.execute(JdbcStatement.java:158)
	at org.apache.commons.dbcp.DelegatingStatement.execute(DelegatingStatement.java:264)
	at org.apache.commons.dbcp.DelegatingStatement.execute(DelegatingStatement.java:264)
	at org.apache.commons.dbcp.DelegatingStatement.execute(DelegatingStatement.java:264)
	at org.geotools.jdbc.JDBCTestSetup.run(JDBCTestSetup.java:156)
	at org.geotools.jdbc.JDBCTestSetup.run(JDBCTestSetup.java:127)
	at org.geotools.data.h2.H2TestSetup.setUpData(H2TestSetup.java:78)
	at org.geotools.jdbc.JDBCDelegatingTestSetup.setUpData(JDBCDelegatingTestSetup.java:72)
	at org.geotools.jdbc.JDBCTestSupport.connect(JDBCTestSupport.java:133)
	at org.geotools.test.OnlineTestCase.setUp(OnlineTestCase.java:243)
	at junit.framework.TestCase.runBare(TestCase.java:139)
	at junit.framework.TestResult$1.protect(TestResult.java:122)
	at junit.framework.TestResult.runProtected(TestResult.java:142)
	at junit.framework.TestResult.run(TestResult.java:125)
	at junit.framework.TestCase.run(TestCase.java:129)
	at org.geotools.test.OnlineTestCase.run(OnlineTestCase.java:123)
	at junit.framework.TestSuite.runTest(TestSuite.java:255)
	at junit.framework.TestSuite.run(TestSuite.java:250)
	at org.junit.internal.runners.JUnit38ClassRunner.run(JUnit38ClassRunner.java:84)
	at org.apache.maven.surefire.junit4.JUnit4Provider.execute(JUnit4Provider.java:264)
	at org.apache.maven.surefire.junit4.JUnit4Provider.executeTestSet(JUnit4Provider.java:153)
	at org.apache.maven.surefire.junit4.JUnit4Provider.invoke(JUnit4Provider.java:124)
	at org.apache.maven.surefire.booter.ForkedBooter.invokeProviderInSameClassLoader(ForkedBooter.java:200)
	at org.apache.maven.surefire.booter.ForkedBooter.runSuitesInProcess(ForkedBooter.java:153)
	at org.apache.maven.surefire.booter.ForkedBooter.main(ForkedBooter.java:103)
Caused by: java.lang.reflect.InvocationTargetException
	at sun.reflect.GeneratedMethodAccessor5.invoke(Unknown Source)
	at sun.reflect.DelegatingMethodAccessorImpl.invoke(DelegatingMethodAccessorImpl.java:43)
	at java.lang.reflect.Method.invoke(Method.java:498)
	at org.h2.engine.FunctionAlias$JavaMethod.getValue(FunctionAlias.java:299)
	... 30 more
Caused by: java.lang.NoClassDefFoundError: com/vividsolutions/jts/geom/Geometry
	at net.sourceforge.hatbox.tools.CmdLine.spatialize(CmdLine.java:249)
	at geodb.GeoDB.CreateSpatialIndex(GeoDB.java:1063)
	... 34 more
Caused by: java.lang.ClassNotFoundException: com.vividsolutions.jts.geom.Geometry
	at java.net.URLClassLoader.findClass(URLClassLoader.java:381)
	at java.lang.ClassLoader.loadClass(ClassLoader.java:424)
	at sun.misc.Launcher$AppClassLoader.loadClass(Launcher.java:338)
	at java.lang.ClassLoader.loadClass(ClassLoader.java:357)
	... 36 more
org.h2.jdbc.JdbcSQLException: Exception calling user-defined function; SQL statement:
CALL CreateSpatialIndex('geotools', 'ft1', 'geometry', 4326) [90105-119]
	at org.h2.message.Message.getSQLException(Message.java:106)
	at org.h2.message.Message.convert(Message.java:279)
	at org.h2.engine.FunctionAlias$JavaMethod.getValue(FunctionAlias.java:306)
	at org.h2.expression.JavaFunction.getValue(JavaFunction.java:38)
	at org.h2.command.dml.Call.query(Call.java:61)
	at org.h2.command.CommandContainer.query(CommandContainer.java:82)
	at org.h2.command.Command.executeQueryLocal(Command.java:142)
	at org.h2.command.Command.executeQuery(Command.java:123)
	at org.h2.jdbc.JdbcStatement.execute(JdbcStatement.java:158)
	at org.apache.commons.dbcp.DelegatingStatement.execute(DelegatingStatement.java:264)
	at org.apache.commons.dbcp.DelegatingStatement.execute(DelegatingStatement.java:264)
	at org.apache.commons.dbcp.DelegatingStatement.execute(DelegatingStatement.java:264)
	at org.geotools.jdbc.JDBCTestSetup.run(JDBCTestSetup.java:156)
	at org.geotools.jdbc.JDBCTestSetup.run(JDBCTestSetup.java:127)
	at org.geotools.data.h2.H2TestSetup.setUpData(H2TestSetup.java:78)
	at org.geotools.jdbc.JDBCDelegatingTestSetup.setUpData(JDBCDelegatingTestSetup.java:72)
	at org.geotools.jdbc.JDBCTestSupport.connect(JDBCTestSupport.java:133)
	at org.geotools.test.OnlineTestCase.setUp(OnlineTestCase.java:243)
	at junit.framework.TestCase.runBare(TestCase.java:139)
	at junit.framework.TestResult$1.protect(TestResult.java:122)
	at junit.framework.TestResult.runProtected(TestResult.java:142)
	at junit.framework.TestResult.run(TestResult.java:125)
	at junit.framework.TestCase.run(TestCase.java:129)
	at org.geotools.test.OnlineTestCase.run(OnlineTestCase.java:123)
	at junit.framework.TestSuite.runTest(TestSuite.java:255)
	at junit.framework.TestSuite.run(TestSuite.java:250)
	at org.junit.internal.runners.JUnit38ClassRunner.run(JUnit38ClassRunner.java:84)
	at org.apache.maven.surefire.junit4.JUnit4Provider.execute(JUnit4Provider.java:264)
	at org.apache.maven.surefire.junit4.JUnit4Provider.executeTestSet(JUnit4Provider.java:153)
	at org.apache.maven.surefire.junit4.JUnit4Provider.invoke(JUnit4Provider.java:124)
	at org.apache.maven.surefire.booter.ForkedBooter.invokeProviderInSameClassLoader(ForkedBooter.java:200)
	at org.apache.maven.surefire.booter.ForkedBooter.runSuitesInProcess(ForkedBooter.java:153)
	at org.apache.maven.surefire.booter.ForkedBooter.main(ForkedBooter.java:103)
Caused by: java.lang.reflect.InvocationTargetException
	at sun.reflect.GeneratedMethodAccessor5.invoke(Unknown Source)
	at sun.reflect.DelegatingMethodAccessorImpl.invoke(DelegatingMethodAccessorImpl.java:43)
	at java.lang.reflect.Method.invoke(Method.java:498)
	at org.h2.engine.FunctionAlias$JavaMethod.getValue(FunctionAlias.java:299)
	... 30 more
Caused by: java.lang.NoClassDefFoundError: com/vividsolutions/jts/geom/Geometry
	at net.sourceforge.hatbox.tools.CmdLine.spatialize(CmdLine.java:249)
	at geodb.GeoDB.CreateSpatialIndex(GeoDB.java:1063)
	... 34 more
Caused by: java.lang.ClassNotFoundException: com.vividsolutions.jts.geom.Geometry
	at java.net.URLClassLoader.findClass(URLClassLoader.java:381)
	at java.lang.ClassLoader.loadClass(ClassLoader.java:424)
	at sun.misc.Launcher$AppClassLoader.loadClass(Launcher.java:338)
	at java.lang.ClassLoader.loadClass(ClassLoader.java:357)
	... 36 more
org.h2.jdbc.JdbcSQLException: Exception calling user-defined function; SQL statement:
CALL CreateSpatialIndex('geotools', 'ft1', 'geometry', 4326) [90105-119]
	at org.h2.message.Message.getSQLException(Message.java:106)
	at org.h2.message.Message.convert(Message.java:279)
	at org.h2.engine.FunctionAlias$JavaMethod.getValue(FunctionAlias.java:306)
	at org.h2.expression.JavaFunction.getValue(JavaFunction.java:38)
	at org.h2.command.dml.Call.query(Call.java:61)
	at org.h2.command.CommandContainer.query(CommandContainer.java:82)
	at org.h2.command.Command.executeQueryLocal(Command.java:142)
	at org.h2.command.Command.executeQuery(Command.java:123)
	at org.h2.jdbc.JdbcStatement.execute(JdbcStatement.java:158)
	at org.apache.commons.dbcp.DelegatingStatement.execute(DelegatingStatement.java:264)
	at org.apache.commons.dbcp.DelegatingStatement.execute(DelegatingStatement.java:264)
	at org.apache.commons.dbcp.DelegatingStatement.execute(DelegatingStatement.java:264)
	at org.geotools.jdbc.JDBCTestSetup.run(JDBCTestSetup.java:156)
	at org.geotools.jdbc.JDBCTestSetup.run(JDBCTestSetup.java:127)
	at org.geotools.data.h2.H2TestSetup.setUpData(H2TestSetup.java:78)
	at org.geotools.jdbc.JDBCDelegatingTestSetup.setUpData(JDBCDelegatingTestSetup.java:72)
	at org.geotools.jdbc.JDBCTestSupport.connect(JDBCTestSupport.java:133)
	at org.geotools.test.OnlineTestCase.setUp(OnlineTestCase.java:243)
	at junit.framework.TestCase.runBare(TestCase.java:139)
	at junit.framework.TestResult$1.protect(TestResult.java:122)
	at junit.framework.TestResult.runProtected(TestResult.java:142)
	at junit.framework.TestResult.run(TestResult.java:125)
	at junit.framework.TestCase.run(TestCase.java:129)
	at org.geotools.test.OnlineTestCase.run(OnlineTestCase.java:123)
	at junit.framework.TestSuite.runTest(TestSuite.java:255)
	at junit.framework.TestSuite.run(TestSuite.java:250)
	at org.junit.internal.runners.JUnit38ClassRunner.run(JUnit38ClassRunner.java:84)
	at org.apache.maven.surefire.junit4.JUnit4Provider.execute(JUnit4Provider.java:264)
	at org.apache.maven.surefire.junit4.JUnit4Provider.executeTestSet(JUnit4Provider.java:153)
	at org.apache.maven.surefire.junit4.JUnit4Provider.invoke(JUnit4Provider.java:124)
	at org.apache.maven.surefire.booter.ForkedBooter.invokeProviderInSameClassLoader(ForkedBooter.java:200)
	at org.apache.maven.surefire.booter.ForkedBooter.runSuitesInProcess(ForkedBooter.java:153)
	at org.apache.maven.surefire.booter.ForkedBooter.main(ForkedBooter.java:103)
Caused by: java.lang.reflect.InvocationTargetException
	at sun.reflect.GeneratedMethodAccessor5.invoke(Unknown Source)
	at sun.reflect.DelegatingMethodAccessorImpl.invoke(DelegatingMethodAccessorImpl.java:43)
	at java.lang.reflect.Method.invoke(Method.java:498)
	at org.h2.engine.FunctionAlias$JavaMethod.getValue(FunctionAlias.java:299)
	... 30 more
Caused by: java.lang.NoClassDefFoundError: com/vividsolutions/jts/geom/Geometry
	at net.sourceforge.hatbox.tools.CmdLine.spatialize(CmdLine.java:249)
	at geodb.GeoDB.CreateSpatialIndex(GeoDB.java:1063)
	... 34 more
Caused by: java.lang.ClassNotFoundException: com.vividsolutions.jts.geom.Geometry
	at java.net.URLClassLoader.findClass(URLClassLoader.java:381)
	at java.lang.ClassLoader.loadClass(ClassLoader.java:424)
	at sun.misc.Launcher$AppClassLoader.loadClass(Launcher.java:338)
	at java.lang.ClassLoader.loadClass(ClassLoader.java:357)
	... 36 more
Tests run: 14, Failures: 0, Errors: 14, Skipped: 0, Time elapsed: 1.773 sec <<< FAILURE! - in org.geotools.data.h2.jndi.H2DataStoreTest
testSimpleIndex(org.geotools.data.h2.jndi.H2DataStoreTest)  Time elapsed: 0.109 sec  <<< ERROR!
java.lang.NullPointerException: null
	at org.geotools.jdbc.JDBCDataStoreOnlineTest.testSimpleIndex(JDBCDataStoreOnlineTest.java:180)
	at sun.reflect.NativeMethodAccessorImpl.invoke0(Native Method)
	at sun.reflect.NativeMethodAccessorImpl.invoke(NativeMethodAccessorImpl.java:62)
	at sun.reflect.DelegatingMethodAccessorImpl.invoke(DelegatingMethodAccessorImpl.java:43)
	at java.lang.reflect.Method.invoke(Method.java:498)
	at junit.framework.TestCase.runTest(TestCase.java:176)
	at junit.framework.TestCase.runBare(TestCase.java:141)
	at junit.framework.TestResult$1.protect(TestResult.java:122)
	at junit.framework.TestResult.runProtected(TestResult.java:142)
	at junit.framework.TestResult.run(TestResult.java:125)
	at junit.framework.TestCase.run(TestCase.java:129)
	at org.geotools.test.OnlineTestCase.run(OnlineTestCase.java:123)
	at junit.framework.TestSuite.runTest(TestSuite.java:255)
	at junit.framework.TestSuite.run(TestSuite.java:250)
	at org.junit.internal.runners.JUnit38ClassRunner.run(JUnit38ClassRunner.java:84)
	at org.apache.maven.surefire.junit4.JUnit4Provider.execute(JUnit4Provider.java:264)
	at org.apache.maven.surefire.junit4.JUnit4Provider.executeTestSet(JUnit4Provider.java:153)
	at org.apache.maven.surefire.junit4.JUnit4Provider.invoke(JUnit4Provider.java:124)
	at org.apache.maven.surefire.booter.ForkedBooter.invokeProviderInSameClassLoader(ForkedBooter.java:200)
	at org.apache.maven.surefire.booter.ForkedBooter.runSuitesInProcess(ForkedBooter.java:153)
	at org.apache.maven.surefire.booter.ForkedBooter.main(ForkedBooter.java:103)

testCreateSchemaWithConstraints(org.geotools.data.h2.jndi.H2DataStoreTest)  Time elapsed: 0.187 sec  <<< ERROR!
java.lang.NullPointerException: null
	at org.geotools.jdbc.JDBCDataStoreOnlineTest.testCreateSchemaWithConstraints(JDBCDataStoreOnlineTest.java:122)
	at sun.reflect.NativeMethodAccessorImpl.invoke0(Native Method)
	at sun.reflect.NativeMethodAccessorImpl.invoke(NativeMethodAccessorImpl.java:62)
	at sun.reflect.DelegatingMethodAccessorImpl.invoke(DelegatingMethodAccessorImpl.java:43)
	at java.lang.reflect.Method.invoke(Method.java:498)
	at junit.framework.TestCase.runTest(TestCase.java:176)
	at junit.framework.TestCase.runBare(TestCase.java:141)
	at junit.framework.TestResult$1.protect(TestResult.java:122)
	at junit.framework.TestResult.runProtected(TestResult.java:142)
	at junit.framework.TestResult.run(TestResult.java:125)
	at junit.framework.TestCase.run(TestCase.java:129)
	at org.geotools.test.OnlineTestCase.run(OnlineTestCase.java:123)
	at junit.framework.TestSuite.runTest(TestSuite.java:255)
	at junit.framework.TestSuite.run(TestSuite.java:250)
	at org.junit.internal.runners.JUnit38ClassRunner.run(JUnit38ClassRunner.java:84)
	at org.apache.maven.surefire.junit4.JUnit4Provider.execute(JUnit4Provider.java:264)
	at org.apache.maven.surefire.junit4.JUnit4Provider.executeTestSet(JUnit4Provider.java:153)
	at org.apache.maven.surefire.junit4.JUnit4Provider.invoke(JUnit4Provider.java:124)
	at org.apache.maven.surefire.booter.ForkedBooter.invokeProviderInSameClassLoader(ForkedBooter.java:200)
	at org.apache.maven.surefire.booter.ForkedBooter.runSuitesInProcess(ForkedBooter.java:153)
	at org.apache.maven.surefire.booter.ForkedBooter.main(ForkedBooter.java:103)

testMultiColumnIndex(org.geotools.data.h2.jndi.H2DataStoreTest)  Time elapsed: 0.142 sec  <<< ERROR!
java.lang.NullPointerException: null
	at org.geotools.jdbc.JDBCDataStoreOnlineTest.testMultiColumnIndex(JDBCDataStoreOnlineTest.java:221)
	at sun.reflect.NativeMethodAccessorImpl.invoke0(Native Method)
	at sun.reflect.NativeMethodAccessorImpl.invoke(NativeMethodAccessorImpl.java:62)
	at sun.reflect.DelegatingMethodAccessorImpl.invoke(DelegatingMethodAccessorImpl.java:43)
	at java.lang.reflect.Method.invoke(Method.java:498)
	at junit.framework.TestCase.runTest(TestCase.java:176)
	at junit.framework.TestCase.runBare(TestCase.java:141)
	at junit.framework.TestResult$1.protect(TestResult.java:122)
	at junit.framework.TestResult.runProtected(TestResult.java:142)
	at junit.framework.TestResult.run(TestResult.java:125)
	at junit.framework.TestCase.run(TestCase.java:129)
	at org.geotools.test.OnlineTestCase.run(OnlineTestCase.java:123)
	at junit.framework.TestSuite.runTest(TestSuite.java:255)
	at junit.framework.TestSuite.run(TestSuite.java:250)
	at org.junit.internal.runners.JUnit38ClassRunner.run(JUnit38ClassRunner.java:84)
	at org.apache.maven.surefire.junit4.JUnit4Provider.execute(JUnit4Provider.java:264)
	at org.apache.maven.surefire.junit4.JUnit4Provider.executeTestSet(JUnit4Provider.java:153)
	at org.apache.maven.surefire.junit4.JUnit4Provider.invoke(JUnit4Provider.java:124)
	at org.apache.maven.surefire.booter.ForkedBooter.invokeProviderInSameClassLoader(ForkedBooter.java:200)
	at org.apache.maven.surefire.booter.ForkedBooter.runSuitesInProcess(ForkedBooter.java:153)
	at org.apache.maven.surefire.booter.ForkedBooter.main(ForkedBooter.java:103)

testCreateSchema(org.geotools.data.h2.jndi.H2DataStoreTest)  Time elapsed: 0.129 sec  <<< ERROR!
java.lang.NullPointerException: null
	at org.geotools.jdbc.JDBCDataStoreOnlineTest.testCreateSchema(JDBCDataStoreOnlineTest.java:80)
	at sun.reflect.NativeMethodAccessorImpl.invoke0(Native Method)
	at sun.reflect.NativeMethodAccessorImpl.invoke(NativeMethodAccessorImpl.java:62)
	at sun.reflect.DelegatingMethodAccessorImpl.invoke(DelegatingMethodAccessorImpl.java:43)
	at java.lang.reflect.Method.invoke(Method.java:498)
	at junit.framework.TestCase.runTest(TestCase.java:176)
	at junit.framework.TestCase.runBare(TestCase.java:141)
	at junit.framework.TestResult$1.protect(TestResult.java:122)
	at junit.framework.TestResult.runProtected(TestResult.java:142)
	at junit.framework.TestResult.run(TestResult.java:125)
	at junit.framework.TestCase.run(TestCase.java:129)
	at org.geotools.test.OnlineTestCase.run(OnlineTestCase.java:123)
	at junit.framework.TestSuite.runTest(TestSuite.java:255)
	at junit.framework.TestSuite.run(TestSuite.java:250)
	at org.junit.internal.runners.JUnit38ClassRunner.run(JUnit38ClassRunner.java:84)
	at org.apache.maven.surefire.junit4.JUnit4Provider.execute(JUnit4Provider.java:264)
	at org.apache.maven.surefire.junit4.JUnit4Provider.executeTestSet(JUnit4Provider.java:153)
	at org.apache.maven.surefire.junit4.JUnit4Provider.invoke(JUnit4Provider.java:124)
	at org.apache.maven.surefire.booter.ForkedBooter.invokeProviderInSameClassLoader(ForkedBooter.java:200)
	at org.apache.maven.surefire.booter.ForkedBooter.runSuitesInProcess(ForkedBooter.java:153)
	at org.apache.maven.surefire.booter.ForkedBooter.main(ForkedBooter.java:103)

testGetNames(org.geotools.data.h2.jndi.H2DataStoreTest)  Time elapsed: 0.144 sec  <<< ERROR!
java.lang.NullPointerException: null
	at org.geotools.jdbc.JDBCDataStoreOnlineTest.testGetNames(JDBCDataStoreOnlineTest.java:57)
	at sun.reflect.NativeMethodAccessorImpl.invoke0(Native Method)
	at sun.reflect.NativeMethodAccessorImpl.invoke(NativeMethodAccessorImpl.java:62)
	at sun.reflect.DelegatingMethodAccessorImpl.invoke(DelegatingMethodAccessorImpl.java:43)
	at java.lang.reflect.Method.invoke(Method.java:498)
	at junit.framework.TestCase.runTest(TestCase.java:176)
	at junit.framework.TestCase.runBare(TestCase.java:141)
	at junit.framework.TestResult$1.protect(TestResult.java:122)
	at junit.framework.TestResult.runProtected(TestResult.java:142)
	at junit.framework.TestResult.run(TestResult.java:125)
	at junit.framework.TestCase.run(TestCase.java:129)
	at org.geotools.test.OnlineTestCase.run(OnlineTestCase.java:123)
	at junit.framework.TestSuite.runTest(TestSuite.java:255)
	at junit.framework.TestSuite.run(TestSuite.java:250)
	at org.junit.internal.runners.JUnit38ClassRunner.run(JUnit38ClassRunner.java:84)
	at org.apache.maven.surefire.junit4.JUnit4Provider.execute(JUnit4Provider.java:264)
	at org.apache.maven.surefire.junit4.JUnit4Provider.executeTestSet(JUnit4Provider.java:153)
	at org.apache.maven.surefire.junit4.JUnit4Provider.invoke(JUnit4Provider.java:124)
	at org.apache.maven.surefire.booter.ForkedBooter.invokeProviderInSameClassLoader(ForkedBooter.java:200)
	at org.apache.maven.surefire.booter.ForkedBooter.runSuitesInProcess(ForkedBooter.java:153)
	at org.apache.maven.surefire.booter.ForkedBooter.main(ForkedBooter.java:103)

testGetFeatureWriterAppend(org.geotools.data.h2.jndi.H2DataStoreTest)  Time elapsed: 0.123 sec  <<< ERROR!
java.lang.NullPointerException: null
	at org.geotools.jdbc.JDBCDataStoreOnlineTest.testGetFeatureWriterAppend(JDBCDataStoreOnlineTest.java:449)
	at sun.reflect.NativeMethodAccessorImpl.invoke0(Native Method)
	at sun.reflect.NativeMethodAccessorImpl.invoke(NativeMethodAccessorImpl.java:62)
	at sun.reflect.DelegatingMethodAccessorImpl.invoke(DelegatingMethodAccessorImpl.java:43)
	at java.lang.reflect.Method.invoke(Method.java:498)
	at junit.framework.TestCase.runTest(TestCase.java:176)
	at junit.framework.TestCase.runBare(TestCase.java:141)
	at junit.framework.TestResult$1.protect(TestResult.java:122)
	at junit.framework.TestResult.runProtected(TestResult.java:142)
	at junit.framework.TestResult.run(TestResult.java:125)
	at junit.framework.TestCase.run(TestCase.java:129)
	at org.geotools.test.OnlineTestCase.run(OnlineTestCase.java:123)
	at junit.framework.TestSuite.runTest(TestSuite.java:255)
	at junit.framework.TestSuite.run(TestSuite.java:250)
	at org.junit.internal.runners.JUnit38ClassRunner.run(JUnit38ClassRunner.java:84)
	at org.apache.maven.surefire.junit4.JUnit4Provider.execute(JUnit4Provider.java:264)
	at org.apache.maven.surefire.junit4.JUnit4Provider.executeTestSet(JUnit4Provider.java:153)
	at org.apache.maven.surefire.junit4.JUnit4Provider.invoke(JUnit4Provider.java:124)
	at org.apache.maven.surefire.booter.ForkedBooter.invokeProviderInSameClassLoader(ForkedBooter.java:200)
	at org.apache.maven.surefire.booter.ForkedBooter.runSuitesInProcess(ForkedBooter.java:153)
	at org.apache.maven.surefire.booter.ForkedBooter.main(ForkedBooter.java:103)

testGetFeatureWriterWithFilter(org.geotools.data.h2.jndi.H2DataStoreTest)  Time elapsed: 0.14 sec  <<< ERROR!
java.lang.NullPointerException: null
	at org.geotools.jdbc.JDBCDataStoreOnlineTest.testGetFeatureWriterWithFilter(JDBCDataStoreOnlineTest.java:427)
	at sun.reflect.NativeMethodAccessorImpl.invoke0(Native Method)
	at sun.reflect.NativeMethodAccessorImpl.invoke(NativeMethodAccessorImpl.java:62)
	at sun.reflect.DelegatingMethodAccessorImpl.invoke(DelegatingMethodAccessorImpl.java:43)
	at java.lang.reflect.Method.invoke(Method.java:498)
	at junit.framework.TestCase.runTest(TestCase.java:176)
	at junit.framework.TestCase.runBare(TestCase.java:141)
	at junit.framework.TestResult$1.protect(TestResult.java:122)
	at junit.framework.TestResult.runProtected(TestResult.java:142)
	at junit.framework.TestResult.run(TestResult.java:125)
	at junit.framework.TestCase.run(TestCase.java:129)
	at org.geotools.test.OnlineTestCase.run(OnlineTestCase.java:123)
	at junit.framework.TestSuite.runTest(TestSuite.java:255)
	at junit.framework.TestSuite.run(TestSuite.java:250)
	at org.junit.internal.runners.JUnit38ClassRunner.run(JUnit38ClassRunner.java:84)
	at org.apache.maven.surefire.junit4.JUnit4Provider.execute(JUnit4Provider.java:264)
	at org.apache.maven.surefire.junit4.JUnit4Provider.executeTestSet(JUnit4Provider.java:153)
	at org.apache.maven.surefire.junit4.JUnit4Provider.invoke(JUnit4Provider.java:124)
	at org.apache.maven.surefire.booter.ForkedBooter.invokeProviderInSameClassLoader(ForkedBooter.java:200)
	at org.apache.maven.surefire.booter.ForkedBooter.runSuitesInProcess(ForkedBooter.java:153)
	at org.apache.maven.surefire.booter.ForkedBooter.main(ForkedBooter.java:103)

testCreateSchemaUTMCRS(org.geotools.data.h2.jndi.H2DataStoreTest)  Time elapsed: 0.136 sec  <<< ERROR!
java.lang.NullPointerException: null
	at org.geotools.jdbc.JDBCDataStoreOnlineTest.testCreateSchemaUTMCRS(JDBCDataStoreOnlineTest.java:264)
	at sun.reflect.NativeMethodAccessorImpl.invoke0(Native Method)
	at sun.reflect.NativeMethodAccessorImpl.invoke(NativeMethodAccessorImpl.java:62)
	at sun.reflect.DelegatingMethodAccessorImpl.invoke(DelegatingMethodAccessorImpl.java:43)
	at java.lang.reflect.Method.invoke(Method.java:498)
	at junit.framework.TestCase.runTest(TestCase.java:176)
	at junit.framework.TestCase.runBare(TestCase.java:141)
	at junit.framework.TestResult$1.protect(TestResult.java:122)
	at junit.framework.TestResult.runProtected(TestResult.java:142)
	at junit.framework.TestResult.run(TestResult.java:125)
	at junit.framework.TestCase.run(TestCase.java:129)
	at org.geotools.test.OnlineTestCase.run(OnlineTestCase.java:123)
	at junit.framework.TestSuite.runTest(TestSuite.java:255)
	at junit.framework.TestSuite.run(TestSuite.java:250)
	at org.junit.internal.runners.JUnit38ClassRunner.run(JUnit38ClassRunner.java:84)
	at org.apache.maven.surefire.junit4.JUnit4Provider.execute(JUnit4Provider.java:264)
	at org.apache.maven.surefire.junit4.JUnit4Provider.executeTestSet(JUnit4Provider.java:153)
	at org.apache.maven.surefire.junit4.JUnit4Provider.invoke(JUnit4Provider.java:124)
	at org.apache.maven.surefire.booter.ForkedBooter.invokeProviderInSameClassLoader(ForkedBooter.java:200)
	at org.apache.maven.surefire.booter.ForkedBooter.runSuitesInProcess(ForkedBooter.java:153)
	at org.apache.maven.surefire.booter.ForkedBooter.main(ForkedBooter.java:103)

testCreateSchemaFidColumn(org.geotools.data.h2.jndi.H2DataStoreTest)  Time elapsed: 0.11 sec  <<< ERROR!
java.lang.NullPointerException: null
	at org.geotools.jdbc.JDBCDataStoreOnlineTest.testCreateSchemaFidColumn(JDBCDataStoreOnlineTest.java:302)
	at sun.reflect.NativeMethodAccessorImpl.invoke0(Native Method)
	at sun.reflect.NativeMethodAccessorImpl.invoke(NativeMethodAccessorImpl.java:62)
	at sun.reflect.DelegatingMethodAccessorImpl.invoke(DelegatingMethodAccessorImpl.java:43)
	at java.lang.reflect.Method.invoke(Method.java:498)
	at junit.framework.TestCase.runTest(TestCase.java:176)
	at junit.framework.TestCase.runBare(TestCase.java:141)
	at junit.framework.TestResult$1.protect(TestResult.java:122)
	at junit.framework.TestResult.runProtected(TestResult.java:142)
	at junit.framework.TestResult.run(TestResult.java:125)
	at junit.framework.TestCase.run(TestCase.java:129)
	at org.geotools.test.OnlineTestCase.run(OnlineTestCase.java:123)
	at junit.framework.TestSuite.runTest(TestSuite.java:255)
	at junit.framework.TestSuite.run(TestSuite.java:250)
	at org.junit.internal.runners.JUnit38ClassRunner.run(JUnit38ClassRunner.java:84)
	at org.apache.maven.surefire.junit4.JUnit4Provider.execute(JUnit4Provider.java:264)
	at org.apache.maven.surefire.junit4.JUnit4Provider.executeTestSet(JUnit4Provider.java:153)
	at org.apache.maven.surefire.junit4.JUnit4Provider.invoke(JUnit4Provider.java:124)
	at org.apache.maven.surefire.booter.ForkedBooter.invokeProviderInSameClassLoader(ForkedBooter.java:200)
	at org.apache.maven.surefire.booter.ForkedBooter.runSuitesInProcess(ForkedBooter.java:153)
	at org.apache.maven.surefire.booter.ForkedBooter.main(ForkedBooter.java:103)

testRemoveSchema(org.geotools.data.h2.jndi.H2DataStoreTest)  Time elapsed: 0.121 sec  <<< ERROR!
java.lang.NullPointerException: null
	at org.geotools.jdbc.JDBCDataStoreOnlineTest.testRemoveSchema(JDBCDataStoreOnlineTest.java:167)
	at sun.reflect.NativeMethodAccessorImpl.invoke0(Native Method)
	at sun.reflect.NativeMethodAccessorImpl.invoke(NativeMethodAccessorImpl.java:62)
	at sun.reflect.DelegatingMethodAccessorImpl.invoke(DelegatingMethodAccessorImpl.java:43)
	at java.lang.reflect.Method.invoke(Method.java:498)
	at junit.framework.TestCase.runTest(TestCase.java:176)
	at junit.framework.TestCase.runBare(TestCase.java:141)
	at junit.framework.TestResult$1.protect(TestResult.java:122)
	at junit.framework.TestResult.runProtected(TestResult.java:142)
	at junit.framework.TestResult.run(TestResult.java:125)
	at junit.framework.TestCase.run(TestCase.java:129)
	at org.geotools.test.OnlineTestCase.run(OnlineTestCase.java:123)
	at junit.framework.TestSuite.runTest(TestSuite.java:255)
	at junit.framework.TestSuite.run(TestSuite.java:250)
	at org.junit.internal.runners.JUnit38ClassRunner.run(JUnit38ClassRunner.java:84)
	at org.apache.maven.surefire.junit4.JUnit4Provider.execute(JUnit4Provider.java:264)
	at org.apache.maven.surefire.junit4.JUnit4Provider.executeTestSet(JUnit4Provider.java:153)
	at org.apache.maven.surefire.junit4.JUnit4Provider.invoke(JUnit4Provider.java:124)
	at org.apache.maven.surefire.booter.ForkedBooter.invokeProviderInSameClassLoader(ForkedBooter.java:200)
	at org.apache.maven.surefire.booter.ForkedBooter.runSuitesInProcess(ForkedBooter.java:153)
	at org.apache.maven.surefire.booter.ForkedBooter.main(ForkedBooter.java:103)

testGetFeatureReader(org.geotools.data.h2.jndi.H2DataStoreTest)  Time elapsed: 0.103 sec  <<< ERROR!
java.lang.NullPointerException: null
	at org.geotools.jdbc.JDBCDataStoreOnlineTest.testGetFeatureReader(JDBCDataStoreOnlineTest.java:358)
	at sun.reflect.NativeMethodAccessorImpl.invoke0(Native Method)
	at sun.reflect.NativeMethodAccessorImpl.invoke(NativeMethodAccessorImpl.java:62)
	at sun.reflect.DelegatingMethodAccessorImpl.invoke(DelegatingMethodAccessorImpl.java:43)
	at java.lang.reflect.Method.invoke(Method.java:498)
	at junit.framework.TestCase.runTest(TestCase.java:176)
	at junit.framework.TestCase.runBare(TestCase.java:141)
	at junit.framework.TestResult$1.protect(TestResult.java:122)
	at junit.framework.TestResult.runProtected(TestResult.java:142)
	at junit.framework.TestResult.run(TestResult.java:125)
	at junit.framework.TestCase.run(TestCase.java:129)
	at org.geotools.test.OnlineTestCase.run(OnlineTestCase.java:123)
	at junit.framework.TestSuite.runTest(TestSuite.java:255)
	at junit.framework.TestSuite.run(TestSuite.java:250)
	at org.junit.internal.runners.JUnit38ClassRunner.run(JUnit38ClassRunner.java:84)
	at org.apache.maven.surefire.junit4.JUnit4Provider.execute(JUnit4Provider.java:264)
	at org.apache.maven.surefire.junit4.JUnit4Provider.executeTestSet(JUnit4Provider.java:153)
	at org.apache.maven.surefire.junit4.JUnit4Provider.invoke(JUnit4Provider.java:124)
	at org.apache.maven.surefire.booter.ForkedBooter.invokeProviderInSameClassLoader(ForkedBooter.java:200)
	at org.apache.maven.surefire.booter.ForkedBooter.runSuitesInProcess(ForkedBooter.java:153)
	at org.apache.maven.surefire.booter.ForkedBooter.main(ForkedBooter.java:103)

testGetFeatureSource(org.geotools.data.h2.jndi.H2DataStoreTest)  Time elapsed: 0.112 sec  <<< ERROR!
java.lang.NullPointerException: null
	at org.geotools.jdbc.JDBCDataStoreOnlineTest.testGetFeatureSource(JDBCDataStoreOnlineTest.java:353)
	at sun.reflect.NativeMethodAccessorImpl.invoke0(Native Method)
	at sun.reflect.NativeMethodAccessorImpl.invoke(NativeMethodAccessorImpl.java:62)
	at sun.reflect.DelegatingMethodAccessorImpl.invoke(DelegatingMethodAccessorImpl.java:43)
	at java.lang.reflect.Method.invoke(Method.java:498)
	at junit.framework.TestCase.runTest(TestCase.java:176)
	at junit.framework.TestCase.runBare(TestCase.java:141)
	at junit.framework.TestResult$1.protect(TestResult.java:122)
	at junit.framework.TestResult.runProtected(TestResult.java:142)
	at junit.framework.TestResult.run(TestResult.java:125)
	at junit.framework.TestCase.run(TestCase.java:129)
	at org.geotools.test.OnlineTestCase.run(OnlineTestCase.java:123)
	at junit.framework.TestSuite.runTest(TestSuite.java:255)
	at junit.framework.TestSuite.run(TestSuite.java:250)
	at org.junit.internal.runners.JUnit38ClassRunner.run(JUnit38ClassRunner.java:84)
	at org.apache.maven.surefire.junit4.JUnit4Provider.execute(JUnit4Provider.java:264)
	at org.apache.maven.surefire.junit4.JUnit4Provider.executeTestSet(JUnit4Provider.java:153)
	at org.apache.maven.surefire.junit4.JUnit4Provider.invoke(JUnit4Provider.java:124)
	at org.apache.maven.surefire.booter.ForkedBooter.invokeProviderInSameClassLoader(ForkedBooter.java:200)
	at org.apache.maven.surefire.booter.ForkedBooter.runSuitesInProcess(ForkedBooter.java:153)
	at org.apache.maven.surefire.booter.ForkedBooter.main(ForkedBooter.java:103)

testGetFeatureWriter(org.geotools.data.h2.jndi.H2DataStoreTest)  Time elapsed: 0.109 sec  <<< ERROR!
java.lang.NullPointerException: null
	at org.geotools.jdbc.JDBCDataStoreOnlineTest.testGetFeatureWriter(JDBCDataStoreOnlineTest.java:407)
	at sun.reflect.NativeMethodAccessorImpl.invoke0(Native Method)
	at sun.reflect.NativeMethodAccessorImpl.invoke(NativeMethodAccessorImpl.java:62)
	at sun.reflect.DelegatingMethodAccessorImpl.invoke(DelegatingMethodAccessorImpl.java:43)
	at java.lang.reflect.Method.invoke(Method.java:498)
	at junit.framework.TestCase.runTest(TestCase.java:176)
	at junit.framework.TestCase.runBare(TestCase.java:141)
	at junit.framework.TestResult$1.protect(TestResult.java:122)
	at junit.framework.TestResult.runProtected(TestResult.java:142)
	at junit.framework.TestResult.run(TestResult.java:125)
	at junit.framework.TestCase.run(TestCase.java:129)
	at org.geotools.test.OnlineTestCase.run(OnlineTestCase.java:123)
	at junit.framework.TestSuite.runTest(TestSuite.java:255)
	at junit.framework.TestSuite.run(TestSuite.java:250)
	at org.junit.internal.runners.JUnit38ClassRunner.run(JUnit38ClassRunner.java:84)
	at org.apache.maven.surefire.junit4.JUnit4Provider.execute(JUnit4Provider.java:264)
	at org.apache.maven.surefire.junit4.JUnit4Provider.executeTestSet(JUnit4Provider.java:153)
	at org.apache.maven.surefire.junit4.JUnit4Provider.invoke(JUnit4Provider.java:124)
	at org.apache.maven.surefire.booter.ForkedBooter.invokeProviderInSameClassLoader(ForkedBooter.java:200)
	at org.apache.maven.surefire.booter.ForkedBooter.runSuitesInProcess(ForkedBooter.java:153)
	at org.apache.maven.surefire.booter.ForkedBooter.main(ForkedBooter.java:103)

testGetSchema(org.geotools.data.h2.jndi.H2DataStoreTest)  Time elapsed: 0.106 sec  <<< ERROR!
java.lang.NullPointerException: null
	at org.geotools.jdbc.JDBCDataStoreOnlineTest.testGetSchema(JDBCDataStoreOnlineTest.java:62)
	at sun.reflect.NativeMethodAccessorImpl.invoke0(Native Method)
	at sun.reflect.NativeMethodAccessorImpl.invoke(NativeMethodAccessorImpl.java:62)
	at sun.reflect.DelegatingMethodAccessorImpl.invoke(DelegatingMethodAccessorImpl.java:43)
	at java.lang.reflect.Method.invoke(Method.java:498)
	at junit.framework.TestCase.runTest(TestCase.java:176)
	at junit.framework.TestCase.runBare(TestCase.java:141)
	at junit.framework.TestResult$1.protect(TestResult.java:122)
	at junit.framework.TestResult.runProtected(TestResult.java:142)
	at junit.framework.TestResult.run(TestResult.java:125)
	at junit.framework.TestCase.run(TestCase.java:129)
	at org.geotools.test.OnlineTestCase.run(OnlineTestCase.java:123)
	at junit.framework.TestSuite.runTest(TestSuite.java:255)
	at junit.framework.TestSuite.run(TestSuite.java:250)
	at org.junit.internal.runners.JUnit38ClassRunner.run(JUnit38ClassRunner.java:84)
	at org.apache.maven.surefire.junit4.JUnit4Provider.execute(JUnit4Provider.java:264)
	at org.apache.maven.surefire.junit4.JUnit4Provider.executeTestSet(JUnit4Provider.java:153)
	at org.apache.maven.surefire.junit4.JUnit4Provider.invoke(JUnit4Provider.java:124)
	at org.apache.maven.surefire.booter.ForkedBooter.invokeProviderInSameClassLoader(ForkedBooter.java:200)
	at org.apache.maven.surefire.booter.ForkedBooter.runSuitesInProcess(ForkedBooter.java:153)
	at org.apache.maven.surefire.booter.ForkedBooter.main(ForkedBooter.java:103)


Results :

Tests in error: 
  H2AggregateFunctionTest>OnlineTestCase.run:123->JDBCAggregateFunctionOnlineTest.testUniqueWithFilter:266 » NullPointer
  H2AggregateFunctionTest>OnlineTestCase.run:123->JDBCAggregateFunctionOnlineTest.testStoreChecksVisitorLimits:323 » NullPointer
  H2AggregateFunctionTest>OnlineTestCase.run:123->JDBCAggregateFunctionOnlineTest.testMaxWithFilter:145 » NullPointer
  H2AggregateFunctionTest>OnlineTestCase.run:123->JDBCAggregateFunctionOnlineTest.testMaxWithLimitOffset:158 » NullPointer
  H2AggregateFunctionTest>OnlineTestCase.run:123->JDBCAggregateFunctionOnlineTest.testMax:135 » NullPointer
  H2AggregateFunctionTest>OnlineTestCase.run:123->JDBCAggregateFunctionOnlineTest.testMin:193 » NullPointer
  H2AggregateFunctionTest>OnlineTestCase.run:123->JDBCAggregateFunctionOnlineTest.testSum:76 » NullPointer
  H2AggregateFunctionTest>OnlineTestCase.run:123->JDBCAggregateFunctionOnlineTest.testUniqueWithLimitOffsetOnVisitor:354 » NullPointer
  H2AggregateFunctionTest>OnlineTestCase.run:123->JDBCAggregateFunctionOnlineTest.testSumWithLimitOffset:99 » NullPointer
  H2AggregateFunctionTest>OnlineTestCase.run:123->JDBCAggregateFunctionOnlineTest.testMinWithFilter:203 » NullPointer
  H2AggregateFunctionTest>OnlineTestCase.run:123->JDBCAggregateFunctionOnlineTest.testUniqueWithLimitOnVisitor:301 » NullPointer
  H2AggregateFunctionTest>OnlineTestCase.run:123->JDBCAggregateFunctionOnlineTest.testNearest:394->JDBCAggregateFunctionOnlineTest.testNearest:418 » NullPointer
  H2AggregateFunctionTest>OnlineTestCase.run:123->JDBCAggregateFunctionOnlineTest.testUniqueWithLimitOffset:282 » NullPointer
  H2AggregateFunctionTest>OnlineTestCase.run:123->JDBCAggregateFunctionOnlineTest.testMinWithLimitOffset:216 » NullPointer
  H2AggregateFunctionTest>OnlineTestCase.run:123->JDBCAggregateFunctionOnlineTest.testSumWithFilter:86 » NullPointer
  H2AggregateFunctionTest>OnlineTestCase.run:123->JDBCAggregateFunctionOnlineTest.testUnique:252 » NullPointer
  H2ConnectionLifecycleTest>OnlineTestCase.run:123->testVariableListener:69 NullPointer
  H2ConnectionLifecycleTest>OnlineTestCase.run:123->JDBCConnectionLifecycleOnlineTest.testConnectionReleased:91 » NullPointer
  H2ConnectionLifecycleTest>OnlineTestCase.run:123->JDBCConnectionLifecycleOnlineTest.testListenerCalled:53 » NullPointer
  H2DataStoreAPITest>OnlineTestCase.run:123->JDBCDataStoreAPIOnlineTest.testGetFeaturesWriterAdd:564 » NullPointer
  H2DataStoreAPITest>OnlineTestCase.run:123->JDBCDataStoreAPIOnlineTest.testCreateSchema:162 » NullPointer
  H2DataStoreAPITest>OnlineTestCase.run:123->JDBCDataStoreAPIOnlineTest.testGetFeatureTypes:105 » NullPointer
  H2DataStoreAPITest>OnlineTestCase.run:123->JDBCDataStoreAPIOnlineTest.testGetFeatureReaderFilterTransaction:448 » NullPointer
  H2DataStoreAPITest>OnlineTestCase.run:123->JDBCDataStoreAPIOnlineTest.testUnLockFeatures:1072 » NullPointer
  H2DataStoreAPITest>OnlineTestCase.run:123->JDBCDataStoreAPIOnlineTest.testGetFeatureWriterFilter:628 » NullPointer
  H2DataStoreAPITest>OnlineTestCase.run:123->JDBCDataStoreAPIOnlineTest.testGetFeatureReaderFilterWithAttributesNotRequested2:295 » NullPointer
  H2DataStoreAPITest>OnlineTestCase.run:123->JDBCDataStoreAPIOnlineTest.testGetFeatureWriterAppendTypeNameTransaction:609 » NullPointer
  H2DataStoreAPITest>OnlineTestCase.run:123->JDBCDataStoreAPIOnlineTest.testGetFeatureWriterRemove:536->JDBCDataStoreAPIOnlineTest.writer:1306 » NullPointer
  H2DataStoreAPITest>OnlineTestCase.run:123->JDBCDataStoreAPIOnlineTest.testLockFeatureInteraction:1101 » NullPointer
  H2DataStoreAPITest>OnlineTestCase.run:123->JDBCDataStoreAPIOnlineTest.testGetFeatureWriterClose:517 » NullPointer
  H2DataStoreAPITest>OnlineTestCase.run:123->JDBCDataStoreAPIOnlineTest.testGetFeatureStoreSetFeatures:1036 » NullPointer
  H2DataStoreAPITest>OnlineTestCase.run:123->JDBCDataStoreAPIOnlineTest.testGetFeatureSourceRoad:871 » NullPointer
  H2DataStoreAPITest>OnlineTestCase.run:123->JDBCDataStoreAPIOnlineTest.testGetFeaturesWriterModify:583->JDBCDataStoreAPIOnlineTest.writer:1306 » NullPointer
  H2DataStoreAPITest>OnlineTestCase.run:123->JDBCDataStoreAPIOnlineTest.testGetFeatureReaderMutability:337->JDBCDataStoreAPIOnlineTest.reader:1301 » NullPointer
  H2DataStoreAPITest>OnlineTestCase.run:123->JDBCDataStoreAPIOnlineTest.testGetFeatureStoreModifyFeatures1:958 » NullPointer
  H2DataStoreAPITest>OnlineTestCase.run:123->JDBCDataStoreAPIOnlineTest.testGetFeatureStoreModifyFeatures2:974 » NullPointer
  H2DataStoreAPITest>OnlineTestCase.run:123->JDBCDataStoreAPIOnlineTest.testGetFeatureStoreModifyFeatures3:1000 » NullPointer
  H2DataStoreAPITest>OnlineTestCase.run:123->JDBCDataStoreAPIOnlineTest.testGetFeatureReaderFilterAutoCommit:423 » NullPointer
  H2DataStoreAPITest>OnlineTestCase.run:123->JDBCDataStoreAPIOnlineTest.testGetFeatureReaderFilterWithAttributesNotRequested:275 » NullPointer
  H2DataStoreAPITest>OnlineTestCase.run:123->JDBCDataStoreAPIOnlineTest.testGeneralization:1596 » NullPointer
  H2DataStoreAPITest>OnlineTestCase.run:123->JDBCDataStoreAPIOnlineTest.testSimplification:1625 » NullPointer
  H2DataStoreAPITest>OnlineTestCase.run:123->JDBCDataStoreAPIOnlineTest.testGetFeatureStoreRemoveAllFeatures:1020 » NullPointer
  H2DataStoreAPITest>OnlineTestCase.run:123->JDBCDataStoreAPIOnlineTest.testGetFeatureStoreRemoveFeatures:1011 » NullPointer
  H2DataStoreAPITest>OnlineTestCase.run:123->JDBCDataStoreAPIOnlineTest.testGetFeatureReaderFilterPrePostWithNoGeometry:258 » NullPointer
  H2DataStoreAPITest>OnlineTestCase.run:123->JDBCDataStoreAPIOnlineTest.testGetFeatureWriterConcurrency:831 » NullPointer
  H2DataStoreAPITest>OnlineTestCase.run:123->JDBCDataStoreAPIOnlineTest.testGetFeatureReader:170 » NullPointer
  H2DataStoreAPITest>OnlineTestCase.run:123->JDBCDataStoreAPIOnlineTest.testGetFeatureReaderLake:214 » NullPointer
  H2DataStoreAPITest>OnlineTestCase.run:123->JDBCDataStoreAPIOnlineTest.testGetFeatureReaderConcurrency:363->JDBCDataStoreAPIOnlineTest.reader:1301 » NullPointer
  H2DataStoreAPITest>OnlineTestCase.run:123->JDBCDataStoreAPIOnlineTest.testGetFeatureStoreAddFeatures:1027 » NullPointer
  H2DataStoreAPITest>OnlineTestCase.run:123->JDBCDataStoreAPIOnlineTest.testGetFeatureWriterTypeNameTransaction:602 » NullPointer
  H2DataStoreAPITest>OnlineTestCase.run:123->JDBCDataStoreAPIOnlineTest.testGetFeatureWriterRemoveAll:552->JDBCDataStoreAPIOnlineTest.writer:1306 » NullPointer
  H2DataStoreAPITest>OnlineTestCase.run:123->JDBCDataStoreAPIOnlineTest.testGetFeatureReaderFilterPrePost:232 » NullPointer
  H2DataStoreAPITest>OnlineTestCase.run:123->JDBCDataStoreAPIOnlineTest.testGetSchemaRoad:115 » NullPointer
  H2DataStoreAPITest>OnlineTestCase.run:123->JDBCDataStoreAPIOnlineTest.testGetFeatureSourceRiver:935 » NullPointer
  H2DataStoreAPITest>OnlineTestCase.run:123->JDBCDataStoreAPIOnlineTest.testGetSchemaRiver:138 » NullPointer
  H2DataStoreAPITest>OnlineTestCase.run:123->JDBCDataStoreAPIOnlineTest.testGeometryFactoryHintsCS:193 » NullPointer
  H2DataStoreAPITest>OnlineTestCase.run:123->JDBCDataStoreAPIOnlineTest.testGeometryFactoryHintsGF:175 » NullPointer
  H2DataStoreAPITest>OnlineTestCase.run:123->JDBCDataStoreAPIOnlineTest.testGetFeatureLockingExpire:1152 » NullPointer
  H2DataStoreAPITest>OnlineTestCase.run:123->JDBCDataStoreAPIOnlineTest.testLockFeatures:1062 » NullPointer
  H2DataStoreTest>OnlineTestCase.run:123->JDBCDataStoreOnlineTest.testSimpleIndex:180 » NullPointer
  H2DataStoreTest>OnlineTestCase.run:123->JDBCDataStoreOnlineTest.testCreateSchemaWithConstraints:122 » NullPointer
  H2DataStoreTest>OnlineTestCase.run:123->JDBCDataStoreOnlineTest.testMultiColumnIndex:221 » NullPointer
  H2DataStoreTest>OnlineTestCase.run:123->JDBCDataStoreOnlineTest.testCreateSchema:80 » NullPointer
  H2DataStoreTest>OnlineTestCase.run:123->JDBCDataStoreOnlineTest.testGetNames:57 » NullPointer
  H2DataStoreTest>OnlineTestCase.run:123->JDBCDataStoreOnlineTest.testGetFeatureWriterAppend:449 » NullPointer
  H2DataStoreTest>OnlineTestCase.run:123->JDBCDataStoreOnlineTest.testGetFeatureWriterWithFilter:427 » NullPointer
  H2DataStoreTest>OnlineTestCase.run:123->JDBCDataStoreOnlineTest.testCreateSchemaUTMCRS:264 » NullPointer
  H2DataStoreTest>OnlineTestCase.run:123->JDBCDataStoreOnlineTest.testCreateSchemaFidColumn:302 » NullPointer
  H2DataStoreTest>OnlineTestCase.run:123->JDBCDataStoreOnlineTest.testRemoveSchema:167 » NullPointer
  H2DataStoreTest>OnlineTestCase.run:123->JDBCDataStoreOnlineTest.testGetFeatureReader:358 » NullPointer
  H2DataStoreTest>OnlineTestCase.run:123->JDBCDataStoreOnlineTest.testGetFeatureSource:353 » NullPointer
  H2DataStoreTest>OnlineTestCase.run:123->JDBCDataStoreOnlineTest.testGetFeatureWriter:407 » NullPointer
  H2DataStoreTest>OnlineTestCase.run:123->JDBCDataStoreOnlineTest.testGetSchema:62 » NullPointer
  H2DistanceFiltersTest>OnlineTestCase.run:123->JDBCDistanceFiltersTest.testDWithinGeographicFeet:61->JDBCDistanceFiltersTest.assertDWithinFilter:116 » NullPointer
  H2DistanceFiltersTest>OnlineTestCase.run:123->JDBCDistanceFiltersTest.testDWithinGeographicMile:52->JDBCDistanceFiltersTest.assertDWithinFilter:116 » NullPointer
  H2DistanceFiltersTest>OnlineTestCase.run:123->JDBCDistanceFiltersTest.testDWithinGeographicMeter:43->JDBCDistanceFiltersTest.assertDWithinFilter:116 » NullPointer
  H2DistanceFiltersTest>OnlineTestCase.run:123->JDBCDistanceFiltersTest.testBeyondGeographicFeet:97->JDBCDistanceFiltersTest.assertBeyondFilter:127 » NullPointer
  H2DistanceFiltersTest>OnlineTestCase.run:123->JDBCDistanceFiltersTest.testBeyondGeographicMile:88->JDBCDistanceFiltersTest.assertBeyondFilter:127 » NullPointer
  H2DistanceFiltersTest>OnlineTestCase.run:123->JDBCDistanceFiltersTest.testBeyondGeographicKm:70->JDBCDistanceFiltersTest.assertBeyondFilter:127 » NullPointer
  H2DistanceFiltersTest>OnlineTestCase.run:123->JDBCDistanceFiltersTest.testDWithinGeographicKm:34->JDBCDistanceFiltersTest.assertDWithinFilter:116 » NullPointer
  H2DistanceFiltersTest>OnlineTestCase.run:123->JDBCDistanceFiltersTest.testBeyondGeographicMeter:79->JDBCDistanceFiltersTest.assertBeyondFilter:127 » NullPointer
  H2FeatureCollectionTest>OnlineTestCase.run:123->JDBCFeatureCollectionOnlineTest.testAdd:111 » NullPointer
  H2FeatureCollectionTest>OnlineTestCase.run:123->JDBCFeatureCollectionOnlineTest.testSize:90 » NullPointer
  H2FeatureCollectionTest>OnlineTestCase.run:123->JDBCFeatureCollectionOnlineTest.testSubCollection:94 » NullPointer
  H2FeatureCollectionTest>OnlineTestCase.run:123->JDBCFeatureCollectionOnlineTest.testBounds:80 » NullPointer
  H2FeatureCollectionTest>OnlineTestCase.run:123->JDBCFeatureCollectionOnlineTest.testIterator:57 » NullPointer
  H2FeatureLockingTest>OnlineTestCase.run:123->JDBCFeatureLockingOnlineTest.testModifyLockedFeatures:286 » NullPointer
  H2FeatureLockingTest>OnlineTestCase.run:123->JDBCFeatureLockingOnlineTest.testDeleteLockedFeatures:260 » NullPointer
  H2FeatureLockingTest>OnlineTestCase.run:123->JDBCFeatureLockingOnlineTest.testUnlockFeatures:191 » NullPointer
  H2FeatureLockingTest>OnlineTestCase.run:123->JDBCFeatureLockingOnlineTest.testLockFeaturesWithFilter:108 » NullPointer
  H2FeatureLockingTest>OnlineTestCase.run:123->JDBCFeatureLockingOnlineTest.testUnlockFeaturesInvalidFilter:234 » NullPointer
  H2FeatureLockingTest>OnlineTestCase.run:123->JDBCFeatureLockingOnlineTest.testLockFeaturesWithInvalidFilter:150 » NullPointer
  H2FeatureLockingTest>OnlineTestCase.run:123->JDBCFeatureLockingOnlineTest.testLockFeaturesWithInvalidQuery:170 » NullPointer
  H2FeatureLockingTest>OnlineTestCase.run:123->JDBCFeatureLockingOnlineTest.testLockFeatures:58 » NullPointer
  H2FeatureReaderTest>OnlineTestCase.run:123->JDBCFeatureReaderOnlineTest.testNext:40 » NullPointer
  H2FeatureSourceExposePkTest>OnlineTestCase.run:123->JDBCFeatureSourceExposePkOnlineTest.testSchema:38 » NullPointer
  H2FeatureSourceExposePkTest>OnlineTestCase.run:123->JDBCFeatureSourceOnlineTest.testQueryCapabilitiesReliableFid:387 » NullPointer
  H2FeatureSourceExposePkTest>OnlineTestCase.run:123->JDBCFeatureSourceOnlineTest.testFeatureIteratorNextContract:421 » NullPointer
  H2FeatureSourceExposePkTest>OnlineTestCase.run:123->JDBCFeatureSourceOnlineTest.testRendererBehaviour:363 » NullPointer
  H2FeatureSourceExposePkTest>OnlineTestCase.run:123->JDBCFeatureSourceOnlineTest.testGetFeaturesWithFilter:134 » NullPointer
  H2FeatureSourceExposePkTest>OnlineTestCase.run:123->JDBCFeatureSourceOnlineTest.testCount:109 » NullPointer
  H2FeatureSourceExposePkTest>OnlineTestCase.run:123->JDBCFeatureSourceOnlineTest.testGetFeaturesWithOffset:291 » NullPointer
  H2FeatureSourceExposePkTest>OnlineTestCase.run:123->JDBCFeatureSourceOnlineTest.testCaseInsensitiveFilter:181 » NullPointer
  H2FeatureSourceExposePkTest>OnlineTestCase.run:123->JDBCFeatureSourceOnlineTest.testGetFeaturesWithSort:224 » NullPointer
  H2FeatureSourceExposePkTest>OnlineTestCase.run:123->JDBCFeatureSourceOnlineTest.testNaturalSortingdesc:407 » NullPointer
  H2FeatureSourceExposePkTest>OnlineTestCase.run:123->JDBCFeatureSourceOnlineTest.testQueryCapabilitiesSort:374 » NullPointer
  H2FeatureSourceExposePkTest>OnlineTestCase.run:123->JDBCFeatureSourceOnlineTest.testNaturalSortingAsc:393 » NullPointer
  H2FeatureSourceExposePkTest>OnlineTestCase.run:123->JDBCFeatureSourceOnlineTest.testGetFeaturesWithOffsetLimitAndPostFilter:334 » NullPointer
  H2FeatureSourceExposePkTest>OnlineTestCase.run:123->JDBCFeatureSourceOnlineTest.testGetFeaturesWithMax:269 » NullPointer
  H2FeatureSourceExposePkTest>OnlineTestCase.run:123->JDBCFeatureSourceOnlineTest.testGeometryFactoryHint:469 » NullPointer
  H2FeatureSourceExposePkTest>OnlineTestCase.run:123->JDBCFeatureSourceOnlineTest.testGetFeaturesWithQuery:189 » NullPointer
  H2FeatureSourceExposePkTest>OnlineTestCase.run:123->JDBCFeatureSourceOnlineTest.testConversionFilter:454 » NullPointer
  H2FeatureSourceExposePkTest>OnlineTestCase.run:123->JDBCFeatureSourceOnlineTest.testGetFeaturesWithLogicFilter:163 » NullPointer
  H2FeatureSourceExposePkTest>OnlineTestCase.run:123->JDBCFeatureSourceOnlineTest.testCountWithOffsetLimit:125 » NullPointer
  H2FeatureSourceExposePkTest>OnlineTestCase.run:123->JDBCFeatureSourceOnlineTest.testBoundsWithQuery:93 » NullPointer
  H2FeatureSourceExposePkTest>OnlineTestCase.run:123->JDBCFeatureSourceOnlineTest.testFeatureIteratorEmptyContract:429 » NullPointer
  H2FeatureSourceExposePkTest>OnlineTestCase.run:123->JDBCFeatureSourceOnlineTest.testGetFeatures:129 » NullPointer
  H2FeatureSourceExposePkTest>OnlineTestCase.run:123->JDBCFeatureSourceOnlineTest.testBounds:83 » NullPointer
  H2FeatureSourceExposePkTest>OnlineTestCase.run:123->JDBCFeatureSourceOnlineTest.testCountWithFilter:113 » NullPointer
  H2FeatureSourceExposePkTest>OnlineTestCase.run:123->JDBCFeatureSourceOnlineTest.testNotFilter:461 » NullPointer
  H2FeatureSourceExposePkTest>OnlineTestCase.run:123->JDBCFeatureSourceOnlineTest.testGetFeaturesWithArithmeticOpFilter:490 » NullPointer
  H2FeatureSourceExposePkTest>OnlineTestCase.run:123->JDBCFeatureSourceOnlineTest.testGetFeaturesWithOffsetLimit:312 » NullPointer
  H2FeatureSourceExposePkTest>OnlineTestCase.run:123->JDBCFeatureSourceOnlineTest.testAcceptsVisitor:510 » NullPointer
  H2FeatureSourceExposePkTest>OnlineTestCase.run:123->JDBCFeatureSourceOnlineTest.testLikeFilter:441 » NullPointer
  H2FeatureSourceTest>OnlineTestCase.run:123->JDBCFeatureSourceOnlineTest.testQueryCapabilitiesReliableFid:387 » NullPointer
  H2FeatureSourceTest>OnlineTestCase.run:123->JDBCFeatureSourceOnlineTest.testFeatureIteratorNextContract:421 » NullPointer
  H2FeatureSourceTest>OnlineTestCase.run:123->JDBCFeatureSourceOnlineTest.testRendererBehaviour:363 » NullPointer
  H2FeatureSourceTest>OnlineTestCase.run:123->JDBCFeatureSourceOnlineTest.testGetFeaturesWithFilter:134 » NullPointer
  H2FeatureSourceTest>OnlineTestCase.run:123->JDBCFeatureSourceOnlineTest.testCount:109 » NullPointer
  H2FeatureSourceTest>OnlineTestCase.run:123->JDBCFeatureSourceOnlineTest.testGetFeaturesWithOffset:291 » NullPointer
  H2FeatureSourceTest>OnlineTestCase.run:123->JDBCFeatureSourceOnlineTest.testCaseInsensitiveFilter:181 » NullPointer
  H2FeatureSourceTest>OnlineTestCase.run:123->JDBCFeatureSourceOnlineTest.testGetFeaturesWithSort:224 » NullPointer
  H2FeatureSourceTest>OnlineTestCase.run:123->JDBCFeatureSourceOnlineTest.testNaturalSortingdesc:407 » NullPointer
  H2FeatureSourceTest>OnlineTestCase.run:123->JDBCFeatureSourceOnlineTest.testQueryCapabilitiesSort:374 » NullPointer
  H2FeatureSourceTest>OnlineTestCase.run:123->JDBCFeatureSourceOnlineTest.testNaturalSortingAsc:393 » NullPointer
  H2FeatureSourceTest>OnlineTestCase.run:123->JDBCFeatureSourceOnlineTest.testGetFeaturesWithOffsetLimitAndPostFilter:334 » NullPointer
  H2FeatureSourceTest>OnlineTestCase.run:123->JDBCFeatureSourceOnlineTest.testGetFeaturesWithMax:269 » NullPointer
  H2FeatureSourceTest>OnlineTestCase.run:123->JDBCFeatureSourceOnlineTest.testGeometryFactoryHint:469 » NullPointer
  H2FeatureSourceTest>OnlineTestCase.run:123->JDBCFeatureSourceOnlineTest.testGetFeaturesWithQuery:189 » NullPointer
  H2FeatureSourceTest>OnlineTestCase.run:123->JDBCFeatureSourceOnlineTest.testConversionFilter:454 » NullPointer
  H2FeatureSourceTest>OnlineTestCase.run:123->JDBCFeatureSourceOnlineTest.testGetFeaturesWithLogicFilter:163 » NullPointer
  H2FeatureSourceTest>OnlineTestCase.run:123->JDBCFeatureSourceOnlineTest.testCountWithOffsetLimit:125 » NullPointer
  H2FeatureSourceTest>OnlineTestCase.run:123->JDBCFeatureSourceOnlineTest.testBoundsWithQuery:93 » NullPointer
  H2FeatureSourceTest>OnlineTestCase.run:123->JDBCFeatureSourceOnlineTest.testFeatureIteratorEmptyContract:429 » NullPointer
  H2FeatureSourceTest>OnlineTestCase.run:123->JDBCFeatureSourceOnlineTest.testGetFeatures:129 » NullPointer
  H2FeatureSourceTest>OnlineTestCase.run:123->JDBCFeatureSourceOnlineTest.testBounds:83 » NullPointer
  H2FeatureSourceTest>OnlineTestCase.run:123->JDBCFeatureSourceOnlineTest.testCountWithFilter:113 » NullPointer
  H2FeatureSourceTest>OnlineTestCase.run:123->JDBCFeatureSourceOnlineTest.testNotFilter:461 » NullPointer
  H2FeatureSourceTest>OnlineTestCase.run:123->JDBCFeatureSourceOnlineTest.testSchema:70 » NullPointer
  H2FeatureSourceTest>OnlineTestCase.run:123->JDBCFeatureSourceOnlineTest.testGetFeaturesWithArithmeticOpFilter:490 » NullPointer
  H2FeatureSourceTest>OnlineTestCase.run:123->JDBCFeatureSourceOnlineTest.testGetFeaturesWithOffsetLimit:312 » NullPointer
  H2FeatureSourceTest>OnlineTestCase.run:123->JDBCFeatureSourceOnlineTest.testAcceptsVisitor:510 » NullPointer
  H2FeatureSourceTest>OnlineTestCase.run:123->JDBCFeatureSourceOnlineTest.testLikeFilter:441 » NullPointer
  H2FeatureStoreExposedPkTest>OnlineTestCase.run:123->JDBCFeatureStoreExposePkOnlineTest.testModifyExposedPk:53 » NullPointer
  H2FeatureStoreExposedPkTest>OnlineTestCase.run:123->JDBCFeatureStoreOnlineTest.testAddFeatures:76 » NullPointer
  H2FeatureStoreExposedPkTest>OnlineTestCase.run:123->JDBCFeatureStoreOnlineTest.testAddNullAttributes:270 » NullPointer
  H2FeatureStoreExposedPkTest>OnlineTestCase.run:123->JDBCFeatureStoreOnlineTest.testModifyFeatures:322 » NullPointer
  H2FeatureStoreExposedPkTest>OnlineTestCase.run:123->JDBCFeatureStoreOnlineTest.testModifyFeaturesSingleAttribute:389 » NullPointer
  H2FeatureStoreExposedPkTest>OnlineTestCase.run:123->JDBCFeatureStoreOnlineTest.testMultithreadedAddFeatures:124 » NullPointer
  H2FeatureStoreExposedPkTest>OnlineTestCase.run:123->JDBCFeatureStoreOnlineTest.testModifyNullAttributes:280 » NullPointer
  H2FeatureStoreExposedPkTest>OnlineTestCase.run:123->JDBCFeatureStoreOnlineTest.testModifyMadeUpGeometry:364 » NullPointer
  H2FeatureStoreExposedPkTest>OnlineTestCase.run:123->JDBCFeatureStoreOnlineTest.testAddFeaturesUseProvidedFid:159 » NullPointer
  H2FeatureStoreExposedPkTest>OnlineTestCase.run:123->JDBCFeatureStoreOnlineTest.testModifyGeometry:345 » NullPointer
  H2FeatureStoreExposedPkTest>OnlineTestCase.run:123->JDBCFeatureStoreOnlineTest.testSetFeatures:289 » NullPointer
  H2FeatureStoreExposedPkTest>OnlineTestCase.run:123->JDBCFeatureStoreOnlineTest.testRemoveFeatures:418 » NullPointer
  H2FeatureStoreExposedPkTest>OnlineTestCase.run:123->JDBCFeatureStoreOnlineTest.testRemoveFeaturesWithInvalidFilter:432 » NullPointer
  H2FeatureStoreExposedPkTest>OnlineTestCase.run:123->JDBCFeatureStoreOnlineTest.testModifyFeaturesInvalidFilter:404 » NullPointer
  H2FeatureStoreTest>OnlineTestCase.run:123->JDBCFeatureStoreOnlineTest.testAddFeatures:76 » NullPointer
  H2FeatureStoreTest>OnlineTestCase.run:123->JDBCFeatureStoreOnlineTest.testAddNullAttributes:270 » NullPointer
  H2FeatureStoreTest>OnlineTestCase.run:123->JDBCFeatureStoreOnlineTest.testModifyFeatures:322 » NullPointer
  H2FeatureStoreTest>OnlineTestCase.run:123->JDBCFeatureStoreOnlineTest.testModifyFeaturesSingleAttribute:389 » NullPointer
  H2FeatureStoreTest>OnlineTestCase.run:123->JDBCFeatureStoreOnlineTest.testMultithreadedAddFeatures:124 » NullPointer
  H2FeatureStoreTest>OnlineTestCase.run:123->JDBCFeatureStoreOnlineTest.testModifyNullAttributes:280 » NullPointer
  H2FeatureStoreTest>OnlineTestCase.run:123->JDBCFeatureStoreOnlineTest.testModifyMadeUpGeometry:364 » NullPointer
  H2FeatureStoreTest>OnlineTestCase.run:123->JDBCFeatureStoreOnlineTest.testAddFeaturesUseProvidedFid:159 » NullPointer
  H2FeatureStoreTest>OnlineTestCase.run:123->JDBCFeatureStoreOnlineTest.testModifyGeometry:345 » NullPointer
  H2FeatureStoreTest>OnlineTestCase.run:123->JDBCFeatureStoreOnlineTest.testSetFeatures:289 » NullPointer
  H2FeatureStoreTest>OnlineTestCase.run:123->JDBCFeatureStoreOnlineTest.testRemoveFeatures:418 » NullPointer
  H2FeatureStoreTest>OnlineTestCase.run:123->JDBCFeatureStoreOnlineTest.testRemoveFeaturesWithInvalidFilter:432 » NullPointer
  H2FeatureStoreTest>OnlineTestCase.run:123->JDBCFeatureStoreOnlineTest.testModifyFeaturesInvalidFilter:404 » NullPointer
  H2GeometryTest>OnlineTestCase.run:123->JDBCGeometryOnlineTest.testGeometry:81->JDBCGeometryOnlineTest.checkGeometryType:107 » IO
  H2GeometryTest>OnlineTestCase.run:123->JDBCGeometryOnlineTest.testGeometryCollection:89->JDBCGeometryOnlineTest.checkGeometryType:107 » IO
  H2GeometryTest>OnlineTestCase.run:123->JDBCGeometryOnlineTest.testMultiPolygon:73->JDBCGeometryOnlineTest.checkGeometryType:107 » IO
  H2GeometryTest>OnlineTestCase.run:123->JDBCGeometryOnlineTest.testPoint:49->JDBCGeometryOnlineTest.checkGeometryType:107 » IO
  H2GeometryTest>OnlineTestCase.run:123->JDBCGeometryOnlineTest.testLineString:53->JDBCGeometryOnlineTest.checkGeometryType:107 » IO
  H2GeometryTest>OnlineTestCase.run:123->JDBCGeometryOnlineTest.testPolygon:61->JDBCGeometryOnlineTest.checkGeometryType:107 » IO
  H2GeometryTest>OnlineTestCase.run:123->JDBCGeometryOnlineTest.testMultiLineString:69->JDBCGeometryOnlineTest.checkGeometryType:107 » IO
  H2GeometryTest>OnlineTestCase.run:123->JDBCGeometryOnlineTest.testMultiPoint:65->JDBCGeometryOnlineTest.checkGeometryType:107 » IO
  H2JDBCTransactionTest>OnlineTestCase.run:123->JDBCTransactionOnlineTest.testSerialTransactions:99 » NullPointer
  H2JDBCTransactionTest>OnlineTestCase.run:123->JDBCTransactionOnlineTest.testNoCommit:59 » NullPointer
  H2JDBCTransactionTest>OnlineTestCase.run:123->JDBCTransactionOnlineTest.testCommit:44 » NullPointer
  H2JoinTest>OnlineTestCase.run:123->JDBCJoinOnlineTest.testSimpleJoin:44->JDBCJoinOnlineTest.doTestSimpleJoin:67 » NullPointer
  H2JoinTest>OnlineTestCase.run:123->JDBCJoinOnlineTest.testOuterJoin:490->JDBCJoinOnlineTest.doTestOuterJoin:495 » NullPointer
  H2JoinTest>OnlineTestCase.run:123->JDBCJoinOnlineTest.testSimpleJoinWithPostFilterNoProperties:308->JDBCJoinOnlineTest.doTestSimpleJoinWithPostFilterNoProperties:313 » NullPointer
  H2JoinTest>OnlineTestCase.run:123->JDBCJoinOnlineTest.testSimpleJoinWithFilterNoProperties:230->JDBCJoinOnlineTest.doTestSimpleJoinWithFilterNoProperties:235 » NullPointer
  H2JoinTest>OnlineTestCase.run:123->JDBCJoinOnlineTest.testSimpleJoinOnPrimaryKey:110 » NullPointer
  H2JoinTest>OnlineTestCase.run:123->JDBCJoinOnlineTest.testSimpleJoinWithFilterCount:259->JDBCJoinOnlineTest.doTestSimpleJoinWithFilterCount:264 » NullPointer
  H2JoinTest>OnlineTestCase.run:123->JDBCJoinOnlineTest.testJoinMoreThanTwo:521->JDBCJoinOnlineTest.doJoinMoreThanTwo:526 » NullPointer
  H2JoinTest>OnlineTestCase.run:123->JDBCJoinOnlineTest.testJoinSchema:49 » NullPointer
  H2JoinTest>OnlineTestCase.run:123->JDBCJoinOnlineTest.testSimpleJoinWithSort:342->JDBCJoinOnlineTest.doTestSimpleJoinWithSort:347 » NullPointer
  H2JoinTest>OnlineTestCase.run:123->JDBCJoinOnlineTest.testSpatialJoin:429->JDBCJoinOnlineTest.doTestSpatialJoin:433 » NullPointer
  H2JoinTest>OnlineTestCase.run:123->JDBCJoinOnlineTest.testSimpleJoinInvertedAliases:153->JDBCJoinOnlineTest.doTestSimpleJoinInvertedAliases:158 » NullPointer
  H2JoinTest>OnlineTestCase.run:123->JDBCJoinOnlineTest.testSimpleJoinWithFilter:199->JDBCJoinOnlineTest.doTestSimpleJoinWithFilter:204 » NullPointer
  H2JoinTest>OnlineTestCase.run:123->JDBCJoinOnlineTest.testSimpleJoinWithLimitOffset:367->JDBCJoinOnlineTest.doTestSimpleJoinWithLimitOffset:372 » NullPointer
  H2JoinTest>OnlineTestCase.run:123->JDBCJoinOnlineTest.testSelfJoin:397->JDBCJoinOnlineTest.doTestSelfJoin:402 » NullPointer
  H2JoinTest>OnlineTestCase.run:123->JDBCJoinOnlineTest.testSimpleJoinWithPostFilter:277->JDBCJoinOnlineTest.doTestSimpleJoinWithPostFilter:282 » NullPointer
  H2SpatialFiltersTest>OnlineTestCase.run:123->JDBCSpatialFiltersOnlineTest.testContainsFilter:156 » NullPointer
  H2SpatialFiltersTest>OnlineTestCase.run:123->JDBCSpatialFiltersOnlineTest.testGeometryCollection:232 » NullPointer
  H2SpatialFiltersTest>OnlineTestCase.run:123->JDBCSpatialFiltersOnlineTest.testWithinFilter:174 » NullPointer
  H2SpatialFiltersTest>OnlineTestCase.run:123->JDBCSpatialFiltersOnlineTest.testIntersectsFilter:121 » NullPointer
  H2SpatialFiltersTest>OnlineTestCase.run:123->JDBCSpatialFiltersOnlineTest.testDisjointFilter:187 » NullPointer
  H2SpatialFiltersTest>OnlineTestCase.run:123->JDBCSpatialFiltersOnlineTest.testTouchesFilter:143 » NullPointer
  H2SpatialFiltersTest>OnlineTestCase.run:123->JDBCSpatialFiltersOnlineTest.testEqualsFilter:195 » NullPointer
  H2SpatialFiltersTest>OnlineTestCase.run:123->JDBCSpatialFiltersOnlineTest.testBboxFilterDefault:99 » NullPointer
  H2SpatialFiltersTest>OnlineTestCase.run:123->JDBCSpatialFiltersOnlineTest.testIntersectsRingFilter:132 » NullPointer
  H2SpatialFiltersTest>OnlineTestCase.run:123->JDBCSpatialFiltersOnlineTest.testCrossesFilter:110 » NullPointer
  H2SpatialFiltersTest>OnlineTestCase.run:123->JDBCSpatialFiltersOnlineTest.testBboxFilter:91 » NullPointer
  H2TypeNamesTest>OnlineTestCase.run:123->JDBCTypeNamesOnlineTest.testTypeNames:36 » NullPointer
  H2VirtualTableTest>OnlineTestCase.run:123->JDBCVirtualTableOnlineTest.testInvalidView:275 » NullPointer
  H2VirtualTableTest>OnlineTestCase.run:123->JDBCVirtualTableOnlineTest.testRiverReducedCommentSchema:136 » NullPointer
  H2VirtualTableTest>OnlineTestCase.run:123->JDBCVirtualTableOnlineTest.testWhereParam:225 » NullPointer
  H2VirtualTableTest>OnlineTestCase.run:123->JDBCVirtualTableOnlineTest.testMulParamValid:242 » NullPointer
  H2VirtualTableTest>OnlineTestCase.run:123->JDBCVirtualTableOnlineTest.testMulParamInvalid:259 » NullPointer
  H2VirtualTableTest>OnlineTestCase.run:123->JDBCVirtualTableOnlineTest.testListAll:159 » NullPointer
  H2VirtualTableTest>OnlineTestCase.run:123->JDBCVirtualTableOnlineTest.testRiverReducedSchema:129 » NullPointer
  H2VirtualTableTest>OnlineTestCase.run:123->JDBCVirtualTableOnlineTest.testJoinViews:344 » NullPointer
  H2VirtualTableTest>OnlineTestCase.run:123->JDBCVirtualTableOnlineTest.testGetFeatureId:193 » NullPointer
  H2VirtualTableTest>OnlineTestCase.run:123->JDBCVirtualTableOnlineTest.testBounds:174 » NullPointer
  H2VirtualTableTest>OnlineTestCase.run:123->JDBCVirtualTableOnlineTest.testInvalidQuery:180 » NullPointer
  H2VirtualTableTest>OnlineTestCase.run:123->JDBCVirtualTableOnlineTest.testGetFeatureById:207 » NullPointer
  H2DataStoreTest>OnlineTestCase.run:123->JDBCDataStoreOnlineTest.testSimpleIndex:180 » NullPointer
  H2DataStoreTest>OnlineTestCase.run:123->JDBCDataStoreOnlineTest.testCreateSchemaWithConstraints:122 » NullPointer
  H2DataStoreTest>OnlineTestCase.run:123->JDBCDataStoreOnlineTest.testMultiColumnIndex:221 » NullPointer
  H2DataStoreTest>OnlineTestCase.run:123->JDBCDataStoreOnlineTest.testCreateSchema:80 » NullPointer
  H2DataStoreTest>OnlineTestCase.run:123->JDBCDataStoreOnlineTest.testGetNames:57 » NullPointer
  H2DataStoreTest>OnlineTestCase.run:123->JDBCDataStoreOnlineTest.testGetFeatureWriterAppend:449 » NullPointer
  H2DataStoreTest>OnlineTestCase.run:123->JDBCDataStoreOnlineTest.testGetFeatureWriterWithFilter:427 » NullPointer
  H2DataStoreTest>OnlineTestCase.run:123->JDBCDataStoreOnlineTest.testCreateSchemaUTMCRS:264 » NullPointer
  H2DataStoreTest>OnlineTestCase.run:123->JDBCDataStoreOnlineTest.testCreateSchemaFidColumn:302 » NullPointer
  H2DataStoreTest>OnlineTestCase.run:123->JDBCDataStoreOnlineTest.testRemoveSchema:167 » NullPointer
  H2DataStoreTest>OnlineTestCase.run:123->JDBCDataStoreOnlineTest.testGetFeatureReader:358 » NullPointer
  H2DataStoreTest>OnlineTestCase.run:123->JDBCDataStoreOnlineTest.testGetFeatureSource:353 » NullPointer
  H2DataStoreTest>OnlineTestCase.run:123->JDBCDataStoreOnlineTest.testGetFeatureWriter:407 » NullPointer
  H2DataStoreTest>OnlineTestCase.run:123->JDBCDataStoreOnlineTest.testGetSchema:62 » NullPointer

Tests run: 335, Failures: 0, Errors: 244, Skipped: 0

[JENKINS] Recording test results
Started calculate disk usage of build
Finished Calculation of disk usage of build in 0 seconds
Started calculate disk usage of workspace
Finished Calculation of disk usage of workspace in 0 seconds
[INFO] ------------------------------------------------------------------------
[INFO] Reactor Summary:
[INFO] 
[INFO] GeoTools 19-SNAPSHOT ............................... SUCCESS [  5.405 s]
[INFO] Build tools for Geotools 2 ......................... SUCCESS [  0.247 s]
[INFO] Maven plugins for Geotools 2 ....................... SUCCESS [  0.242 s]
[INFO] JAR files collector ................................ SUCCESS [  3.871 s]
[INFO] Cross-modules javadoc .............................. SUCCESS [  5.527 s]
[INFO] JJTree and JavaCC compilers plugin ................. SUCCESS [  3.213 s]
[INFO] Geotools modules ................................... SUCCESS [  0.190 s]
[INFO] Geotools libraries ................................. SUCCESS [  0.225 s]
[INFO] Open GIS Interfaces ................................ SUCCESS [  5.666 s]
[INFO] Metadata ........................................... SUCCESS [  8.972 s]
[INFO] Sample data module ................................. SUCCESS [  4.855 s]
[INFO] Referencing services ............................... SUCCESS [ 11.333 s]
[INFO] API interfaces ..................................... SUCCESS [  4.469 s]
[INFO] Geotools plugins ................................... SUCCESS [  0.217 s]
[INFO] EPSG Authority Service using HSQL database ......... SUCCESS [ 20.609 s]
[INFO] Main module ........................................ SUCCESS [ 25.334 s]
[INFO] Geotools extensions ................................ SUCCESS [  0.225 s]
[INFO] XML Parsing ........................................ SUCCESS [  0.225 s]
[INFO] XML Parsing ........................................ SUCCESS [  8.778 s]
[INFO] Feature Based Graphs and Networks .................. SUCCESS [  5.858 s]
[INFO] XML Code Generation Support ........................ SUCCESS [  3.207 s]
[INFO] EPSG Authority Service using WKT file .............. SUCCESS [  5.958 s]
[INFO] OGC CQL to Filter parser ........................... SUCCESS [  7.423 s]
[INFO] Grid Coverage module ............................... SUCCESS [ 29.998 s]
[INFO] DataStore Support .................................. SUCCESS [  4.009 s]
[INFO] Property File DataStore ............................ SUCCESS [  3.789 s]
[INFO] GeoTIFF grid coverage exchange module .............. SUCCESS [ 10.471 s]
[INFO] JDBC DataStore Support ............................. SUCCESS [  7.106 s]
[INFO] JDBC DataStore Plugins ............................. SUCCESS [  0.216 s]
[INFO] H2 DataStore ....................................... FAILURE [ 37.519 s]
[INFO] Oracle DataStore ................................... SKIPPED
[INFO] PostGIS DataStore .................................. SKIPPED
[INFO] Shapefile module ................................... SKIPPED
[INFO] Feature transforming feature source wrapper ........ SKIPPED
[INFO] WorldImage datasource module ....................... SKIPPED
[INFO] imagemosaic datasource module ...................... SKIPPED
[INFO] ArcGrid datasource module .......................... SKIPPED
[INFO] GML2 XML Support ................................... SKIPPED
[INFO] GML3 XML Support ................................... SKIPPED
[INFO] Filter XML Support ................................. SKIPPED
[INFO] SLD XML Support .................................... SKIPPED
[INFO] Render ............................................. SKIPPED
[INFO] OGC Web Service Models ............................. SKIPPED
[INFO] Xlink Model ........................................ SKIPPED
[INFO] Open Web Services Model ............................ SKIPPED
[INFO] Filter Encoding Specification Model ................ SKIPPED
[INFO] Web Feature Service Model .......................... SKIPPED
[INFO] OWS XML Support .................................... SKIPPED
[INFO] Filter Encoding Specification XML Support .......... SKIPPED
[INFO] WFS XML Support .................................... SKIPPED
[INFO] XML Parsing Support ................................ SKIPPED
[INFO] Web Processing Service Model ....................... SKIPPED
[INFO] Web Coverage Service Model ......................... SKIPPED
[INFO] Catalog Services for the Web Model ................. SKIPPED
[INFO] Web Map Tile Service model ......................... SKIPPED
[INFO] ArcSDE plugin ...................................... SKIPPED
[INFO] ArcSDE dummy api ................................... SKIPPED
[INFO] ArcSDE support classes ............................. SKIPPED
[INFO] ArcSDE DataStore plugin ............................ SKIPPED
[INFO] Dynamic symbolizer module based on JFreeChart and Eastwood SKIPPED
[INFO] Extensions to EPSG authority factory ............... SKIPPED
[INFO] EPSG Authority Service using PostgreSQL database ... SKIPPED
[INFO] Feature-Pregeneralized ............................. SKIPPED
[INFO] grass raster datasource module ..................... SKIPPED
[INFO] GTopo30 datasource module .......................... SKIPPED
[INFO] ImageI/O-Ext based grid coverage readers ........... SKIPPED
[INFO] imagepyramid datasource module ..................... SKIPPED
[INFO] imagemosaic-jdbc module ............................ SKIPPED
[INFO] DB2 DataStore ...................................... SKIPPED
[INFO] MySQL DataStore .................................... SKIPPED
[INFO] SQL Server DataStore ............................... SKIPPED
[INFO] SpatiaLite DataStore ............................... SKIPPED
[INFO] Teradata DataStore ................................. SKIPPED
[INFO] JP2K based grid coverage readers ................... SKIPPED
[INFO] OGR DataStore Module ............................... SKIPPED
[INFO] Core OGR DataStore Module .......................... SKIPPED
[INFO] Bridj OGR DataStore Module ......................... SKIPPED
[INFO] JNI OGR DataStore Module ........................... SKIPPED
[INFO] Vertical coordinate transformations ................ SKIPPED
[INFO] Dynamic symbolizers for SVG symbols ................ SKIPPED
[INFO] Coverage Multidimensional Module ................... SKIPPED
[INFO] API interfaces ..................................... SKIPPED
[INFO] NetCDF gridcoverage module ......................... SKIPPED
[INFO] GRIB gridcoverage module ........................... SKIPPED
[INFO] GeoPackage Module .................................. SKIPPED
[INFO] Application Schema Support ......................... SKIPPED
[INFO] Application Schema Resolver ........................ SKIPPED
[INFO] Complex Features Support ........................... SKIPPED
[INFO] Application Schema DataAccess ...................... SKIPPED
[INFO] Sample DataAccess .................................. SKIPPED
[INFO] Brewer module ...................................... SKIPPED
[INFO] Vector grids ....................................... SKIPPED
[INFO] Validation Processor and Framework ................. SKIPPED
[INFO] Web Map Server client .............................. SKIPPED
[INFO] Geotools unsupported ............................... SKIPPED
[INFO] Process ............................................ SKIPPED
[INFO] Swing widgets ...................................... SKIPPED
[INFO] Tile Client ........................................ SKIPPED
[INFO] WMTS XML Support ................................... SKIPPED
[INFO] Web Map Tile Service Client ........................ SKIPPED
[INFO] KML XML Support .................................... SKIPPED
[INFO] WCS XML Support .................................... SKIPPED
[INFO] WPS XML Support .................................... SKIPPED
[INFO] WMS XML Support .................................... SKIPPED
[INFO] CSW XML Support .................................... SKIPPED
[INFO] Process Feature .................................... SKIPPED
[INFO] Process Raster ..................................... SKIPPED
[INFO] YSLD Parser/Encoder ................................ SKIPPED
[INFO] SWT widgets ........................................ SKIPPED
[INFO] GeoJSON Support .................................... SKIPPED
[INFO] Process Geometry ................................... SKIPPED
[INFO] MBTiles Module ..................................... SKIPPED
[INFO] WFS client module (NG) 19-SNAPSHOT ................. SKIPPED
[INFO] ------------------------------------------------------------------------
[INFO] BUILD FAILURE
[INFO] ------------------------------------------------------------------------
[INFO] Total time: 04:13 min
[INFO] Finished at: 2018-06-26T15:14:54-04:00
[INFO] ------------------------------------------------------------------------
Waiting for Jenkins to finish collecting data
[ERROR] Failed to execute goal org.apache.maven.plugins:maven-surefire-plugin:2.15:test (default-test) on project gt-jdbc-h2: There are test failures.
[ERROR] 
[ERROR] Please refer to /home/hudson/genie.jts/.jenkins/jobs/GeoTools/workspace/modules/plugin/jdbc/jdbc-h2/target/surefire-reports for the individual test results.
[ERROR] -> [Help 1]
[ERROR] 
[ERROR] To see the full stack trace of the errors, re-run Maven with the -e switch.
[ERROR] Re-run Maven using the -X switch to enable full debug logging.
[ERROR] 
[ERROR] For more information about the errors and possible solutions, please read the following articles:
[ERROR] [Help 1] http://cwiki.apache.org/confluence/display/MAVEN/MojoFailureException
[ERROR] 
[ERROR] After correcting the problems, you can resume the build with the command
[ERROR]   mvn <goals> -rf :gt-jdbc-h2
[JENKINS] Archiving /home/hudson/genie.jts/.jenkins/jobs/GeoTools/workspace/modules/ogc/net.opengis.wcs/pom.xml to org.geotools.ogc/net.opengis.wcs/19-SNAPSHOT/net.opengis.wcs-19-SNAPSHOT.pom
[JENKINS] Archiving /home/hudson/genie.jts/.jenkins/jobs/GeoTools/workspace/modules/plugin/ogr/ogr-core/pom.xml to org.geotools/gt-ogr-core/19-SNAPSHOT/gt-ogr-core-19-SNAPSHOT.pom
[JENKINS] Archiving /home/hudson/genie.jts/.jenkins/jobs/GeoTools/workspace/build/maven/pom.xml to org.geotools.maven/maven/19-SNAPSHOT/maven-19-SNAPSHOT.pom
[JENKINS] Archiving /home/hudson/genie.jts/.jenkins/jobs/GeoTools/workspace/modules/plugin/referencing3D/pom.xml to org.geotools/gt-referencing3D/19-SNAPSHOT/gt-referencing3D-19-SNAPSHOT.pom
[JENKINS] Archiving /home/hudson/genie.jts/.jenkins/jobs/GeoTools/workspace/modules/ogc/org.w3.xlink/pom.xml to org.geotools.ogc/org.w3.xlink/19-SNAPSHOT/org.w3.xlink-19-SNAPSHOT.pom
[JENKINS] Archiving /home/hudson/genie.jts/.jenkins/jobs/GeoTools/workspace/modules/plugin/arcsde/common/pom.xml to org.geotools/gt-arcsde-common/19-SNAPSHOT/gt-arcsde-common-19-SNAPSHOT.pom
[JENKINS] Archiving /home/hudson/genie.jts/.jenkins/jobs/GeoTools/workspace/modules/plugin/imagemosaic-jdbc/pom.xml to org.geotools/gt-imagemosaic-jdbc/19-SNAPSHOT/gt-imagemosaic-jdbc-19-SNAPSHOT.pom
[JENKINS] Archiving /home/hudson/genie.jts/.jenkins/jobs/GeoTools/workspace/modules/library/xml/pom.xml to org.geotools/gt-xml/19-SNAPSHOT/gt-xml-19-SNAPSHOT.pom
[JENKINS] Archiving /home/hudson/genie.jts/.jenkins/jobs/GeoTools/workspace/build/maven/javadoc/pom.xml to org.geotools.maven/javadoc/19-SNAPSHOT/javadoc-19-SNAPSHOT.pom
[JENKINS] Archiving /home/hudson/genie.jts/.jenkins/jobs/GeoTools/workspace/build/maven/javadoc/target/javadoc-19-SNAPSHOT.jar to org.geotools.maven/javadoc/19-SNAPSHOT/javadoc-19-SNAPSHOT.jar
[JENKINS] Archiving /home/hudson/genie.jts/.jenkins/jobs/GeoTools/workspace/build/maven/javadoc/target/javadoc-19-SNAPSHOT-sources.jar to org.geotools.maven/javadoc/19-SNAPSHOT/javadoc-19-SNAPSHOT-sources.jar
[JENKINS] Archiving /home/hudson/genie.jts/.jenkins/jobs/GeoTools/workspace/modules/library/api/pom.xml to org.geotools/gt-api/19-SNAPSHOT/gt-api-19-SNAPSHOT.pom
[JENKINS] Archiving /home/hudson/genie.jts/.jenkins/jobs/GeoTools/workspace/modules/library/api/target/gt-api-19-SNAPSHOT.jar to org.geotools/gt-api/19-SNAPSHOT/gt-api-19-SNAPSHOT.jar
[JENKINS] Archiving /home/hudson/genie.jts/.jenkins/jobs/GeoTools/workspace/modules/library/api/target/gt-api-19-SNAPSHOT-sources.jar to org.geotools/gt-api/19-SNAPSHOT/gt-api-19-SNAPSHOT-sources.jar
[JENKINS] Archiving /home/hudson/genie.jts/.jenkins/jobs/GeoTools/workspace/modules/extension/xsd/xsd-sld/pom.xml to org.geotools.xsd/gt-xsd-sld/19-SNAPSHOT/gt-xsd-sld-19-SNAPSHOT.pom
[JENKINS] Archiving /home/hudson/genie.jts/.jenkins/jobs/GeoTools/workspace/modules/plugin/jdbc/jdbc-teradata/pom.xml to org.geotools.jdbc/gt-jdbc-teradata/19-SNAPSHOT/gt-jdbc-teradata-19-SNAPSHOT.pom
[JENKINS] Archiving /home/hudson/genie.jts/.jenkins/jobs/GeoTools/workspace/modules/extension/xsd/xsd-core/pom.xml to org.geotools.xsd/gt-xsd-core/19-SNAPSHOT/gt-xsd-core-19-SNAPSHOT.pom
[JENKINS] Archiving /home/hudson/genie.jts/.jenkins/jobs/GeoTools/workspace/modules/extension/xsd/xsd-core/target/gt-xsd-core-19-SNAPSHOT.jar to org.geotools.xsd/gt-xsd-core/19-SNAPSHOT/gt-xsd-core-19-SNAPSHOT.jar
[JENKINS] Archiving /home/hudson/genie.jts/.jenkins/jobs/GeoTools/workspace/modules/extension/xsd/xsd-core/target/gt-xsd-core-19-SNAPSHOT-sources.jar to org.geotools.xsd/gt-xsd-core/19-SNAPSHOT/gt-xsd-core-19-SNAPSHOT-sources.jar
[JENKINS] Archiving /home/hudson/genie.jts/.jenkins/jobs/GeoTools/workspace/modules/plugin/epsg-hsql/pom.xml to org.geotools/gt-epsg-hsql/19-SNAPSHOT/gt-epsg-hsql-19-SNAPSHOT.pom
[JENKINS] Archiving /home/hudson/genie.jts/.jenkins/jobs/GeoTools/workspace/modules/plugin/epsg-hsql/target/gt-epsg-hsql-19-SNAPSHOT.jar to org.geotools/gt-epsg-hsql/19-SNAPSHOT/gt-epsg-hsql-19-SNAPSHOT.jar
[JENKINS] Archiving /home/hudson/genie.jts/.jenkins/jobs/GeoTools/workspace/modules/plugin/epsg-hsql/target/gt-epsg-hsql-19-SNAPSHOT-sources.jar to org.geotools/gt-epsg-hsql/19-SNAPSHOT/gt-epsg-hsql-19-SNAPSHOT-sources.jar
[JENKINS] Archiving /home/hudson/genie.jts/.jenkins/jobs/GeoTools/workspace/modules/extension/xsd/xsd-wcs/pom.xml to org.geotools.xsd/gt-xsd-wcs/19-SNAPSHOT/gt-xsd-wcs-19-SNAPSHOT.pom
[JENKINS] Archiving /home/hudson/genie.jts/.jenkins/jobs/GeoTools/workspace/modules/extension/tile-client/pom.xml to org.geotools/gt-tile-client/19-SNAPSHOT/gt-tile-client-19-SNAPSHOT.pom
[JENKINS] Archiving /home/hudson/genie.jts/.jenkins/jobs/GeoTools/workspace/modules/plugin/jdbc/jdbc-spatialite/pom.xml to org.geotools.jdbc/gt-jdbc-spatialite/19-SNAPSHOT/gt-jdbc-spatialite-19-SNAPSHOT.pom
[JENKINS] Archiving /home/hudson/genie.jts/.jenkins/jobs/GeoTools/workspace/modules/unsupported/process-feature/pom.xml to org.geotools/gt-process-feature/19-SNAPSHOT/gt-process-feature-19-SNAPSHOT.pom
[JENKINS] Archiving /home/hudson/genie.jts/.jenkins/jobs/GeoTools/workspace/modules/ogc/net.opengis.csw/pom.xml to org.geotools.ogc/net.opengis.csw/19-SNAPSHOT/net.opengis.csw-19-SNAPSHOT.pom
[JENKINS] Archiving /home/hudson/genie.jts/.jenkins/jobs/GeoTools/workspace/modules/plugin/jdbc/jdbc-db2/pom.xml to org.geotools.jdbc/gt-jdbc-db2/19-SNAPSHOT/gt-jdbc-db2-19-SNAPSHOT.pom
[JENKINS] Archiving /home/hudson/genie.jts/.jenkins/jobs/GeoTools/workspace/modules/extension/xsd/xsd-gml2/pom.xml to org.geotools.xsd/gt-xsd-gml2/19-SNAPSHOT/gt-xsd-gml2-19-SNAPSHOT.pom
[JENKINS] Archiving /home/hudson/genie.jts/.jenkins/jobs/GeoTools/workspace/modules/plugin/coverage-multidim/coverage-api/pom.xml to org.geotools/gt-coverage-api/19-SNAPSHOT/gt-coverage-api-19-SNAPSHOT.pom
[JENKINS] Archiving /home/hudson/genie.jts/.jenkins/jobs/GeoTools/workspace/modules/extension/xsd/xsd-gml3/pom.xml to org.geotools.xsd/gt-xsd-gml3/19-SNAPSHOT/gt-xsd-gml3-19-SNAPSHOT.pom
[JENKINS] Archiving /home/hudson/genie.jts/.jenkins/jobs/GeoTools/workspace/modules/unsupported/process-geometry/pom.xml to org.geotools/gt-process-geometry/19-SNAPSHOT/gt-process-geometry-19-SNAPSHOT.pom
[JENKINS] Archiving /home/hudson/genie.jts/.jenkins/jobs/GeoTools/workspace/modules/unsupported/mbtiles/pom.xml to org.geotools/gt-mbtiles/19-SNAPSHOT/gt-mbtiles-19-SNAPSHOT.pom
[JENKINS] Archiving /home/hudson/genie.jts/.jenkins/jobs/GeoTools/workspace/modules/plugin/ogr/ogr-jni/pom.xml to org.geotools/gt-ogr-jni/19-SNAPSHOT/gt-ogr-jni-19-SNAPSHOT.pom
[JENKINS] Archiving /home/hudson/genie.jts/.jenkins/jobs/GeoTools/workspace/modules/library/pom.xml to org.geotools/library/19-SNAPSHOT/library-19-SNAPSHOT.pom
[JENKINS] Archiving /home/hudson/genie.jts/.jenkins/jobs/GeoTools/workspace/modules/plugin/epsg-extension/pom.xml to org.geotools/gt-epsg-extension/19-SNAPSHOT/gt-epsg-extension-19-SNAPSHOT.pom
[JENKINS] Archiving /home/hudson/genie.jts/.jenkins/jobs/GeoTools/workspace/modules/extension/xsd/xsd-kml/pom.xml to org.geotools.xsd/gt-xsd-kml/19-SNAPSHOT/gt-xsd-kml-19-SNAPSHOT.pom
[JENKINS] Archiving /home/hudson/genie.jts/.jenkins/jobs/GeoTools/workspace/modules/extension/complex/pom.xml to org.geotools/gt-complex/19-SNAPSHOT/gt-complex-19-SNAPSHOT.pom
[JENKINS] Archiving /home/hudson/genie.jts/.jenkins/jobs/GeoTools/workspace/modules/plugin/image/pom.xml to org.geotools/gt-image/19-SNAPSHOT/gt-image-19-SNAPSHOT.pom
[JENKINS] Archiving /home/hudson/genie.jts/.jenkins/jobs/GeoTools/workspace/modules/extension/transform/pom.xml to org.geotools/gt-transform/19-SNAPSHOT/gt-transform-19-SNAPSHOT.pom
[JENKINS] Archiving /home/hudson/genie.jts/.jenkins/jobs/GeoTools/workspace/modules/extension/xsd/xsd-wmts/pom.xml to org.geotools.xsd/gt-xsd-wmts/19-SNAPSHOT/gt-xsd-wmts-19-SNAPSHOT.pom
[JENKINS] Archiving /home/hudson/genie.jts/.jenkins/jobs/GeoTools/workspace/modules/plugin/arcsde/pom.xml to org.geotools/arcsde-plugin/19-SNAPSHOT/arcsde-plugin-19-SNAPSHOT.pom
[JENKINS] Archiving /home/hudson/genie.jts/.jenkins/jobs/GeoTools/workspace/modules/unsupported/process/pom.xml to org.geotools/gt-process/19-SNAPSHOT/gt-process-19-SNAPSHOT.pom
[JENKINS] Archiving /home/hudson/genie.jts/.jenkins/jobs/GeoTools/workspace/modules/plugin/jdbc/jdbc-h2/pom.xml to org.geotools.jdbc/gt-jdbc-h2/19-SNAPSHOT/gt-jdbc-h2-19-SNAPSHOT.pom
[JENKINS] Archiving /home/hudson/genie.jts/.jenkins/jobs/GeoTools/workspace/modules/library/sample-data/pom.xml to org.geotools/gt-sample-data/19-SNAPSHOT/gt-sample-data-19-SNAPSHOT.pom
[JENKINS] Archiving /home/hudson/genie.jts/.jenkins/jobs/GeoTools/workspace/modules/library/sample-data/target/gt-sample-data-19-SNAPSHOT.jar to org.geotools/gt-sample-data/19-SNAPSHOT/gt-sample-data-19-SNAPSHOT.jar
[JENKINS] Archiving /home/hudson/genie.jts/.jenkins/jobs/GeoTools/workspace/modules/library/sample-data/target/gt-sample-data-19-SNAPSHOT-sources.jar to org.geotools/gt-sample-data/19-SNAPSHOT/gt-sample-data-19-SNAPSHOT-sources.jar
[JENKINS] Archiving /home/hudson/genie.jts/.jenkins/jobs/GeoTools/workspace/modules/plugin/geopkg/pom.xml to org.geotools/gt-geopkg/19-SNAPSHOT/gt-geopkg-19-SNAPSHOT.pom
[JENKINS] Archiving /home/hudson/genie.jts/.jenkins/jobs/GeoTools/workspace/modules/plugin/pom.xml to org.geotools/plugin/19-SNAPSHOT/plugin-19-SNAPSHOT.pom
[JENKINS] Archiving /home/hudson/genie.jts/.jenkins/jobs/GeoTools/workspace/modules/extension/app-schema/pom.xml to org.geotools/app-schema/19-SNAPSHOT/app-schema-19-SNAPSHOT.pom
[JENKINS] Archiving /home/hudson/genie.jts/.jenkins/jobs/GeoTools/workspace/modules/unsupported/geojson/pom.xml to org.geotools/gt-geojson/19-SNAPSHOT/gt-geojson-19-SNAPSHOT.pom
[JENKINS] Archiving /home/hudson/genie.jts/.jenkins/jobs/GeoTools/workspace/modules/plugin/coverage-multidim/grib/pom.xml to org.geotools/gt-grib/19-SNAPSHOT/gt-grib-19-SNAPSHOT.pom
[JENKINS] Archiving /home/hudson/genie.jts/.jenkins/jobs/GeoTools/workspace/modules/plugin/arcgrid/pom.xml to org.geotools/gt-arcgrid/19-SNAPSHOT/gt-arcgrid-19-SNAPSHOT.pom
[JENKINS] Archiving /home/hudson/genie.jts/.jenkins/jobs/GeoTools/workspace/modules/plugin/coverage-multidim/pom.xml to org.geotools/gt-coverage-multidim/19-SNAPSHOT/gt-coverage-multidim-19-SNAPSHOT.pom
[JENKINS] Archiving /home/hudson/genie.jts/.jenkins/jobs/GeoTools/workspace/modules/extension/grid/pom.xml to org.geotools/gt-grid/19-SNAPSHOT/gt-grid-19-SNAPSHOT.pom
[JENKINS] Archiving /home/hudson/genie.jts/.jenkins/jobs/GeoTools/workspace/build/maven/jar-collector/pom.xml to org.geotools.maven/jar-collector/19-SNAPSHOT/jar-collector-19-SNAPSHOT.pom
[JENKINS] Archiving /home/hudson/genie.jts/.jenkins/jobs/GeoTools/workspace/build/maven/jar-collector/target/jar-collector-19-SNAPSHOT.jar to org.geotools.maven/jar-collector/19-SNAPSHOT/jar-collector-19-SNAPSHOT.jar
[JENKINS] Archiving /home/hudson/genie.jts/.jenkins/jobs/GeoTools/workspace/build/maven/jar-collector/target/jar-collector-19-SNAPSHOT-sources.jar to org.geotools.maven/jar-collector/19-SNAPSHOT/jar-collector-19-SNAPSHOT-sources.jar
[JENKINS] Archiving /home/hudson/genie.jts/.jenkins/jobs/GeoTools/workspace/build/pom.xml to org.geotools.maven/build/19-SNAPSHOT/build-19-SNAPSHOT.pom
[JENKINS] Archiving /home/hudson/genie.jts/.jenkins/jobs/GeoTools/workspace/modules/unsupported/swing/pom.xml to org.geotools/gt-swing/19-SNAPSHOT/gt-swing-19-SNAPSHOT.pom
[JENKINS] Archiving /home/hudson/genie.jts/.jenkins/jobs/GeoTools/workspace/modules/ogc/net.opengis.wmts/pom.xml to org.geotools.ogc/net.opengis.wmts/19-SNAPSHOT/net.opengis.wmts-19-SNAPSHOT.pom
[JENKINS] Archiving /home/hudson/genie.jts/.jenkins/jobs/GeoTools/workspace/build/maven/xmlcodegen/pom.xml to org.geotools.maven/xmlcodegen/19-SNAPSHOT/xmlcodegen-19-SNAPSHOT.pom
[JENKINS] Archiving /home/hudson/genie.jts/.jenkins/jobs/GeoTools/workspace/build/maven/xmlcodegen/target/xmlcodegen-19-SNAPSHOT.jar to org.geotools.maven/xmlcodegen/19-SNAPSHOT/xmlcodegen-19-SNAPSHOT.jar
[JENKINS] Archiving /home/hudson/genie.jts/.jenkins/jobs/GeoTools/workspace/build/maven/xmlcodegen/target/xmlcodegen-19-SNAPSHOT-sources.jar to org.geotools.maven/xmlcodegen/19-SNAPSHOT/xmlcodegen-19-SNAPSHOT-sources.jar
[JENKINS] Archiving /home/hudson/genie.jts/.jenkins/jobs/GeoTools/workspace/modules/extension/xsd/xsd-csw/pom.xml to org.geotools.xsd/gt-xsd-csw/19-SNAPSHOT/gt-xsd-csw-19-SNAPSHOT.pom
[JENKINS] Archiving /home/hudson/genie.jts/.jenkins/jobs/GeoTools/workspace/modules/plugin/geotiff/pom.xml to org.geotools/gt-geotiff/19-SNAPSHOT/gt-geotiff-19-SNAPSHOT.pom
[JENKINS] Archiving /home/hudson/genie.jts/.jenkins/jobs/GeoTools/workspace/modules/plugin/geotiff/target/gt-geotiff-19-SNAPSHOT.jar to org.geotools/gt-geotiff/19-SNAPSHOT/gt-geotiff-19-SNAPSHOT.jar
[JENKINS] Archiving /home/hudson/genie.jts/.jenkins/jobs/GeoTools/workspace/modules/plugin/geotiff/target/gt-geotiff-19-SNAPSHOT-sources.jar to org.geotools/gt-geotiff/19-SNAPSHOT/gt-geotiff-19-SNAPSHOT-sources.jar
[JENKINS] Archiving /home/hudson/genie.jts/.jenkins/jobs/GeoTools/workspace/modules/plugin/jdbc/jdbc-oracle/pom.xml to org.geotools.jdbc/gt-jdbc-oracle/19-SNAPSHOT/gt-jdbc-oracle-19-SNAPSHOT.pom
[JENKINS] Archiving /home/hudson/genie.jts/.jenkins/jobs/GeoTools/workspace/modules/plugin/imagemosaic/pom.xml to org.geotools/gt-imagemosaic/19-SNAPSHOT/gt-imagemosaic-19-SNAPSHOT.pom
[JENKINS] Archiving /home/hudson/genie.jts/.jenkins/jobs/GeoTools/workspace/modules/plugin/jp2k/pom.xml to org.geotools/gt-jp2k/19-SNAPSHOT/gt-jp2k-19-SNAPSHOT.pom
[JENKINS] Archiving /home/hudson/genie.jts/.jenkins/jobs/GeoTools/workspace/modules/plugin/imagepyramid/pom.xml to org.geotools/gt-imagepyramid/19-SNAPSHOT/gt-imagepyramid-19-SNAPSHOT.pom
[JENKINS] Archiving /home/hudson/genie.jts/.jenkins/jobs/GeoTools/workspace/modules/library/referencing/pom.xml to org.geotools/gt-referencing/19-SNAPSHOT/gt-referencing-19-SNAPSHOT.pom
[JENKINS] Archiving /home/hudson/genie.jts/.jenkins/jobs/GeoTools/workspace/modules/library/referencing/target/gt-referencing-19-SNAPSHOT.jar to org.geotools/gt-referencing/19-SNAPSHOT/gt-referencing-19-SNAPSHOT.jar
[JENKINS] Archiving /home/hudson/genie.jts/.jenkins/jobs/GeoTools/workspace/modules/library/referencing/target/gt-referencing-19-SNAPSHOT-tests.jar to org.geotools/gt-referencing/19-SNAPSHOT/gt-referencing-19-SNAPSHOT-tests.jar
[JENKINS] Archiving /home/hudson/genie.jts/.jenkins/jobs/GeoTools/workspace/modules/library/referencing/target/gt-referencing-19-SNAPSHOT-sources.jar to org.geotools/gt-referencing/19-SNAPSHOT/gt-referencing-19-SNAPSHOT-sources.jar
[JENKINS] Archiving /home/hudson/genie.jts/.jenkins/jobs/GeoTools/workspace/modules/library/opengis/pom.xml to org.geotools/gt-opengis/19-SNAPSHOT/gt-opengis-19-SNAPSHOT.pom
[JENKINS] Archiving /home/hudson/genie.jts/.jenkins/jobs/GeoTools/workspace/modules/library/opengis/target/gt-opengis-19-SNAPSHOT.jar to org.geotools/gt-opengis/19-SNAPSHOT/gt-opengis-19-SNAPSHOT.jar
[JENKINS] Archiving /home/hudson/genie.jts/.jenkins/jobs/GeoTools/workspace/modules/library/opengis/target/gt-opengis-19-SNAPSHOT-sources.jar to org.geotools/gt-opengis/19-SNAPSHOT/gt-opengis-19-SNAPSHOT-sources.jar
[JENKINS] Archiving /home/hudson/genie.jts/.jenkins/jobs/GeoTools/workspace/modules/plugin/epsg-wkt/pom.xml to org.geotools/gt-epsg-wkt/19-SNAPSHOT/gt-epsg-wkt-19-SNAPSHOT.pom
[JENKINS] Archiving /home/hudson/genie.jts/.jenkins/jobs/GeoTools/workspace/modules/plugin/epsg-wkt/target/gt-epsg-wkt-19-SNAPSHOT.jar to org.geotools/gt-epsg-wkt/19-SNAPSHOT/gt-epsg-wkt-19-SNAPSHOT.jar
[JENKINS] Archiving /home/hudson/genie.jts/.jenkins/jobs/GeoTools/workspace/modules/plugin/epsg-wkt/target/gt-epsg-wkt-19-SNAPSHOT-sources.jar to org.geotools/gt-epsg-wkt/19-SNAPSHOT/gt-epsg-wkt-19-SNAPSHOT-sources.jar
[JENKINS] Archiving /home/hudson/genie.jts/.jenkins/jobs/GeoTools/workspace/modules/library/metadata/pom.xml to org.geotools/gt-metadata/19-SNAPSHOT/gt-metadata-19-SNAPSHOT.pom
[JENKINS] Archiving /home/hudson/genie.jts/.jenkins/jobs/GeoTools/workspace/modules/library/metadata/target/gt-metadata-19-SNAPSHOT.jar to org.geotools/gt-metadata/19-SNAPSHOT/gt-metadata-19-SNAPSHOT.jar
[JENKINS] Archiving /home/hudson/genie.jts/.jenkins/jobs/GeoTools/workspace/modules/library/metadata/target/gt-metadata-19-SNAPSHOT-sources.jar to org.geotools/gt-metadata/19-SNAPSHOT/gt-metadata-19-SNAPSHOT-sources.jar
[JENKINS] Archiving /home/hudson/genie.jts/.jenkins/jobs/GeoTools/workspace/modules/plugin/jdbc/pom.xml to org.geotools.jdbc/gt-jdbc/19-SNAPSHOT/gt-jdbc-19-SNAPSHOT.pom
[JENKINS] Archiving /home/hudson/genie.jts/.jenkins/jobs/GeoTools/workspace/modules/extension/validation/pom.xml to org.geotools/gt-validation/19-SNAPSHOT/gt-validation-19-SNAPSHOT.pom
[JENKINS] Archiving /home/hudson/genie.jts/.jenkins/jobs/GeoTools/workspace/modules/unsupported/wfs-ng/pom.xml to org.geotools/gt-wfs-ng/19-SNAPSHOT/gt-wfs-ng-19-SNAPSHOT.pom
[JENKINS] Archiving /home/hudson/genie.jts/.jenkins/jobs/GeoTools/workspace/modules/ogc/pom.xml to org.geotools/ogc/19-SNAPSHOT/ogc-19-SNAPSHOT.pom
[JENKINS] Archiving /home/hudson/genie.jts/.jenkins/jobs/GeoTools/workspace/modules/extension/xsd/xsd-fes/pom.xml to org.geotools.xsd/gt-xsd-fes/19-SNAPSHOT/gt-xsd-fes-19-SNAPSHOT.pom
[JENKINS] Archiving /home/hudson/genie.jts/.jenkins/jobs/GeoTools/workspace/modules/ogc/net.opengis.fes/pom.xml to org.geotools.ogc/net.opengis.fes/19-SNAPSHOT/net.opengis.fes-19-SNAPSHOT.pom
[JENKINS] Archiving /home/hudson/genie.jts/.jenkins/jobs/GeoTools/workspace/modules/plugin/arcsde/datastore/pom.xml to org.geotools/gt-arcsde/19-SNAPSHOT/gt-arcsde-19-SNAPSHOT.pom
[JENKINS] Archiving /home/hudson/genie.jts/.jenkins/jobs/GeoTools/workspace/modules/plugin/ogr/pom.xml to org.geotools/gt-ogr/19-SNAPSHOT/gt-ogr-19-SNAPSHOT.pom
[JENKINS] Archiving /home/hudson/genie.jts/.jenkins/jobs/GeoTools/workspace/modules/extension/xsd/xsd-filter/pom.xml to org.geotools.xsd/gt-xsd-filter/19-SNAPSHOT/gt-xsd-filter-19-SNAPSHOT.pom
[JENKINS] Archiving /home/hudson/genie.jts/.jenkins/jobs/GeoTools/workspace/modules/extension/app-schema/app-schema/pom.xml to org.geotools/gt-app-schema/19-SNAPSHOT/gt-app-schema-19-SNAPSHOT.pom
[JENKINS] Archiving /home/hudson/genie.jts/.jenkins/jobs/GeoTools/workspace/modules/ogc/net.opengis.ows/pom.xml to org.geotools.ogc/net.opengis.ows/19-SNAPSHOT/net.opengis.ows-19-SNAPSHOT.pom
[JENKINS] Archiving /home/hudson/genie.jts/.jenkins/jobs/GeoTools/workspace/modules/extension/wmts/pom.xml to org.geotools/gt-wmts/19-SNAPSHOT/gt-wmts-19-SNAPSHOT.pom
[JENKINS] Archiving /home/hudson/genie.jts/.jenkins/jobs/GeoTools/workspace/modules/extension/ysld/pom.xml to org.geotools/gt-ysld/19-SNAPSHOT/gt-ysld-19-SNAPSHOT.pom
[JENKINS] Archiving /home/hudson/genie.jts/.jenkins/jobs/GeoTools/workspace/modules/plugin/shapefile/pom.xml to org.geotools/gt-shapefile/19-SNAPSHOT/gt-shapefile-19-SNAPSHOT.pom
[JENKINS] Archiving /home/hudson/genie.jts/.jenkins/jobs/GeoTools/workspace/modules/ogc/net.opengis.wfs/pom.xml to org.geotools.ogc/net.opengis.wfs/19-SNAPSHOT/net.opengis.wfs-19-SNAPSHOT.pom
[JENKINS] Archiving /home/hudson/genie.jts/.jenkins/jobs/GeoTools/workspace/modules/library/coverage/pom.xml to org.geotools/gt-coverage/19-SNAPSHOT/gt-coverage-19-SNAPSHOT.pom
[JENKINS] Archiving /home/hudson/genie.jts/.jenkins/jobs/GeoTools/workspace/modules/library/coverage/target/gt-coverage-19-SNAPSHOT.jar to org.geotools/gt-coverage/19-SNAPSHOT/gt-coverage-19-SNAPSHOT.jar
[JENKINS] Archiving /home/hudson/genie.jts/.jenkins/jobs/GeoTools/workspace/modules/library/coverage/target/gt-coverage-19-SNAPSHOT-sources.jar to org.geotools/gt-coverage/19-SNAPSHOT/gt-coverage-19-SNAPSHOT-sources.jar
[JENKINS] Archiving /home/hudson/genie.jts/.jenkins/jobs/GeoTools/workspace/modules/extension/xsd/xsd-wps/pom.xml to org.geotools.xsd/gt-xsd-wps/19-SNAPSHOT/gt-xsd-wps-19-SNAPSHOT.pom
[JENKINS] Archiving /home/hudson/genie.jts/.jenkins/jobs/GeoTools/workspace/pom.xml to org.geotools/geotools/19-SNAPSHOT/geotools-19-SNAPSHOT.pom
[JENKINS] Archiving /home/hudson/genie.jts/.jenkins/jobs/GeoTools/workspace/modules/library/jdbc/pom.xml to org.geotools/gt-jdbc/19-SNAPSHOT/gt-jdbc-19-SNAPSHOT.pom
[JENKINS] Archiving /home/hudson/genie.jts/.jenkins/jobs/GeoTools/workspace/modules/library/jdbc/target/gt-jdbc-19-SNAPSHOT.jar to org.geotools/gt-jdbc/19-SNAPSHOT/gt-jdbc-19-SNAPSHOT.jar
[JENKINS] Archiving /home/hudson/genie.jts/.jenkins/jobs/GeoTools/workspace/modules/library/jdbc/target/gt-jdbc-19-SNAPSHOT-tests.jar to org.geotools/gt-jdbc/19-SNAPSHOT/gt-jdbc-19-SNAPSHOT-tests.jar
[JENKINS] Archiving /home/hudson/genie.jts/.jenkins/jobs/GeoTools/workspace/modules/library/jdbc/target/gt-jdbc-19-SNAPSHOT-sources.jar to org.geotools/gt-jdbc/19-SNAPSHOT/gt-jdbc-19-SNAPSHOT-sources.jar
[JENKINS] Archiving /home/hudson/genie.jts/.jenkins/jobs/GeoTools/workspace/modules/extension/xsd/pom.xml to org.geotools.xsd/xsd/19-SNAPSHOT/xsd-19-SNAPSHOT.pom
[JENKINS] Archiving /home/hudson/genie.jts/.jenkins/jobs/GeoTools/workspace/build/maven/jjtree-javacc/pom.xml to org.geotools.maven/jjtree-javacc/19-SNAPSHOT/jjtree-javacc-19-SNAPSHOT.pom
[JENKINS] Archiving /home/hudson/genie.jts/.jenkins/jobs/GeoTools/workspace/build/maven/jjtree-javacc/target/jjtree-javacc-19-SNAPSHOT.jar to org.geotools.maven/jjtree-javacc/19-SNAPSHOT/jjtree-javacc-19-SNAPSHOT.jar
[JENKINS] Archiving /home/hudson/genie.jts/.jenkins/jobs/GeoTools/workspace/build/maven/jjtree-javacc/target/jjtree-javacc-19-SNAPSHOT-sources.jar to org.geotools.maven/jjtree-javacc/19-SNAPSHOT/jjtree-javacc-19-SNAPSHOT-sources.jar
[JENKINS] Archiving /home/hudson/genie.jts/.jenkins/jobs/GeoTools/workspace/modules/extension/app-schema/sample-data-access/pom.xml to org.geotools/gt-sample-data-access/19-SNAPSHOT/gt-sample-data-access-19-SNAPSHOT.pom
[JENKINS] Archiving /home/hudson/genie.jts/.jenkins/jobs/GeoTools/workspace/modules/plugin/charts/pom.xml to org.geotools/gt-charts/19-SNAPSHOT/gt-charts-19-SNAPSHOT.pom
[JENKINS] Archiving /home/hudson/genie.jts/.jenkins/jobs/GeoTools/workspace/modules/library/cql/pom.xml to org.geotools/gt-cql/19-SNAPSHOT/gt-cql-19-SNAPSHOT.pom
[JENKINS] Archiving /home/hudson/genie.jts/.jenkins/jobs/GeoTools/workspace/modules/library/cql/target/gt-cql-19-SNAPSHOT.jar to org.geotools/gt-cql/19-SNAPSHOT/gt-cql-19-SNAPSHOT.jar
[JENKINS] Archiving /home/hudson/genie.jts/.jenkins/jobs/GeoTools/workspace/modules/library/cql/target/gt-cql-19-SNAPSHOT-sources.jar to org.geotools/gt-cql/19-SNAPSHOT/gt-cql-19-SNAPSHOT-sources.jar
[JENKINS] Archiving /home/hudson/genie.jts/.jenkins/jobs/GeoTools/workspace/modules/plugin/jdbc/jdbc-sqlserver/pom.xml to org.geotools.jdbc/gt-jdbc-sqlserver/19-SNAPSHOT/gt-jdbc-sqlserver-19-SNAPSHOT.pom
[JENKINS] Archiving /home/hudson/genie.jts/.jenkins/jobs/GeoTools/workspace/modules/extension/app-schema/app-schema-resolver/pom.xml to org.geotools/gt-app-schema-resolver/19-SNAPSHOT/gt-app-schema-resolver-19-SNAPSHOT.pom
[JENKINS] Archiving /home/hudson/genie.jts/.jenkins/jobs/GeoTools/workspace/modules/unsupported/pom.xml to org.geotools/unsupported/19-SNAPSHOT/unsupported-19-SNAPSHOT.pom
[JENKINS] Archiving /home/hudson/genie.jts/.jenkins/jobs/GeoTools/workspace/modules/plugin/jdbc/jdbc-postgis/pom.xml to org.geotools.jdbc/gt-jdbc-postgis/19-SNAPSHOT/gt-jdbc-postgis-19-SNAPSHOT.pom
[JENKINS] Archiving /home/hudson/genie.jts/.jenkins/jobs/GeoTools/workspace/modules/library/data/pom.xml to org.geotools/gt-data/19-SNAPSHOT/gt-data-19-SNAPSHOT.pom
[JENKINS] Archiving /home/hudson/genie.jts/.jenkins/jobs/GeoTools/workspace/modules/library/data/target/gt-data-19-SNAPSHOT.jar to org.geotools/gt-data/19-SNAPSHOT/gt-data-19-SNAPSHOT.jar
[JENKINS] Archiving /home/hudson/genie.jts/.jenkins/jobs/GeoTools/workspace/modules/library/data/target/gt-data-19-SNAPSHOT-sources.jar to org.geotools/gt-data/19-SNAPSHOT/gt-data-19-SNAPSHOT-sources.jar
[JENKINS] Archiving /home/hudson/genie.jts/.jenkins/jobs/GeoTools/workspace/modules/plugin/jdbc/jdbc-mysql/pom.xml to org.geotools.jdbc/gt-jdbc-mysql/19-SNAPSHOT/gt-jdbc-mysql-19-SNAPSHOT.pom
[JENKINS] Archiving /home/hudson/genie.jts/.jenkins/jobs/GeoTools/workspace/modules/plugin/svg/pom.xml to org.geotools/gt-svg/19-SNAPSHOT/gt-svg-19-SNAPSHOT.pom
[JENKINS] Archiving /home/hudson/genie.jts/.jenkins/jobs/GeoTools/workspace/modules/extension/xsd/xsd-wms/pom.xml to org.geotools.xsd/gt-xsd-wms/19-SNAPSHOT/gt-xsd-wms-19-SNAPSHOT.pom
[JENKINS] Archiving /home/hudson/genie.jts/.jenkins/jobs/GeoTools/workspace/modules/plugin/epsg-postgresql/pom.xml to org.geotools/gt-epsg-postgresql/19-SNAPSHOT/gt-epsg-postgresql-19-SNAPSHOT.pom
[JENKINS] Archiving /home/hudson/genie.jts/.jenkins/jobs/GeoTools/workspace/modules/extension/brewer/pom.xml to org.geotools/gt-brewer/19-SNAPSHOT/gt-brewer-19-SNAPSHOT.pom
[JENKINS] Archiving /home/hudson/genie.jts/.jenkins/jobs/GeoTools/workspace/modules/plugin/coverage-multidim/netcdf/pom.xml to org.geotools/gt-netcdf/19-SNAPSHOT/gt-netcdf-19-SNAPSHOT.pom
[JENKINS] Archiving /home/hudson/genie.jts/.jenkins/jobs/GeoTools/workspace/modules/plugin/imageio-ext-gdal/pom.xml to org.geotools/gt-imageio-ext-gdal/19-SNAPSHOT/gt-imageio-ext-gdal-19-SNAPSHOT.pom
[JENKINS] Archiving /home/hudson/genie.jts/.jenkins/jobs/GeoTools/workspace/modules/plugin/ogr/ogr-bridj/pom.xml to org.geotools/gt-ogr-bridj/19-SNAPSHOT/gt-ogr-bridj-19-SNAPSHOT.pom
[JENKINS] Archiving /home/hudson/genie.jts/.jenkins/jobs/GeoTools/workspace/modules/pom.xml to org.geotools/modules/19-SNAPSHOT/modules-19-SNAPSHOT.pom
[JENKINS] Archiving /home/hudson/genie.jts/.jenkins/jobs/GeoTools/workspace/modules/extension/graph/pom.xml to org.geotools/gt-graph/19-SNAPSHOT/gt-graph-19-SNAPSHOT.pom
[JENKINS] Archiving /home/hudson/genie.jts/.jenkins/jobs/GeoTools/workspace/modules/extension/graph/target/gt-graph-19-SNAPSHOT.jar to org.geotools/gt-graph/19-SNAPSHOT/gt-graph-19-SNAPSHOT.jar
[JENKINS] Archiving /home/hudson/genie.jts/.jenkins/jobs/GeoTools/workspace/modules/extension/graph/target/gt-graph-19-SNAPSHOT-sources.jar to org.geotools/gt-graph/19-SNAPSHOT/gt-graph-19-SNAPSHOT-sources.jar
[JENKINS] Archiving /home/hudson/genie.jts/.jenkins/jobs/GeoTools/workspace/modules/unsupported/process-raster/pom.xml to org.geotools/gt-process-raster/19-SNAPSHOT/gt-process-raster-19-SNAPSHOT.pom
[JENKINS] Archiving /home/hudson/genie.jts/.jenkins/jobs/GeoTools/workspace/modules/extension/wms/pom.xml to org.geotools/gt-wms/19-SNAPSHOT/gt-wms-19-SNAPSHOT.pom
[JENKINS] Archiving /home/hudson/genie.jts/.jenkins/jobs/GeoTools/workspace/modules/plugin/arcsde/sde-dummy/pom.xml to org.geotools/gt-sde-dummy/19-SNAPSHOT/gt-sde-dummy-19-SNAPSHOT.pom
[JENKINS] Archiving /home/hudson/genie.jts/.jenkins/jobs/GeoTools/workspace/modules/extension/pom.xml to org.geotools/extension/19-SNAPSHOT/extension-19-SNAPSHOT.pom
[JENKINS] Archiving /home/hudson/genie.jts/.jenkins/jobs/GeoTools/workspace/modules/plugin/grassraster/pom.xml to org.geotools/gt-grassraster/19-SNAPSHOT/gt-grassraster-19-SNAPSHOT.pom
[JENKINS] Archiving /home/hudson/genie.jts/.jenkins/jobs/GeoTools/workspace/modules/library/render/pom.xml to org.geotools/gt-render/19-SNAPSHOT/gt-render-19-SNAPSHOT.pom
[JENKINS] Archiving /home/hudson/genie.jts/.jenkins/jobs/GeoTools/workspace/modules/ogc/net.opengis.wps/pom.xml to org.geotools.ogc/net.opengis.wps/19-SNAPSHOT/net.opengis.wps-19-SNAPSHOT.pom
[JENKINS] Archiving /home/hudson/genie.jts/.jenkins/jobs/GeoTools/workspace/modules/unsupported/swt/pom.xml to org.geotools/gt-swt/19-SNAPSHOT/gt-swt-19-SNAPSHOT.pom
[JENKINS] Archiving /home/hudson/genie.jts/.jenkins/jobs/GeoTools/workspace/modules/plugin/feature-pregeneralized/pom.xml to org.geotools/gt-feature-pregeneralized/19-SNAPSHOT/gt-feature-pregeneralized-19-SNAPSHOT.pom
[JENKINS] Archiving /home/hudson/genie.jts/.jenkins/jobs/GeoTools/workspace/modules/plugin/gtopo30/pom.xml to org.geotools/gt-gtopo30/19-SNAPSHOT/gt-gtopo30-19-SNAPSHOT.pom
[JENKINS] Archiving /home/hudson/genie.jts/.jenkins/jobs/GeoTools/workspace/modules/plugin/property/pom.xml to org.geotools/gt-property/19-SNAPSHOT/gt-property-19-SNAPSHOT.pom
[JENKINS] Archiving /home/hudson/genie.jts/.jenkins/jobs/GeoTools/workspace/modules/plugin/property/target/gt-property-19-SNAPSHOT.jar to org.geotools/gt-property/19-SNAPSHOT/gt-property-19-SNAPSHOT.jar
[JENKINS] Archiving /home/hudson/genie.jts/.jenkins/jobs/GeoTools/workspace/modules/plugin/property/target/gt-property-19-SNAPSHOT-sources.jar to org.geotools/gt-property/19-SNAPSHOT/gt-property-19-SNAPSHOT-sources.jar
[JENKINS] Archiving /home/hudson/genie.jts/.jenkins/jobs/GeoTools/workspace/modules/extension/xsd/xsd-ows/pom.xml to org.geotools.xsd/gt-xsd-ows/19-SNAPSHOT/gt-xsd-ows-19-SNAPSHOT.pom
[JENKINS] Archiving /home/hudson/genie.jts/.jenkins/jobs/GeoTools/workspace/modules/library/main/pom.xml to org.geotools/gt-main/19-SNAPSHOT/gt-main-19-SNAPSHOT.pom
[JENKINS] Archiving /home/hudson/genie.jts/.jenkins/jobs/GeoTools/workspace/modules/library/main/target/gt-main-19-SNAPSHOT.jar to org.geotools/gt-main/19-SNAPSHOT/gt-main-19-SNAPSHOT.jar
[JENKINS] Archiving /home/hudson/genie.jts/.jenkins/jobs/GeoTools/workspace/modules/library/main/target/gt-main-19-SNAPSHOT-tests.jar to org.geotools/gt-main/19-SNAPSHOT/gt-main-19-SNAPSHOT-tests.jar
[JENKINS] Archiving /home/hudson/genie.jts/.jenkins/jobs/GeoTools/workspace/modules/library/main/target/gt-main-19-SNAPSHOT-sources.jar to org.geotools/gt-main/19-SNAPSHOT/gt-main-19-SNAPSHOT-sources.jar
[JENKINS] Archiving /home/hudson/genie.jts/.jenkins/jobs/GeoTools/workspace/modules/extension/xsd/xsd-wfs/pom.xml to org.geotools.xsd/gt-xsd-wfs/19-SNAPSHOT/gt-xsd-wfs-19-SNAPSHOT.pom
channel stopped
Started calculate disk usage of build
Finished Calculation of disk usage of build in 0 seconds
Started calculate disk usage of workspace
Finished Calculation of disk usage of workspace in 0 seconds
Finished: FAILURE