SuccessConsole Output

Started calculate disk usage of build
Finished Calculation of disk usage of build in 0 seconds
Started calculate disk usage of workspace
Finished Calculation of disk usage of workspace in 0 seconds
[INFO] 
[INFO] --------------------< org.geotools.jdbc:gt-jdbc-h2 >--------------------
[INFO] Building H2 DataStore 20-SNAPSHOT                               [30/114]
[INFO] --------------------------------[ jar ]---------------------------------
[INFO] 
[INFO] --- git-commit-id-plugin:2.1.15:revision (default) @ gt-jdbc-h2 ---
[INFO] 
[INFO] --- fmt-maven-plugin:2.4.0:format (default) @ gt-jdbc-h2 ---
[debug] Using AOSP style
[INFO] Processed 70 files (0 reformatted).
[INFO] 
[INFO] --- maven-resources-plugin:2.6:resources (default-resources) @ gt-jdbc-h2 ---
[INFO] Using 'UTF-8' encoding to copy filtered resources.
[INFO] Copying 3 resources
[INFO] 
[INFO] --- maven-compiler-plugin:3.1:compile (default-compile) @ gt-jdbc-h2 ---
[INFO] Changes detected - recompiling the module!
[INFO] Compiling 8 source files to /home/hudson/genie.jts/.jenkins/jobs/GeoTools-Master/workspace/modules/plugin/jdbc/jdbc-h2/target/classes
[INFO] 
[INFO] --- maven-resources-plugin:2.6:testResources (default-testResources) @ gt-jdbc-h2 ---
[INFO] Using 'UTF-8' encoding to copy filtered resources.
[INFO] skip non existing resourceDirectory /home/hudson/genie.jts/.jenkins/jobs/GeoTools-Master/workspace/modules/plugin/jdbc/jdbc-h2/src/test/resources
[INFO] 
[INFO] --- maven-compiler-plugin:3.1:testCompile (default-testCompile) @ gt-jdbc-h2 ---
[INFO] Nothing to compile - all classes are up to date
[INFO] 
[INFO] --- maven-surefire-plugin:2.15:test (default-test) @ gt-jdbc-h2 ---
[INFO] Surefire report directory: /home/hudson/genie.jts/.jenkins/jobs/GeoTools-Master/workspace/modules/plugin/jdbc/jdbc-h2/target/surefire-reports

-------------------------------------------------------
 T E S T S
-------------------------------------------------------
Picked up JAVA_TOOL_OPTIONS: -Xmx2G -Djava.io.tmpdir=/tmp/genie.jts
Running org.geotools.data.h2.H2AggregateFunctionTest
Tests run: 18, Failures: 0, Errors: 0, Skipped: 0, Time elapsed: 5.092 sec - in org.geotools.data.h2.H2AggregateFunctionTest
Running org.geotools.data.h2.H2BooleanTest
Tests run: 2, Failures: 0, Errors: 0, Skipped: 0, Time elapsed: 0.267 sec - in org.geotools.data.h2.H2BooleanTest
Running org.geotools.data.h2.H2ConnectionLifecycleTest
2018-06-23T21:07:17.466-0400  WARNING  Could not find mapping for 'geometry', ignoring the column and setting the feature type read only
2018-06-23T21:07:17.621-0400  WARNING  Error occurred closing connection
2018-06-23T21:07:17.622-0400  WARNING  Error occurred closing connection
2018-06-23T21:07:17.622-0400  WARNING  Error occurred closing connection
2018-06-23T21:07:17.623-0400  WARNING  Error occurred closing connection
2018-06-23T21:07:17.623-0400  WARNING  Error occurred closing connection
2018-06-23T21:07:17.624-0400  WARNING  Error occurred closing connection
2018-06-23T21:07:17.625-0400  WARNING  Error occurred closing connection
2018-06-23T21:07:17.638-0400  WARNING  Error occurred closing connection
2018-06-23T21:07:17.639-0400  WARNING  Error occurred closing connection
2018-06-23T21:07:17.639-0400  WARNING  Error occurred closing connection
2018-06-23T21:07:17.639-0400  WARNING  Error occurred closing connection
2018-06-23T21:07:17.640-0400  WARNING  Error occurred closing connection
2018-06-23T21:07:17.640-0400  WARNING  Error occurred closing connection
2018-06-23T21:07:17.641-0400  WARNING  Error occurred closing connection
2018-06-23T21:07:17.641-0400  WARNING  Error occurred closing connection
2018-06-23T21:07:17.642-0400  WARNING  Error occurred closing connection
2018-06-23T21:07:17.642-0400  WARNING  Error occurred closing connection
2018-06-23T21:07:17.642-0400  WARNING  Error occurred closing connection
2018-06-23T21:07:17.643-0400  WARNING  Error occurred closing connection
2018-06-23T21:07:17.643-0400  WARNING  Error occurred closing connection
2018-06-23T21:07:17.644-0400  WARNING  Error occurred closing connection
2018-06-23T21:07:17.644-0400  WARNING  Error occurred closing connection
2018-06-23T21:07:17.645-0400  WARNING  Error occurred closing connection
2018-06-23T21:07:17.645-0400  WARNING  Error occurred closing connection
2018-06-23T21:07:17.645-0400  WARNING  Error occurred closing connection
2018-06-23T21:07:17.646-0400  WARNING  Error occurred closing connection
2018-06-23T21:07:17.646-0400  WARNING  Error occurred closing connection
2018-06-23T21:07:17.646-0400  WARNING  Error occurred closing connection
2018-06-23T21:07:17.647-0400  WARNING  Error occurred closing connection
2018-06-23T21:07:17.647-0400  WARNING  Error occurred closing connection
2018-06-23T21:07:17.648-0400  WARNING  Error occurred closing connection
2018-06-23T21:07:17.648-0400  WARNING  Error occurred closing connection
2018-06-23T21:07:17.648-0400  WARNING  Error occurred closing connection
2018-06-23T21:07:17.649-0400  WARNING  Error occurred closing connection
2018-06-23T21:07:17.649-0400  WARNING  Error occurred closing connection
2018-06-23T21:07:17.650-0400  WARNING  Error occurred closing connection
2018-06-23T21:07:17.650-0400  WARNING  Error occurred closing connection
2018-06-23T21:07:17.650-0400  WARNING  Error occurred closing connection
2018-06-23T21:07:17.651-0400  WARNING  Error occurred closing connection
2018-06-23T21:07:17.651-0400  WARNING  Error occurred closing connection
2018-06-23T21:07:17.651-0400  WARNING  Error occurred closing connection
2018-06-23T21:07:17.652-0400  WARNING  Error occurred closing connection
2018-06-23T21:07:17.652-0400  WARNING  Error occurred closing connection
2018-06-23T21:07:17.653-0400  WARNING  Error occurred closing connection
2018-06-23T21:07:17.653-0400  WARNING  Error occurred closing connection
2018-06-23T21:07:17.653-0400  WARNING  Error occurred closing connection
2018-06-23T21:07:17.654-0400  WARNING  Error occurred closing connection
2018-06-23T21:07:17.654-0400  WARNING  Error occurred closing connection
2018-06-23T21:07:17.654-0400  WARNING  Error occurred closing connection
2018-06-23T21:07:17.655-0400  WARNING  Error occurred closing connection
2018-06-23T21:07:17.655-0400  WARNING  Error occurred closing connection
2018-06-23T21:07:17.656-0400  WARNING  Error occurred closing connection
2018-06-23T21:07:17.656-0400  WARNING  Error occurred closing connection
2018-06-23T21:07:17.656-0400  WARNING  Error occurred closing connection
2018-06-23T21:07:17.657-0400  WARNING  Error occurred closing connection
2018-06-23T21:07:17.657-0400  WARNING  Error occurred closing connection
2018-06-23T21:07:17.657-0400  WARNING  Error occurred closing connection
2018-06-23T21:07:17.658-0400  WARNING  Error occurred closing connection
2018-06-23T21:07:17.658-0400  WARNING  Error occurred closing connection
2018-06-23T21:07:17.658-0400  WARNING  Error occurred closing connection
2018-06-23T21:07:17.659-0400  WARNING  Error occurred closing connection
2018-06-23T21:07:17.659-0400  WARNING  Error occurred closing connection
2018-06-23T21:07:17.660-0400  WARNING  Error occurred closing connection
2018-06-23T21:07:17.660-0400  WARNING  Error occurred closing connection
2018-06-23T21:07:17.660-0400  WARNING  Error occurred closing connection
2018-06-23T21:07:17.661-0400  WARNING  Error occurred closing connection
2018-06-23T21:07:17.661-0400  WARNING  Error occurred closing connection
2018-06-23T21:07:17.662-0400  WARNING  Error occurred closing connection
2018-06-23T21:07:17.662-0400  WARNING  Error occurred closing connection
2018-06-23T21:07:17.662-0400  WARNING  Error occurred closing connection
2018-06-23T21:07:17.663-0400  WARNING  Error occurred closing connection
2018-06-23T21:07:17.663-0400  WARNING  Error occurred closing connection
2018-06-23T21:07:17.663-0400  WARNING  Error occurred closing connection
2018-06-23T21:07:17.664-0400  WARNING  Error occurred closing connection
2018-06-23T21:07:17.664-0400  WARNING  Error occurred closing connection
2018-06-23T21:07:17.664-0400  WARNING  Error occurred closing connection
2018-06-23T21:07:17.665-0400  WARNING  Error occurred closing connection
2018-06-23T21:07:17.665-0400  WARNING  Error occurred closing connection
2018-06-23T21:07:17.666-0400  WARNING  Error occurred closing connection
2018-06-23T21:07:17.666-0400  WARNING  Error occurred closing connection
2018-06-23T21:07:17.666-0400  WARNING  Error occurred closing connection
2018-06-23T21:07:17.667-0400  WARNING  Error occurred closing connection
2018-06-23T21:07:17.667-0400  WARNING  Error occurred closing connection
2018-06-23T21:07:17.668-0400  WARNING  Error occurred closing connection
2018-06-23T21:07:17.668-0400  WARNING  Error occurred closing connection
2018-06-23T21:07:17.668-0400  WARNING  Error occurred closing connection
2018-06-23T21:07:17.669-0400  WARNING  Error occurred closing connection
2018-06-23T21:07:17.669-0400  WARNING  Error occurred closing connection
2018-06-23T21:07:17.669-0400  WARNING  Error occurred closing connection
2018-06-23T21:07:17.670-0400  WARNING  Error occurred closing connection
2018-06-23T21:07:17.670-0400  WARNING  Error occurred closing connection
2018-06-23T21:07:17.670-0400  WARNING  Error occurred closing connection
2018-06-23T21:07:17.671-0400  WARNING  Error occurred closing connection
2018-06-23T21:07:17.671-0400  WARNING  Error occurred closing connection
2018-06-23T21:07:17.671-0400  WARNING  Error occurred closing connection
2018-06-23T21:07:17.672-0400  WARNING  Error occurred closing connection
2018-06-23T21:07:17.672-0400  WARNING  Error occurred closing connection
2018-06-23T21:07:17.672-0400  WARNING  Error occurred closing connection
2018-06-23T21:07:17.673-0400  WARNING  Error occurred closing connection
2018-06-23T21:07:17.673-0400  WARNING  Error occurred closing connection
Tests run: 3, Failures: 0, Errors: 0, Skipped: 0, Time elapsed: 0.501 sec - in org.geotools.data.h2.H2ConnectionLifecycleTest
Running org.geotools.data.h2.H2DataStoreAPITest
Tests run: 43, Failures: 0, Errors: 0, Skipped: 0, Time elapsed: 10.366 sec - in org.geotools.data.h2.H2DataStoreAPITest
Running org.geotools.data.h2.H2DataStoreFactoryTest
Tests run: 4, Failures: 0, Errors: 0, Skipped: 0, Time elapsed: 0.695 sec - in org.geotools.data.h2.H2DataStoreFactoryTest
Running org.geotools.data.h2.H2DataStoreTest
Tests run: 14, Failures: 0, Errors: 0, Skipped: 0, Time elapsed: 3.304 sec - in org.geotools.data.h2.H2DataStoreTest
Running org.geotools.data.h2.H2DateTest
[ d <= Sun Jun 28 00:00:00 GMT-12:00 2009 ]
[ d <= Sun Jun 28 00:00:00 PDT 2009 ]
[ d <= Sun Jun 28 00:00:00 EST 2009 ]
[ d <= Sun Jun 28 00:00:00 GMT 2009 ]
[ d <= Sun Jun 28 00:00:00 CEST 2009 ]
[ d <= Sun Jun 28 00:00:00 GMT+12:00 2009 ]
[ d <= Sun Jun 28 00:00:00 GMT+14:00 2009 ]
Tests run: 4, Failures: 0, Errors: 0, Skipped: 0, Time elapsed: 0.74 sec - in org.geotools.data.h2.H2DateTest
Running org.geotools.data.h2.H2DistanceFiltersTest
Tests run: 8, Failures: 0, Errors: 0, Skipped: 0, Time elapsed: 2.733 sec - in org.geotools.data.h2.H2DistanceFiltersTest
Running org.geotools.data.h2.H2EmptyGeometryTest
Tests run: 6, Failures: 0, Errors: 0, Skipped: 0, Time elapsed: 1.207 sec - in org.geotools.data.h2.H2EmptyGeometryTest
Running org.geotools.data.h2.H2EmptyTest
Tests run: 2, Failures: 0, Errors: 0, Skipped: 0, Time elapsed: 0.696 sec - in org.geotools.data.h2.H2EmptyTest
Running org.geotools.data.h2.H2FeatureCollectionTest
Tests run: 5, Failures: 0, Errors: 0, Skipped: 0, Time elapsed: 0.897 sec - in org.geotools.data.h2.H2FeatureCollectionTest
Running org.geotools.data.h2.H2FeatureLockingTest
Tests run: 8, Failures: 0, Errors: 0, Skipped: 0, Time elapsed: 1.333 sec - in org.geotools.data.h2.H2FeatureLockingTest
Running org.geotools.data.h2.H2FeatureReaderTest
Tests run: 1, Failures: 0, Errors: 0, Skipped: 0, Time elapsed: 0.176 sec - in org.geotools.data.h2.H2FeatureReaderTest
Running org.geotools.data.h2.H2FeatureSourceExposePkTest
java.lang.IllegalArgumentException: Property 'invalidAttribute' could not be found in ft1
	at org.geotools.filter.visitor.PostPreProcessFilterSplittingVisitor.visit(PostPreProcessFilterSplittingVisitor.java:781)
	at org.geotools.filter.AttributeExpressionImpl.accept(AttributeExpressionImpl.java:354)
	at org.geotools.filter.visitor.PostPreProcessFilterSplittingVisitor.visitBinaryComparisonOperator(PostPreProcessFilterSplittingVisitor.java:426)
	at org.geotools.filter.visitor.PostPreProcessFilterSplittingVisitor.visit(PostPreProcessFilterSplittingVisitor.java:380)
	at org.geotools.filter.IsEqualsToImpl.accept(IsEqualsToImpl.java:153)
	at org.geotools.jdbc.SQLDialect.splitFilter(SQLDialect.java:1409)
	at org.geotools.jdbc.JDBCFeatureSource.splitFilter(JDBCFeatureSource.java:382)
	at org.geotools.jdbc.JDBCFeatureSource.splitFilter(JDBCFeatureSource.java:369)
	at org.geotools.jdbc.JDBCFeatureSource.getReaderInternal(JDBCFeatureSource.java:553)
	at org.geotools.jdbc.JDBCFeatureStore.getReaderInternal(JDBCFeatureStore.java:220)
	at org.geotools.data.store.ContentFeatureSource.getReader(ContentFeatureSource.java:610)
	at org.geotools.data.store.ContentFeatureCollection.features(ContentFeatureCollection.java:164)
	at org.geotools.jdbc.JDBCFeatureSourceOnlineTest.testGetFeaturesWithInvalidFilter(JDBCFeatureSourceOnlineTest.java:161)
	at sun.reflect.NativeMethodAccessorImpl.invoke0(Native Method)
	at sun.reflect.NativeMethodAccessorImpl.invoke(NativeMethodAccessorImpl.java:62)
	at sun.reflect.DelegatingMethodAccessorImpl.invoke(DelegatingMethodAccessorImpl.java:43)
	at java.lang.reflect.Method.invoke(Method.java:498)
	at junit.framework.TestCase.runTest(TestCase.java:176)
	at junit.framework.TestCase.runBare(TestCase.java:141)
	at junit.framework.TestResult$1.protect(TestResult.java:122)
	at junit.framework.TestResult.runProtected(TestResult.java:142)
	at junit.framework.TestResult.run(TestResult.java:125)
	at junit.framework.TestCase.run(TestCase.java:129)
	at org.geotools.test.OnlineTestCase.run(OnlineTestCase.java:112)
	at junit.framework.TestSuite.runTest(TestSuite.java:255)
	at junit.framework.TestSuite.run(TestSuite.java:250)
	at org.junit.internal.runners.JUnit38ClassRunner.run(JUnit38ClassRunner.java:84)
	at org.apache.maven.surefire.junit4.JUnit4Provider.execute(JUnit4Provider.java:264)
	at org.apache.maven.surefire.junit4.JUnit4Provider.executeTestSet(JUnit4Provider.java:153)
	at org.apache.maven.surefire.junit4.JUnit4Provider.invoke(JUnit4Provider.java:124)
	at org.apache.maven.surefire.booter.ForkedBooter.invokeProviderInSameClassLoader(ForkedBooter.java:200)
	at org.apache.maven.surefire.booter.ForkedBooter.runSuitesInProcess(ForkedBooter.java:153)
	at org.apache.maven.surefire.booter.ForkedBooter.main(ForkedBooter.java:103)
Tests run: 31, Failures: 0, Errors: 0, Skipped: 0, Time elapsed: 6.071 sec - in org.geotools.data.h2.H2FeatureSourceExposePkTest
Running org.geotools.data.h2.H2FeatureSourceTest
java.lang.IllegalArgumentException: Property 'invalidAttribute' could not be found in ft1
	at org.geotools.filter.visitor.PostPreProcessFilterSplittingVisitor.visit(PostPreProcessFilterSplittingVisitor.java:781)
	at org.geotools.filter.AttributeExpressionImpl.accept(AttributeExpressionImpl.java:354)
	at org.geotools.filter.visitor.PostPreProcessFilterSplittingVisitor.visitBinaryComparisonOperator(PostPreProcessFilterSplittingVisitor.java:426)
	at org.geotools.filter.visitor.PostPreProcessFilterSplittingVisitor.visit(PostPreProcessFilterSplittingVisitor.java:380)
	at org.geotools.filter.IsEqualsToImpl.accept(IsEqualsToImpl.java:153)
	at org.geotools.jdbc.SQLDialect.splitFilter(SQLDialect.java:1409)
	at org.geotools.jdbc.JDBCFeatureSource.splitFilter(JDBCFeatureSource.java:382)
	at org.geotools.jdbc.JDBCFeatureSource.splitFilter(JDBCFeatureSource.java:369)
	at org.geotools.jdbc.JDBCFeatureSource.getReaderInternal(JDBCFeatureSource.java:553)
	at org.geotools.jdbc.JDBCFeatureStore.getReaderInternal(JDBCFeatureStore.java:220)
	at org.geotools.data.store.ContentFeatureSource.getReader(ContentFeatureSource.java:610)
	at org.geotools.data.store.ContentFeatureCollection.features(ContentFeatureCollection.java:164)
	at org.geotools.jdbc.JDBCFeatureSourceOnlineTest.testGetFeaturesWithInvalidFilter(JDBCFeatureSourceOnlineTest.java:161)
	at sun.reflect.NativeMethodAccessorImpl.invoke0(Native Method)
	at sun.reflect.NativeMethodAccessorImpl.invoke(NativeMethodAccessorImpl.java:62)
	at sun.reflect.DelegatingMethodAccessorImpl.invoke(DelegatingMethodAccessorImpl.java:43)
	at java.lang.reflect.Method.invoke(Method.java:498)
	at junit.framework.TestCase.runTest(TestCase.java:176)
	at junit.framework.TestCase.runBare(TestCase.java:141)
	at junit.framework.TestResult$1.protect(TestResult.java:122)
	at junit.framework.TestResult.runProtected(TestResult.java:142)
	at junit.framework.TestResult.run(TestResult.java:125)
	at junit.framework.TestCase.run(TestCase.java:129)
	at org.geotools.test.OnlineTestCase.run(OnlineTestCase.java:112)
	at junit.framework.TestSuite.runTest(TestSuite.java:255)
	at junit.framework.TestSuite.run(TestSuite.java:250)
	at org.junit.internal.runners.JUnit38ClassRunner.run(JUnit38ClassRunner.java:84)
	at org.apache.maven.surefire.junit4.JUnit4Provider.execute(JUnit4Provider.java:264)
	at org.apache.maven.surefire.junit4.JUnit4Provider.executeTestSet(JUnit4Provider.java:153)
	at org.apache.maven.surefire.junit4.JUnit4Provider.invoke(JUnit4Provider.java:124)
	at org.apache.maven.surefire.booter.ForkedBooter.invokeProviderInSameClassLoader(ForkedBooter.java:200)
	at org.apache.maven.surefire.booter.ForkedBooter.runSuitesInProcess(ForkedBooter.java:153)
	at org.apache.maven.surefire.booter.ForkedBooter.main(ForkedBooter.java:103)
Tests run: 31, Failures: 0, Errors: 0, Skipped: 0, Time elapsed: 6.232 sec - in org.geotools.data.h2.H2FeatureSourceTest
Running org.geotools.data.h2.H2FeatureStoreExposedPkTest
Tests run: 16, Failures: 0, Errors: 0, Skipped: 0, Time elapsed: 3.142 sec - in org.geotools.data.h2.H2FeatureStoreExposedPkTest
Running org.geotools.data.h2.H2FeatureStoreTest
Tests run: 15, Failures: 0, Errors: 0, Skipped: 0, Time elapsed: 13.744 sec - in org.geotools.data.h2.H2FeatureStoreTest
Running org.geotools.data.h2.H2GeometryTest
Tests run: 9, Failures: 0, Errors: 0, Skipped: 0, Time elapsed: 1.881 sec - in org.geotools.data.h2.H2GeometryTest
Running org.geotools.data.h2.H2GeometrylessTest
Tests run: 5, Failures: 0, Errors: 0, Skipped: 0, Time elapsed: 0.864 sec - in org.geotools.data.h2.H2GeometrylessTest
Running org.geotools.data.h2.H2JDBCTransactionTest
Tests run: 4, Failures: 0, Errors: 0, Skipped: 0, Time elapsed: 0.708 sec - in org.geotools.data.h2.H2JDBCTransactionTest
Running org.geotools.data.h2.H2JNDIDataSourceTest
Tests run: 2, Failures: 0, Errors: 0, Skipped: 0, Time elapsed: 0.629 sec - in org.geotools.data.h2.H2JNDIDataSourceTest
Running org.geotools.data.h2.H2JoinTest
Tests run: 15, Failures: 0, Errors: 0, Skipped: 0, Time elapsed: 3.025 sec - in org.geotools.data.h2.H2JoinTest
Running org.geotools.data.h2.H2LobTest
Tests run: 4, Failures: 0, Errors: 0, Skipped: 0, Time elapsed: 0.675 sec - in org.geotools.data.h2.H2LobTest
Running org.geotools.data.h2.H2NoPrimaryKeyTest
Tests run: 4, Failures: 0, Errors: 0, Skipped: 0, Time elapsed: 0.692 sec - in org.geotools.data.h2.H2NoPrimaryKeyTest
Running org.geotools.data.h2.H2PrimaryKeyFinderTest
Tests run: 3, Failures: 0, Errors: 0, Skipped: 0, Time elapsed: 0.647 sec - in org.geotools.data.h2.H2PrimaryKeyFinderTest
Running org.geotools.data.h2.H2PrimaryKeyTest
Tests run: 8, Failures: 0, Errors: 0, Skipped: 0, Time elapsed: 1.502 sec - in org.geotools.data.h2.H2PrimaryKeyTest
Running org.geotools.data.h2.H2SkipColumnTest
2018-06-23T21:08:19.988-0400  WARNING  Could not find mapping for 'weird', ignoring the column and setting the feature type read only
2018-06-23T21:08:20.145-0400  WARNING  Could not find mapping for 'weird', ignoring the column and setting the feature type read only
2018-06-23T21:08:20.320-0400  WARNING  Could not find mapping for 'weird', ignoring the column and setting the feature type read only
Tests run: 3, Failures: 0, Errors: 0, Skipped: 0, Time elapsed: 0.499 sec - in org.geotools.data.h2.H2SkipColumnTest
Running org.geotools.data.h2.H2SpatialFiltersTest
Tests run: 11, Failures: 0, Errors: 0, Skipped: 0, Time elapsed: 3.206 sec - in org.geotools.data.h2.H2SpatialFiltersTest
Running org.geotools.data.h2.H2TemporalFilterTest
Tests run: 12, Failures: 0, Errors: 0, Skipped: 0, Time elapsed: 2.251 sec - in org.geotools.data.h2.H2TemporalFilterTest
Running org.geotools.data.h2.H2ThreeValuedLogicTest
Tests run: 4, Failures: 0, Errors: 0, Skipped: 0, Time elapsed: 0.692 sec - in org.geotools.data.h2.H2ThreeValuedLogicTest
Running org.geotools.data.h2.H2TypeNamesTest
Tests run: 1, Failures: 0, Errors: 0, Skipped: 0, Time elapsed: 0.206 sec - in org.geotools.data.h2.H2TypeNamesTest
Running org.geotools.data.h2.H2UDTTest
Tests run: 3, Failures: 0, Errors: 0, Skipped: 0, Time elapsed: 15.025 sec - in org.geotools.data.h2.H2UDTTest
Running org.geotools.data.h2.H2UuidTest
Tests run: 6, Failures: 0, Errors: 0, Skipped: 0, Time elapsed: 1.113 sec - in org.geotools.data.h2.H2UuidTest
Running org.geotools.data.h2.H2ViewTest
Tests run: 5, Failures: 0, Errors: 0, Skipped: 0, Time elapsed: 0.888 sec - in org.geotools.data.h2.H2ViewTest
Running org.geotools.data.h2.H2VirtualTableTest
2018-06-23T21:08:43.928-0400  WARNING  Could not find mapping for 'geom', ignoring the column and setting the feature type read only
2018-06-23T21:08:43.930-0400  WARNING  Could not find mapping for 'geom', ignoring the column and setting the feature type read only
2018-06-23T21:08:44.112-0400  WARNING  Could not find mapping for 'geom', ignoring the column and setting the feature type read only
2018-06-23T21:08:44.114-0400  WARNING  Could not find mapping for 'geom', ignoring the column and setting the feature type read only
2018-06-23T21:08:44.545-0400  WARNING  Could not find mapping for 'geom', ignoring the column and setting the feature type read only
2018-06-23T21:08:44.547-0400  WARNING  Could not find mapping for 'geom', ignoring the column and setting the feature type read only
2018-06-23T21:08:44.770-0400  WARNING  Could not find mapping for 'geom', ignoring the column and setting the feature type read only
2018-06-23T21:08:44.771-0400  WARNING  Could not find mapping for 'geom', ignoring the column and setting the feature type read only
2018-06-23T21:08:44.987-0400  WARNING  Could not find mapping for 'geom', ignoring the column and setting the feature type read only
2018-06-23T21:08:44.988-0400  WARNING  Could not find mapping for 'geom', ignoring the column and setting the feature type read only
2018-06-23T21:08:45.183-0400  WARNING  Could not find mapping for 'geom', ignoring the column and setting the feature type read only
2018-06-23T21:08:45.185-0400  WARNING  Could not find mapping for 'geom', ignoring the column and setting the feature type read only
2018-06-23T21:08:45.414-0400  WARNING  Could not find mapping for 'geom', ignoring the column and setting the feature type read only
2018-06-23T21:08:45.416-0400  WARNING  Could not find mapping for 'geom', ignoring the column and setting the feature type read only
2018-06-23T21:08:45.423-0400  SEVERE  Invalid value for parameter mul
java.lang.IllegalArgumentException: Value abc does not match [\d\.e\+-]+
	at org.geotools.jdbc.RegexpValidator.validate(RegexpValidator.java:42)
	at org.geotools.jdbc.VirtualTable.expandParameters(VirtualTable.java:249)
	at org.geotools.jdbc.JDBCDataStore.encodeAliasedTableName(JDBCDataStore.java:4612)
	at org.geotools.jdbc.JDBCDataStore.encodeTableName(JDBCDataStore.java:4601)
	at org.geotools.jdbc.JDBCDataStore.selectSQL(JDBCDataStore.java:3351)
	at org.geotools.jdbc.JDBCFeatureSource.getReaderInternal(JDBCFeatureSource.java:595)
	at org.geotools.data.store.ContentFeatureSource.getReader(ContentFeatureSource.java:610)
	at org.geotools.data.store.ContentFeatureCollection.features(ContentFeatureCollection.java:164)
	at org.geotools.data.store.ContentFeatureCollection.features(ContentFeatureCollection.java:53)
	at org.geotools.jdbc.JDBCVirtualTableOnlineTest.testMulParamInvalid(JDBCVirtualTableOnlineTest.java:277)
	at sun.reflect.NativeMethodAccessorImpl.invoke0(Native Method)
	at sun.reflect.NativeMethodAccessorImpl.invoke(NativeMethodAccessorImpl.java:62)
	at sun.reflect.DelegatingMethodAccessorImpl.invoke(DelegatingMethodAccessorImpl.java:43)
	at java.lang.reflect.Method.invoke(Method.java:498)
	at junit.framework.TestCase.runTest(TestCase.java:176)
	at junit.framework.TestCase.runBare(TestCase.java:141)
	at junit.framework.TestResult$1.protect(TestResult.java:122)
	at junit.framework.TestResult.runProtected(TestResult.java:142)
	at junit.framework.TestResult.run(TestResult.java:125)
	at junit.framework.TestCase.run(TestCase.java:129)
	at org.geotools.test.OnlineTestCase.run(OnlineTestCase.java:112)
	at junit.framework.TestSuite.runTest(TestSuite.java:255)
	at junit.framework.TestSuite.run(TestSuite.java:250)
	at org.junit.internal.runners.JUnit38ClassRunner.run(JUnit38ClassRunner.java:84)
	at org.apache.maven.surefire.junit4.JUnit4Provider.execute(JUnit4Provider.java:264)
	at org.apache.maven.surefire.junit4.JUnit4Provider.executeTestSet(JUnit4Provider.java:153)
	at org.apache.maven.surefire.junit4.JUnit4Provider.invoke(JUnit4Provider.java:124)
	at org.apache.maven.surefire.booter.ForkedBooter.invokeProviderInSameClassLoader(ForkedBooter.java:200)
	at org.apache.maven.surefire.booter.ForkedBooter.runSuitesInProcess(ForkedBooter.java:153)
	at org.apache.maven.surefire.booter.ForkedBooter.main(ForkedBooter.java:103)

2018-06-23T21:08:45.594-0400  WARNING  Could not find mapping for 'geom', ignoring the column and setting the feature type read only
2018-06-23T21:08:45.596-0400  WARNING  Could not find mapping for 'geom', ignoring the column and setting the feature type read only
2018-06-23T21:08:45.810-0400  WARNING  Could not find mapping for 'geom', ignoring the column and setting the feature type read only
2018-06-23T21:08:45.812-0400  WARNING  Could not find mapping for 'geom', ignoring the column and setting the feature type read only
2018-06-23T21:08:46.017-0400  WARNING  Could not find mapping for 'geom', ignoring the column and setting the feature type read only
2018-06-23T21:08:46.018-0400  WARNING  Could not find mapping for 'geom', ignoring the column and setting the feature type read only
2018-06-23T21:08:46.213-0400  WARNING  Could not find mapping for 'geom', ignoring the column and setting the feature type read only
2018-06-23T21:08:46.215-0400  WARNING  Could not find mapping for 'geom', ignoring the column and setting the feature type read only
2018-06-23T21:08:46.420-0400  WARNING  Could not find mapping for 'geom', ignoring the column and setting the feature type read only
2018-06-23T21:08:46.422-0400  WARNING  Could not find mapping for 'geom', ignoring the column and setting the feature type read only
2018-06-23T21:08:46.611-0400  WARNING  Could not find mapping for 'geom', ignoring the column and setting the feature type read only
2018-06-23T21:08:46.613-0400  WARNING  Could not find mapping for 'geom', ignoring the column and setting the feature type read only
2018-06-23T21:08:46.817-0400  WARNING  Could not find mapping for 'geom', ignoring the column and setting the feature type read only
2018-06-23T21:08:46.818-0400  WARNING  Could not find mapping for 'geom', ignoring the column and setting the feature type read only
2018-06-23T21:08:47.023-0400  WARNING  Could not find mapping for 'geom', ignoring the column and setting the feature type read only
2018-06-23T21:08:47.024-0400  WARNING  Could not find mapping for 'geom', ignoring the column and setting the feature type read only
Tests run: 15, Failures: 0, Errors: 0, Skipped: 0, Time elapsed: 3.34 sec - in org.geotools.data.h2.H2VirtualTableTest
Running org.geotools.data.h2.jndi.H2DataStoreTest
Tests run: 14, Failures: 0, Errors: 0, Skipped: 0, Time elapsed: 2.819 sec - in org.geotools.data.h2.jndi.H2DataStoreTest

Results :

Tests run: 339, Failures: 0, Errors: 0, Skipped: 0

[JENKINS] Recording test results
[INFO] 
[INFO] --- maven-jar-plugin:2.4:jar (default-jar) @ gt-jdbc-h2 ---
[INFO] Building jar: /home/hudson/genie.jts/.jenkins/jobs/GeoTools-Master/workspace/modules/plugin/jdbc/jdbc-h2/target/gt-jdbc-h2-20-SNAPSHOT.jar
[INFO] 
[INFO] >>> maven-source-plugin:2.2.1:jar (attach-sources) > generate-sources @ gt-jdbc-h2 >>>
[INFO] 
[INFO] --- git-commit-id-plugin:2.1.15:revision (default) @ gt-jdbc-h2 ---
[WARNING] Failed to getClass for org.apache.maven.plugin.source.SourceJarMojo
[INFO] 
[INFO] <<< maven-source-plugin:2.2.1:jar (attach-sources) < generate-sources @ gt-jdbc-h2 <<<
[INFO] 
[INFO] 
[INFO] --- maven-source-plugin:2.2.1:jar (attach-sources) @ gt-jdbc-h2 ---
[INFO] Building jar: /home/hudson/genie.jts/.jenkins/jobs/GeoTools-Master/workspace/modules/plugin/jdbc/jdbc-h2/target/gt-jdbc-h2-20-SNAPSHOT-sources.jar
[INFO] 
[INFO] --- maven-install-plugin:2.4:install (default-install) @ gt-jdbc-h2 ---
[INFO] Installing /home/hudson/genie.jts/.jenkins/jobs/GeoTools-Master/workspace/modules/plugin/jdbc/jdbc-h2/target/gt-jdbc-h2-20-SNAPSHOT.jar to /opt/public/hipp/homes/genie.jts/.m2/repository/org/geotools/jdbc/gt-jdbc-h2/20-SNAPSHOT/gt-jdbc-h2-20-SNAPSHOT.jar
[INFO] Installing /home/hudson/genie.jts/.jenkins/jobs/GeoTools-Master/workspace/modules/plugin/jdbc/jdbc-h2/pom.xml to /opt/public/hipp/homes/genie.jts/.m2/repository/org/geotools/jdbc/gt-jdbc-h2/20-SNAPSHOT/gt-jdbc-h2-20-SNAPSHOT.pom
[INFO] Installing /home/hudson/genie.jts/.jenkins/jobs/GeoTools-Master/workspace/modules/plugin/jdbc/jdbc-h2/target/gt-jdbc-h2-20-SNAPSHOT-sources.jar to /opt/public/hipp/homes/genie.jts/.m2/repository/org/geotools/jdbc/gt-jdbc-h2/20-SNAPSHOT/gt-jdbc-h2-20-SNAPSHOT-sources.jar