SuccessConsole Output

Started calculate disk usage of build
Finished Calculation of disk usage of build in 0 seconds
Started calculate disk usage of workspace
Finished Calculation of disk usage of workspace in 0 seconds
[INFO] 
[INFO] --------------------< org.geotools.jdbc:gt-jdbc-h2 >--------------------
[INFO] Building H2 DataStore 20-SNAPSHOT                               [30/114]
[INFO] --------------------------------[ jar ]---------------------------------
[INFO] Downloading from central.maven.org: http://central.maven.org/maven2/org/opengeo/geodb/0.7-RC2/geodb-0.7-RC2.pom
[INFO] Downloading from osgeo: http://download.osgeo.org/webdav/geotools/org/opengeo/geodb/0.7-RC2/geodb-0.7-RC2.pom
[INFO] Downloaded from osgeo: http://download.osgeo.org/webdav/geotools/org/opengeo/geodb/0.7-RC2/geodb-0.7-RC2.pom (2.0 kB at 8.5 kB/s)
[INFO] Downloading from central.maven.org: http://central.maven.org/maven2/org/opengeo/geodb-parent/0.7-RC2/geodb-parent-0.7-RC2.pom
[INFO] Downloading from osgeo: http://download.osgeo.org/webdav/geotools/org/opengeo/geodb-parent/0.7-RC2/geodb-parent-0.7-RC2.pom
[INFO] Downloaded from osgeo: http://download.osgeo.org/webdav/geotools/org/opengeo/geodb-parent/0.7-RC2/geodb-parent-0.7-RC2.pom (2.6 kB at 17 kB/s)
[INFO] Downloading from central.maven.org: http://central.maven.org/maven2/org/opengeo/geodb/0.7-RC2/geodb-0.7-RC2.jar
[INFO] Downloading from osgeo: http://download.osgeo.org/webdav/geotools/org/opengeo/geodb/0.7-RC2/geodb-0.7-RC2.jar
[INFO] Downloaded from osgeo: http://download.osgeo.org/webdav/geotools/org/opengeo/geodb/0.7-RC2/geodb-0.7-RC2.jar (18 kB at 75 kB/s)
[INFO] 
[INFO] --- git-commit-id-plugin:2.1.15:revision (default) @ gt-jdbc-h2 ---
[INFO] 
[INFO] --- fmt-maven-plugin:2.4.0:format (default) @ gt-jdbc-h2 ---
[debug] Using AOSP style
[INFO] Processed 70 files (0 reformatted).
[INFO] 
[INFO] --- maven-resources-plugin:2.6:resources (default-resources) @ gt-jdbc-h2 ---
[INFO] Using 'UTF-8' encoding to copy filtered resources.
[INFO] Copying 3 resources
[INFO] 
[INFO] --- maven-compiler-plugin:3.1:compile (default-compile) @ gt-jdbc-h2 ---
[INFO] Changes detected - recompiling the module!
[INFO] Compiling 8 source files to /home/hudson/genie.jts/.jenkins/jobs/GeoTools-Master/workspace/modules/plugin/jdbc/jdbc-h2/target/classes
[INFO] 
[INFO] --- maven-resources-plugin:2.6:testResources (default-testResources) @ gt-jdbc-h2 ---
[INFO] Using 'UTF-8' encoding to copy filtered resources.
[INFO] skip non existing resourceDirectory /home/hudson/genie.jts/.jenkins/jobs/GeoTools-Master/workspace/modules/plugin/jdbc/jdbc-h2/src/test/resources
[INFO] 
[INFO] --- maven-compiler-plugin:3.1:testCompile (default-testCompile) @ gt-jdbc-h2 ---
[INFO] Changes detected - recompiling the module!
[INFO] Compiling 62 source files to /home/hudson/genie.jts/.jenkins/jobs/GeoTools-Master/workspace/modules/plugin/jdbc/jdbc-h2/target/test-classes
[INFO] 
[INFO] --- maven-surefire-plugin:2.15:test (default-test) @ gt-jdbc-h2 ---
[INFO] Surefire report directory: /home/hudson/genie.jts/.jenkins/jobs/GeoTools-Master/workspace/modules/plugin/jdbc/jdbc-h2/target/surefire-reports

-------------------------------------------------------
 T E S T S
-------------------------------------------------------
Picked up JAVA_TOOL_OPTIONS: -Xmx2G -Djava.io.tmpdir=/tmp/genie.jts
Running org.geotools.data.h2.H2AggregateFunctionTest
Tests run: 18, Failures: 0, Errors: 0, Skipped: 0, Time elapsed: 6.795 sec - in org.geotools.data.h2.H2AggregateFunctionTest
Running org.geotools.data.h2.H2BooleanTest
Tests run: 2, Failures: 0, Errors: 0, Skipped: 0, Time elapsed: 0.492 sec - in org.geotools.data.h2.H2BooleanTest
Running org.geotools.data.h2.H2ConnectionLifecycleTest
2018-06-23T20:00:03.632-0400  WARNING  Could not find mapping for 'geometry', ignoring the column and setting the feature type read only
2018-06-23T20:00:03.925-0400  WARNING  Error occurred closing connection
2018-06-23T20:00:03.926-0400  WARNING  Error occurred closing connection
2018-06-23T20:00:03.927-0400  WARNING  Error occurred closing connection
2018-06-23T20:00:03.927-0400  WARNING  Error occurred closing connection
2018-06-23T20:00:03.928-0400  WARNING  Error occurred closing connection
2018-06-23T20:00:03.929-0400  WARNING  Error occurred closing connection
2018-06-23T20:00:03.930-0400  WARNING  Error occurred closing connection
2018-06-23T20:00:03.930-0400  WARNING  Error occurred closing connection
2018-06-23T20:00:03.931-0400  WARNING  Error occurred closing connection
2018-06-23T20:00:03.932-0400  WARNING  Error occurred closing connection
2018-06-23T20:00:03.933-0400  WARNING  Error occurred closing connection
2018-06-23T20:00:03.933-0400  WARNING  Error occurred closing connection
2018-06-23T20:00:03.934-0400  WARNING  Error occurred closing connection
2018-06-23T20:00:03.935-0400  WARNING  Error occurred closing connection
2018-06-23T20:00:03.936-0400  WARNING  Error occurred closing connection
2018-06-23T20:00:03.937-0400  WARNING  Error occurred closing connection
2018-06-23T20:00:03.938-0400  WARNING  Error occurred closing connection
2018-06-23T20:00:03.938-0400  WARNING  Error occurred closing connection
2018-06-23T20:00:03.939-0400  WARNING  Error occurred closing connection
2018-06-23T20:00:03.940-0400  WARNING  Error occurred closing connection
2018-06-23T20:00:03.941-0400  WARNING  Error occurred closing connection
2018-06-23T20:00:03.941-0400  WARNING  Error occurred closing connection
2018-06-23T20:00:03.942-0400  WARNING  Error occurred closing connection
2018-06-23T20:00:03.943-0400  WARNING  Error occurred closing connection
2018-06-23T20:00:03.944-0400  WARNING  Error occurred closing connection
2018-06-23T20:00:03.944-0400  WARNING  Error occurred closing connection
2018-06-23T20:00:03.945-0400  WARNING  Error occurred closing connection
2018-06-23T20:00:03.946-0400  WARNING  Error occurred closing connection
2018-06-23T20:00:03.946-0400  WARNING  Error occurred closing connection
2018-06-23T20:00:03.947-0400  WARNING  Error occurred closing connection
2018-06-23T20:00:03.948-0400  WARNING  Error occurred closing connection
2018-06-23T20:00:03.948-0400  WARNING  Error occurred closing connection
2018-06-23T20:00:03.949-0400  WARNING  Error occurred closing connection
2018-06-23T20:00:03.950-0400  WARNING  Error occurred closing connection
2018-06-23T20:00:03.951-0400  WARNING  Error occurred closing connection
2018-06-23T20:00:03.951-0400  WARNING  Error occurred closing connection
2018-06-23T20:00:03.952-0400  WARNING  Error occurred closing connection
2018-06-23T20:00:03.953-0400  WARNING  Error occurred closing connection
2018-06-23T20:00:03.953-0400  WARNING  Error occurred closing connection
2018-06-23T20:00:03.954-0400  WARNING  Error occurred closing connection
2018-06-23T20:00:03.955-0400  WARNING  Error occurred closing connection
2018-06-23T20:00:03.955-0400  WARNING  Error occurred closing connection
2018-06-23T20:00:03.956-0400  WARNING  Error occurred closing connection
2018-06-23T20:00:03.957-0400  WARNING  Error occurred closing connection
2018-06-23T20:00:03.957-0400  WARNING  Error occurred closing connection
2018-06-23T20:00:03.958-0400  WARNING  Error occurred closing connection
2018-06-23T20:00:03.959-0400  WARNING  Error occurred closing connection
2018-06-23T20:00:03.959-0400  WARNING  Error occurred closing connection
2018-06-23T20:00:03.960-0400  WARNING  Error occurred closing connection
2018-06-23T20:00:03.960-0400  WARNING  Error occurred closing connection
2018-06-23T20:00:03.961-0400  WARNING  Error occurred closing connection
2018-06-23T20:00:03.962-0400  WARNING  Error occurred closing connection
2018-06-23T20:00:03.962-0400  WARNING  Error occurred closing connection
2018-06-23T20:00:03.963-0400  WARNING  Error occurred closing connection
2018-06-23T20:00:03.963-0400  WARNING  Error occurred closing connection
2018-06-23T20:00:03.964-0400  WARNING  Error occurred closing connection
2018-06-23T20:00:03.965-0400  WARNING  Error occurred closing connection
2018-06-23T20:00:03.965-0400  WARNING  Error occurred closing connection
2018-06-23T20:00:03.966-0400  WARNING  Error occurred closing connection
2018-06-23T20:00:03.966-0400  WARNING  Error occurred closing connection
2018-06-23T20:00:03.967-0400  WARNING  Error occurred closing connection
2018-06-23T20:00:03.968-0400  WARNING  Error occurred closing connection
2018-06-23T20:00:03.968-0400  WARNING  Error occurred closing connection
2018-06-23T20:00:03.969-0400  WARNING  Error occurred closing connection
2018-06-23T20:00:03.970-0400  WARNING  Error occurred closing connection
2018-06-23T20:00:03.970-0400  WARNING  Error occurred closing connection
2018-06-23T20:00:03.971-0400  WARNING  Error occurred closing connection
2018-06-23T20:00:03.971-0400  WARNING  Error occurred closing connection
2018-06-23T20:00:03.972-0400  WARNING  Error occurred closing connection
2018-06-23T20:00:03.972-0400  WARNING  Error occurred closing connection
2018-06-23T20:00:03.973-0400  WARNING  Error occurred closing connection
2018-06-23T20:00:03.973-0400  WARNING  Error occurred closing connection
2018-06-23T20:00:03.974-0400  WARNING  Error occurred closing connection
2018-06-23T20:00:03.974-0400  WARNING  Error occurred closing connection
2018-06-23T20:00:03.975-0400  WARNING  Error occurred closing connection
2018-06-23T20:00:03.976-0400  WARNING  Error occurred closing connection
2018-06-23T20:00:03.976-0400  WARNING  Error occurred closing connection
2018-06-23T20:00:03.977-0400  WARNING  Error occurred closing connection
2018-06-23T20:00:03.977-0400  WARNING  Error occurred closing connection
2018-06-23T20:00:03.978-0400  WARNING  Error occurred closing connection
2018-06-23T20:00:03.979-0400  WARNING  Error occurred closing connection
2018-06-23T20:00:03.979-0400  WARNING  Error occurred closing connection
2018-06-23T20:00:03.980-0400  WARNING  Error occurred closing connection
2018-06-23T20:00:03.980-0400  WARNING  Error occurred closing connection
2018-06-23T20:00:03.981-0400  WARNING  Error occurred closing connection
2018-06-23T20:00:03.981-0400  WARNING  Error occurred closing connection
2018-06-23T20:00:03.982-0400  WARNING  Error occurred closing connection
2018-06-23T20:00:03.982-0400  WARNING  Error occurred closing connection
2018-06-23T20:00:03.983-0400  WARNING  Error occurred closing connection
2018-06-23T20:00:03.983-0400  WARNING  Error occurred closing connection
2018-06-23T20:00:03.984-0400  WARNING  Error occurred closing connection
2018-06-23T20:00:03.984-0400  WARNING  Error occurred closing connection
2018-06-23T20:00:03.985-0400  WARNING  Error occurred closing connection
2018-06-23T20:00:03.985-0400  WARNING  Error occurred closing connection
2018-06-23T20:00:03.986-0400  WARNING  Error occurred closing connection
2018-06-23T20:00:03.987-0400  WARNING  Error occurred closing connection
2018-06-23T20:00:03.987-0400  WARNING  Error occurred closing connection
2018-06-23T20:00:03.988-0400  WARNING  Error occurred closing connection
2018-06-23T20:00:03.988-0400  WARNING  Error occurred closing connection
2018-06-23T20:00:03.989-0400  WARNING  Error occurred closing connection
Tests run: 3, Failures: 0, Errors: 0, Skipped: 0, Time elapsed: 0.885 sec - in org.geotools.data.h2.H2ConnectionLifecycleTest
Running org.geotools.data.h2.H2DataStoreAPITest
Tests run: 43, Failures: 0, Errors: 0, Skipped: 0, Time elapsed: 11.521 sec - in org.geotools.data.h2.H2DataStoreAPITest
Running org.geotools.data.h2.H2DataStoreFactoryTest
Tests run: 4, Failures: 0, Errors: 0, Skipped: 0, Time elapsed: 0.275 sec - in org.geotools.data.h2.H2DataStoreFactoryTest
Running org.geotools.data.h2.H2DataStoreTest
Tests run: 14, Failures: 0, Errors: 0, Skipped: 0, Time elapsed: 2.561 sec - in org.geotools.data.h2.H2DataStoreTest
Running org.geotools.data.h2.H2DateTest
[ d <= Sun Jun 28 00:00:00 GMT-12:00 2009 ]
[ d <= Sun Jun 28 00:00:00 PDT 2009 ]
[ d <= Sun Jun 28 00:00:00 EST 2009 ]
[ d <= Sun Jun 28 00:00:00 GMT 2009 ]
[ d <= Sun Jun 28 00:00:00 CEST 2009 ]
[ d <= Sun Jun 28 00:00:00 GMT+12:00 2009 ]
[ d <= Sun Jun 28 00:00:00 GMT+14:00 2009 ]
Tests run: 4, Failures: 0, Errors: 0, Skipped: 0, Time elapsed: 0.807 sec - in org.geotools.data.h2.H2DateTest
Running org.geotools.data.h2.H2DistanceFiltersTest
Tests run: 8, Failures: 0, Errors: 0, Skipped: 0, Time elapsed: 1.451 sec - in org.geotools.data.h2.H2DistanceFiltersTest
Running org.geotools.data.h2.H2EmptyGeometryTest
Tests run: 6, Failures: 0, Errors: 0, Skipped: 0, Time elapsed: 1.446 sec - in org.geotools.data.h2.H2EmptyGeometryTest
Running org.geotools.data.h2.H2EmptyTest
Tests run: 2, Failures: 0, Errors: 0, Skipped: 0, Time elapsed: 0.276 sec - in org.geotools.data.h2.H2EmptyTest
Running org.geotools.data.h2.H2FeatureCollectionTest
Tests run: 5, Failures: 0, Errors: 0, Skipped: 0, Time elapsed: 0.783 sec - in org.geotools.data.h2.H2FeatureCollectionTest
Running org.geotools.data.h2.H2FeatureLockingTest
Tests run: 8, Failures: 0, Errors: 0, Skipped: 0, Time elapsed: 1.238 sec - in org.geotools.data.h2.H2FeatureLockingTest
Running org.geotools.data.h2.H2FeatureReaderTest
Tests run: 1, Failures: 0, Errors: 0, Skipped: 0, Time elapsed: 0.375 sec - in org.geotools.data.h2.H2FeatureReaderTest
Running org.geotools.data.h2.H2FeatureSourceExposePkTest
java.lang.IllegalArgumentException: Property 'invalidAttribute' could not be found in ft1
	at org.geotools.filter.visitor.PostPreProcessFilterSplittingVisitor.visit(PostPreProcessFilterSplittingVisitor.java:781)
	at org.geotools.filter.AttributeExpressionImpl.accept(AttributeExpressionImpl.java:354)
	at org.geotools.filter.visitor.PostPreProcessFilterSplittingVisitor.visitBinaryComparisonOperator(PostPreProcessFilterSplittingVisitor.java:426)
	at org.geotools.filter.visitor.PostPreProcessFilterSplittingVisitor.visit(PostPreProcessFilterSplittingVisitor.java:380)
	at org.geotools.filter.IsEqualsToImpl.accept(IsEqualsToImpl.java:153)
	at org.geotools.jdbc.SQLDialect.splitFilter(SQLDialect.java:1409)
	at org.geotools.jdbc.JDBCFeatureSource.splitFilter(JDBCFeatureSource.java:382)
	at org.geotools.jdbc.JDBCFeatureSource.splitFilter(JDBCFeatureSource.java:369)
	at org.geotools.jdbc.JDBCFeatureSource.getReaderInternal(JDBCFeatureSource.java:553)
	at org.geotools.jdbc.JDBCFeatureStore.getReaderInternal(JDBCFeatureStore.java:220)
	at org.geotools.data.store.ContentFeatureSource.getReader(ContentFeatureSource.java:610)
	at org.geotools.data.store.ContentFeatureCollection.features(ContentFeatureCollection.java:164)
	at org.geotools.jdbc.JDBCFeatureSourceOnlineTest.testGetFeaturesWithInvalidFilter(JDBCFeatureSourceOnlineTest.java:161)
	at sun.reflect.NativeMethodAccessorImpl.invoke0(Native Method)
	at sun.reflect.NativeMethodAccessorImpl.invoke(NativeMethodAccessorImpl.java:62)
	at sun.reflect.DelegatingMethodAccessorImpl.invoke(DelegatingMethodAccessorImpl.java:43)
	at java.lang.reflect.Method.invoke(Method.java:498)
	at junit.framework.TestCase.runTest(TestCase.java:176)
	at junit.framework.TestCase.runBare(TestCase.java:141)
	at junit.framework.TestResult$1.protect(TestResult.java:122)
	at junit.framework.TestResult.runProtected(TestResult.java:142)
	at junit.framework.TestResult.run(TestResult.java:125)
	at junit.framework.TestCase.run(TestCase.java:129)
	at org.geotools.test.OnlineTestCase.run(OnlineTestCase.java:112)
	at junit.framework.TestSuite.runTest(TestSuite.java:255)
	at junit.framework.TestSuite.run(TestSuite.java:250)
	at org.junit.internal.runners.JUnit38ClassRunner.run(JUnit38ClassRunner.java:84)
	at org.apache.maven.surefire.junit4.JUnit4Provider.execute(JUnit4Provider.java:264)
	at org.apache.maven.surefire.junit4.JUnit4Provider.executeTestSet(JUnit4Provider.java:153)
	at org.apache.maven.surefire.junit4.JUnit4Provider.invoke(JUnit4Provider.java:124)
	at org.apache.maven.surefire.booter.ForkedBooter.invokeProviderInSameClassLoader(ForkedBooter.java:200)
	at org.apache.maven.surefire.booter.ForkedBooter.runSuitesInProcess(ForkedBooter.java:153)
	at org.apache.maven.surefire.booter.ForkedBooter.main(ForkedBooter.java:103)
Tests run: 31, Failures: 0, Errors: 0, Skipped: 0, Time elapsed: 4.871 sec - in org.geotools.data.h2.H2FeatureSourceExposePkTest
Running org.geotools.data.h2.H2FeatureSourceTest
java.lang.IllegalArgumentException: Property 'invalidAttribute' could not be found in ft1
	at org.geotools.filter.visitor.PostPreProcessFilterSplittingVisitor.visit(PostPreProcessFilterSplittingVisitor.java:781)
	at org.geotools.filter.AttributeExpressionImpl.accept(AttributeExpressionImpl.java:354)
	at org.geotools.filter.visitor.PostPreProcessFilterSplittingVisitor.visitBinaryComparisonOperator(PostPreProcessFilterSplittingVisitor.java:426)
	at org.geotools.filter.visitor.PostPreProcessFilterSplittingVisitor.visit(PostPreProcessFilterSplittingVisitor.java:380)
	at org.geotools.filter.IsEqualsToImpl.accept(IsEqualsToImpl.java:153)
	at org.geotools.jdbc.SQLDialect.splitFilter(SQLDialect.java:1409)
	at org.geotools.jdbc.JDBCFeatureSource.splitFilter(JDBCFeatureSource.java:382)
	at org.geotools.jdbc.JDBCFeatureSource.splitFilter(JDBCFeatureSource.java:369)
	at org.geotools.jdbc.JDBCFeatureSource.getReaderInternal(JDBCFeatureSource.java:553)
	at org.geotools.jdbc.JDBCFeatureStore.getReaderInternal(JDBCFeatureStore.java:220)
	at org.geotools.data.store.ContentFeatureSource.getReader(ContentFeatureSource.java:610)
	at org.geotools.data.store.ContentFeatureCollection.features(ContentFeatureCollection.java:164)
	at org.geotools.jdbc.JDBCFeatureSourceOnlineTest.testGetFeaturesWithInvalidFilter(JDBCFeatureSourceOnlineTest.java:161)
	at sun.reflect.NativeMethodAccessorImpl.invoke0(Native Method)
	at sun.reflect.NativeMethodAccessorImpl.invoke(NativeMethodAccessorImpl.java:62)
	at sun.reflect.DelegatingMethodAccessorImpl.invoke(DelegatingMethodAccessorImpl.java:43)
	at java.lang.reflect.Method.invoke(Method.java:498)
	at junit.framework.TestCase.runTest(TestCase.java:176)
	at junit.framework.TestCase.runBare(TestCase.java:141)
	at junit.framework.TestResult$1.protect(TestResult.java:122)
	at junit.framework.TestResult.runProtected(TestResult.java:142)
	at junit.framework.TestResult.run(TestResult.java:125)
	at junit.framework.TestCase.run(TestCase.java:129)
	at org.geotools.test.OnlineTestCase.run(OnlineTestCase.java:112)
	at junit.framework.TestSuite.runTest(TestSuite.java:255)
	at junit.framework.TestSuite.run(TestSuite.java:250)
	at org.junit.internal.runners.JUnit38ClassRunner.run(JUnit38ClassRunner.java:84)
	at org.apache.maven.surefire.junit4.JUnit4Provider.execute(JUnit4Provider.java:264)
	at org.apache.maven.surefire.junit4.JUnit4Provider.executeTestSet(JUnit4Provider.java:153)
	at org.apache.maven.surefire.junit4.JUnit4Provider.invoke(JUnit4Provider.java:124)
	at org.apache.maven.surefire.booter.ForkedBooter.invokeProviderInSameClassLoader(ForkedBooter.java:200)
	at org.apache.maven.surefire.booter.ForkedBooter.runSuitesInProcess(ForkedBooter.java:153)
	at org.apache.maven.surefire.booter.ForkedBooter.main(ForkedBooter.java:103)
Tests run: 31, Failures: 0, Errors: 0, Skipped: 0, Time elapsed: 4.652 sec - in org.geotools.data.h2.H2FeatureSourceTest
Running org.geotools.data.h2.H2FeatureStoreExposedPkTest
Tests run: 16, Failures: 0, Errors: 0, Skipped: 0, Time elapsed: 2.956 sec - in org.geotools.data.h2.H2FeatureStoreExposedPkTest
Running org.geotools.data.h2.H2FeatureStoreTest
Tests run: 15, Failures: 0, Errors: 0, Skipped: 0, Time elapsed: 2.521 sec - in org.geotools.data.h2.H2FeatureStoreTest
Running org.geotools.data.h2.H2GeometryTest
Tests run: 9, Failures: 0, Errors: 0, Skipped: 0, Time elapsed: 1.224 sec - in org.geotools.data.h2.H2GeometryTest
Running org.geotools.data.h2.H2GeometrylessTest
Tests run: 5, Failures: 0, Errors: 0, Skipped: 0, Time elapsed: 0.794 sec - in org.geotools.data.h2.H2GeometrylessTest
Running org.geotools.data.h2.H2JDBCTransactionTest
Tests run: 4, Failures: 0, Errors: 0, Skipped: 0, Time elapsed: 0.623 sec - in org.geotools.data.h2.H2JDBCTransactionTest
Running org.geotools.data.h2.H2JNDIDataSourceTest
Tests run: 2, Failures: 0, Errors: 0, Skipped: 0, Time elapsed: 0.59 sec - in org.geotools.data.h2.H2JNDIDataSourceTest
Running org.geotools.data.h2.H2JoinTest
Tests run: 15, Failures: 0, Errors: 0, Skipped: 0, Time elapsed: 2.712 sec - in org.geotools.data.h2.H2JoinTest
Running org.geotools.data.h2.H2LobTest
Tests run: 4, Failures: 0, Errors: 0, Skipped: 0, Time elapsed: 0.583 sec - in org.geotools.data.h2.H2LobTest
Running org.geotools.data.h2.H2NoPrimaryKeyTest
Tests run: 4, Failures: 0, Errors: 0, Skipped: 0, Time elapsed: 0.672 sec - in org.geotools.data.h2.H2NoPrimaryKeyTest
Running org.geotools.data.h2.H2PrimaryKeyFinderTest
Tests run: 3, Failures: 0, Errors: 0, Skipped: 0, Time elapsed: 0.937 sec - in org.geotools.data.h2.H2PrimaryKeyFinderTest
Running org.geotools.data.h2.H2PrimaryKeyTest
Tests run: 8, Failures: 0, Errors: 0, Skipped: 0, Time elapsed: 2.702 sec - in org.geotools.data.h2.H2PrimaryKeyTest
Running org.geotools.data.h2.H2SkipColumnTest
2018-06-23T20:00:51.040-0400  WARNING  Could not find mapping for 'weird', ignoring the column and setting the feature type read only
2018-06-23T20:00:51.192-0400  WARNING  Could not find mapping for 'weird', ignoring the column and setting the feature type read only
2018-06-23T20:00:51.335-0400  WARNING  Could not find mapping for 'weird', ignoring the column and setting the feature type read only
Tests run: 3, Failures: 0, Errors: 0, Skipped: 0, Time elapsed: 0.56 sec - in org.geotools.data.h2.H2SkipColumnTest
Running org.geotools.data.h2.H2SpatialFiltersTest
Tests run: 11, Failures: 0, Errors: 0, Skipped: 0, Time elapsed: 1.993 sec - in org.geotools.data.h2.H2SpatialFiltersTest
Running org.geotools.data.h2.H2TemporalFilterTest
Tests run: 12, Failures: 0, Errors: 0, Skipped: 0, Time elapsed: 1.975 sec - in org.geotools.data.h2.H2TemporalFilterTest
Running org.geotools.data.h2.H2ThreeValuedLogicTest
Tests run: 4, Failures: 0, Errors: 0, Skipped: 0, Time elapsed: 0.664 sec - in org.geotools.data.h2.H2ThreeValuedLogicTest
Running org.geotools.data.h2.H2TypeNamesTest
Tests run: 1, Failures: 0, Errors: 0, Skipped: 0, Time elapsed: 0.146 sec - in org.geotools.data.h2.H2TypeNamesTest
Running org.geotools.data.h2.H2UDTTest
Tests run: 3, Failures: 0, Errors: 0, Skipped: 0, Time elapsed: 0.713 sec - in org.geotools.data.h2.H2UDTTest
Running org.geotools.data.h2.H2UuidTest
Tests run: 6, Failures: 0, Errors: 0, Skipped: 0, Time elapsed: 1.086 sec - in org.geotools.data.h2.H2UuidTest
Running org.geotools.data.h2.H2ViewTest
Tests run: 5, Failures: 0, Errors: 0, Skipped: 0, Time elapsed: 1.174 sec - in org.geotools.data.h2.H2ViewTest
Running org.geotools.data.h2.H2VirtualTableTest
2018-06-23T20:00:59.385-0400  WARNING  Could not find mapping for 'geom', ignoring the column and setting the feature type read only
2018-06-23T20:00:59.386-0400  WARNING  Could not find mapping for 'geom', ignoring the column and setting the feature type read only
2018-06-23T20:00:59.550-0400  WARNING  Could not find mapping for 'geom', ignoring the column and setting the feature type read only
2018-06-23T20:00:59.551-0400  WARNING  Could not find mapping for 'geom', ignoring the column and setting the feature type read only
2018-06-23T20:00:59.849-0400  WARNING  Could not find mapping for 'geom', ignoring the column and setting the feature type read only
2018-06-23T20:00:59.851-0400  WARNING  Could not find mapping for 'geom', ignoring the column and setting the feature type read only
2018-06-23T20:01:00.014-0400  WARNING  Could not find mapping for 'geom', ignoring the column and setting the feature type read only
2018-06-23T20:01:00.016-0400  WARNING  Could not find mapping for 'geom', ignoring the column and setting the feature type read only
2018-06-23T20:01:00.180-0400  WARNING  Could not find mapping for 'geom', ignoring the column and setting the feature type read only
2018-06-23T20:01:00.182-0400  WARNING  Could not find mapping for 'geom', ignoring the column and setting the feature type read only
2018-06-23T20:01:00.344-0400  WARNING  Could not find mapping for 'geom', ignoring the column and setting the feature type read only
2018-06-23T20:01:00.346-0400  WARNING  Could not find mapping for 'geom', ignoring the column and setting the feature type read only
2018-06-23T20:01:00.514-0400  WARNING  Could not find mapping for 'geom', ignoring the column and setting the feature type read only
2018-06-23T20:01:00.516-0400  WARNING  Could not find mapping for 'geom', ignoring the column and setting the feature type read only
2018-06-23T20:01:00.524-0400  SEVERE  Invalid value for parameter mul
java.lang.IllegalArgumentException: Value abc does not match [\d\.e\+-]+
	at org.geotools.jdbc.RegexpValidator.validate(RegexpValidator.java:42)
	at org.geotools.jdbc.VirtualTable.expandParameters(VirtualTable.java:249)
	at org.geotools.jdbc.JDBCDataStore.encodeAliasedTableName(JDBCDataStore.java:4612)
	at org.geotools.jdbc.JDBCDataStore.encodeTableName(JDBCDataStore.java:4601)
	at org.geotools.jdbc.JDBCDataStore.selectSQL(JDBCDataStore.java:3351)
	at org.geotools.jdbc.JDBCFeatureSource.getReaderInternal(JDBCFeatureSource.java:595)
	at org.geotools.data.store.ContentFeatureSource.getReader(ContentFeatureSource.java:610)
	at org.geotools.data.store.ContentFeatureCollection.features(ContentFeatureCollection.java:164)
	at org.geotools.data.store.ContentFeatureCollection.features(ContentFeatureCollection.java:53)
	at org.geotools.jdbc.JDBCVirtualTableOnlineTest.testMulParamInvalid(JDBCVirtualTableOnlineTest.java:277)
	at sun.reflect.NativeMethodAccessorImpl.invoke0(Native Method)
	at sun.reflect.NativeMethodAccessorImpl.invoke(NativeMethodAccessorImpl.java:62)
	at sun.reflect.DelegatingMethodAccessorImpl.invoke(DelegatingMethodAccessorImpl.java:43)
	at java.lang.reflect.Method.invoke(Method.java:498)
	at junit.framework.TestCase.runTest(TestCase.java:176)
	at junit.framework.TestCase.runBare(TestCase.java:141)
	at junit.framework.TestResult$1.protect(TestResult.java:122)
	at junit.framework.TestResult.runProtected(TestResult.java:142)
	at junit.framework.TestResult.run(TestResult.java:125)
	at junit.framework.TestCase.run(TestCase.java:129)
	at org.geotools.test.OnlineTestCase.run(OnlineTestCase.java:112)
	at junit.framework.TestSuite.runTest(TestSuite.java:255)
	at junit.framework.TestSuite.run(TestSuite.java:250)
	at org.junit.internal.runners.JUnit38ClassRunner.run(JUnit38ClassRunner.java:84)
	at org.apache.maven.surefire.junit4.JUnit4Provider.execute(JUnit4Provider.java:264)
	at org.apache.maven.surefire.junit4.JUnit4Provider.executeTestSet(JUnit4Provider.java:153)
	at org.apache.maven.surefire.junit4.JUnit4Provider.invoke(JUnit4Provider.java:124)
	at org.apache.maven.surefire.booter.ForkedBooter.invokeProviderInSameClassLoader(ForkedBooter.java:200)
	at org.apache.maven.surefire.booter.ForkedBooter.runSuitesInProcess(ForkedBooter.java:153)
	at org.apache.maven.surefire.booter.ForkedBooter.main(ForkedBooter.java:103)

2018-06-23T20:01:00.711-0400  WARNING  Could not find mapping for 'geom', ignoring the column and setting the feature type read only
2018-06-23T20:01:00.713-0400  WARNING  Could not find mapping for 'geom', ignoring the column and setting the feature type read only
2018-06-23T20:01:00.873-0400  WARNING  Could not find mapping for 'geom', ignoring the column and setting the feature type read only
2018-06-23T20:01:00.875-0400  WARNING  Could not find mapping for 'geom', ignoring the column and setting the feature type read only
2018-06-23T20:01:01.136-0400  WARNING  Could not find mapping for 'geom', ignoring the column and setting the feature type read only
2018-06-23T20:01:01.138-0400  WARNING  Could not find mapping for 'geom', ignoring the column and setting the feature type read only
2018-06-23T20:01:01.456-0400  WARNING  Could not find mapping for 'geom', ignoring the column and setting the feature type read only
2018-06-23T20:01:01.458-0400  WARNING  Could not find mapping for 'geom', ignoring the column and setting the feature type read only
2018-06-23T20:01:01.727-0400  WARNING  Could not find mapping for 'geom', ignoring the column and setting the feature type read only
2018-06-23T20:01:01.729-0400  WARNING  Could not find mapping for 'geom', ignoring the column and setting the feature type read only
2018-06-23T20:01:02.090-0400  WARNING  Could not find mapping for 'geom', ignoring the column and setting the feature type read only
2018-06-23T20:01:02.092-0400  WARNING  Could not find mapping for 'geom', ignoring the column and setting the feature type read only
2018-06-23T20:01:02.273-0400  WARNING  Could not find mapping for 'geom', ignoring the column and setting the feature type read only
2018-06-23T20:01:02.274-0400  WARNING  Could not find mapping for 'geom', ignoring the column and setting the feature type read only
2018-06-23T20:01:02.453-0400  WARNING  Could not find mapping for 'geom', ignoring the column and setting the feature type read only
2018-06-23T20:01:02.455-0400  WARNING  Could not find mapping for 'geom', ignoring the column and setting the feature type read only
Tests run: 15, Failures: 0, Errors: 0, Skipped: 0, Time elapsed: 3.241 sec - in org.geotools.data.h2.H2VirtualTableTest
Running org.geotools.data.h2.jndi.H2DataStoreTest
Tests run: 14, Failures: 0, Errors: 0, Skipped: 0, Time elapsed: 2.571 sec - in org.geotools.data.h2.jndi.H2DataStoreTest

Results :

Tests run: 339, Failures: 0, Errors: 0, Skipped: 0

[JENKINS] Recording test results
[INFO] 
[INFO] --- maven-jar-plugin:2.4:jar (default-jar) @ gt-jdbc-h2 ---
[INFO] Building jar: /home/hudson/genie.jts/.jenkins/jobs/GeoTools-Master/workspace/modules/plugin/jdbc/jdbc-h2/target/gt-jdbc-h2-20-SNAPSHOT.jar
[INFO] 
[INFO] >>> maven-source-plugin:2.2.1:jar (attach-sources) > generate-sources @ gt-jdbc-h2 >>>
[INFO] 
[INFO] --- git-commit-id-plugin:2.1.15:revision (default) @ gt-jdbc-h2 ---
[WARNING] Failed to getClass for org.apache.maven.plugin.source.SourceJarMojo
[INFO] 
[INFO] <<< maven-source-plugin:2.2.1:jar (attach-sources) < generate-sources @ gt-jdbc-h2 <<<
[INFO] 
[INFO] 
[INFO] --- maven-source-plugin:2.2.1:jar (attach-sources) @ gt-jdbc-h2 ---
[INFO] Building jar: /home/hudson/genie.jts/.jenkins/jobs/GeoTools-Master/workspace/modules/plugin/jdbc/jdbc-h2/target/gt-jdbc-h2-20-SNAPSHOT-sources.jar
[INFO] 
[INFO] --- maven-install-plugin:2.4:install (default-install) @ gt-jdbc-h2 ---
[INFO] Installing /home/hudson/genie.jts/.jenkins/jobs/GeoTools-Master/workspace/modules/plugin/jdbc/jdbc-h2/target/gt-jdbc-h2-20-SNAPSHOT.jar to /opt/public/hipp/homes/genie.jts/.m2/repository/org/geotools/jdbc/gt-jdbc-h2/20-SNAPSHOT/gt-jdbc-h2-20-SNAPSHOT.jar
[INFO] Installing /home/hudson/genie.jts/.jenkins/jobs/GeoTools-Master/workspace/modules/plugin/jdbc/jdbc-h2/pom.xml to /opt/public/hipp/homes/genie.jts/.m2/repository/org/geotools/jdbc/gt-jdbc-h2/20-SNAPSHOT/gt-jdbc-h2-20-SNAPSHOT.pom
[INFO] Installing /home/hudson/genie.jts/.jenkins/jobs/GeoTools-Master/workspace/modules/plugin/jdbc/jdbc-h2/target/gt-jdbc-h2-20-SNAPSHOT-sources.jar to /opt/public/hipp/homes/genie.jts/.m2/repository/org/geotools/jdbc/gt-jdbc-h2/20-SNAPSHOT/gt-jdbc-h2-20-SNAPSHOT-sources.jar