FailedConsole Output

Skipping 481 KB.. Full Log
0)
	at org.apache.maven.surefire.booter.ForkedBooter.runSuitesInProcess(ForkedBooter.java:153)
	at org.apache.maven.surefire.booter.ForkedBooter.main(ForkedBooter.java:103)

Jun 23, 2018 9:09:22 PM org.geotools.data.shapefile.shp.ShapefileReader <init>
WARNING: Could not open the .shx file, continuing assuming the .shp file is not sparse
java.io.FileNotFoundException: /home/hudson/genie.jts/.jenkins/jobs/GeoTools-Master/workspace/modules/plugin/shapefile/target/test-classes/org/geotools/data/shapefile/test-data/shapes/stream.shx (No such file or directory)
	at java.io.RandomAccessFile.open0(Native Method)
	at java.io.RandomAccessFile.open(RandomAccessFile.java:316)
	at java.io.RandomAccessFile.<init>(RandomAccessFile.java:243)
	at org.geotools.data.shapefile.files.ShpFiles.getReadChannel(ShpFiles.java:758)
	at org.geotools.data.shapefile.shp.IndexFile.<init>(IndexFile.java:72)
	at org.geotools.data.shapefile.shp.ShapefileReader.<init>(ShapefileReader.java:267)
	at org.geotools.data.shapefile.ShapefileSetManager.openShapeReader(ShapefileSetManager.java:48)
	at org.geotools.data.shapefile.ShapefileFeatureSource.getCountInternal(ShapefileFeatureSource.java:290)
	at org.geotools.data.shapefile.ShapefileFeatureStore.getCountInternal(ShapefileFeatureStore.java:126)
	at org.geotools.data.store.ContentFeatureSource.getCount(ContentFeatureSource.java:464)
	at org.geotools.data.store.ContentFeatureCollection.size(ContentFeatureCollection.java:226)
	at org.geotools.data.shapefile.ShapefileDataStoreTest.testGetCount(ShapefileDataStoreTest.java:1465)
	at sun.reflect.NativeMethodAccessorImpl.invoke0(Native Method)
	at sun.reflect.NativeMethodAccessorImpl.invoke(NativeMethodAccessorImpl.java:62)
	at sun.reflect.DelegatingMethodAccessorImpl.invoke(DelegatingMethodAccessorImpl.java:43)
	at java.lang.reflect.Method.invoke(Method.java:498)
	at org.junit.runners.model.FrameworkMethod$1.runReflectiveCall(FrameworkMethod.java:47)
	at org.junit.internal.runners.model.ReflectiveCallable.run(ReflectiveCallable.java:12)
	at org.junit.runners.model.FrameworkMethod.invokeExplosively(FrameworkMethod.java:44)
	at org.junit.internal.runners.statements.InvokeMethod.evaluate(InvokeMethod.java:17)
	at org.junit.internal.runners.statements.RunAfters.evaluate(RunAfters.java:27)
	at org.junit.runners.ParentRunner.runLeaf(ParentRunner.java:271)
	at org.junit.runners.BlockJUnit4ClassRunner.runChild(BlockJUnit4ClassRunner.java:70)
	at org.junit.runners.BlockJUnit4ClassRunner.runChild(BlockJUnit4ClassRunner.java:50)
	at org.junit.runners.ParentRunner$3.run(ParentRunner.java:238)
	at org.junit.runners.ParentRunner$1.schedule(ParentRunner.java:63)
	at org.junit.runners.ParentRunner.runChildren(ParentRunner.java:236)
	at org.junit.runners.ParentRunner.access$000(ParentRunner.java:53)
	at org.junit.runners.ParentRunner$2.evaluate(ParentRunner.java:229)
	at org.junit.runners.ParentRunner.run(ParentRunner.java:309)
	at org.apache.maven.surefire.junit4.JUnit4Provider.execute(JUnit4Provider.java:264)
	at org.apache.maven.surefire.junit4.JUnit4Provider.executeTestSet(JUnit4Provider.java:153)
	at org.apache.maven.surefire.junit4.JUnit4Provider.invoke(JUnit4Provider.java:124)
	at org.apache.maven.surefire.booter.ForkedBooter.invokeProviderInSameClassLoader(ForkedBooter.java:200)
	at org.apache.maven.surefire.booter.ForkedBooter.runSuitesInProcess(ForkedBooter.java:153)
	at org.apache.maven.surefire.booter.ForkedBooter.main(ForkedBooter.java:103)

Jun 23, 2018 9:09:22 PM org.geotools.data.shapefile.shp.ShapefileReader <init>
WARNING: Could not open the .shx file, continuing assuming the .shp file is not sparse
java.io.FileNotFoundException: /home/hudson/genie.jts/.jenkins/jobs/GeoTools-Master/workspace/modules/plugin/shapefile/target/test-classes/org/geotools/data/shapefile/test-data/shapes/stream.shx (No such file or directory)
	at java.io.RandomAccessFile.open0(Native Method)
	at java.io.RandomAccessFile.open(RandomAccessFile.java:316)
	at java.io.RandomAccessFile.<init>(RandomAccessFile.java:243)
	at org.geotools.data.shapefile.files.ShpFiles.getReadChannel(ShpFiles.java:758)
	at org.geotools.data.shapefile.shp.IndexFile.<init>(IndexFile.java:72)
	at org.geotools.data.shapefile.shp.ShapefileReader.<init>(ShapefileReader.java:267)
	at org.geotools.data.shapefile.ShapefileSetManager.openShapeReader(ShapefileSetManager.java:48)
	at org.geotools.data.shapefile.ShapefileFeatureSource.getCountInternal(ShapefileFeatureSource.java:290)
	at org.geotools.data.shapefile.ShapefileFeatureStore.getCountInternal(ShapefileFeatureStore.java:126)
	at org.geotools.data.store.ContentFeatureSource.getCount(ContentFeatureSource.java:464)
	at org.geotools.data.shapefile.ShapefileDataStoreTest.testGetCount(ShapefileDataStoreTest.java:1466)
	at sun.reflect.NativeMethodAccessorImpl.invoke0(Native Method)
	at sun.reflect.NativeMethodAccessorImpl.invoke(NativeMethodAccessorImpl.java:62)
	at sun.reflect.DelegatingMethodAccessorImpl.invoke(DelegatingMethodAccessorImpl.java:43)
	at java.lang.reflect.Method.invoke(Method.java:498)
	at org.junit.runners.model.FrameworkMethod$1.runReflectiveCall(FrameworkMethod.java:47)
	at org.junit.internal.runners.model.ReflectiveCallable.run(ReflectiveCallable.java:12)
	at org.junit.runners.model.FrameworkMethod.invokeExplosively(FrameworkMethod.java:44)
	at org.junit.internal.runners.statements.InvokeMethod.evaluate(InvokeMethod.java:17)
	at org.junit.internal.runners.statements.RunAfters.evaluate(RunAfters.java:27)
	at org.junit.runners.ParentRunner.runLeaf(ParentRunner.java:271)
	at org.junit.runners.BlockJUnit4ClassRunner.runChild(BlockJUnit4ClassRunner.java:70)
	at org.junit.runners.BlockJUnit4ClassRunner.runChild(BlockJUnit4ClassRunner.java:50)
	at org.junit.runners.ParentRunner$3.run(ParentRunner.java:238)
	at org.junit.runners.ParentRunner$1.schedule(ParentRunner.java:63)
	at org.junit.runners.ParentRunner.runChildren(ParentRunner.java:236)
	at org.junit.runners.ParentRunner.access$000(ParentRunner.java:53)
	at org.junit.runners.ParentRunner$2.evaluate(ParentRunner.java:229)
	at org.junit.runners.ParentRunner.run(ParentRunner.java:309)
	at org.apache.maven.surefire.junit4.JUnit4Provider.execute(JUnit4Provider.java:264)
	at org.apache.maven.surefire.junit4.JUnit4Provider.executeTestSet(JUnit4Provider.java:153)
	at org.apache.maven.surefire.junit4.JUnit4Provider.invoke(JUnit4Provider.java:124)
	at org.apache.maven.surefire.booter.ForkedBooter.invokeProviderInSameClassLoader(ForkedBooter.java:200)
	at org.apache.maven.surefire.booter.ForkedBooter.runSuitesInProcess(ForkedBooter.java:153)
	at org.apache.maven.surefire.booter.ForkedBooter.main(ForkedBooter.java:103)

Jun 23, 2018 9:09:22 PM org.geotools.data.shapefile.shp.ShapefileReader <init>
WARNING: Could not open the .shx file, continuing assuming the .shp file is not sparse
java.io.FileNotFoundException: /home/hudson/genie.jts/.jenkins/jobs/GeoTools-Master/workspace/modules/plugin/shapefile/target/test-classes/org/geotools/data/shapefile/test-data/shapes/stream.shx (No such file or directory)
	at java.io.RandomAccessFile.open0(Native Method)
	at java.io.RandomAccessFile.open(RandomAccessFile.java:316)
	at java.io.RandomAccessFile.<init>(RandomAccessFile.java:243)
	at org.geotools.data.shapefile.files.ShpFiles.getReadChannel(ShpFiles.java:758)
	at org.geotools.data.shapefile.shp.IndexFile.<init>(IndexFile.java:72)
	at org.geotools.data.shapefile.shp.ShapefileReader.<init>(ShapefileReader.java:267)
	at org.geotools.data.shapefile.ShapefileSetManager.openShapeReader(ShapefileSetManager.java:48)
	at org.geotools.data.shapefile.ShapefileFeatureSource.getReaderInternal(ShapefileFeatureSource.java:369)
	at org.geotools.data.shapefile.ShapefileFeatureStore.getReaderInternal(ShapefileFeatureStore.java:132)
	at org.geotools.data.store.ContentFeatureSource.getReader(ContentFeatureSource.java:600)
	at org.geotools.data.store.ContentFeatureCollection.size(ContentFeatureCollection.java:240)
	at org.geotools.data.shapefile.ShapefileDataStoreTest.testGetCount(ShapefileDataStoreTest.java:1481)
	at sun.reflect.NativeMethodAccessorImpl.invoke0(Native Method)
	at sun.reflect.NativeMethodAccessorImpl.invoke(NativeMethodAccessorImpl.java:62)
	at sun.reflect.DelegatingMethodAccessorImpl.invoke(DelegatingMethodAccessorImpl.java:43)
	at java.lang.reflect.Method.invoke(Method.java:498)
	at org.junit.runners.model.FrameworkMethod$1.runReflectiveCall(FrameworkMethod.java:47)
	at org.junit.internal.runners.model.ReflectiveCallable.run(ReflectiveCallable.java:12)
	at org.junit.runners.model.FrameworkMethod.invokeExplosively(FrameworkMethod.java:44)
	at org.junit.internal.runners.statements.InvokeMethod.evaluate(InvokeMethod.java:17)
	at org.junit.internal.runners.statements.RunAfters.evaluate(RunAfters.java:27)
	at org.junit.runners.ParentRunner.runLeaf(ParentRunner.java:271)
	at org.junit.runners.BlockJUnit4ClassRunner.runChild(BlockJUnit4ClassRunner.java:70)
	at org.junit.runners.BlockJUnit4ClassRunner.runChild(BlockJUnit4ClassRunner.java:50)
	at org.junit.runners.ParentRunner$3.run(ParentRunner.java:238)
	at org.junit.runners.ParentRunner$1.schedule(ParentRunner.java:63)
	at org.junit.runners.ParentRunner.runChildren(ParentRunner.java:236)
	at org.junit.runners.ParentRunner.access$000(ParentRunner.java:53)
	at org.junit.runners.ParentRunner$2.evaluate(ParentRunner.java:229)
	at org.junit.runners.ParentRunner.run(ParentRunner.java:309)
	at org.apache.maven.surefire.junit4.JUnit4Provider.execute(JUnit4Provider.java:264)
	at org.apache.maven.surefire.junit4.JUnit4Provider.executeTestSet(JUnit4Provider.java:153)
	at org.apache.maven.surefire.junit4.JUnit4Provider.invoke(JUnit4Provider.java:124)
	at org.apache.maven.surefire.booter.ForkedBooter.invokeProviderInSameClassLoader(ForkedBooter.java:200)
	at org.apache.maven.surefire.booter.ForkedBooter.runSuitesInProcess(ForkedBooter.java:153)
	at org.apache.maven.surefire.booter.ForkedBooter.main(ForkedBooter.java:103)

Jun 23, 2018 9:09:22 PM org.geotools.data.shapefile.shp.ShapefileReader <init>
WARNING: Could not open the .shx file, continuing assuming the .shp file is not sparse
java.io.FileNotFoundException: /home/hudson/genie.jts/.jenkins/jobs/GeoTools-Master/workspace/modules/plugin/shapefile/target/test-classes/org/geotools/data/shapefile/test-data/shapes/stream.shx (No such file or directory)
	at java.io.RandomAccessFile.open0(Native Method)
	at java.io.RandomAccessFile.open(RandomAccessFile.java:316)
	at java.io.RandomAccessFile.<init>(RandomAccessFile.java:243)
	at org.geotools.data.shapefile.files.ShpFiles.getReadChannel(ShpFiles.java:758)
	at org.geotools.data.shapefile.shp.IndexFile.<init>(IndexFile.java:72)
	at org.geotools.data.shapefile.shp.ShapefileReader.<init>(ShapefileReader.java:267)
	at org.geotools.data.shapefile.ShapefileSetManager.openShapeReader(ShapefileSetManager.java:48)
	at org.geotools.data.shapefile.ShapefileFeatureSource.getReaderInternal(ShapefileFeatureSource.java:369)
	at org.geotools.data.shapefile.ShapefileFeatureStore.getReaderInternal(ShapefileFeatureStore.java:132)
	at org.geotools.data.store.ContentFeatureSource.getReader(ContentFeatureSource.java:600)
	at org.geotools.data.store.ContentFeatureCollection.isEmpty(ContentFeatureCollection.java:312)
	at org.geotools.data.shapefile.ShapefileDataStoreTest.testGetCount(ShapefileDataStoreTest.java:1482)
	at sun.reflect.NativeMethodAccessorImpl.invoke0(Native Method)
	at sun.reflect.NativeMethodAccessorImpl.invoke(NativeMethodAccessorImpl.java:62)
	at sun.reflect.DelegatingMethodAccessorImpl.invoke(DelegatingMethodAccessorImpl.java:43)
	at java.lang.reflect.Method.invoke(Method.java:498)
	at org.junit.runners.model.FrameworkMethod$1.runReflectiveCall(FrameworkMethod.java:47)
	at org.junit.internal.runners.model.ReflectiveCallable.run(ReflectiveCallable.java:12)
	at org.junit.runners.model.FrameworkMethod.invokeExplosively(FrameworkMethod.java:44)
	at org.junit.internal.runners.statements.InvokeMethod.evaluate(InvokeMethod.java:17)
	at org.junit.internal.runners.statements.RunAfters.evaluate(RunAfters.java:27)
	at org.junit.runners.ParentRunner.runLeaf(ParentRunner.java:271)
	at org.junit.runners.BlockJUnit4ClassRunner.runChild(BlockJUnit4ClassRunner.java:70)
	at org.junit.runners.BlockJUnit4ClassRunner.runChild(BlockJUnit4ClassRunner.java:50)
	at org.junit.runners.ParentRunner$3.run(ParentRunner.java:238)
	at org.junit.runners.ParentRunner$1.schedule(ParentRunner.java:63)
	at org.junit.runners.ParentRunner.runChildren(ParentRunner.java:236)
	at org.junit.runners.ParentRunner.access$000(ParentRunner.java:53)
	at org.junit.runners.ParentRunner$2.evaluate(ParentRunner.java:229)
	at org.junit.runners.ParentRunner.run(ParentRunner.java:309)
	at org.apache.maven.surefire.junit4.JUnit4Provider.execute(JUnit4Provider.java:264)
	at org.apache.maven.surefire.junit4.JUnit4Provider.executeTestSet(JUnit4Provider.java:153)
	at org.apache.maven.surefire.junit4.JUnit4Provider.invoke(JUnit4Provider.java:124)
	at org.apache.maven.surefire.booter.ForkedBooter.invokeProviderInSameClassLoader(ForkedBooter.java:200)
	at org.apache.maven.surefire.booter.ForkedBooter.runSuitesInProcess(ForkedBooter.java:153)
	at org.apache.maven.surefire.booter.ForkedBooter.main(ForkedBooter.java:103)

2018-06-23T21:09:23.171-0400  WARNING  Writing DBF data, value 12,345,678,901,234,567,890,123,456,789 cannot be represented in size 19
2018-06-23T21:09:23.202-0400  WARNING  Could not open the .shx file, continuing assuming the .shp file is not sparse
java.io.FileNotFoundException: /home/hudson/genie.jts/.jenkins/jobs/GeoTools-Master/workspace/modules/plugin/shapefile/target/test-classes/org/geotools/data/shapefile/test-data/shapes/stream.shx (No such file or directory)
	at java.io.RandomAccessFile.open0(Native Method)
	at java.io.RandomAccessFile.open(RandomAccessFile.java:316)
	at java.io.RandomAccessFile.<init>(RandomAccessFile.java:243)
	at org.geotools.data.shapefile.files.ShpFiles.getReadChannel(ShpFiles.java:758)
	at org.geotools.data.shapefile.shp.IndexFile.<init>(IndexFile.java:72)
	at org.geotools.data.shapefile.shp.ShapefileReader.<init>(ShapefileReader.java:267)
	at org.geotools.data.shapefile.ShapefileSetManager.openShapeReader(ShapefileSetManager.java:48)
	at org.geotools.data.shapefile.ShapefileFeatureSource.readAttributes(ShapefileFeatureSource.java:520)
	at org.geotools.data.shapefile.ShapefileFeatureSource.buildFeatureType(ShapefileFeatureSource.java:479)
	at org.geotools.data.shapefile.ShapefileFeatureStore.buildFeatureType(ShapefileFeatureStore.java:137)
	at org.geotools.data.store.ContentFeatureSource.getAbsoluteSchema(ContentFeatureSource.java:328)
	at org.geotools.data.store.ContentFeatureSource.getSchema(ContentFeatureSource.java:297)
	at org.geotools.data.store.ContentFeatureSource.getFeatures(ContentFeatureSource.java:1029)
	at org.geotools.data.store.ContentFeatureSource.getFeatures(ContentFeatureSource.java:106)
	at org.geotools.data.shapefile.ShapefileDataStoreTest.testGeometryFilter(ShapefileDataStoreTest.java:605)
	at sun.reflect.NativeMethodAccessorImpl.invoke0(Native Method)
	at sun.reflect.NativeMethodAccessorImpl.invoke(NativeMethodAccessorImpl.java:62)
	at sun.reflect.DelegatingMethodAccessorImpl.invoke(DelegatingMethodAccessorImpl.java:43)
	at java.lang.reflect.Method.invoke(Method.java:498)
	at org.junit.runners.model.FrameworkMethod$1.runReflectiveCall(FrameworkMethod.java:47)
	at org.junit.internal.runners.model.ReflectiveCallable.run(ReflectiveCallable.java:12)
	at org.junit.runners.model.FrameworkMethod.invokeExplosively(FrameworkMethod.java:44)
	at org.junit.internal.runners.statements.InvokeMethod.evaluate(InvokeMethod.java:17)
	at org.junit.internal.runners.statements.RunAfters.evaluate(RunAfters.java:27)
	at org.junit.runners.ParentRunner.runLeaf(ParentRunner.java:271)
	at org.junit.runners.BlockJUnit4ClassRunner.runChild(BlockJUnit4ClassRunner.java:70)
	at org.junit.runners.BlockJUnit4ClassRunner.runChild(BlockJUnit4ClassRunner.java:50)
	at org.junit.runners.ParentRunner$3.run(ParentRunner.java:238)
	at org.junit.runners.ParentRunner$1.schedule(ParentRunner.java:63)
	at org.junit.runners.ParentRunner.runChildren(ParentRunner.java:236)
	at org.junit.runners.ParentRunner.access$000(ParentRunner.java:53)
	at org.junit.runners.ParentRunner$2.evaluate(ParentRunner.java:229)
	at org.junit.runners.ParentRunner.run(ParentRunner.java:309)
	at org.apache.maven.surefire.junit4.JUnit4Provider.execute(JUnit4Provider.java:264)
	at org.apache.maven.surefire.junit4.JUnit4Provider.executeTestSet(JUnit4Provider.java:153)
	at org.apache.maven.surefire.junit4.JUnit4Provider.invoke(JUnit4Provider.java:124)
	at org.apache.maven.surefire.booter.ForkedBooter.invokeProviderInSameClassLoader(ForkedBooter.java:200)
	at org.apache.maven.surefire.booter.ForkedBooter.runSuitesInProcess(ForkedBooter.java:153)
	at org.apache.maven.surefire.booter.ForkedBooter.main(ForkedBooter.java:103)

2018-06-23T21:09:23.224-0400  WARNING  Writing DBF data, value 12,345,678,901,234,567,890,123,456,789 cannot be represented in size 19
2018-06-23T21:09:23.225-0400  WARNING  Writing DBF data, value 12,345,678,901,234,567,890,123,456,789 cannot be represented in size 19
2018-06-23T21:09:23.225-0400  WARNING  Writing DBF data, value 12,345,678,901,234,567,890,123,456,789 cannot be represented in size 19
2018-06-23T21:09:23.226-0400  WARNING  Writing DBF data, value 12,345,678,901,234,567,890,123,456,789 cannot be represented in size 19
2018-06-23T21:09:23.227-0400  WARNING  Writing DBF data, value 12,345,678,901,234,567,890,123,456,789 cannot be represented in size 19
2018-06-23T21:09:23.227-0400  WARNING  Writing DBF data, value 12,345,678,901,234,567,890,123,456,789 cannot be represented in size 19
2018-06-23T21:09:23.228-0400  WARNING  Writing DBF data, value 12,345,678,901,234,567,890,123,456,789 cannot be represented in size 19
2018-06-23T21:09:23.229-0400  WARNING  Writing DBF data, value 12,345,678,901,234,567,890,123,456,789 cannot be represented in size 19
2018-06-23T21:09:23.229-0400  WARNING  Writing DBF data, value 12,345,678,901,234,567,890,123,456,789 cannot be represented in size 19
2018-06-23T21:09:23.230-0400  WARNING  Writing DBF data, value 12,345,678,901,234,567,890,123,456,789 cannot be represented in size 19
2018-06-23T21:09:23.231-0400  WARNING  Writing DBF data, value 12,345,678,901,234,567,890,123,456,789 cannot be represented in size 19
2018-06-23T21:09:23.231-0400  WARNING  Writing DBF data, value 12,345,678,901,234,567,890,123,456,789 cannot be represented in size 19
2018-06-23T21:09:23.232-0400  WARNING  Writing DBF data, value 12,345,678,901,234,567,890,123,456,789 cannot be represented in size 19
2018-06-23T21:09:23.233-0400  WARNING  Writing DBF data, value 12,345,678,901,234,567,890,123,456,789 cannot be represented in size 19
2018-06-23T21:09:23.233-0400  WARNING  Writing DBF data, value 12,345,678,901,234,567,890,123,456,789 cannot be represented in size 19
2018-06-23T21:09:23.234-0400  WARNING  Writing DBF data, value 12,345,678,901,234,567,890,123,456,789 cannot be represented in size 19
2018-06-23T21:09:23.234-0400  WARNING  Writing DBF data, value 12,345,678,901,234,567,890,123,456,789 cannot be represented in size 19
2018-06-23T21:09:23.235-0400  WARNING  Writing DBF data, value 12,345,678,901,234,567,890,123,456,789 cannot be represented in size 19
2018-06-23T21:09:23.236-0400  WARNING  Writing DBF data, value 12,345,678,901,234,567,890,123,456,789 cannot be represented in size 19
2018-06-23T21:09:23.236-0400  WARNING  Writing DBF data, value 12,345,678,901,234,567,890,123,456,789 cannot be represented in size 19
2018-06-23T21:09:23.322-0400  SEVERE  There's code leaving transaction unclosed. Call Transaction.close() after using them to ensure they do not hold state such as JDBC connections or file handles
2018-06-23T21:09:23.323-0400  SEVERE  Unclosed transaction handle is 'org.geotools.data.shapefile.ShapefileDataStoreTest.testWrite Transaction'
2018-06-23T21:09:23.386-0400  WARNING  Writing DBF data, value 12,345,678,901,234,567,890,123,456,789 cannot be represented in size 19
2018-06-23T21:09:23.387-0400  WARNING  Writing DBF data, value 12,345,678,901,234,567,890,123,456,789 cannot be represented in size 19
2018-06-23T21:09:23.387-0400  WARNING  Writing DBF data, value 12,345,678,901,234,567,890,123,456,789 cannot be represented in size 19
2018-06-23T21:09:23.388-0400  WARNING  Writing DBF data, value 12,345,678,901,234,567,890,123,456,789 cannot be represented in size 19
2018-06-23T21:09:23.388-0400  WARNING  Writing DBF data, value 12,345,678,901,234,567,890,123,456,789 cannot be represented in size 19
2018-06-23T21:09:23.388-0400  WARNING  Writing DBF data, value 12,345,678,901,234,567,890,123,456,789 cannot be represented in size 19
2018-06-23T21:09:23.389-0400  WARNING  Writing DBF data, value 12,345,678,901,234,567,890,123,456,789 cannot be represented in size 19
2018-06-23T21:09:23.389-0400  WARNING  Writing DBF data, value 12,345,678,901,234,567,890,123,456,789 cannot be represented in size 19
2018-06-23T21:09:23.389-0400  WARNING  Writing DBF data, value 12,345,678,901,234,567,890,123,456,789 cannot be represented in size 19
2018-06-23T21:09:23.390-0400  WARNING  Writing DBF data, value 12,345,678,901,234,567,890,123,456,789 cannot be represented in size 19
2018-06-23T21:09:23.390-0400  WARNING  Writing DBF data, value 12,345,678,901,234,567,890,123,456,789 cannot be represented in size 19
2018-06-23T21:09:23.391-0400  WARNING  Writing DBF data, value 12,345,678,901,234,567,890,123,456,789 cannot be represented in size 19
2018-06-23T21:09:23.391-0400  WARNING  Writing DBF data, value 12,345,678,901,234,567,890,123,456,789 cannot be represented in size 19
2018-06-23T21:09:23.391-0400  WARNING  Writing DBF data, value 12,345,678,901,234,567,890,123,456,789 cannot be represented in size 19
2018-06-23T21:09:23.392-0400  WARNING  Writing DBF data, value 12,345,678,901,234,567,890,123,456,789 cannot be represented in size 19
2018-06-23T21:09:23.392-0400  WARNING  Writing DBF data, value 12,345,678,901,234,567,890,123,456,789 cannot be represented in size 19
2018-06-23T21:09:23.393-0400  WARNING  Writing DBF data, value 12,345,678,901,234,567,890,123,456,789 cannot be represented in size 19
2018-06-23T21:09:23.393-0400  WARNING  Writing DBF data, value 12,345,678,901,234,567,890,123,456,789 cannot be represented in size 19
2018-06-23T21:09:23.393-0400  WARNING  Writing DBF data, value 12,345,678,901,234,567,890,123,456,789 cannot be represented in size 19
2018-06-23T21:09:23.394-0400  WARNING  Writing DBF data, value 12,345,678,901,234,567,890,123,456,789 cannot be represented in size 19
2018-06-23T21:09:23.620-0400  WARNING  Writing DBF data, value 12,345,678,901,234,567,890,123,456,789 cannot be represented in size 19
2018-06-23T21:09:23.620-0400  WARNING  Writing DBF data, value 12,345,678,901,234,567,890,123,456,789 cannot be represented in size 19
2018-06-23T21:09:23.620-0400  WARNING  Writing DBF data, value 12,345,678,901,234,567,890,123,456,789 cannot be represented in size 19
2018-06-23T21:09:23.621-0400  WARNING  Writing DBF data, value 12,345,678,901,234,567,890,123,456,789 cannot be represented in size 19
2018-06-23T21:09:23.621-0400  WARNING  Writing DBF data, value 12,345,678,901,234,567,890,123,456,789 cannot be represented in size 19
2018-06-23T21:09:23.621-0400  WARNING  Writing DBF data, value 12,345,678,901,234,567,890,123,456,789 cannot be represented in size 19
2018-06-23T21:09:23.622-0400  WARNING  Writing DBF data, value 12,345,678,901,234,567,890,123,456,789 cannot be represented in size 19
2018-06-23T21:09:23.622-0400  WARNING  Writing DBF data, value 12,345,678,901,234,567,890,123,456,789 cannot be represented in size 19
2018-06-23T21:09:23.622-0400  WARNING  Writing DBF data, value 12,345,678,901,234,567,890,123,456,789 cannot be represented in size 19
2018-06-23T21:09:23.623-0400  WARNING  Writing DBF data, value 12,345,678,901,234,567,890,123,456,789 cannot be represented in size 19
2018-06-23T21:09:23.623-0400  WARNING  Writing DBF data, value 12,345,678,901,234,567,890,123,456,789 cannot be represented in size 19
2018-06-23T21:09:23.623-0400  WARNING  Writing DBF data, value 12,345,678,901,234,567,890,123,456,789 cannot be represented in size 19
2018-06-23T21:09:23.624-0400  WARNING  Writing DBF data, value 12,345,678,901,234,567,890,123,456,789 cannot be represented in size 19
2018-06-23T21:09:23.624-0400  WARNING  Writing DBF data, value 12,345,678,901,234,567,890,123,456,789 cannot be represented in size 19
2018-06-23T21:09:23.624-0400  WARNING  Writing DBF data, value 12,345,678,901,234,567,890,123,456,789 cannot be represented in size 19
2018-06-23T21:09:23.625-0400  WARNING  Writing DBF data, value 12,345,678,901,234,567,890,123,456,789 cannot be represented in size 19
2018-06-23T21:09:23.625-0400  WARNING  Writing DBF data, value 12,345,678,901,234,567,890,123,456,789 cannot be represented in size 19
2018-06-23T21:09:23.626-0400  WARNING  Writing DBF data, value 12,345,678,901,234,567,890,123,456,789 cannot be represented in size 19
2018-06-23T21:09:23.626-0400  WARNING  Writing DBF data, value 12,345,678,901,234,567,890,123,456,789 cannot be represented in size 19
2018-06-23T21:09:23.626-0400  WARNING  Writing DBF data, value 12,345,678,901,234,567,890,123,456,789 cannot be represented in size 19
2018-06-23T21:09:23.699-0400  WARNING  Writing DBF data, value 12,345,678,901,234,567,890,123,456,789 cannot be represented in size 19
2018-06-23T21:09:23.700-0400  WARNING  Writing DBF data, value 12,345,678,901,234,567,890,123,456,789 cannot be represented in size 19
2018-06-23T21:09:23.700-0400  WARNING  Writing DBF data, value 12,345,678,901,234,567,890,123,456,789 cannot be represented in size 19
2018-06-23T21:09:23.701-0400  WARNING  Writing DBF data, value 12,345,678,901,234,567,890,123,456,789 cannot be represented in size 19
2018-06-23T21:09:23.701-0400  WARNING  Writing DBF data, value 12,345,678,901,234,567,890,123,456,789 cannot be represented in size 19
2018-06-23T21:09:23.701-0400  WARNING  Writing DBF data, value 12,345,678,901,234,567,890,123,456,789 cannot be represented in size 19
2018-06-23T21:09:23.702-0400  WARNING  Writing DBF data, value 12,345,678,901,234,567,890,123,456,789 cannot be represented in size 19
2018-06-23T21:09:23.702-0400  WARNING  Writing DBF data, value 12,345,678,901,234,567,890,123,456,789 cannot be represented in size 19
2018-06-23T21:09:23.703-0400  WARNING  Writing DBF data, value 12,345,678,901,234,567,890,123,456,789 cannot be represented in size 19
2018-06-23T21:09:23.703-0400  WARNING  Writing DBF data, value 12,345,678,901,234,567,890,123,456,789 cannot be represented in size 19
2018-06-23T21:09:23.703-0400  WARNING  Writing DBF data, value 12,345,678,901,234,567,890,123,456,789 cannot be represented in size 19
2018-06-23T21:09:23.704-0400  WARNING  Writing DBF data, value 12,345,678,901,234,567,890,123,456,789 cannot be represented in size 19
2018-06-23T21:09:23.704-0400  WARNING  Writing DBF data, value 12,345,678,901,234,567,890,123,456,789 cannot be represented in size 19
2018-06-23T21:09:23.704-0400  WARNING  Writing DBF data, value 12,345,678,901,234,567,890,123,456,789 cannot be represented in size 19
2018-06-23T21:09:23.705-0400  WARNING  Writing DBF data, value 12,345,678,901,234,567,890,123,456,789 cannot be represented in size 19
2018-06-23T21:09:23.705-0400  WARNING  Writing DBF data, value 12,345,678,901,234,567,890,123,456,789 cannot be represented in size 19
2018-06-23T21:09:23.706-0400  WARNING  Writing DBF data, value 12,345,678,901,234,567,890,123,456,789 cannot be represented in size 19
2018-06-23T21:09:23.706-0400  WARNING  Writing DBF data, value 12,345,678,901,234,567,890,123,456,789 cannot be represented in size 19
2018-06-23T21:09:23.706-0400  WARNING  Writing DBF data, value 12,345,678,901,234,567,890,123,456,789 cannot be represented in size 19
2018-06-23T21:09:23.707-0400  WARNING  Writing DBF data, value 12,345,678,901,234,567,890,123,456,789 cannot be represented in size 19
2018-06-23T21:09:23.756-0400  SEVERE  There's code leaving transaction unclosed. Call Transaction.close() after using them to ensure they do not hold state such as JDBC connections or file handles
2018-06-23T21:09:23.756-0400  SEVERE  Unclosed transaction handle is 'org.geotools.data.shapefile.ShapefileDataStoreTest.testCountTransaction Transaction'
2018-06-23T21:09:23.765-0400  WARNING  Writing DBF data, value 12,345,678,901,234,567,890,123,456,789 cannot be represented in size 19
2018-06-23T21:09:23.766-0400  WARNING  Writing DBF data, value 12,345,678,901,234,567,890,123,456,789 cannot be represented in size 19
2018-06-23T21:09:23.766-0400  WARNING  Writing DBF data, value 12,345,678,901,234,567,890,123,456,789 cannot be represented in size 19
2018-06-23T21:09:23.766-0400  WARNING  Writing DBF data, value 12,345,678,901,234,567,890,123,456,789 cannot be represented in size 19
2018-06-23T21:09:23.767-0400  WARNING  Writing DBF data, value 12,345,678,901,234,567,890,123,456,789 cannot be represented in size 19
2018-06-23T21:09:23.767-0400  WARNING  Writing DBF data, value 12,345,678,901,234,567,890,123,456,789 cannot be represented in size 19
2018-06-23T21:09:23.767-0400  WARNING  Writing DBF data, value 12,345,678,901,234,567,890,123,456,789 cannot be represented in size 19
2018-06-23T21:09:23.768-0400  WARNING  Writing DBF data, value 12,345,678,901,234,567,890,123,456,789 cannot be represented in size 19
2018-06-23T21:09:23.768-0400  WARNING  Writing DBF data, value 12,345,678,901,234,567,890,123,456,789 cannot be represented in size 19
2018-06-23T21:09:23.768-0400  WARNING  Writing DBF data, value 12,345,678,901,234,567,890,123,456,789 cannot be represented in size 19
2018-06-23T21:09:23.769-0400  WARNING  Writing DBF data, value 12,345,678,901,234,567,890,123,456,789 cannot be represented in size 19
2018-06-23T21:09:23.769-0400  WARNING  Writing DBF data, value 12,345,678,901,234,567,890,123,456,789 cannot be represented in size 19
2018-06-23T21:09:23.769-0400  WARNING  Writing DBF data, value 12,345,678,901,234,567,890,123,456,789 cannot be represented in size 19
2018-06-23T21:09:23.770-0400  WARNING  Writing DBF data, value 12,345,678,901,234,567,890,123,456,789 cannot be represented in size 19
2018-06-23T21:09:23.770-0400  WARNING  Writing DBF data, value 12,345,678,901,234,567,890,123,456,789 cannot be represented in size 19
2018-06-23T21:09:23.770-0400  WARNING  Writing DBF data, value 12,345,678,901,234,567,890,123,456,789 cannot be represented in size 19
2018-06-23T21:09:23.771-0400  WARNING  Writing DBF data, value 12,345,678,901,234,567,890,123,456,789 cannot be represented in size 19
2018-06-23T21:09:23.771-0400  WARNING  Writing DBF data, value 12,345,678,901,234,567,890,123,456,789 cannot be represented in size 19
2018-06-23T21:09:23.772-0400  WARNING  Writing DBF data, value 12,345,678,901,234,567,890,123,456,789 cannot be represented in size 19
2018-06-23T21:09:23.772-0400  WARNING  Writing DBF data, value 12,345,678,901,234,567,890,123,456,789 cannot be represented in size 19
SimpleFeatureImpl:test-+()shp1384568808865916787=[SimpleFeatureImpl.Attribute: the_geom<Point id=test-+()shp1384568808865916787.1>=POINT (1 -1), SimpleFeatureImpl.Attribute: b<b id=test-+()shp1384568808865916787.1>=19, SimpleFeatureImpl.Attribute: c<c id=test-+()shp1384568808865916787.1>=19, SimpleFeatureImpl.Attribute: d<d id=test-+()shp1384568808865916787.1>=19.0, SimpleFeatureImpl.Attribute: e<e id=test-+()shp1384568808865916787.1>=19.0, SimpleFeatureImpl.Attribute: f<f id=test-+()shp1384568808865916787.1>=19, SimpleFeatureImpl.Attribute: g<g id=test-+()shp1384568808865916787.1>=Wed Dec 31 00:00:00 EST 1969, SimpleFeatureImpl.Attribute: h<h id=test-+()shp1384568808865916787.1>=true, SimpleFeatureImpl.Attribute: i<i id=test-+()shp1384568808865916787.1>=22.0, SimpleFeatureImpl.Attribute: j<j id=test-+()shp1384568808865916787.1>=1234567890123456789, SimpleFeatureImpl.Attribute: k<k id=test-+()shp1384568808865916787.1>=1.2345678901234568E26, SimpleFeatureImpl.Attribute: l<l id=test-+()shp1384568808865916787.1>=1234567890123456789, SimpleFeatureImpl.Attribute: m<m id=test-+()shp1384568808865916787.1>=Wed Dec 31 00:00:00 EST 1969, SimpleFeatureImpl.Attribute: n<n id=test-+()shp1384568808865916787.1>=f5eea453-9232-4ba1-9cd5-42907e44fa09]
SimpleFeatureImpl:test-+()shp1384568808865916787=[SimpleFeatureImpl.Attribute: the_geom<Point id=test-+()shp1384568808865916787.1>=POINT (1 -1), SimpleFeatureImpl.Attribute: b<b id=test-+()shp1384568808865916787.1>=18, SimpleFeatureImpl.Attribute: c<c id=test-+()shp1384568808865916787.1>=18, SimpleFeatureImpl.Attribute: d<d id=test-+()shp1384568808865916787.1>=18.0, SimpleFeatureImpl.Attribute: e<e id=test-+()shp1384568808865916787.1>=18.0, SimpleFeatureImpl.Attribute: f<f id=test-+()shp1384568808865916787.1>=18, SimpleFeatureImpl.Attribute: g<g id=test-+()shp1384568808865916787.1>=Wed Dec 31 00:00:00 EST 1969, SimpleFeatureImpl.Attribute: h<h id=test-+()shp1384568808865916787.1>=true, SimpleFeatureImpl.Attribute: i<i id=test-+()shp1384568808865916787.1>=22.0, SimpleFeatureImpl.Attribute: j<j id=test-+()shp1384568808865916787.1>=1234567890123456789, SimpleFeatureImpl.Attribute: k<k id=test-+()shp1384568808865916787.1>=1.2345678901234568E26, SimpleFeatureImpl.Attribute: l<l id=test-+()shp1384568808865916787.1>=1234567890123456789, SimpleFeatureImpl.Attribute: m<m id=test-+()shp1384568808865916787.1>=Wed Dec 31 00:00:00 EST 1969, SimpleFeatureImpl.Attribute: n<n id=test-+()shp1384568808865916787.1>=aca4877a-f238-4750-b1ad-6f074ea51c51]
SimpleFeatureImpl:test-+()shp1384568808865916787=[SimpleFeatureImpl.Attribute: the_geom<Point id=test-+()shp1384568808865916787.1>=POINT (1 -1), SimpleFeatureImpl.Attribute: b<b id=test-+()shp1384568808865916787.1>=17, SimpleFeatureImpl.Attribute: c<c id=test-+()shp1384568808865916787.1>=17, SimpleFeatureImpl.Attribute: d<d id=test-+()shp1384568808865916787.1>=17.0, SimpleFeatureImpl.Attribute: e<e id=test-+()shp1384568808865916787.1>=17.0, SimpleFeatureImpl.Attribute: f<f id=test-+()shp1384568808865916787.1>=17, SimpleFeatureImpl.Attribute: g<g id=test-+()shp1384568808865916787.1>=Wed Dec 31 00:00:00 EST 1969, SimpleFeatureImpl.Attribute: h<h id=test-+()shp1384568808865916787.1>=true, SimpleFeatureImpl.Attribute: i<i id=test-+()shp1384568808865916787.1>=22.0, SimpleFeatureImpl.Attribute: j<j id=test-+()shp1384568808865916787.1>=1234567890123456789, SimpleFeatureImpl.Attribute: k<k id=test-+()shp1384568808865916787.1>=1.2345678901234568E26, SimpleFeatureImpl.Attribute: l<l id=test-+()shp1384568808865916787.1>=1234567890123456789, SimpleFeatureImpl.Attribute: m<m id=test-+()shp1384568808865916787.1>=Wed Dec 31 00:00:00 EST 1969, SimpleFeatureImpl.Attribute: n<n id=test-+()shp1384568808865916787.1>=1fcb11fd-c340-4199-82a7-fad9463d6ea7]
SimpleFeatureImpl:test-+()shp1384568808865916787=[SimpleFeatureImpl.Attribute: the_geom<Point id=test-+()shp1384568808865916787.1>=POINT (1 -1), SimpleFeatureImpl.Attribute: b<b id=test-+()shp1384568808865916787.1>=16, SimpleFeatureImpl.Attribute: c<c id=test-+()shp1384568808865916787.1>=16, SimpleFeatureImpl.Attribute: d<d id=test-+()shp1384568808865916787.1>=16.0, SimpleFeatureImpl.Attribute: e<e id=test-+()shp1384568808865916787.1>=16.0, SimpleFeatureImpl.Attribute: f<f id=test-+()shp1384568808865916787.1>=16, SimpleFeatureImpl.Attribute: g<g id=test-+()shp1384568808865916787.1>=Wed Dec 31 00:00:00 EST 1969, SimpleFeatureImpl.Attribute: h<h id=test-+()shp1384568808865916787.1>=true, SimpleFeatureImpl.Attribute: i<i id=test-+()shp1384568808865916787.1>=22.0, SimpleFeatureImpl.Attribute: j<j id=test-+()shp1384568808865916787.1>=1234567890123456789, SimpleFeatureImpl.Attribute: k<k id=test-+()shp1384568808865916787.1>=1.2345678901234568E26, SimpleFeatureImpl.Attribute: l<l id=test-+()shp1384568808865916787.1>=1234567890123456789, SimpleFeatureImpl.Attribute: m<m id=test-+()shp1384568808865916787.1>=Wed Dec 31 00:00:00 EST 1969, SimpleFeatureImpl.Attribute: n<n id=test-+()shp1384568808865916787.1>=322c5838-97dd-4946-8e3a-10c9cdcfc94e]
SimpleFeatureImpl:test-+()shp1384568808865916787=[SimpleFeatureImpl.Attribute: the_geom<Point id=test-+()shp1384568808865916787.1>=POINT (1 -1), SimpleFeatureImpl.Attribute: b<b id=test-+()shp1384568808865916787.1>=15, SimpleFeatureImpl.Attribute: c<c id=test-+()shp1384568808865916787.1>=15, SimpleFeatureImpl.Attribute: d<d id=test-+()shp1384568808865916787.1>=15.0, SimpleFeatureImpl.Attribute: e<e id=test-+()shp1384568808865916787.1>=15.0, SimpleFeatureImpl.Attribute: f<f id=test-+()shp1384568808865916787.1>=15, SimpleFeatureImpl.Attribute: g<g id=test-+()shp1384568808865916787.1>=Wed Dec 31 00:00:00 EST 1969, SimpleFeatureImpl.Attribute: h<h id=test-+()shp1384568808865916787.1>=true, SimpleFeatureImpl.Attribute: i<i id=test-+()shp1384568808865916787.1>=22.0, SimpleFeatureImpl.Attribute: j<j id=test-+()shp1384568808865916787.1>=1234567890123456789, SimpleFeatureImpl.Attribute: k<k id=test-+()shp1384568808865916787.1>=1.2345678901234568E26, SimpleFeatureImpl.Attribute: l<l id=test-+()shp1384568808865916787.1>=1234567890123456789, SimpleFeatureImpl.Attribute: m<m id=test-+()shp1384568808865916787.1>=Wed Dec 31 00:00:00 EST 1969, SimpleFeatureImpl.Attribute: n<n id=test-+()shp1384568808865916787.1>=c001f2ba-8238-4975-8cc3-313912e13bb3]
SimpleFeatureImpl:test-+()shp1384568808865916787=[SimpleFeatureImpl.Attribute: the_geom<Point id=test-+()shp1384568808865916787.1>=POINT (1 -1), SimpleFeatureImpl.Attribute: b<b id=test-+()shp1384568808865916787.1>=14, SimpleFeatureImpl.Attribute: c<c id=test-+()shp1384568808865916787.1>=14, SimpleFeatureImpl.Attribute: d<d id=test-+()shp1384568808865916787.1>=14.0, SimpleFeatureImpl.Attribute: e<e id=test-+()shp1384568808865916787.1>=14.0, SimpleFeatureImpl.Attribute: f<f id=test-+()shp1384568808865916787.1>=14, SimpleFeatureImpl.Attribute: g<g id=test-+()shp1384568808865916787.1>=Wed Dec 31 00:00:00 EST 1969, SimpleFeatureImpl.Attribute: h<h id=test-+()shp1384568808865916787.1>=true, SimpleFeatureImpl.Attribute: i<i id=test-+()shp1384568808865916787.1>=22.0, SimpleFeatureImpl.Attribute: j<j id=test-+()shp1384568808865916787.1>=1234567890123456789, SimpleFeatureImpl.Attribute: k<k id=test-+()shp1384568808865916787.1>=1.2345678901234568E26, SimpleFeatureImpl.Attribute: l<l id=test-+()shp1384568808865916787.1>=1234567890123456789, SimpleFeatureImpl.Attribute: m<m id=test-+()shp1384568808865916787.1>=Wed Dec 31 00:00:00 EST 1969, SimpleFeatureImpl.Attribute: n<n id=test-+()shp1384568808865916787.1>=f6968c7e-c33c-45a9-a19e-715e1203ae2f]
SimpleFeatureImpl:test-+()shp1384568808865916787=[SimpleFeatureImpl.Attribute: the_geom<Point id=test-+()shp1384568808865916787.1>=POINT (1 -1), SimpleFeatureImpl.Attribute: b<b id=test-+()shp1384568808865916787.1>=13, SimpleFeatureImpl.Attribute: c<c id=test-+()shp1384568808865916787.1>=13, SimpleFeatureImpl.Attribute: d<d id=test-+()shp1384568808865916787.1>=13.0, SimpleFeatureImpl.Attribute: e<e id=test-+()shp1384568808865916787.1>=13.0, SimpleFeatureImpl.Attribute: f<f id=test-+()shp1384568808865916787.1>=13, SimpleFeatureImpl.Attribute: g<g id=test-+()shp1384568808865916787.1>=Wed Dec 31 00:00:00 EST 1969, SimpleFeatureImpl.Attribute: h<h id=test-+()shp1384568808865916787.1>=true, SimpleFeatureImpl.Attribute: i<i id=test-+()shp1384568808865916787.1>=22.0, SimpleFeatureImpl.Attribute: j<j id=test-+()shp1384568808865916787.1>=1234567890123456789, SimpleFeatureImpl.Attribute: k<k id=test-+()shp1384568808865916787.1>=1.2345678901234568E26, SimpleFeatureImpl.Attribute: l<l id=test-+()shp1384568808865916787.1>=1234567890123456789, SimpleFeatureImpl.Attribute: m<m id=test-+()shp1384568808865916787.1>=Wed Dec 31 00:00:00 EST 1969, SimpleFeatureImpl.Attribute: n<n id=test-+()shp1384568808865916787.1>=9301c477-3b67-479b-a3ac-ce921099057f]
SimpleFeatureImpl:test-+()shp1384568808865916787=[SimpleFeatureImpl.Attribute: the_geom<Point id=test-+()shp1384568808865916787.1>=POINT (1 -1), SimpleFeatureImpl.Attribute: b<b id=test-+()shp1384568808865916787.1>=12, SimpleFeatureImpl.Attribute: c<c id=test-+()shp1384568808865916787.1>=12, SimpleFeatureImpl.Attribute: d<d id=test-+()shp1384568808865916787.1>=12.0, SimpleFeatureImpl.Attribute: e<e id=test-+()shp1384568808865916787.1>=12.0, SimpleFeatureImpl.Attribute: f<f id=test-+()shp1384568808865916787.1>=12, SimpleFeatureImpl.Attribute: g<g id=test-+()shp1384568808865916787.1>=Wed Dec 31 00:00:00 EST 1969, SimpleFeatureImpl.Attribute: h<h id=test-+()shp1384568808865916787.1>=true, SimpleFeatureImpl.Attribute: i<i id=test-+()shp1384568808865916787.1>=22.0, SimpleFeatureImpl.Attribute: j<j id=test-+()shp1384568808865916787.1>=1234567890123456789, SimpleFeatureImpl.Attribute: k<k id=test-+()shp1384568808865916787.1>=1.2345678901234568E26, SimpleFeatureImpl.Attribute: l<l id=test-+()shp1384568808865916787.1>=1234567890123456789, SimpleFeatureImpl.Attribute: m<m id=test-+()shp1384568808865916787.1>=Wed Dec 31 00:00:00 EST 1969, SimpleFeatureImpl.Attribute: n<n id=test-+()shp1384568808865916787.1>=817253a2-af04-465b-9563-b0ec9f8c2704]
SimpleFeatureImpl:test-+()shp1384568808865916787=[SimpleFeatureImpl.Attribute: the_geom<Point id=test-+()shp1384568808865916787.1>=POINT (1 -1), SimpleFeatureImpl.Attribute: b<b id=test-+()shp1384568808865916787.1>=11, SimpleFeatureImpl.Attribute: c<c id=test-+()shp1384568808865916787.1>=11, SimpleFeatureImpl.Attribute: d<d id=test-+()shp1384568808865916787.1>=11.0, SimpleFeatureImpl.Attribute: e<e id=test-+()shp1384568808865916787.1>=11.0, SimpleFeatureImpl.Attribute: f<f id=test-+()shp1384568808865916787.1>=11, SimpleFeatureImpl.Attribute: g<g id=test-+()shp1384568808865916787.1>=Wed Dec 31 00:00:00 EST 1969, SimpleFeatureImpl.Attribute: h<h id=test-+()shp1384568808865916787.1>=true, SimpleFeatureImpl.Attribute: i<i id=test-+()shp1384568808865916787.1>=22.0, SimpleFeatureImpl.Attribute: j<j id=test-+()shp1384568808865916787.1>=1234567890123456789, SimpleFeatureImpl.Attribute: k<k id=test-+()shp1384568808865916787.1>=1.2345678901234568E26, SimpleFeatureImpl.Attribute: l<l id=test-+()shp1384568808865916787.1>=1234567890123456789, SimpleFeatureImpl.Attribute: m<m id=test-+()shp1384568808865916787.1>=Wed Dec 31 00:00:00 EST 1969, SimpleFeatureImpl.Attribute: n<n id=test-+()shp1384568808865916787.1>=c0404b7c-7002-4084-a65e-c16dafc053d4]
SimpleFeatureImpl:test-+()shp1384568808865916787=[SimpleFeatureImpl.Attribute: the_geom<Point id=test-+()shp1384568808865916787.1>=POINT (1 -1), SimpleFeatureImpl.Attribute: b<b id=test-+()shp1384568808865916787.1>=10, SimpleFeatureImpl.Attribute: c<c id=test-+()shp1384568808865916787.1>=10, SimpleFeatureImpl.Attribute: d<d id=test-+()shp1384568808865916787.1>=10.0, SimpleFeatureImpl.Attribute: e<e id=test-+()shp1384568808865916787.1>=10.0, SimpleFeatureImpl.Attribute: f<f id=test-+()shp1384568808865916787.1>=10, SimpleFeatureImpl.Attribute: g<g id=test-+()shp1384568808865916787.1>=Wed Dec 31 00:00:00 EST 1969, SimpleFeatureImpl.Attribute: h<h id=test-+()shp1384568808865916787.1>=true, SimpleFeatureImpl.Attribute: i<i id=test-+()shp1384568808865916787.1>=22.0, SimpleFeatureImpl.Attribute: j<j id=test-+()shp1384568808865916787.1>=1234567890123456789, SimpleFeatureImpl.Attribute: k<k id=test-+()shp1384568808865916787.1>=1.2345678901234568E26, SimpleFeatureImpl.Attribute: l<l id=test-+()shp1384568808865916787.1>=1234567890123456789, SimpleFeatureImpl.Attribute: m<m id=test-+()shp1384568808865916787.1>=Wed Dec 31 00:00:00 EST 1969, SimpleFeatureImpl.Attribute: n<n id=test-+()shp1384568808865916787.1>=16281c83-4413-460b-a8f7-9d51560edf24]
SimpleFeatureImpl:test-+()shp1384568808865916787=[SimpleFeatureImpl.Attribute: the_geom<Point id=test-+()shp1384568808865916787.1>=POINT (1 -1), SimpleFeatureImpl.Attribute: b<b id=test-+()shp1384568808865916787.1>=9, SimpleFeatureImpl.Attribute: c<c id=test-+()shp1384568808865916787.1>=9, SimpleFeatureImpl.Attribute: d<d id=test-+()shp1384568808865916787.1>=9.0, SimpleFeatureImpl.Attribute: e<e id=test-+()shp1384568808865916787.1>=9.0, SimpleFeatureImpl.Attribute: f<f id=test-+()shp1384568808865916787.1>=9, SimpleFeatureImpl.Attribute: g<g id=test-+()shp1384568808865916787.1>=Wed Dec 31 00:00:00 EST 1969, SimpleFeatureImpl.Attribute: h<h id=test-+()shp1384568808865916787.1>=true, SimpleFeatureImpl.Attribute: i<i id=test-+()shp1384568808865916787.1>=22.0, SimpleFeatureImpl.Attribute: j<j id=test-+()shp1384568808865916787.1>=1234567890123456789, SimpleFeatureImpl.Attribute: k<k id=test-+()shp1384568808865916787.1>=1.2345678901234568E26, SimpleFeatureImpl.Attribute: l<l id=test-+()shp1384568808865916787.1>=1234567890123456789, SimpleFeatureImpl.Attribute: m<m id=test-+()shp1384568808865916787.1>=Wed Dec 31 00:00:00 EST 1969, SimpleFeatureImpl.Attribute: n<n id=test-+()shp1384568808865916787.1>=ef2fb726-37ea-481d-a514-e0f696a62f73]
SimpleFeatureImpl:test-+()shp1384568808865916787=[SimpleFeatureImpl.Attribute: the_geom<Point id=test-+()shp1384568808865916787.1>=POINT (1 -1), SimpleFeatureImpl.Attribute: b<b id=test-+()shp1384568808865916787.1>=8, SimpleFeatureImpl.Attribute: c<c id=test-+()shp1384568808865916787.1>=8, SimpleFeatureImpl.Attribute: d<d id=test-+()shp1384568808865916787.1>=8.0, SimpleFeatureImpl.Attribute: e<e id=test-+()shp1384568808865916787.1>=8.0, SimpleFeatureImpl.Attribute: f<f id=test-+()shp1384568808865916787.1>=8, SimpleFeatureImpl.Attribute: g<g id=test-+()shp1384568808865916787.1>=Wed Dec 31 00:00:00 EST 1969, SimpleFeatureImpl.Attribute: h<h id=test-+()shp1384568808865916787.1>=true, SimpleFeatureImpl.Attribute: i<i id=test-+()shp1384568808865916787.1>=22.0, SimpleFeatureImpl.Attribute: j<j id=test-+()shp1384568808865916787.1>=1234567890123456789, SimpleFeatureImpl.Attribute: k<k id=test-+()shp1384568808865916787.1>=1.2345678901234568E26, SimpleFeatureImpl.Attribute: l<l id=test-+()shp1384568808865916787.1>=1234567890123456789, SimpleFeatureImpl.Attribute: m<m id=test-+()shp1384568808865916787.1>=Wed Dec 31 00:00:00 EST 1969, SimpleFeatureImpl.Attribute: n<n id=test-+()shp1384568808865916787.1>=d5acdd3d-1af1-4b4f-bfa8-6b786e67970b]
SimpleFeatureImpl:test-+()shp1384568808865916787=[SimpleFeatureImpl.Attribute: the_geom<Point id=test-+()shp1384568808865916787.1>=POINT (1 -1), SimpleFeatureImpl.Attribute: b<b id=test-+()shp1384568808865916787.1>=7, SimpleFeatureImpl.Attribute: c<c id=test-+()shp1384568808865916787.1>=7, SimpleFeatureImpl.Attribute: d<d id=test-+()shp1384568808865916787.1>=7.0, SimpleFeatureImpl.Attribute: e<e id=test-+()shp1384568808865916787.1>=7.0, SimpleFeatureImpl.Attribute: f<f id=test-+()shp1384568808865916787.1>=7, SimpleFeatureImpl.Attribute: g<g id=test-+()shp1384568808865916787.1>=Wed Dec 31 00:00:00 EST 1969, SimpleFeatureImpl.Attribute: h<h id=test-+()shp1384568808865916787.1>=true, SimpleFeatureImpl.Attribute: i<i id=test-+()shp1384568808865916787.1>=22.0, SimpleFeatureImpl.Attribute: j<j id=test-+()shp1384568808865916787.1>=1234567890123456789, SimpleFeatureImpl.Attribute: k<k id=test-+()shp1384568808865916787.1>=1.2345678901234568E26, SimpleFeatureImpl.Attribute: l<l id=test-+()shp1384568808865916787.1>=1234567890123456789, SimpleFeatureImpl.Attribute: m<m id=test-+()shp1384568808865916787.1>=Wed Dec 31 00:00:00 EST 1969, SimpleFeatureImpl.Attribute: n<n id=test-+()shp1384568808865916787.1>=d7feee06-522c-45b5-bdf2-301f7fc62345]
SimpleFeatureImpl:test-+()shp1384568808865916787=[SimpleFeatureImpl.Attribute: the_geom<Point id=test-+()shp1384568808865916787.1>=POINT (1 -1), SimpleFeatureImpl.Attribute: b<b id=test-+()shp1384568808865916787.1>=6, SimpleFeatureImpl.Attribute: c<c id=test-+()shp1384568808865916787.1>=6, SimpleFeatureImpl.Attribute: d<d id=test-+()shp1384568808865916787.1>=6.0, SimpleFeatureImpl.Attribute: e<e id=test-+()shp1384568808865916787.1>=6.0, SimpleFeatureImpl.Attribute: f<f id=test-+()shp1384568808865916787.1>=6, SimpleFeatureImpl.Attribute: g<g id=test-+()shp1384568808865916787.1>=Wed Dec 31 00:00:00 EST 1969, SimpleFeatureImpl.Attribute: h<h id=test-+()shp1384568808865916787.1>=true, SimpleFeatureImpl.Attribute: i<i id=test-+()shp1384568808865916787.1>=22.0, SimpleFeatureImpl.Attribute: j<j id=test-+()shp1384568808865916787.1>=1234567890123456789, SimpleFeatureImpl.Attribute: k<k id=test-+()shp1384568808865916787.1>=1.2345678901234568E26, SimpleFeatureImpl.Attribute: l<l id=test-+()shp1384568808865916787.1>=1234567890123456789, SimpleFeatureImpl.Attribute: m<m id=test-+()shp1384568808865916787.1>=Wed Dec 31 00:00:00 EST 1969, SimpleFeatureImpl.Attribute: n<n id=test-+()shp1384568808865916787.1>=d3922766-a009-4e1c-aa9e-143df64bea88]
SimpleFeatureImpl:test-+()shp1384568808865916787=[SimpleFeatureImpl.Attribute: the_geom<Point id=test-+()shp1384568808865916787.1>=POINT (1 -1), SimpleFeatureImpl.Attribute: b<b id=test-+()shp1384568808865916787.1>=5, SimpleFeatureImpl.Attribute: c<c id=test-+()shp1384568808865916787.1>=5, SimpleFeatureImpl.Attribute: d<d id=test-+()shp1384568808865916787.1>=5.0, SimpleFeatureImpl.Attribute: e<e id=test-+()shp1384568808865916787.1>=5.0, SimpleFeatureImpl.Attribute: f<f id=test-+()shp1384568808865916787.1>=5, SimpleFeatureImpl.Attribute: g<g id=test-+()shp1384568808865916787.1>=Wed Dec 31 00:00:00 EST 1969, SimpleFeatureImpl.Attribute: h<h id=test-+()shp1384568808865916787.1>=true, SimpleFeatureImpl.Attribute: i<i id=test-+()shp1384568808865916787.1>=22.0, SimpleFeatureImpl.Attribute: j<j id=test-+()shp1384568808865916787.1>=1234567890123456789, SimpleFeatureImpl.Attribute: k<k id=test-+()shp1384568808865916787.1>=1.2345678901234568E26, SimpleFeatureImpl.Attribute: l<l id=test-+()shp1384568808865916787.1>=1234567890123456789, SimpleFeatureImpl.Attribute: m<m id=test-+()shp1384568808865916787.1>=Wed Dec 31 00:00:00 EST 1969, SimpleFeatureImpl.Attribute: n<n id=test-+()shp1384568808865916787.1>=d1c877fc-9406-46dd-9031-128bdb8c0bbe]
SimpleFeatureImpl:test-+()shp1384568808865916787=[SimpleFeatureImpl.Attribute: the_geom<Point id=test-+()shp1384568808865916787.1>=POINT (1 -1), SimpleFeatureImpl.Attribute: b<b id=test-+()shp1384568808865916787.1>=4, SimpleFeatureImpl.Attribute: c<c id=test-+()shp1384568808865916787.1>=4, SimpleFeatureImpl.Attribute: d<d id=test-+()shp1384568808865916787.1>=4.0, SimpleFeatureImpl.Attribute: e<e id=test-+()shp1384568808865916787.1>=4.0, SimpleFeatureImpl.Attribute: f<f id=test-+()shp1384568808865916787.1>=4, SimpleFeatureImpl.Attribute: g<g id=test-+()shp1384568808865916787.1>=Wed Dec 31 00:00:00 EST 1969, SimpleFeatureImpl.Attribute: h<h id=test-+()shp1384568808865916787.1>=true, SimpleFeatureImpl.Attribute: i<i id=test-+()shp1384568808865916787.1>=22.0, SimpleFeatureImpl.Attribute: j<j id=test-+()shp1384568808865916787.1>=1234567890123456789, SimpleFeatureImpl.Attribute: k<k id=test-+()shp1384568808865916787.1>=1.2345678901234568E26, SimpleFeatureImpl.Attribute: l<l id=test-+()shp1384568808865916787.1>=1234567890123456789, SimpleFeatureImpl.Attribute: m<m id=test-+()shp1384568808865916787.1>=Wed Dec 31 00:00:00 EST 1969, SimpleFeatureImpl.Attribute: n<n id=test-+()shp1384568808865916787.1>=3bd5c119-0449-4043-95d0-f12fb4f257f8]
SimpleFeatureImpl:test-+()shp1384568808865916787=[SimpleFeatureImpl.Attribute: the_geom<Point id=test-+()shp1384568808865916787.1>=POINT (1 -1), SimpleFeatureImpl.Attribute: b<b id=test-+()shp1384568808865916787.1>=3, SimpleFeatureImpl.Attribute: c<c id=test-+()shp1384568808865916787.1>=3, SimpleFeatureImpl.Attribute: d<d id=test-+()shp1384568808865916787.1>=3.0, SimpleFeatureImpl.Attribute: e<e id=test-+()shp1384568808865916787.1>=3.0, SimpleFeatureImpl.Attribute: f<f id=test-+()shp1384568808865916787.1>=3, SimpleFeatureImpl.Attribute: g<g id=test-+()shp1384568808865916787.1>=Wed Dec 31 00:00:00 EST 1969, SimpleFeatureImpl.Attribute: h<h id=test-+()shp1384568808865916787.1>=true, SimpleFeatureImpl.Attribute: i<i id=test-+()shp1384568808865916787.1>=22.0, SimpleFeatureImpl.Attribute: j<j id=test-+()shp1384568808865916787.1>=1234567890123456789, SimpleFeatureImpl.Attribute: k<k id=test-+()shp1384568808865916787.1>=1.2345678901234568E26, SimpleFeatureImpl.Attribute: l<l id=test-+()shp1384568808865916787.1>=1234567890123456789, SimpleFeatureImpl.Attribute: m<m id=test-+()shp1384568808865916787.1>=Wed Dec 31 00:00:00 EST 1969, SimpleFeatureImpl.Attribute: n<n id=test-+()shp1384568808865916787.1>=4e06f5db-b0ff-49fc-b4ff-8ec1b2f13a26]
SimpleFeatureImpl:test-+()shp1384568808865916787=[SimpleFeatureImpl.Attribute: the_geom<Point id=test-+()shp1384568808865916787.1>=POINT (1 -1), SimpleFeatureImpl.Attribute: b<b id=test-+()shp1384568808865916787.1>=2, SimpleFeatureImpl.Attribute: c<c id=test-+()shp1384568808865916787.1>=2, SimpleFeatureImpl.Attribute: d<d id=test-+()shp1384568808865916787.1>=2.0, SimpleFeatureImpl.Attribute: e<e id=test-+()shp1384568808865916787.1>=2.0, SimpleFeatureImpl.Attribute: f<f id=test-+()shp1384568808865916787.1>=2, SimpleFeatureImpl.Attribute: g<g id=test-+()shp1384568808865916787.1>=Wed Dec 31 00:00:00 EST 1969, SimpleFeatureImpl.Attribute: h<h id=test-+()shp1384568808865916787.1>=true, SimpleFeatureImpl.Attribute: i<i id=test-+()shp1384568808865916787.1>=22.0, SimpleFeatureImpl.Attribute: j<j id=test-+()shp1384568808865916787.1>=1234567890123456789, SimpleFeatureImpl.Attribute: k<k id=test-+()shp1384568808865916787.1>=1.2345678901234568E26, SimpleFeatureImpl.Attribute: l<l id=test-+()shp1384568808865916787.1>=1234567890123456789, SimpleFeatureImpl.Attribute: m<m id=test-+()shp1384568808865916787.1>=Wed Dec 31 00:00:00 EST 1969, SimpleFeatureImpl.Attribute: n<n id=test-+()shp1384568808865916787.1>=0399016c-ab53-4ece-84f2-eb745a5508ad]
SimpleFeatureImpl:test-+()shp1384568808865916787=[SimpleFeatureImpl.Attribute: the_geom<Point id=test-+()shp1384568808865916787.1>=POINT (1 -1), SimpleFeatureImpl.Attribute: b<b id=test-+()shp1384568808865916787.1>=1, SimpleFeatureImpl.Attribute: c<c id=test-+()shp1384568808865916787.1>=1, SimpleFeatureImpl.Attribute: d<d id=test-+()shp1384568808865916787.1>=1.0, SimpleFeatureImpl.Attribute: e<e id=test-+()shp1384568808865916787.1>=1.0, SimpleFeatureImpl.Attribute: f<f id=test-+()shp1384568808865916787.1>=1, SimpleFeatureImpl.Attribute: g<g id=test-+()shp1384568808865916787.1>=Wed Dec 31 00:00:00 EST 1969, SimpleFeatureImpl.Attribute: h<h id=test-+()shp1384568808865916787.1>=true, SimpleFeatureImpl.Attribute: i<i id=test-+()shp1384568808865916787.1>=22.0, SimpleFeatureImpl.Attribute: j<j id=test-+()shp1384568808865916787.1>=1234567890123456789, SimpleFeatureImpl.Attribute: k<k id=test-+()shp1384568808865916787.1>=1.2345678901234568E26, SimpleFeatureImpl.Attribute: l<l id=test-+()shp1384568808865916787.1>=1234567890123456789, SimpleFeatureImpl.Attribute: m<m id=test-+()shp1384568808865916787.1>=Wed Dec 31 00:00:00 EST 1969, SimpleFeatureImpl.Attribute: n<n id=test-+()shp1384568808865916787.1>=d5317897-d789-48aa-94d6-6536882d0161]
SimpleFeatureImpl:test-+()shp1384568808865916787=[SimpleFeatureImpl.Attribute: the_geom<Point id=test-+()shp1384568808865916787.1>=POINT (1 -1), SimpleFeatureImpl.Attribute: b<b id=test-+()shp1384568808865916787.1>=0, SimpleFeatureImpl.Attribute: c<c id=test-+()shp1384568808865916787.1>=0, SimpleFeatureImpl.Attribute: d<d id=test-+()shp1384568808865916787.1>=0.0, SimpleFeatureImpl.Attribute: e<e id=test-+()shp1384568808865916787.1>=0.0, SimpleFeatureImpl.Attribute: f<f id=test-+()shp1384568808865916787.1>=0, SimpleFeatureImpl.Attribute: g<g id=test-+()shp1384568808865916787.1>=Wed Dec 31 00:00:00 EST 1969, SimpleFeatureImpl.Attribute: h<h id=test-+()shp1384568808865916787.1>=true, SimpleFeatureImpl.Attribute: i<i id=test-+()shp1384568808865916787.1>=22.0, SimpleFeatureImpl.Attribute: j<j id=test-+()shp1384568808865916787.1>=1234567890123456789, SimpleFeatureImpl.Attribute: k<k id=test-+()shp1384568808865916787.1>=1.2345678901234568E26, SimpleFeatureImpl.Attribute: l<l id=test-+()shp1384568808865916787.1>=1234567890123456789, SimpleFeatureImpl.Attribute: m<m id=test-+()shp1384568808865916787.1>=Wed Dec 31 00:00:00 EST 1969, SimpleFeatureImpl.Attribute: n<n id=test-+()shp1384568808865916787.1>=21cad319-fb06-49bc-b20d-f2968863ef49]
2018-06-23T21:09:24.368-0400  WARNING  Writing DBF data, value 12,345,678,901,234,567,890,123,456,789 cannot be represented in size 19
2018-06-23T21:09:24.369-0400  WARNING  Writing DBF data, value 12,345,678,901,234,567,890,123,456,789 cannot be represented in size 19
2018-06-23T21:09:24.369-0400  WARNING  Writing DBF data, value 12,345,678,901,234,567,890,123,456,789 cannot be represented in size 19
2018-06-23T21:09:24.370-0400  WARNING  Writing DBF data, value 12,345,678,901,234,567,890,123,456,789 cannot be represented in size 19
2018-06-23T21:09:24.370-0400  WARNING  Writing DBF data, value 12,345,678,901,234,567,890,123,456,789 cannot be represented in size 19
2018-06-23T21:09:24.370-0400  WARNING  Writing DBF data, value 12,345,678,901,234,567,890,123,456,789 cannot be represented in size 19
2018-06-23T21:09:24.371-0400  WARNING  Writing DBF data, value 12,345,678,901,234,567,890,123,456,789 cannot be represented in size 19
2018-06-23T21:09:24.371-0400  WARNING  Writing DBF data, value 12,345,678,901,234,567,890,123,456,789 cannot be represented in size 19
2018-06-23T21:09:24.371-0400  WARNING  Writing DBF data, value 12,345,678,901,234,567,890,123,456,789 cannot be represented in size 19
2018-06-23T21:09:24.372-0400  WARNING  Writing DBF data, value 12,345,678,901,234,567,890,123,456,789 cannot be represented in size 19
2018-06-23T21:09:24.372-0400  WARNING  Writing DBF data, value 12,345,678,901,234,567,890,123,456,789 cannot be represented in size 19
2018-06-23T21:09:24.372-0400  WARNING  Writing DBF data, value 12,345,678,901,234,567,890,123,456,789 cannot be represented in size 19
2018-06-23T21:09:24.373-0400  WARNING  Writing DBF data, value 12,345,678,901,234,567,890,123,456,789 cannot be represented in size 19
2018-06-23T21:09:24.373-0400  WARNING  Writing DBF data, value 12,345,678,901,234,567,890,123,456,789 cannot be represented in size 19
2018-06-23T21:09:24.373-0400  WARNING  Writing DBF data, value 12,345,678,901,234,567,890,123,456,789 cannot be represented in size 19
2018-06-23T21:09:24.374-0400  WARNING  Writing DBF data, value 12,345,678,901,234,567,890,123,456,789 cannot be represented in size 19
2018-06-23T21:09:24.374-0400  WARNING  Writing DBF data, value 12,345,678,901,234,567,890,123,456,789 cannot be represented in size 19
2018-06-23T21:09:24.374-0400  WARNING  Writing DBF data, value 12,345,678,901,234,567,890,123,456,789 cannot be represented in size 19
2018-06-23T21:09:24.375-0400  WARNING  Writing DBF data, value 12,345,678,901,234,567,890,123,456,789 cannot be represented in size 19
2018-06-23T21:09:24.375-0400  WARNING  Writing DBF data, value 12,345,678,901,234,567,890,123,456,789 cannot be represented in size 19
2018-06-23T21:09:24.643-0400  WARNING  Writing DBF data, value 12,345,678,901,234,567,890,123,456,789 cannot be represented in size 19
2018-06-23T21:09:24.643-0400  WARNING  Writing DBF data, value 12,345,678,901,234,567,890,123,456,789 cannot be represented in size 19
2018-06-23T21:09:24.644-0400  WARNING  Writing DBF data, value 12,345,678,901,234,567,890,123,456,789 cannot be represented in size 19
2018-06-23T21:09:24.644-0400  WARNING  Writing DBF data, value 12,345,678,901,234,567,890,123,456,789 cannot be represented in size 19
2018-06-23T21:09:24.644-0400  WARNING  Writing DBF data, value 12,345,678,901,234,567,890,123,456,789 cannot be represented in size 19
2018-06-23T21:09:24.645-0400  WARNING  Writing DBF data, value 12,345,678,901,234,567,890,123,456,789 cannot be represented in size 19
2018-06-23T21:09:24.645-0400  WARNING  Writing DBF data, value 12,345,678,901,234,567,890,123,456,789 cannot be represented in size 19
2018-06-23T21:09:24.646-0400  WARNING  Writing DBF data, value 12,345,678,901,234,567,890,123,456,789 cannot be represented in size 19
2018-06-23T21:09:24.646-0400  WARNING  Writing DBF data, value 12,345,678,901,234,567,890,123,456,789 cannot be represented in size 19
2018-06-23T21:09:24.646-0400  WARNING  Writing DBF data, value 12,345,678,901,234,567,890,123,456,789 cannot be represented in size 19
2018-06-23T21:09:24.647-0400  WARNING  Writing DBF data, value 12,345,678,901,234,567,890,123,456,789 cannot be represented in size 19
2018-06-23T21:09:24.647-0400  WARNING  Writing DBF data, value 12,345,678,901,234,567,890,123,456,789 cannot be represented in size 19
2018-06-23T21:09:24.648-0400  WARNING  Writing DBF data, value 12,345,678,901,234,567,890,123,456,789 cannot be represented in size 19
2018-06-23T21:09:24.648-0400  WARNING  Writing DBF data, value 12,345,678,901,234,567,890,123,456,789 cannot be represented in size 19
2018-06-23T21:09:24.648-0400  WARNING  Writing DBF data, value 12,345,678,901,234,567,890,123,456,789 cannot be represented in size 19
2018-06-23T21:09:24.649-0400  WARNING  Writing DBF data, value 12,345,678,901,234,567,890,123,456,789 cannot be represented in size 19
2018-06-23T21:09:24.649-0400  WARNING  Writing DBF data, value 12,345,678,901,234,567,890,123,456,789 cannot be represented in size 19
2018-06-23T21:09:24.649-0400  WARNING  Writing DBF data, value 12,345,678,901,234,567,890,123,456,789 cannot be represented in size 19
2018-06-23T21:09:24.650-0400  WARNING  Writing DBF data, value 12,345,678,901,234,567,890,123,456,789 cannot be represented in size 19
2018-06-23T21:09:24.650-0400  WARNING  Writing DBF data, value 12,345,678,901,234,567,890,123,456,789 cannot be represented in size 19
2018-06-23T21:09:24.853-0400  WARNING  Writing DBF data, value 12,345,678,901,234,567,890,123,456,789 cannot be represented in size 19
2018-06-23T21:09:24.853-0400  WARNING  Writing DBF data, value 12,345,678,901,234,567,890,123,456,789 cannot be represented in size 19
2018-06-23T21:09:24.854-0400  WARNING  Writing DBF data, value 12,345,678,901,234,567,890,123,456,789 cannot be represented in size 19
2018-06-23T21:09:24.854-0400  WARNING  Writing DBF data, value 12,345,678,901,234,567,890,123,456,789 cannot be represented in size 19
2018-06-23T21:09:24.855-0400  WARNING  Writing DBF data, value 12,345,678,901,234,567,890,123,456,789 cannot be represented in size 19
2018-06-23T21:09:24.855-0400  WARNING  Writing DBF data, value 12,345,678,901,234,567,890,123,456,789 cannot be represented in size 19
2018-06-23T21:09:24.856-0400  WARNING  Writing DBF data, value 12,345,678,901,234,567,890,123,456,789 cannot be represented in size 19
2018-06-23T21:09:24.856-0400  WARNING  Writing DBF data, value 12,345,678,901,234,567,890,123,456,789 cannot be represented in size 19
2018-06-23T21:09:24.856-0400  WARNING  Writing DBF data, value 12,345,678,901,234,567,890,123,456,789 cannot be represented in size 19
2018-06-23T21:09:24.857-0400  WARNING  Writing DBF data, value 12,345,678,901,234,567,890,123,456,789 cannot be represented in size 19
2018-06-23T21:09:24.857-0400  WARNING  Writing DBF data, value 12,345,678,901,234,567,890,123,456,789 cannot be represented in size 19
2018-06-23T21:09:24.857-0400  WARNING  Writing DBF data, value 12,345,678,901,234,567,890,123,456,789 cannot be represented in size 19
2018-06-23T21:09:24.858-0400  WARNING  Writing DBF data, value 12,345,678,901,234,567,890,123,456,789 cannot be represented in size 19
2018-06-23T21:09:24.858-0400  WARNING  Writing DBF data, value 12,345,678,901,234,567,890,123,456,789 cannot be represented in size 19
2018-06-23T21:09:24.858-0400  WARNING  Writing DBF data, value 12,345,678,901,234,567,890,123,456,789 cannot be represented in size 19
2018-06-23T21:09:24.859-0400  WARNING  Writing DBF data, value 12,345,678,901,234,567,890,123,456,789 cannot be represented in size 19
2018-06-23T21:09:24.859-0400  WARNING  Writing DBF data, value 12,345,678,901,234,567,890,123,456,789 cannot be represented in size 19
2018-06-23T21:09:24.859-0400  WARNING  Writing DBF data, value 12,345,678,901,234,567,890,123,456,789 cannot be represented in size 19
2018-06-23T21:09:24.860-0400  WARNING  Writing DBF data, value 12,345,678,901,234,567,890,123,456,789 cannot be represented in size 19
2018-06-23T21:09:24.860-0400  WARNING  Writing DBF data, value 12,345,678,901,234,567,890,123,456,789 cannot be represented in size 19
Tests run: 52, Failures: 0, Errors: 0, Skipped: 0, Time elapsed: 2.849 sec - in org.geotools.data.shapefile.ShapefileDataStoreTest
Running org.geotools.data.shapefile.ShapefileDumperTest
Tests run: 14, Failures: 0, Errors: 0, Skipped: 0, Time elapsed: 0.755 sec - in org.geotools.data.shapefile.ShapefileDumperTest
Running org.geotools.data.shapefile.ShapefileNullHandlingTest
Tests run: 1, Failures: 0, Errors: 0, Skipped: 0, Time elapsed: 0.015 sec - in org.geotools.data.shapefile.ShapefileNullHandlingTest
Running org.geotools.data.shapefile.ShapefileQuadTreeReadWriteTest
2018-06-23T21:09:33.113-0400  WARNING  Could not open the .shx file, continuing assuming the .shp file is not sparse
java.io.FileNotFoundException: /home/hudson/genie.jts/.jenkins/jobs/GeoTools-Master/workspace/modules/plugin/shapefile/target/test-classes/org/geotools/data/shapefile/test-data/shapes/stream.shx (No such file or directory)
	at java.io.RandomAccessFile.open0(Native Method)
	at java.io.RandomAccessFile.open(RandomAccessFile.java:316)
	at java.io.RandomAccessFile.<init>(RandomAccessFile.java:243)
	at org.geotools.data.shapefile.files.ShpFiles.getReadChannel(ShpFiles.java:758)
	at org.geotools.data.shapefile.shp.IndexFile.<init>(IndexFile.java:72)
	at org.geotools.data.shapefile.shp.ShapefileReader.<init>(ShapefileReader.java:267)
	at org.geotools.data.shapefile.ShapefileSetManager.openShapeReader(ShapefileSetManager.java:48)
	at org.geotools.data.shapefile.ShapefileFeatureSource.readAttributes(ShapefileFeatureSource.java:520)
	at org.geotools.data.shapefile.ShapefileFeatureSource.buildFeatureType(ShapefileFeatureSource.java:479)
	at org.geotools.data.shapefile.ShapefileFeatureStore.buildFeatureType(ShapefileFeatureStore.java:137)
	at org.geotools.data.store.ContentFeatureSource.getAbsoluteSchema(ContentFeatureSource.java:328)
	at org.geotools.data.store.ContentFeatureSource.getSchema(ContentFeatureSource.java:297)
	at org.geotools.data.store.ContentFeatureSource.getSchema(ContentFeatureSource.java:106)
	at org.geotools.data.shapefile.ShapefileQuadTreeReadWriteTest.testWriteTwice(ShapefileQuadTreeReadWriteTest.java:100)
	at sun.reflect.NativeMethodAccessorImpl.invoke0(Native Method)
	at sun.reflect.NativeMethodAccessorImpl.invoke(NativeMethodAccessorImpl.java:62)
	at sun.reflect.DelegatingMethodAccessorImpl.invoke(DelegatingMethodAccessorImpl.java:43)
	at java.lang.reflect.Method.invoke(Method.java:498)
	at org.junit.runners.model.FrameworkMethod$1.runReflectiveCall(FrameworkMethod.java:47)
	at org.junit.internal.runners.model.ReflectiveCallable.run(ReflectiveCallable.java:12)
	at org.junit.runners.model.FrameworkMethod.invokeExplosively(FrameworkMethod.java:44)
	at org.junit.internal.runners.statements.InvokeMethod.evaluate(InvokeMethod.java:17)
	at org.junit.internal.runners.statements.RunAfters.evaluate(RunAfters.java:27)
	at org.junit.runners.ParentRunner.runLeaf(ParentRunner.java:271)
	at org.junit.runners.BlockJUnit4ClassRunner.runChild(BlockJUnit4ClassRunner.java:70)
	at org.junit.runners.BlockJUnit4ClassRunner.runChild(BlockJUnit4ClassRunner.java:50)
	at org.junit.runners.ParentRunner$3.run(ParentRunner.java:238)
	at org.junit.runners.ParentRunner$1.schedule(ParentRunner.java:63)
	at org.junit.runners.ParentRunner.runChildren(ParentRunner.java:236)
	at org.junit.runners.ParentRunner.access$000(ParentRunner.java:53)
	at org.junit.runners.ParentRunner$2.evaluate(ParentRunner.java:229)
	at org.junit.runners.ParentRunner.run(ParentRunner.java:309)
	at org.apache.maven.surefire.junit4.JUnit4Provider.execute(JUnit4Provider.java:264)
	at org.apache.maven.surefire.junit4.JUnit4Provider.executeTestSet(JUnit4Provider.java:153)
	at org.apache.maven.surefire.junit4.JUnit4Provider.invoke(JUnit4Provider.java:124)
	at org.apache.maven.surefire.booter.ForkedBooter.invokeProviderInSameClassLoader(ForkedBooter.java:200)
	at org.apache.maven.surefire.booter.ForkedBooter.runSuitesInProcess(ForkedBooter.java:153)
	at org.apache.maven.surefire.booter.ForkedBooter.main(ForkedBooter.java:103)

2018-06-23T21:09:33.146-0400  WARNING  Could not open the .shx file, continuing assuming the .shp file is not sparse
java.io.FileNotFoundException: /home/hudson/genie.jts/.jenkins/jobs/GeoTools-Master/workspace/modules/plugin/shapefile/target/test-classes/org/geotools/data/shapefile/test-data/shapes/stream.shx (No such file or directory)
	at java.io.RandomAccessFile.open0(Native Method)
	at java.io.RandomAccessFile.open(RandomAccessFile.java:316)
	at java.io.RandomAccessFile.<init>(RandomAccessFile.java:243)
	at org.geotools.data.shapefile.files.ShpFiles.getReadChannel(ShpFiles.java:758)
	at org.geotools.data.shapefile.shp.IndexFile.<init>(IndexFile.java:72)
	at org.geotools.data.shapefile.shp.ShapefileReader.<init>(ShapefileReader.java:267)
	at org.geotools.data.shapefile.ShapefileSetManager.openShapeReader(ShapefileSetManager.java:48)
	at org.geotools.data.shapefile.ShapefileFeatureSource.getReaderInternal(ShapefileFeatureSource.java:369)
	at org.geotools.data.shapefile.ShapefileFeatureStore.getReaderInternal(ShapefileFeatureStore.java:132)
	at org.geotools.data.store.ContentFeatureSource.getReader(ContentFeatureSource.java:610)
	at org.geotools.data.store.ContentFeatureCollection.features(ContentFeatureCollection.java:164)
	at org.geotools.data.store.ContentFeatureCollection.features(ContentFeatureCollection.java:53)
	at org.geotools.data.store.ContentFeatureStore.addFeatures(ContentFeatureStore.java:254)
	at org.geotools.data.shapefile.ShapefileQuadTreeReadWriteTest.doubleWrite(ShapefileQuadTreeReadWriteTest.java:133)
	at org.geotools.data.shapefile.ShapefileQuadTreeReadWriteTest.testWriteTwice(ShapefileQuadTreeReadWriteTest.java:105)
	at sun.reflect.NativeMethodAccessorImpl.invoke0(Native Method)
	at sun.reflect.NativeMethodAccessorImpl.invoke(NativeMethodAccessorImpl.java:62)
	at sun.reflect.DelegatingMethodAccessorImpl.invoke(DelegatingMethodAccessorImpl.java:43)
	at java.lang.reflect.Method.invoke(Method.java:498)
	at org.junit.runners.model.FrameworkMethod$1.runReflectiveCall(FrameworkMethod.java:47)
	at org.junit.internal.runners.model.ReflectiveCallable.run(ReflectiveCallable.java:12)
	at org.junit.runners.model.FrameworkMethod.invokeExplosively(FrameworkMethod.java:44)
	at org.junit.internal.runners.statements.InvokeMethod.evaluate(InvokeMethod.java:17)
	at org.junit.internal.runners.statements.RunAfters.evaluate(RunAfters.java:27)
	at org.junit.runners.ParentRunner.runLeaf(ParentRunner.java:271)
	at org.junit.runners.BlockJUnit4ClassRunner.runChild(BlockJUnit4ClassRunner.java:70)
	at org.junit.runners.BlockJUnit4ClassRunner.runChild(BlockJUnit4ClassRunner.java:50)
	at org.junit.runners.ParentRunner$3.run(ParentRunner.java:238)
	at org.junit.runners.ParentRunner$1.schedule(ParentRunner.java:63)
	at org.junit.runners.ParentRunner.runChildren(ParentRunner.java:236)
	at org.junit.runners.ParentRunner.access$000(ParentRunner.java:53)
	at org.junit.runners.ParentRunner$2.evaluate(ParentRunner.java:229)
	at org.junit.runners.ParentRunner.run(ParentRunner.java:309)
	at org.apache.maven.surefire.junit4.JUnit4Provider.execute(JUnit4Provider.java:264)
	at org.apache.maven.surefire.junit4.JUnit4Provider.executeTestSet(JUnit4Provider.java:153)
	at org.apache.maven.surefire.junit4.JUnit4Provider.invoke(JUnit4Provider.java:124)
	at org.apache.maven.surefire.booter.ForkedBooter.invokeProviderInSameClassLoader(ForkedBooter.java:200)
	at org.apache.maven.surefire.booter.ForkedBooter.runSuitesInProcess(ForkedBooter.java:153)
	at org.apache.maven.surefire.booter.ForkedBooter.main(ForkedBooter.java:103)

2018-06-23T21:09:33.203-0400  WARNING  Could not open the .shx file, continuing assuming the .shp file is not sparse
java.io.FileNotFoundException: /home/hudson/genie.jts/.jenkins/jobs/GeoTools-Master/workspace/modules/plugin/shapefile/target/test-classes/org/geotools/data/shapefile/test-data/shapes/stream.shx (No such file or directory)
	at java.io.RandomAccessFile.open0(Native Method)
	at java.io.RandomAccessFile.open(RandomAccessFile.java:316)
	at java.io.RandomAccessFile.<init>(RandomAccessFile.java:243)
	at org.geotools.data.shapefile.files.ShpFiles.getReadChannel(ShpFiles.java:758)
	at org.geotools.data.shapefile.shp.IndexFile.<init>(IndexFile.java:72)
	at org.geotools.data.shapefile.shp.ShapefileReader.<init>(ShapefileReader.java:267)
	at org.geotools.data.shapefile.ShapefileSetManager.openShapeReader(ShapefileSetManager.java:48)
	at org.geotools.data.shapefile.ShapefileFeatureSource.getCountInternal(ShapefileFeatureSource.java:290)
	at org.geotools.data.shapefile.ShapefileFeatureStore.getCountInternal(ShapefileFeatureStore.java:126)
	at org.geotools.data.store.ContentFeatureSource.getCount(ContentFeatureSource.java:464)
	at org.geotools.data.store.ContentFeatureCollection.size(ContentFeatureCollection.java:226)
	at org.geotools.data.shapefile.ShapefileQuadTreeReadWriteTest.doubleWrite(ShapefileQuadTreeReadWriteTest.java:134)
	at org.geotools.data.shapefile.ShapefileQuadTreeReadWriteTest.testWriteTwice(ShapefileQuadTreeReadWriteTest.java:105)
	at sun.reflect.NativeMethodAccessorImpl.invoke0(Native Method)
	at sun.reflect.NativeMethodAccessorImpl.invoke(NativeMethodAccessorImpl.java:62)
	at sun.reflect.DelegatingMethodAccessorImpl.invoke(DelegatingMethodAccessorImpl.java:43)
	at java.lang.reflect.Method.invoke(Method.java:498)
	at org.junit.runners.model.FrameworkMethod$1.runReflectiveCall(FrameworkMethod.java:47)
	at org.junit.internal.runners.model.ReflectiveCallable.run(ReflectiveCallable.java:12)
	at org.junit.runners.model.FrameworkMethod.invokeExplosively(FrameworkMethod.java:44)
	at org.junit.internal.runners.statements.InvokeMethod.evaluate(InvokeMethod.java:17)
	at org.junit.internal.runners.statements.RunAfters.evaluate(RunAfters.java:27)
	at org.junit.runners.ParentRunner.runLeaf(ParentRunner.java:271)
	at org.junit.runners.BlockJUnit4ClassRunner.runChild(BlockJUnit4ClassRunner.java:70)
	at org.junit.runners.BlockJUnit4ClassRunner.runChild(BlockJUnit4ClassRunner.java:50)
	at org.junit.runners.ParentRunner$3.run(ParentRunner.java:238)
	at org.junit.runners.ParentRunner$1.schedule(ParentRunner.java:63)
	at org.junit.runners.ParentRunner.runChildren(ParentRunner.java:236)
	at org.junit.runners.ParentRunner.access$000(ParentRunner.java:53)
	at org.junit.runners.ParentRunner$2.evaluate(ParentRunner.java:229)
	at org.junit.runners.ParentRunner.run(ParentRunner.java:309)
	at org.apache.maven.surefire.junit4.JUnit4Provider.execute(JUnit4Provider.java:264)
	at org.apache.maven.surefire.junit4.JUnit4Provider.executeTestSet(JUnit4Provider.java:153)
	at org.apache.maven.surefire.junit4.JUnit4Provider.invoke(JUnit4Provider.java:124)
	at org.apache.maven.surefire.booter.ForkedBooter.invokeProviderInSameClassLoader(ForkedBooter.java:200)
	at org.apache.maven.surefire.booter.ForkedBooter.runSuitesInProcess(ForkedBooter.java:153)
	at org.apache.maven.surefire.booter.ForkedBooter.main(ForkedBooter.java:103)

2018-06-23T21:09:33.215-0400  WARNING  Could not open the .shx file, continuing assuming the .shp file is not sparse
java.io.FileNotFoundException: /home/hudson/genie.jts/.jenkins/jobs/GeoTools-Master/workspace/modules/plugin/shapefile/target/test-classes/org/geotools/data/shapefile/test-data/shapes/stream.shx (No such file or directory)
	at java.io.RandomAccessFile.open0(Native Method)
	at java.io.RandomAccessFile.open(RandomAccessFile.java:316)
	at java.io.RandomAccessFile.<init>(RandomAccessFile.java:243)
	at org.geotools.data.shapefile.files.ShpFiles.getReadChannel(ShpFiles.java:758)
	at org.geotools.data.shapefile.shp.IndexFile.<init>(IndexFile.java:72)
	at org.geotools.data.shapefile.shp.ShapefileReader.<init>(ShapefileReader.java:267)
	at org.geotools.data.shapefile.ShapefileSetManager.openShapeReader(ShapefileSetManager.java:48)
	at org.geotools.data.shapefile.ShapefileFeatureSource.getReaderInternal(ShapefileFeatureSource.java:369)
	at org.geotools.data.shapefile.ShapefileFeatureStore.getReaderInternal(ShapefileFeatureStore.java:132)
	at org.geotools.data.store.ContentFeatureSource.getReader(ContentFeatureSource.java:610)
	at org.geotools.data.store.ContentFeatureCollection.features(ContentFeatureCollection.java:164)
	at org.geotools.data.store.ContentFeatureCollection.features(ContentFeatureCollection.java:53)
	at org.geotools.data.store.ContentFeatureStore.addFeatures(ContentFeatureStore.java:254)
	at org.geotools.data.shapefile.ShapefileQuadTreeReadWriteTest.doubleWrite(ShapefileQuadTreeReadWriteTest.java:135)
	at org.geotools.data.shapefile.ShapefileQuadTreeReadWriteTest.testWriteTwice(ShapefileQuadTreeReadWriteTest.java:105)
	at sun.reflect.NativeMethodAccessorImpl.invoke0(Native Method)
	at sun.reflect.NativeMethodAccessorImpl.invoke(NativeMethodAccessorImpl.java:62)
	at sun.reflect.DelegatingMethodAccessorImpl.invoke(DelegatingMethodAccessorImpl.java:43)
	at java.lang.reflect.Method.invoke(Method.java:498)
	at org.junit.runners.model.FrameworkMethod$1.runReflectiveCall(FrameworkMethod.java:47)
	at org.junit.internal.runners.model.ReflectiveCallable.run(ReflectiveCallable.java:12)
	at org.junit.runners.model.FrameworkMethod.invokeExplosively(FrameworkMethod.java:44)
	at org.junit.internal.runners.statements.InvokeMethod.evaluate(InvokeMethod.java:17)
	at org.junit.internal.runners.statements.RunAfters.evaluate(RunAfters.java:27)
	at org.junit.runners.ParentRunner.runLeaf(ParentRunner.java:271)
	at org.junit.runners.BlockJUnit4ClassRunner.runChild(BlockJUnit4ClassRunner.java:70)
	at org.junit.runners.BlockJUnit4ClassRunner.runChild(BlockJUnit4ClassRunner.java:50)
	at org.junit.runners.ParentRunner$3.run(ParentRunner.java:238)
	at org.junit.runners.ParentRunner$1.schedule(ParentRunner.java:63)
	at org.junit.runners.ParentRunner.runChildren(ParentRunner.java:236)
	at org.junit.runners.ParentRunner.access$000(ParentRunner.java:53)
	at org.junit.runners.ParentRunner$2.evaluate(ParentRunner.java:229)
	at org.junit.runners.ParentRunner.run(ParentRunner.java:309)
	at org.apache.maven.surefire.junit4.JUnit4Provider.execute(JUnit4Provider.java:264)
	at org.apache.maven.surefire.junit4.JUnit4Provider.executeTestSet(JUnit4Provider.java:153)
	at org.apache.maven.surefire.junit4.JUnit4Provider.invoke(JUnit4Provider.java:124)
	at org.apache.maven.surefire.booter.ForkedBooter.invokeProviderInSameClassLoader(ForkedBooter.java:200)
	at org.apache.maven.surefire.booter.ForkedBooter.runSuitesInProcess(ForkedBooter.java:153)
	at org.apache.maven.surefire.booter.ForkedBooter.main(ForkedBooter.java:103)

2018-06-23T21:09:33.259-0400  WARNING  Could not open the .shx file, continuing assuming the .shp file is not sparse
java.io.FileNotFoundException: /home/hudson/genie.jts/.jenkins/jobs/GeoTools-Master/workspace/modules/plugin/shapefile/target/test-classes/org/geotools/data/shapefile/test-data/shapes/stream.shx (No such file or directory)
	at java.io.RandomAccessFile.open0(Native Method)
	at java.io.RandomAccessFile.open(RandomAccessFile.java:316)
	at java.io.RandomAccessFile.<init>(RandomAccessFile.java:243)
	at org.geotools.data.shapefile.files.ShpFiles.getReadChannel(ShpFiles.java:758)
	at org.geotools.data.shapefile.shp.IndexFile.<init>(IndexFile.java:72)
	at org.geotools.data.shapefile.shp.ShapefileReader.<init>(ShapefileReader.java:267)
	at org.geotools.data.shapefile.ShapefileSetManager.openShapeReader(ShapefileSetManager.java:48)
	at org.geotools.data.shapefile.ShapefileFeatureSource.getCountInternal(ShapefileFeatureSource.java:290)
	at org.geotools.data.shapefile.ShapefileFeatureStore.getCountInternal(ShapefileFeatureStore.java:126)
	at org.geotools.data.store.ContentFeatureSource.getCount(ContentFeatureSource.java:464)
	at org.geotools.data.store.ContentFeatureCollection.size(ContentFeatureCollection.java:226)
	at org.geotools.data.shapefile.ShapefileQuadTreeReadWriteTest.doubleWrite(ShapefileQuadTreeReadWriteTest.java:137)
	at org.geotools.data.shapefile.ShapefileQuadTreeReadWriteTest.testWriteTwice(ShapefileQuadTreeReadWriteTest.java:105)
	at sun.reflect.NativeMethodAccessorImpl.invoke0(Native Method)
	at sun.reflect.NativeMethodAccessorImpl.invoke(NativeMethodAccessorImpl.java:62)
	at sun.reflect.DelegatingMethodAccessorImpl.invoke(DelegatingMethodAccessorImpl.java:43)
	at java.lang.reflect.Method.invoke(Method.java:498)
	at org.junit.runners.model.FrameworkMethod$1.runReflectiveCall(FrameworkMethod.java:47)
	at org.junit.internal.runners.model.ReflectiveCallable.run(ReflectiveCallable.java:12)
	at org.junit.runners.model.FrameworkMethod.invokeExplosively(FrameworkMethod.java:44)
	at org.junit.internal.runners.statements.InvokeMethod.evaluate(InvokeMethod.java:17)
	at org.junit.internal.runners.statements.RunAfters.evaluate(RunAfters.java:27)
	at org.junit.runners.ParentRunner.runLeaf(ParentRunner.java:271)
	at org.junit.runners.BlockJUnit4ClassRunner.runChild(BlockJUnit4ClassRunner.java:70)
	at org.junit.runners.BlockJUnit4ClassRunner.runChild(BlockJUnit4ClassRunner.java:50)
	at org.junit.runners.ParentRunner$3.run(ParentRunner.java:238)
	at org.junit.runners.ParentRunner$1.schedule(ParentRunner.java:63)
	at org.junit.runners.ParentRunner.runChildren(ParentRunner.java:236)
	at org.junit.runners.ParentRunner.access$000(ParentRunner.java:53)
	at org.junit.runners.ParentRunner$2.evaluate(ParentRunner.java:229)
	at org.junit.runners.ParentRunner.run(ParentRunner.java:309)
	at org.apache.maven.surefire.junit4.JUnit4Provider.execute(JUnit4Provider.java:264)
	at org.apache.maven.surefire.junit4.JUnit4Provider.executeTestSet(JUnit4Provider.java:153)
	at org.apache.maven.surefire.junit4.JUnit4Provider.invoke(JUnit4Provider.java:124)
	at org.apache.maven.surefire.booter.ForkedBooter.invokeProviderInSameClassLoader(ForkedBooter.java:200)
	at org.apache.maven.surefire.booter.ForkedBooter.runSuitesInProcess(ForkedBooter.java:153)
	at org.apache.maven.surefire.booter.ForkedBooter.main(ForkedBooter.java:103)

2018-06-23T21:09:33.282-0400  WARNING  Could not open the .shx file, continuing assuming the .shp file is not sparse
java.io.FileNotFoundException: /home/hudson/genie.jts/.jenkins/jobs/GeoTools-Master/workspace/modules/plugin/shapefile/target/test-classes/org/geotools/data/shapefile/test-data/shapes/stream.shx (No such file or directory)
	at java.io.RandomAccessFile.open0(Native Method)
	at java.io.RandomAccessFile.open(RandomAccessFile.java:316)
	at java.io.RandomAccessFile.<init>(RandomAccessFile.java:243)
	at org.geotools.data.shapefile.files.ShpFiles.getReadChannel(ShpFiles.java:758)
	at org.geotools.data.shapefile.shp.IndexFile.<init>(IndexFile.java:72)
	at org.geotools.data.shapefile.shp.ShapefileReader.<init>(ShapefileReader.java:267)
	at org.geotools.data.shapefile.ShapefileSetManager.openShapeReader(ShapefileSetManager.java:48)
	at org.geotools.data.shapefile.ShapefileFeatureSource.getReaderInternal(ShapefileFeatureSource.java:369)
	at org.geotools.data.shapefile.ShapefileFeatureStore.getReaderInternal(ShapefileFeatureStore.java:132)
	at org.geotools.data.store.ContentFeatureSource.getReader(ContentFeatureSource.java:610)
	at org.geotools.data.store.ContentFeatureCollection.features(ContentFeatureCollection.java:164)
	at org.geotools.data.store.ContentFeatureCollection.features(ContentFeatureCollection.java:53)
	at org.geotools.data.store.ContentFeatureStore.addFeatures(ContentFeatureStore.java:254)
	at org.geotools.data.shapefile.ShapefileQuadTreeReadWriteTest.doubleWrite(ShapefileQuadTreeReadWriteTest.java:133)
	at org.geotools.data.shapefile.ShapefileQuadTreeReadWriteTest.testWriteTwice(ShapefileQuadTreeReadWriteTest.java:106)
	at sun.reflect.NativeMethodAccessorImpl.invoke0(Native Method)
	at sun.reflect.NativeMethodAccessorImpl.invoke(NativeMethodAccessorImpl.java:62)
	at sun.reflect.DelegatingMethodAccessorImpl.invoke(DelegatingMethodAccessorImpl.java:43)
	at java.lang.reflect.Method.invoke(Method.java:498)
	at org.junit.runners.model.FrameworkMethod$1.runReflectiveCall(FrameworkMethod.java:47)
	at org.junit.internal.runners.model.ReflectiveCallable.run(ReflectiveCallable.java:12)
	at org.junit.runners.model.FrameworkMethod.invokeExplosively(FrameworkMethod.java:44)
	at org.junit.internal.runners.statements.InvokeMethod.evaluate(InvokeMethod.java:17)
	at org.junit.internal.runners.statements.RunAfters.evaluate(RunAfters.java:27)
	at org.junit.runners.ParentRunner.runLeaf(ParentRunner.java:271)
	at org.junit.runners.BlockJUnit4ClassRunner.runChild(BlockJUnit4ClassRunner.java:70)
	at org.junit.runners.BlockJUnit4ClassRunner.runChild(BlockJUnit4ClassRunner.java:50)
	at org.junit.runners.ParentRunner$3.run(ParentRunner.java:238)
	at org.junit.runners.ParentRunner$1.schedule(ParentRunner.java:63)
	at org.junit.runners.ParentRunner.runChildren(ParentRunner.java:236)
	at org.junit.runners.ParentRunner.access$000(ParentRunner.java:53)
	at org.junit.runners.ParentRunner$2.evaluate(ParentRunner.java:229)
	at org.junit.runners.ParentRunner.run(ParentRunner.java:309)
	at org.apache.maven.surefire.junit4.JUnit4Provider.execute(JUnit4Provider.java:264)
	at org.apache.maven.surefire.junit4.JUnit4Provider.executeTestSet(JUnit4Provider.java:153)
	at org.apache.maven.surefire.junit4.JUnit4Provider.invoke(JUnit4Provider.java:124)
	at org.apache.maven.surefire.booter.ForkedBooter.invokeProviderInSameClassLoader(ForkedBooter.java:200)
	at org.apache.maven.surefire.booter.ForkedBooter.runSuitesInProcess(ForkedBooter.java:153)
	at org.apache.maven.surefire.booter.ForkedBooter.main(ForkedBooter.java:103)

2018-06-23T21:09:33.322-0400  WARNING  Could not open the .shx file, continuing assuming the .shp file is not sparse
java.io.FileNotFoundException: /home/hudson/genie.jts/.jenkins/jobs/GeoTools-Master/workspace/modules/plugin/shapefile/target/test-classes/org/geotools/data/shapefile/test-data/shapes/stream.shx (No such file or directory)
	at java.io.RandomAccessFile.open0(Native Method)
	at java.io.RandomAccessFile.open(RandomAccessFile.java:316)
	at java.io.RandomAccessFile.<init>(RandomAccessFile.java:243)
	at org.geotools.data.shapefile.files.ShpFiles.getReadChannel(ShpFiles.java:758)
	at org.geotools.data.shapefile.shp.IndexFile.<init>(IndexFile.java:72)
	at org.geotools.data.shapefile.shp.ShapefileReader.<init>(ShapefileReader.java:267)
	at org.geotools.data.shapefile.ShapefileSetManager.openShapeReader(ShapefileSetManager.java:48)
	at org.geotools.data.shapefile.ShapefileFeatureSource.getCountInternal(ShapefileFeatureSource.java:290)
	at org.geotools.data.shapefile.ShapefileFeatureStore.getCountInternal(ShapefileFeatureStore.java:126)
	at org.geotools.data.store.ContentFeatureSource.getCount(ContentFeatureSource.java:464)
	at org.geotools.data.store.ContentFeatureCollection.size(ContentFeatureCollection.java:226)
	at org.geotools.data.shapefile.ShapefileQuadTreeReadWriteTest.doubleWrite(ShapefileQuadTreeReadWriteTest.java:134)
	at org.geotools.data.shapefile.ShapefileQuadTreeReadWriteTest.testWriteTwice(ShapefileQuadTreeReadWriteTest.java:106)
	at sun.reflect.NativeMethodAccessorImpl.invoke0(Native Method)
	at sun.reflect.NativeMethodAccessorImpl.invoke(NativeMethodAccessorImpl.java:62)
	at sun.reflect.DelegatingMethodAccessorImpl.invoke(DelegatingMethodAccessorImpl.java:43)
	at java.lang.reflect.Method.invoke(Method.java:498)
	at org.junit.runners.model.FrameworkMethod$1.runReflectiveCall(FrameworkMethod.java:47)
	at org.junit.internal.runners.model.ReflectiveCallable.run(ReflectiveCallable.java:12)
	at org.junit.runners.model.FrameworkMethod.invokeExplosively(FrameworkMethod.java:44)
	at org.junit.internal.runners.statements.InvokeMethod.evaluate(InvokeMethod.java:17)
	at org.junit.internal.runners.statements.RunAfters.evaluate(RunAfters.java:27)
	at org.junit.runners.ParentRunner.runLeaf(ParentRunner.java:271)
	at org.junit.runners.BlockJUnit4ClassRunner.runChild(BlockJUnit4ClassRunner.java:70)
	at org.junit.runners.BlockJUnit4ClassRunner.runChild(BlockJUnit4ClassRunner.java:50)
	at org.junit.runners.ParentRunner$3.run(ParentRunner.java:238)
	at org.junit.runners.ParentRunner$1.schedule(ParentRunner.java:63)
	at org.junit.runners.ParentRunner.runChildren(ParentRunner.java:236)
	at org.junit.runners.ParentRunner.access$000(ParentRunner.java:53)
	at org.junit.runners.ParentRunner$2.evaluate(ParentRunner.java:229)
	at org.junit.runners.ParentRunner.run(ParentRunner.java:309)
	at org.apache.maven.surefire.junit4.JUnit4Provider.execute(JUnit4Provider.java:264)
	at org.apache.maven.surefire.junit4.JUnit4Provider.executeTestSet(JUnit4Provider.java:153)
	at org.apache.maven.surefire.junit4.JUnit4Provider.invoke(JUnit4Provider.java:124)
	at org.apache.maven.surefire.booter.ForkedBooter.invokeProviderInSameClassLoader(ForkedBooter.java:200)
	at org.apache.maven.surefire.booter.ForkedBooter.runSuitesInProcess(ForkedBooter.java:153)
	at org.apache.maven.surefire.booter.ForkedBooter.main(ForkedBooter.java:103)

2018-06-23T21:09:33.333-0400  WARNING  Could not open the .shx file, continuing assuming the .shp file is not sparse
java.io.FileNotFoundException: /home/hudson/genie.jts/.jenkins/jobs/GeoTools-Master/workspace/modules/plugin/shapefile/target/test-classes/org/geotools/data/shapefile/test-data/shapes/stream.shx (No such file or directory)
	at java.io.RandomAccessFile.open0(Native Method)
	at java.io.RandomAccessFile.open(RandomAccessFile.java:316)
	at java.io.RandomAccessFile.<init>(RandomAccessFile.java:243)
	at org.geotools.data.shapefile.files.ShpFiles.getReadChannel(ShpFiles.java:758)
	at org.geotools.data.shapefile.shp.IndexFile.<init>(IndexFile.java:72)
	at org.geotools.data.shapefile.shp.ShapefileReader.<init>(ShapefileReader.java:267)
	at org.geotools.data.shapefile.ShapefileSetManager.openShapeReader(ShapefileSetManager.java:48)
	at org.geotools.data.shapefile.ShapefileFeatureSource.getReaderInternal(ShapefileFeatureSource.java:369)
	at org.geotools.data.shapefile.ShapefileFeatureStore.getReaderInternal(ShapefileFeatureStore.java:132)
	at org.geotools.data.store.ContentFeatureSource.getReader(ContentFeatureSource.java:610)
	at org.geotools.data.store.ContentFeatureCollection.features(ContentFeatureCollection.java:164)
	at org.geotools.data.store.ContentFeatureCollection.features(ContentFeatureCollection.java:53)
	at org.geotools.data.store.ContentFeatureStore.addFeatures(ContentFeatureStore.java:254)
	at org.geotools.data.shapefile.ShapefileQuadTreeReadWriteTest.doubleWrite(ShapefileQuadTreeReadWriteTest.java:135)
	at org.geotools.data.shapefile.ShapefileQuadTreeReadWriteTest.testWriteTwice(ShapefileQuadTreeReadWriteTest.java:106)
	at sun.reflect.NativeMethodAccessorImpl.invoke0(Native Method)
	at sun.reflect.NativeMethodAccessorImpl.invoke(NativeMethodAccessorImpl.java:62)
	at sun.reflect.DelegatingMethodAccessorImpl.invoke(DelegatingMethodAccessorImpl.java:43)
	at java.lang.reflect.Method.invoke(Method.java:498)
	at org.junit.runners.model.FrameworkMethod$1.runReflectiveCall(FrameworkMethod.java:47)
	at org.junit.internal.runners.model.ReflectiveCallable.run(ReflectiveCallable.java:12)
	at org.junit.runners.model.FrameworkMethod.invokeExplosively(FrameworkMethod.java:44)
	at org.junit.internal.runners.statements.InvokeMethod.evaluate(InvokeMethod.java:17)
	at org.junit.internal.runners.statements.RunAfters.evaluate(RunAfters.java:27)
	at org.junit.runners.ParentRunner.runLeaf(ParentRunner.java:271)
	at org.junit.runners.BlockJUnit4ClassRunner.runChild(BlockJUnit4ClassRunner.java:70)
	at org.junit.runners.BlockJUnit4ClassRunner.runChild(BlockJUnit4ClassRunner.java:50)
	at org.junit.runners.ParentRunner$3.run(ParentRunner.java:238)
	at org.junit.runners.ParentRunner$1.schedule(ParentRunner.java:63)
	at org.junit.runners.ParentRunner.runChildren(ParentRunner.java:236)
	at org.junit.runners.ParentRunner.access$000(ParentRunner.java:53)
	at org.junit.runners.ParentRunner$2.evaluate(ParentRunner.java:229)
	at org.junit.runners.ParentRunner.run(ParentRunner.java:309)
	at org.apache.maven.surefire.junit4.JUnit4Provider.execute(JUnit4Provider.java:264)
	at org.apache.maven.surefire.junit4.JUnit4Provider.executeTestSet(JUnit4Provider.java:153)
	at org.apache.maven.surefire.junit4.JUnit4Provider.invoke(JUnit4Provider.java:124)
	at org.apache.maven.surefire.booter.ForkedBooter.invokeProviderInSameClassLoader(ForkedBooter.java:200)
	at org.apache.maven.surefire.booter.ForkedBooter.runSuitesInProcess(ForkedBooter.java:153)
	at org.apache.maven.surefire.booter.ForkedBooter.main(ForkedBooter.java:103)

2018-06-23T21:09:33.376-0400  WARNING  Could not open the .shx file, continuing assuming the .shp file is not sparse
java.io.FileNotFoundException: /home/hudson/genie.jts/.jenkins/jobs/GeoTools-Master/workspace/modules/plugin/shapefile/target/test-classes/org/geotools/data/shapefile/test-data/shapes/stream.shx (No such file or directory)
	at java.io.RandomAccessFile.open0(Native Method)
	at java.io.RandomAccessFile.open(RandomAccessFile.java:316)
	at java.io.RandomAccessFile.<init>(RandomAccessFile.java:243)
	at org.geotools.data.shapefile.files.ShpFiles.getReadChannel(ShpFiles.java:758)
	at org.geotools.data.shapefile.shp.IndexFile.<init>(IndexFile.java:72)
	at org.geotools.data.shapefile.shp.ShapefileReader.<init>(ShapefileReader.java:267)
	at org.geotools.data.shapefile.ShapefileSetManager.openShapeReader(ShapefileSetManager.java:48)
	at org.geotools.data.shapefile.ShapefileFeatureSource.getCountInternal(ShapefileFeatureSource.java:290)
	at org.geotools.data.shapefile.ShapefileFeatureStore.getCountInternal(ShapefileFeatureStore.java:126)
	at org.geotools.data.store.ContentFeatureSource.getCount(ContentFeatureSource.java:464)
	at org.geotools.data.store.ContentFeatureCollection.size(ContentFeatureCollection.java:226)
	at org.geotools.data.shapefile.ShapefileQuadTreeReadWriteTest.doubleWrite(ShapefileQuadTreeReadWriteTest.java:137)
	at org.geotools.data.shapefile.ShapefileQuadTreeReadWriteTest.testWriteTwice(ShapefileQuadTreeReadWriteTest.java:106)
	at sun.reflect.NativeMethodAccessorImpl.invoke0(Native Method)
	at sun.reflect.NativeMethodAccessorImpl.invoke(NativeMethodAccessorImpl.java:62)
	at sun.reflect.DelegatingMethodAccessorImpl.invoke(DelegatingMethodAccessorImpl.java:43)
	at java.lang.reflect.Method.invoke(Method.java:498)
	at org.junit.runners.model.FrameworkMethod$1.runReflectiveCall(FrameworkMethod.java:47)
	at org.junit.internal.runners.model.ReflectiveCallable.run(ReflectiveCallable.java:12)
	at org.junit.runners.model.FrameworkMethod.invokeExplosively(FrameworkMethod.java:44)
	at org.junit.internal.runners.statements.InvokeMethod.evaluate(InvokeMethod.java:17)
	at org.junit.internal.runners.statements.RunAfters.evaluate(RunAfters.java:27)
	at org.junit.runners.ParentRunner.runLeaf(ParentRunner.java:271)
	at org.junit.runners.BlockJUnit4ClassRunner.runChild(BlockJUnit4ClassRunner.java:70)
	at org.junit.runners.BlockJUnit4ClassRunner.runChild(BlockJUnit4ClassRunner.java:50)
	at org.junit.runners.ParentRunner$3.run(ParentRunner.java:238)
	at org.junit.runners.ParentRunner$1.schedule(ParentRunner.java:63)
	at org.junit.runners.ParentRunner.runChildren(ParentRunner.java:236)
	at org.junit.runners.ParentRunner.access$000(ParentRunner.java:53)
	at org.junit.runners.ParentRunner$2.evaluate(ParentRunner.java:229)
	at org.junit.runners.ParentRunner.run(ParentRunner.java:309)
	at org.apache.maven.surefire.junit4.JUnit4Provider.execute(JUnit4Provider.java:264)
	at org.apache.maven.surefire.junit4.JUnit4Provider.executeTestSet(JUnit4Provider.java:153)
	at org.apache.maven.surefire.junit4.JUnit4Provider.invoke(JUnit4Provider.java:124)
	at org.apache.maven.surefire.booter.ForkedBooter.invokeProviderInSameClassLoader(ForkedBooter.java:200)
	at org.apache.maven.surefire.booter.ForkedBooter.runSuitesInProcess(ForkedBooter.java:153)
	at org.apache.maven.surefire.booter.ForkedBooter.main(ForkedBooter.java:103)

Tests run: 4, Failures: 0, Errors: 0, Skipped: 0, Time elapsed: 7.757 sec - in org.geotools.data.shapefile.ShapefileQuadTreeReadWriteTest
Running org.geotools.data.shapefile.ShapefileReadWriteTest
Tests run: 7, Failures: 0, Errors: 0, Skipped: 0, Time elapsed: 8.547 sec - in org.geotools.data.shapefile.ShapefileReadWriteTest
Running org.geotools.data.shapefile.ShapefileTest
2018-06-23T21:09:42.039-0400  WARNING  Could not open the .shx file, continuing assuming the .shp file is not sparse
java.io.FileNotFoundException: JAR entry org/geotools/test-data/shapes/extraAtEnd.shx not found in /home/hudson/genie.jts/.jenkins/jobs/GeoTools-Master/workspace/modules/library/sample-data/target/gt-sample-data-20-SNAPSHOT.jar
	at sun.net.www.protocol.jar.JarURLConnection.connect(JarURLConnection.java:144)
	at sun.net.www.protocol.jar.JarURLConnection.getInputStream(JarURLConnection.java:152)
	at org.geotools.data.shapefile.files.ShpFiles.getReadChannel(ShpFiles.java:762)
	at org.geotools.data.shapefile.shp.IndexFile.<init>(IndexFile.java:72)
	at org.geotools.data.shapefile.shp.ShapefileReader.<init>(ShapefileReader.java:267)
	at org.geotools.data.shapefile.shp.ShapefileReader.<init>(ShapefileReader.java:238)
	at org.geotools.data.shapefile.ShapefileTest.loadShapes(ShapefileTest.java:279)
	at org.geotools.data.shapefile.ShapefileTest.testExtraAtEnd(ShapefileTest.java:120)
	at sun.reflect.NativeMethodAccessorImpl.invoke0(Native Method)
	at sun.reflect.NativeMethodAccessorImpl.invoke(NativeMethodAccessorImpl.java:62)
	at sun.reflect.DelegatingMethodAccessorImpl.invoke(DelegatingMethodAccessorImpl.java:43)
	at java.lang.reflect.Method.invoke(Method.java:498)
	at org.junit.runners.model.FrameworkMethod$1.runReflectiveCall(FrameworkMethod.java:47)
	at org.junit.internal.runners.model.ReflectiveCallable.run(ReflectiveCallable.java:12)
	at org.junit.runners.model.FrameworkMethod.invokeExplosively(FrameworkMethod.java:44)
	at org.junit.internal.runners.statements.InvokeMethod.evaluate(InvokeMethod.java:17)
	at org.junit.internal.runners.statements.RunAfters.evaluate(RunAfters.java:27)
	at org.junit.runners.ParentRunner.runLeaf(ParentRunner.java:271)
	at org.junit.runners.BlockJUnit4ClassRunner.runChild(BlockJUnit4ClassRunner.java:70)
	at org.junit.runners.BlockJUnit4ClassRunner.runChild(BlockJUnit4ClassRunner.java:50)
	at org.junit.runners.ParentRunner$3.run(ParentRunner.java:238)
	at org.junit.runners.ParentRunner$1.schedule(ParentRunner.java:63)
	at org.junit.runners.ParentRunner.runChildren(ParentRunner.java:236)
	at org.junit.runners.ParentRunner.access$000(ParentRunner.java:53)
	at org.junit.runners.ParentRunner$2.evaluate(ParentRunner.java:229)
	at org.junit.runners.ParentRunner.run(ParentRunner.java:309)
	at org.apache.maven.surefire.junit4.JUnit4Provider.execute(JUnit4Provider.java:264)
	at org.apache.maven.surefire.junit4.JUnit4Provider.executeTestSet(JUnit4Provider.java:153)
	at org.apache.maven.surefire.junit4.JUnit4Provider.invoke(JUnit4Provider.java:124)
	at org.apache.maven.surefire.booter.ForkedBooter.invokeProviderInSameClassLoader(ForkedBooter.java:200)
	at org.apache.maven.surefire.booter.ForkedBooter.runSuitesInProcess(ForkedBooter.java:153)
	at org.apache.maven.surefire.booter.ForkedBooter.main(ForkedBooter.java:103)

2018-06-23T21:09:42.040-0400  WARNING  Could not open the .shx file, continuing assuming the .shp file is not sparse
java.io.FileNotFoundException: JAR entry org/geotools/test-data/shapes/extraAtEnd.shx not found in /home/hudson/genie.jts/.jenkins/jobs/GeoTools-Master/workspace/modules/library/sample-data/target/gt-sample-data-20-SNAPSHOT.jar
	at sun.net.www.protocol.jar.JarURLConnection.connect(JarURLConnection.java:144)
	at sun.net.www.protocol.jar.JarURLConnection.getInputStream(JarURLConnection.java:152)
	at org.geotools.data.shapefile.files.ShpFiles.getReadChannel(ShpFiles.java:762)
	at org.geotools.data.shapefile.shp.IndexFile.<init>(IndexFile.java:72)
	at org.geotools.data.shapefile.shp.ShapefileReader.<init>(ShapefileReader.java:267)
	at org.geotools.data.shapefile.shp.ShapefileReader.<init>(ShapefileReader.java:238)
	at org.geotools.data.shapefile.ShapefileTest.loadMemoryMapped(ShapefileTest.java:477)
	at org.geotools.data.shapefile.ShapefileTest.testExtraAtEnd(ShapefileTest.java:121)
	at sun.reflect.NativeMethodAccessorImpl.invoke0(Native Method)
	at sun.reflect.NativeMethodAccessorImpl.invoke(NativeMethodAccessorImpl.java:62)
	at sun.reflect.DelegatingMethodAccessorImpl.invoke(DelegatingMethodAccessorImpl.java:43)
	at java.lang.reflect.Method.invoke(Method.java:498)
	at org.junit.runners.model.FrameworkMethod$1.runReflectiveCall(FrameworkMethod.java:47)
	at org.junit.internal.runners.model.ReflectiveCallable.run(ReflectiveCallable.java:12)
	at org.junit.runners.model.FrameworkMethod.invokeExplosively(FrameworkMethod.java:44)
	at org.junit.internal.runners.statements.InvokeMethod.evaluate(InvokeMethod.java:17)
	at org.junit.internal.runners.statements.RunAfters.evaluate(RunAfters.java:27)
	at org.junit.runners.ParentRunner.runLeaf(ParentRunner.java:271)
	at org.junit.runners.BlockJUnit4ClassRunner.runChild(BlockJUnit4ClassRunner.java:70)
	at org.junit.runners.BlockJUnit4ClassRunner.runChild(BlockJUnit4ClassRunner.java:50)
	at org.junit.runners.ParentRunner$3.run(ParentRunner.java:238)
	at org.junit.runners.ParentRunner$1.schedule(ParentRunner.java:63)
	at org.junit.runners.ParentRunner.runChildren(ParentRunner.java:236)
	at org.junit.runners.ParentRunner.access$000(ParentRunner.java:53)
	at org.junit.runners.ParentRunner$2.evaluate(ParentRunner.java:229)
	at org.junit.runners.ParentRunner.run(ParentRunner.java:309)
	at org.apache.maven.surefire.junit4.JUnit4Provider.execute(JUnit4Provider.java:264)
	at org.apache.maven.surefire.junit4.JUnit4Provider.executeTestSet(JUnit4Provider.java:153)
	at org.apache.maven.surefire.junit4.JUnit4Provider.invoke(JUnit4Provider.java:124)
	at org.apache.maven.surefire.booter.ForkedBooter.invokeProviderInSameClassLoader(ForkedBooter.java:200)
	at org.apache.maven.surefire.booter.ForkedBooter.runSuitesInProcess(ForkedBooter.java:153)
	at org.apache.maven.surefire.booter.ForkedBooter.main(ForkedBooter.java:103)

Tests run: 18, Failures: 0, Errors: 0, Skipped: 0, Time elapsed: 0.24 sec - in org.geotools.data.shapefile.ShapefileTest
Running org.geotools.data.shapefile.ShpFileTypesTest
Tests run: 7, Failures: 0, Errors: 0, Skipped: 0, Time elapsed: 0 sec - in org.geotools.data.shapefile.ShpFileTypesTest
Running org.geotools.data.shapefile.ShpFilesLockingTest
Tests run: 5, Failures: 2, Errors: 0, Skipped: 0, Time elapsed: 0.122 sec <<< FAILURE! - in org.geotools.data.shapefile.ShpFilesLockingTest
testAcquireWriteFile(org.geotools.data.shapefile.ShpFilesLockingTest)  Time elapsed: 0.009 sec  <<< FAILURE!
org.junit.ComparisonFailure: expected:</[jobs/genie.jt]s/geotools-master/wo...> but was:</[home/hudson/genie.jts/.jenkins/job]s/geotools-master/wo...>
	at org.junit.Assert.assertEquals(Assert.java:115)
	at org.junit.Assert.assertEquals(Assert.java:144)
	at org.geotools.data.shapefile.ShpFilesLockingTest.testAcquireWriteFile(ShpFilesLockingTest.java:86)

testAcquireReadFile(org.geotools.data.shapefile.ShpFilesLockingTest)  Time elapsed: 0.002 sec  <<< FAILURE!
org.junit.ComparisonFailure: expected:</[jobs/genie.jt]s/geotools-master/wo...> but was:</[home/hudson/genie.jts/.jenkins/job]s/geotools-master/wo...>
	at org.junit.Assert.assertEquals(Assert.java:115)
	at org.junit.Assert.assertEquals(Assert.java:144)
	at org.geotools.data.shapefile.ShpFilesLockingTest.testAcquireReadFile(ShpFilesLockingTest.java:63)

Running org.geotools.data.shapefile.ShpFilesTest
Tests run: 11, Failures: 0, Errors: 0, Skipped: 0, Time elapsed: 0.008 sec - in org.geotools.data.shapefile.ShpFilesTest
Running org.geotools.data.shapefile.StorageFileTest
Tests run: 4, Failures: 0, Errors: 0, Skipped: 0, Time elapsed: 0.006 sec - in org.geotools.data.shapefile.StorageFileTest
Running org.geotools.data.shapefile.dbf.DbaseFieldFormatterTest
2018-06-23T21:09:42.344-0400  WARNING  Writing DBF data, value 12,345.678 cannot be represented in size 6
2018-06-23T21:09:42.345-0400  WARNING  Writing DBF data, value 31,415,926,535.898 cannot be represented in size 4
                            12345678->   12345678.000000000000000000000000
                                   0->                                   0
              1.7976931348623157E308->              1.7976931348623157E308
                            4.9E-324->   0.0000000000000000000000000000000
                                 NaN->                                 NaN
                                   0->   0.0000000000000000000000000000000
                           12345.678->   12345.678000000000000000000000000
                3.141592653589793E10->   31415926535.897930000000000000000
                              42.123->   42.123000000000000000000000000000
                                  -1->                                  -1
                   3.141592653589793->   3.1415926535897930000000000000000
                          -987654321->   -987654321.0000000000000000000000
                   3.141592653589793->                                 3.1
2018-06-23T21:09:42.350-0400  WARNING  Writing DBF data, value 3.142 cannot be represented in size 2
2018-06-23T21:09:42.351-0400  WARNING  Writing DBF data, value -3.142 cannot be represented in size 3
                          -987654321->                          -987654321
2018-06-23T21:09:42.351-0400  WARNING  Writing DBF data, value 12,345,678 cannot be represented in size 6
                                1999->   1999.0000000000000000000000000000
                            12345678->                            12345678
                              1999.0->   1999.0000000000000000000000000000
                                1999->                                1999
                                  -1->   -1.000000000000000000000000000000
                         -1.00001E38->                         -1.00001E38
                         -1.00001E38->                         -1.00001E38
               3.141592653589793E100->               3.141592653589793E100
                             -1.0E39->                             -1.0E39
Tests run: 28, Failures: 0, Errors: 0, Skipped: 0, Time elapsed: 0.01 sec - in org.geotools.data.shapefile.dbf.DbaseFieldFormatterTest
Running org.geotools.data.shapefile.dbf.DbaseFileReaderTest
Tests run: 1, Failures: 0, Errors: 0, Skipped: 0, Time elapsed: 0.084 sec - in org.geotools.data.shapefile.dbf.DbaseFileReaderTest
Running org.geotools.data.shapefile.fid.FidIndexerTest
Tests run: 1, Failures: 0, Errors: 0, Skipped: 0, Time elapsed: 0.01 sec - in org.geotools.data.shapefile.fid.FidIndexerTest
Running org.geotools.data.shapefile.fid.FidQueryTest
2018-06-23T21:09:42.493-0400  SEVERE  The following locker still has a lock: read on file:/home/hudson/genie.jts/.jenkins/jobs/GeoTools-Master/workspace/modules/plugin/shapefile/somefile.shp by org.geotools.data.shapefile.ShpFilesLockingTest
2018-06-23T21:09:42.493-0400  SEVERE  The following locker still has a lock: write on file:/home/hudson/genie.jts/.jenkins/jobs/GeoTools-Master/workspace/modules/plugin/shapefile/somefile.shp by org.geotools.data.shapefile.ShpFilesLockingTest
Tests run: 4, Failures: 0, Errors: 0, Skipped: 0, Time elapsed: 0.148 sec - in org.geotools.data.shapefile.fid.FidQueryTest
Running org.geotools.data.shapefile.fid.IndexedFidReaderTest
Tests run: 6, Failures: 0, Errors: 0, Skipped: 0, Time elapsed: 0.022 sec - in org.geotools.data.shapefile.fid.IndexedFidReaderTest
Running org.geotools.data.shapefile.fid.IndexedFidWriterTest
Tests run: 4, Failures: 0, Errors: 0, Skipped: 0, Time elapsed: 0.011 sec - in org.geotools.data.shapefile.fid.IndexedFidWriterTest
Running org.geotools.data.shapefile.shp.JTSUtilitiesTest
Tests run: 1, Failures: 0, Errors: 0, Skipped: 0, Time elapsed: 0 sec - in org.geotools.data.shapefile.shp.JTSUtilitiesTest
Running org.geotools.data.shapefile.shp.PolygonHandler2Test
Tests run: 2, Failures: 0, Errors: 0, Skipped: 0, Time elapsed: 0.002 sec - in org.geotools.data.shapefile.shp.PolygonHandler2Test
Running org.geotools.data.shapefile.shp.PolygonHandlerTest
Tests run: 2, Failures: 0, Errors: 0, Skipped: 0, Time elapsed: 0.001 sec - in org.geotools.data.shapefile.shp.PolygonHandlerTest
Running org.geotools.data.shapefile.shp.xml.ShpXmlFileReaderTest
Tests run: 1, Failures: 0, Errors: 0, Skipped: 0, Time elapsed: 0.111 sec - in org.geotools.data.shapefile.shp.xml.ShpXmlFileReaderTest

Results :

Failed tests: 
  ShpFilesLockingTest.testAcquireWriteFile:86 expected:</[jobs/genie.jt]s/geotools-master/wo...> but was:</[home/hudson/genie.jts/.jenkins/job]s/geotools-master/wo...>
  ShpFilesLockingTest.testAcquireReadFile:63 expected:</[jobs/genie.jt]s/geotools-master/wo...> but was:</[home/hudson/genie.jts/.jenkins/job]s/geotools-master/wo...>

Tests run: 205, Failures: 2, Errors: 0, Skipped: 1

[JENKINS] Recording test results
Started calculate disk usage of build
Finished Calculation of disk usage of build in 0 seconds
Started calculate disk usage of workspace
Finished Calculation of disk usage of workspace in 0 seconds
[INFO] ------------------------------------------------------------------------
[INFO] Reactor Summary:
[INFO] 
[INFO] GeoTools 20-SNAPSHOT ............................... SUCCESS [ 12.943 s]
[INFO] Build tools for Geotools 2 ......................... SUCCESS [  0.300 s]
[INFO] Maven plugins for Geotools 2 ....................... SUCCESS [  0.290 s]
[INFO] JAR files collector ................................ SUCCESS [ 12.368 s]
[INFO] Cross-modules javadoc .............................. SUCCESS [  9.297 s]
[INFO] JJTree and JavaCC compilers plugin ................. SUCCESS [  3.227 s]
[INFO] Geotools modules ................................... SUCCESS [  0.237 s]
[INFO] Geotools libraries ................................. SUCCESS [  0.302 s]
[INFO] Open GIS Interfaces ................................ SUCCESS [ 12.213 s]
[INFO] Metadata ........................................... SUCCESS [ 11.629 s]
[INFO] Sample data module ................................. SUCCESS [ 11.504 s]
[INFO] Referencing services ............................... SUCCESS [ 29.487 s]
[INFO] API interfaces ..................................... SUCCESS [  5.836 s]
[INFO] Geotools plugins ................................... SUCCESS [  0.240 s]
[INFO] EPSG Authority Service using HSQL database ......... SUCCESS [ 21.688 s]
[INFO] Main module ........................................ SUCCESS [ 29.036 s]
[INFO] Geotools extensions ................................ SUCCESS [  0.254 s]
[INFO] XML Parsing ........................................ SUCCESS [  0.269 s]
[INFO] XML Parsing ........................................ SUCCESS [  8.933 s]
[INFO] Feature Based Graphs and Networks .................. SUCCESS [  7.558 s]
[INFO] XML Code Generation Support ........................ SUCCESS [  4.871 s]
[INFO] EPSG Authority Service using WKT file .............. SUCCESS [  4.624 s]
[INFO] OGC CQL to Filter parser ........................... SUCCESS [  8.742 s]
[INFO] Grid Coverage module ............................... SUCCESS [ 32.670 s]
[INFO] DataStore Support .................................. SUCCESS [  4.920 s]
[INFO] Property File DataStore ............................ SUCCESS [  4.743 s]
[INFO] GeoTIFF grid coverage exchange module .............. SUCCESS [  8.563 s]
[INFO] JDBC DataStore Support ............................. SUCCESS [  9.015 s]
[INFO] JDBC DataStore Plugins ............................. SUCCESS [  0.236 s]
[INFO] H2 DataStore ....................................... SUCCESS [01:43 min]
[INFO] Oracle DataStore ................................... SUCCESS [  3.044 s]
[INFO] PostGIS DataStore .................................. SUCCESS [ 17.548 s]
[INFO] Shapefile module ................................... FAILURE [ 29.802 s]
[INFO] Feature transforming feature source wrapper ........ SKIPPED
[INFO] WorldImage datasource module ....................... SKIPPED
[INFO] imagemosaic datasource module ...................... SKIPPED
[INFO] ArcGrid datasource module .......................... SKIPPED
[INFO] GML2 XML Support ................................... SKIPPED
[INFO] GML3 XML Support ................................... SKIPPED
[INFO] Filter XML Support ................................. SKIPPED
[INFO] SLD XML Support .................................... SKIPPED
[INFO] Render ............................................. SKIPPED
[INFO] OGC Web Service Models ............................. SKIPPED
[INFO] Xlink Model ........................................ SKIPPED
[INFO] Open Web Services Model ............................ SKIPPED
[INFO] Filter Encoding Specification Model ................ SKIPPED
[INFO] Web Feature Service Model .......................... SKIPPED
[INFO] OWS XML Support .................................... SKIPPED
[INFO] Filter Encoding Specification XML Support .......... SKIPPED
[INFO] WFS XML Support .................................... SKIPPED
[INFO] XML Parsing Support ................................ SKIPPED
[INFO] Web Processing Service Model ....................... SKIPPED
[INFO] Web Coverage Service Model ......................... SKIPPED
[INFO] Catalog Services for the Web Model ................. SKIPPED
[INFO] Web Map Tile Service model ......................... SKIPPED
[INFO] ArcSDE plugin ...................................... SKIPPED
[INFO] ArcSDE dummy api ................................... SKIPPED
[INFO] ArcSDE support classes ............................. SKIPPED
[INFO] ArcSDE DataStore plugin ............................ SKIPPED
[INFO] Dynamic symbolizer module based on JFreeChart and Eastwood SKIPPED
[INFO] Extensions to EPSG authority factory ............... SKIPPED
[INFO] EPSG Authority Service using PostgreSQL database ... SKIPPED
[INFO] Feature-Pregeneralized ............................. SKIPPED
[INFO] grass raster datasource module ..................... SKIPPED
[INFO] GTopo30 datasource module .......................... SKIPPED
[INFO] ImageI/O-Ext based grid coverage readers ........... SKIPPED
[INFO] imagepyramid datasource module ..................... SKIPPED
[INFO] imagemosaic-jdbc module ............................ SKIPPED
[INFO] DB2 DataStore ...................................... SKIPPED
[INFO] MySQL DataStore .................................... SKIPPED
[INFO] SQL Server DataStore ............................... SKIPPED
[INFO] SpatiaLite DataStore ............................... SKIPPED
[INFO] Teradata DataStore ................................. SKIPPED
[INFO] JP2K based grid coverage readers ................... SKIPPED
[INFO] OGR DataStore Module ............................... SKIPPED
[INFO] Core OGR DataStore Module .......................... SKIPPED
[INFO] Bridj OGR DataStore Module ......................... SKIPPED
[INFO] JNI OGR DataStore Module ........................... SKIPPED
[INFO] Vertical coordinate transformations ................ SKIPPED
[INFO] Dynamic symbolizers for SVG symbols ................ SKIPPED
[INFO] Coverage Multidimensional Module ................... SKIPPED
[INFO] API interfaces ..................................... SKIPPED
[INFO] NetCDF gridcoverage module ......................... SKIPPED
[INFO] GRIB gridcoverage module ........................... SKIPPED
[INFO] GeoPackage Module .................................. SKIPPED
[INFO] Application Schema Support ......................... SKIPPED
[INFO] Application Schema Resolver ........................ SKIPPED
[INFO] Complex Features Support ........................... SKIPPED
[INFO] Application Schema DataAccess ...................... SKIPPED
[INFO] MongoDB DataStore .................................. SKIPPED
[INFO] Sample DataAccess .................................. SKIPPED
[INFO] Brewer module ...................................... SKIPPED
[INFO] Vector grids ....................................... SKIPPED
[INFO] Validation Processor and Framework ................. SKIPPED
[INFO] Web Map Server client .............................. SKIPPED
[INFO] Geotools unsupported ............................... SKIPPED
[INFO] Process ............................................ SKIPPED
[INFO] Swing widgets ...................................... SKIPPED
[INFO] Tile Client ........................................ SKIPPED
[INFO] WMTS XML Support ................................... SKIPPED
[INFO] Web Map Tile Service Client ........................ SKIPPED
[INFO] KML XML Support .................................... SKIPPED
[INFO] WCS XML Support .................................... SKIPPED
[INFO] WPS XML Support .................................... SKIPPED
[INFO] WMS XML Support .................................... SKIPPED
[INFO] CSW XML Support .................................... SKIPPED
[INFO] Process Feature .................................... SKIPPED
[INFO] Process Raster ..................................... SKIPPED
[INFO] YSLD Parser/Encoder ................................ SKIPPED
[INFO] SWT widgets ........................................ SKIPPED
[INFO] GeoJSON Support .................................... SKIPPED
[INFO] Process Geometry ................................... SKIPPED
[INFO] MBTiles Module ..................................... SKIPPED
[INFO] WFS client module (NG) 20-SNAPSHOT ................. SKIPPED
[INFO] ------------------------------------------------------------------------
[INFO] BUILD FAILURE
[INFO] ------------------------------------------------------------------------
[INFO] Total time: 07:21 min
[INFO] Finished at: 2018-06-23T21:09:51-04:00
[INFO] ------------------------------------------------------------------------
Waiting for Jenkins to finish collecting data
[ERROR] Failed to execute goal org.apache.maven.plugins:maven-surefire-plugin:2.15:test (default-test) on project gt-shapefile: There are test failures.
[ERROR] 
[ERROR] Please refer to /home/hudson/genie.jts/.jenkins/jobs/GeoTools-Master/workspace/modules/plugin/shapefile/target/surefire-reports for the individual test results.
[ERROR] -> [Help 1]
[ERROR] 
[ERROR] To see the full stack trace of the errors, re-run Maven with the -e switch.
[ERROR] Re-run Maven using the -X switch to enable full debug logging.
[ERROR] 
[ERROR] For more information about the errors and possible solutions, please read the following articles:
[ERROR] [Help 1] http://cwiki.apache.org/confluence/display/MAVEN/MojoFailureException
[ERROR] 
[ERROR] After correcting the problems, you can resume the build with the command
[ERROR]   mvn <goals> -rf :gt-shapefile
[JENKINS] Archiving /home/hudson/genie.jts/.jenkins/jobs/GeoTools-Master/workspace/modules/ogc/net.opengis.wcs/pom.xml to org.geotools.ogc/net.opengis.wcs/20-SNAPSHOT/net.opengis.wcs-20-SNAPSHOT.pom
[JENKINS] Archiving /home/hudson/genie.jts/.jenkins/jobs/GeoTools-Master/workspace/modules/plugin/ogr/ogr-core/pom.xml to org.geotools/gt-ogr-core/20-SNAPSHOT/gt-ogr-core-20-SNAPSHOT.pom
[JENKINS] Archiving /home/hudson/genie.jts/.jenkins/jobs/GeoTools-Master/workspace/build/maven/pom.xml to org.geotools.maven/maven/20-SNAPSHOT/maven-20-SNAPSHOT.pom
[JENKINS] Archiving /home/hudson/genie.jts/.jenkins/jobs/GeoTools-Master/workspace/modules/plugin/referencing3D/pom.xml to org.geotools/gt-referencing3D/20-SNAPSHOT/gt-referencing3D-20-SNAPSHOT.pom
[JENKINS] Archiving /home/hudson/genie.jts/.jenkins/jobs/GeoTools-Master/workspace/modules/ogc/org.w3.xlink/pom.xml to org.geotools.ogc/org.w3.xlink/20-SNAPSHOT/org.w3.xlink-20-SNAPSHOT.pom
[JENKINS] Archiving /home/hudson/genie.jts/.jenkins/jobs/GeoTools-Master/workspace/modules/plugin/arcsde/common/pom.xml to org.geotools/gt-arcsde-common/20-SNAPSHOT/gt-arcsde-common-20-SNAPSHOT.pom
[JENKINS] Archiving /home/hudson/genie.jts/.jenkins/jobs/GeoTools-Master/workspace/modules/plugin/imagemosaic-jdbc/pom.xml to org.geotools/gt-imagemosaic-jdbc/20-SNAPSHOT/gt-imagemosaic-jdbc-20-SNAPSHOT.pom
[JENKINS] Archiving /home/hudson/genie.jts/.jenkins/jobs/GeoTools-Master/workspace/modules/library/xml/pom.xml to org.geotools/gt-xml/20-SNAPSHOT/gt-xml-20-SNAPSHOT.pom
[JENKINS] Archiving /home/hudson/genie.jts/.jenkins/jobs/GeoTools-Master/workspace/build/maven/javadoc/pom.xml to org.geotools.maven/javadoc/20-SNAPSHOT/javadoc-20-SNAPSHOT.pom
[JENKINS] Archiving /home/hudson/genie.jts/.jenkins/jobs/GeoTools-Master/workspace/build/maven/javadoc/target/javadoc-20-SNAPSHOT.jar to org.geotools.maven/javadoc/20-SNAPSHOT/javadoc-20-SNAPSHOT.jar
[JENKINS] Archiving /home/hudson/genie.jts/.jenkins/jobs/GeoTools-Master/workspace/build/maven/javadoc/target/javadoc-20-SNAPSHOT-sources.jar to org.geotools.maven/javadoc/20-SNAPSHOT/javadoc-20-SNAPSHOT-sources.jar
[JENKINS] Archiving /home/hudson/genie.jts/.jenkins/jobs/GeoTools-Master/workspace/modules/library/api/pom.xml to org.geotools/gt-api/20-SNAPSHOT/gt-api-20-SNAPSHOT.pom
[JENKINS] Archiving /home/hudson/genie.jts/.jenkins/jobs/GeoTools-Master/workspace/modules/library/api/target/gt-api-20-SNAPSHOT.jar to org.geotools/gt-api/20-SNAPSHOT/gt-api-20-SNAPSHOT.jar
[JENKINS] Archiving /home/hudson/genie.jts/.jenkins/jobs/GeoTools-Master/workspace/modules/library/api/target/gt-api-20-SNAPSHOT-sources.jar to org.geotools/gt-api/20-SNAPSHOT/gt-api-20-SNAPSHOT-sources.jar
[JENKINS] Archiving /home/hudson/genie.jts/.jenkins/jobs/GeoTools-Master/workspace/modules/extension/xsd/xsd-sld/pom.xml to org.geotools.xsd/gt-xsd-sld/20-SNAPSHOT/gt-xsd-sld-20-SNAPSHOT.pom
[JENKINS] Archiving /home/hudson/genie.jts/.jenkins/jobs/GeoTools-Master/workspace/modules/plugin/jdbc/jdbc-teradata/pom.xml to org.geotools.jdbc/gt-jdbc-teradata/20-SNAPSHOT/gt-jdbc-teradata-20-SNAPSHOT.pom
[JENKINS] Archiving /home/hudson/genie.jts/.jenkins/jobs/GeoTools-Master/workspace/modules/extension/xsd/xsd-core/pom.xml to org.geotools.xsd/gt-xsd-core/20-SNAPSHOT/gt-xsd-core-20-SNAPSHOT.pom
[JENKINS] Archiving /home/hudson/genie.jts/.jenkins/jobs/GeoTools-Master/workspace/modules/extension/xsd/xsd-core/target/gt-xsd-core-20-SNAPSHOT.jar to org.geotools.xsd/gt-xsd-core/20-SNAPSHOT/gt-xsd-core-20-SNAPSHOT.jar
[JENKINS] Archiving /home/hudson/genie.jts/.jenkins/jobs/GeoTools-Master/workspace/modules/extension/xsd/xsd-core/target/gt-xsd-core-20-SNAPSHOT-sources.jar to org.geotools.xsd/gt-xsd-core/20-SNAPSHOT/gt-xsd-core-20-SNAPSHOT-sources.jar
[JENKINS] Archiving /home/hudson/genie.jts/.jenkins/jobs/GeoTools-Master/workspace/modules/plugin/epsg-hsql/pom.xml to org.geotools/gt-epsg-hsql/20-SNAPSHOT/gt-epsg-hsql-20-SNAPSHOT.pom
[JENKINS] Archiving /home/hudson/genie.jts/.jenkins/jobs/GeoTools-Master/workspace/modules/plugin/epsg-hsql/target/gt-epsg-hsql-20-SNAPSHOT.jar to org.geotools/gt-epsg-hsql/20-SNAPSHOT/gt-epsg-hsql-20-SNAPSHOT.jar
[JENKINS] Archiving /home/hudson/genie.jts/.jenkins/jobs/GeoTools-Master/workspace/modules/plugin/epsg-hsql/target/gt-epsg-hsql-20-SNAPSHOT-sources.jar to org.geotools/gt-epsg-hsql/20-SNAPSHOT/gt-epsg-hsql-20-SNAPSHOT-sources.jar
[JENKINS] Archiving /home/hudson/genie.jts/.jenkins/jobs/GeoTools-Master/workspace/modules/extension/xsd/xsd-wcs/pom.xml to org.geotools.xsd/gt-xsd-wcs/20-SNAPSHOT/gt-xsd-wcs-20-SNAPSHOT.pom
[JENKINS] Archiving /home/hudson/genie.jts/.jenkins/jobs/GeoTools-Master/workspace/modules/extension/tile-client/pom.xml to org.geotools/gt-tile-client/20-SNAPSHOT/gt-tile-client-20-SNAPSHOT.pom
[JENKINS] Archiving /home/hudson/genie.jts/.jenkins/jobs/GeoTools-Master/workspace/modules/plugin/jdbc/jdbc-spatialite/pom.xml to org.geotools.jdbc/gt-jdbc-spatialite/20-SNAPSHOT/gt-jdbc-spatialite-20-SNAPSHOT.pom
[JENKINS] Archiving /home/hudson/genie.jts/.jenkins/jobs/GeoTools-Master/workspace/modules/unsupported/process-feature/pom.xml to org.geotools/gt-process-feature/20-SNAPSHOT/gt-process-feature-20-SNAPSHOT.pom
[JENKINS] Archiving /home/hudson/genie.jts/.jenkins/jobs/GeoTools-Master/workspace/modules/ogc/net.opengis.csw/pom.xml to org.geotools.ogc/net.opengis.csw/20-SNAPSHOT/net.opengis.csw-20-SNAPSHOT.pom
[JENKINS] Archiving /home/hudson/genie.jts/.jenkins/jobs/GeoTools-Master/workspace/modules/plugin/jdbc/jdbc-db2/pom.xml to org.geotools.jdbc/gt-jdbc-db2/20-SNAPSHOT/gt-jdbc-db2-20-SNAPSHOT.pom
[JENKINS] Archiving /home/hudson/genie.jts/.jenkins/jobs/GeoTools-Master/workspace/modules/extension/xsd/xsd-gml2/pom.xml to org.geotools.xsd/gt-xsd-gml2/20-SNAPSHOT/gt-xsd-gml2-20-SNAPSHOT.pom
[JENKINS] Archiving /home/hudson/genie.jts/.jenkins/jobs/GeoTools-Master/workspace/modules/plugin/coverage-multidim/coverage-api/pom.xml to org.geotools/gt-coverage-api/20-SNAPSHOT/gt-coverage-api-20-SNAPSHOT.pom
[JENKINS] Archiving /home/hudson/genie.jts/.jenkins/jobs/GeoTools-Master/workspace/modules/extension/xsd/xsd-gml3/pom.xml to org.geotools.xsd/gt-xsd-gml3/20-SNAPSHOT/gt-xsd-gml3-20-SNAPSHOT.pom
[JENKINS] Archiving /home/hudson/genie.jts/.jenkins/jobs/GeoTools-Master/workspace/modules/unsupported/process-geometry/pom.xml to org.geotools/gt-process-geometry/20-SNAPSHOT/gt-process-geometry-20-SNAPSHOT.pom
[JENKINS] Archiving /home/hudson/genie.jts/.jenkins/jobs/GeoTools-Master/workspace/modules/unsupported/mbtiles/pom.xml to org.geotools/gt-mbtiles/20-SNAPSHOT/gt-mbtiles-20-SNAPSHOT.pom
[JENKINS] Archiving /home/hudson/genie.jts/.jenkins/jobs/GeoTools-Master/workspace/modules/plugin/ogr/ogr-jni/pom.xml to org.geotools/gt-ogr-jni/20-SNAPSHOT/gt-ogr-jni-20-SNAPSHOT.pom
[JENKINS] Archiving /home/hudson/genie.jts/.jenkins/jobs/GeoTools-Master/workspace/modules/library/pom.xml to org.geotools/library/20-SNAPSHOT/library-20-SNAPSHOT.pom
[JENKINS] Archiving /home/hudson/genie.jts/.jenkins/jobs/GeoTools-Master/workspace/modules/plugin/epsg-extension/pom.xml to org.geotools/gt-epsg-extension/20-SNAPSHOT/gt-epsg-extension-20-SNAPSHOT.pom
[JENKINS] Archiving /home/hudson/genie.jts/.jenkins/jobs/GeoTools-Master/workspace/modules/extension/xsd/xsd-kml/pom.xml to org.geotools.xsd/gt-xsd-kml/20-SNAPSHOT/gt-xsd-kml-20-SNAPSHOT.pom
[JENKINS] Archiving /home/hudson/genie.jts/.jenkins/jobs/GeoTools-Master/workspace/modules/extension/complex/pom.xml to org.geotools/gt-complex/20-SNAPSHOT/gt-complex-20-SNAPSHOT.pom
[JENKINS] Archiving /home/hudson/genie.jts/.jenkins/jobs/GeoTools-Master/workspace/modules/plugin/image/pom.xml to org.geotools/gt-image/20-SNAPSHOT/gt-image-20-SNAPSHOT.pom
[JENKINS] Archiving /home/hudson/genie.jts/.jenkins/jobs/GeoTools-Master/workspace/modules/extension/transform/pom.xml to org.geotools/gt-transform/20-SNAPSHOT/gt-transform-20-SNAPSHOT.pom
[JENKINS] Archiving /home/hudson/genie.jts/.jenkins/jobs/GeoTools-Master/workspace/modules/extension/xsd/xsd-wmts/pom.xml to org.geotools.xsd/gt-xsd-wmts/20-SNAPSHOT/gt-xsd-wmts-20-SNAPSHOT.pom
[JENKINS] Archiving /home/hudson/genie.jts/.jenkins/jobs/GeoTools-Master/workspace/modules/plugin/arcsde/pom.xml to org.geotools/arcsde-plugin/20-SNAPSHOT/arcsde-plugin-20-SNAPSHOT.pom
[JENKINS] Archiving /home/hudson/genie.jts/.jenkins/jobs/GeoTools-Master/workspace/modules/unsupported/process/pom.xml to org.geotools/gt-process/20-SNAPSHOT/gt-process-20-SNAPSHOT.pom
[JENKINS] Archiving /home/hudson/genie.jts/.jenkins/jobs/GeoTools-Master/workspace/modules/plugin/jdbc/jdbc-h2/pom.xml to org.geotools.jdbc/gt-jdbc-h2/20-SNAPSHOT/gt-jdbc-h2-20-SNAPSHOT.pom
[JENKINS] Archiving /home/hudson/genie.jts/.jenkins/jobs/GeoTools-Master/workspace/modules/plugin/jdbc/jdbc-h2/target/gt-jdbc-h2-20-SNAPSHOT.jar to org.geotools.jdbc/gt-jdbc-h2/20-SNAPSHOT/gt-jdbc-h2-20-SNAPSHOT.jar
[JENKINS] Archiving /home/hudson/genie.jts/.jenkins/jobs/GeoTools-Master/workspace/modules/plugin/jdbc/jdbc-h2/target/gt-jdbc-h2-20-SNAPSHOT-sources.jar to org.geotools.jdbc/gt-jdbc-h2/20-SNAPSHOT/gt-jdbc-h2-20-SNAPSHOT-sources.jar
[JENKINS] Archiving /home/hudson/genie.jts/.jenkins/jobs/GeoTools-Master/workspace/modules/library/sample-data/pom.xml to org.geotools/gt-sample-data/20-SNAPSHOT/gt-sample-data-20-SNAPSHOT.pom
[JENKINS] Archiving /home/hudson/genie.jts/.jenkins/jobs/GeoTools-Master/workspace/modules/library/sample-data/target/gt-sample-data-20-SNAPSHOT.jar to org.geotools/gt-sample-data/20-SNAPSHOT/gt-sample-data-20-SNAPSHOT.jar
[JENKINS] Archiving /home/hudson/genie.jts/.jenkins/jobs/GeoTools-Master/workspace/modules/library/sample-data/target/gt-sample-data-20-SNAPSHOT-sources.jar to org.geotools/gt-sample-data/20-SNAPSHOT/gt-sample-data-20-SNAPSHOT-sources.jar
[JENKINS] Archiving /home/hudson/genie.jts/.jenkins/jobs/GeoTools-Master/workspace/modules/plugin/geopkg/pom.xml to org.geotools/gt-geopkg/20-SNAPSHOT/gt-geopkg-20-SNAPSHOT.pom
[JENKINS] Archiving /home/hudson/genie.jts/.jenkins/jobs/GeoTools-Master/workspace/modules/plugin/pom.xml to org.geotools/plugin/20-SNAPSHOT/plugin-20-SNAPSHOT.pom
[JENKINS] Archiving /home/hudson/genie.jts/.jenkins/jobs/GeoTools-Master/workspace/modules/extension/app-schema/pom.xml to org.geotools/app-schema/20-SNAPSHOT/app-schema-20-SNAPSHOT.pom
[JENKINS] Archiving /home/hudson/genie.jts/.jenkins/jobs/GeoTools-Master/workspace/modules/unsupported/geojson/pom.xml to org.geotools/gt-geojson/20-SNAPSHOT/gt-geojson-20-SNAPSHOT.pom
[JENKINS] Archiving /home/hudson/genie.jts/.jenkins/jobs/GeoTools-Master/workspace/modules/plugin/coverage-multidim/grib/pom.xml to org.geotools/gt-grib/20-SNAPSHOT/gt-grib-20-SNAPSHOT.pom
[JENKINS] Archiving /home/hudson/genie.jts/.jenkins/jobs/GeoTools-Master/workspace/modules/plugin/arcgrid/pom.xml to org.geotools/gt-arcgrid/20-SNAPSHOT/gt-arcgrid-20-SNAPSHOT.pom
[JENKINS] Archiving /home/hudson/genie.jts/.jenkins/jobs/GeoTools-Master/workspace/modules/plugin/coverage-multidim/pom.xml to org.geotools/gt-coverage-multidim/20-SNAPSHOT/gt-coverage-multidim-20-SNAPSHOT.pom
[JENKINS] Archiving /home/hudson/genie.jts/.jenkins/jobs/GeoTools-Master/workspace/modules/extension/grid/pom.xml to org.geotools/gt-grid/20-SNAPSHOT/gt-grid-20-SNAPSHOT.pom
[JENKINS] Archiving /home/hudson/genie.jts/.jenkins/jobs/GeoTools-Master/workspace/build/maven/jar-collector/pom.xml to org.geotools.maven/jar-collector/20-SNAPSHOT/jar-collector-20-SNAPSHOT.pom
[JENKINS] Archiving /home/hudson/genie.jts/.jenkins/jobs/GeoTools-Master/workspace/build/maven/jar-collector/target/jar-collector-20-SNAPSHOT.jar to org.geotools.maven/jar-collector/20-SNAPSHOT/jar-collector-20-SNAPSHOT.jar
[JENKINS] Archiving /home/hudson/genie.jts/.jenkins/jobs/GeoTools-Master/workspace/build/maven/jar-collector/target/jar-collector-20-SNAPSHOT-sources.jar to org.geotools.maven/jar-collector/20-SNAPSHOT/jar-collector-20-SNAPSHOT-sources.jar
[JENKINS] Archiving /home/hudson/genie.jts/.jenkins/jobs/GeoTools-Master/workspace/build/pom.xml to org.geotools.maven/build/20-SNAPSHOT/build-20-SNAPSHOT.pom
[JENKINS] Archiving /home/hudson/genie.jts/.jenkins/jobs/GeoTools-Master/workspace/modules/unsupported/swing/pom.xml to org.geotools/gt-swing/20-SNAPSHOT/gt-swing-20-SNAPSHOT.pom
[JENKINS] Archiving /home/hudson/genie.jts/.jenkins/jobs/GeoTools-Master/workspace/modules/plugin/mongodb/pom.xml to org.geotools/gt-mongodb/20-SNAPSHOT/gt-mongodb-20-SNAPSHOT.pom
[JENKINS] Archiving /home/hudson/genie.jts/.jenkins/jobs/GeoTools-Master/workspace/modules/ogc/net.opengis.wmts/pom.xml to org.geotools.ogc/net.opengis.wmts/20-SNAPSHOT/net.opengis.wmts-20-SNAPSHOT.pom
[JENKINS] Archiving /home/hudson/genie.jts/.jenkins/jobs/GeoTools-Master/workspace/build/maven/xmlcodegen/pom.xml to org.geotools.maven/xmlcodegen/20-SNAPSHOT/xmlcodegen-20-SNAPSHOT.pom
[JENKINS] Archiving /home/hudson/genie.jts/.jenkins/jobs/GeoTools-Master/workspace/build/maven/xmlcodegen/target/xmlcodegen-20-SNAPSHOT.jar to org.geotools.maven/xmlcodegen/20-SNAPSHOT/xmlcodegen-20-SNAPSHOT.jar
[JENKINS] Archiving /home/hudson/genie.jts/.jenkins/jobs/GeoTools-Master/workspace/build/maven/xmlcodegen/target/xmlcodegen-20-SNAPSHOT-sources.jar to org.geotools.maven/xmlcodegen/20-SNAPSHOT/xmlcodegen-20-SNAPSHOT-sources.jar
[JENKINS] Archiving /home/hudson/genie.jts/.jenkins/jobs/GeoTools-Master/workspace/modules/extension/xsd/xsd-csw/pom.xml to org.geotools.xsd/gt-xsd-csw/20-SNAPSHOT/gt-xsd-csw-20-SNAPSHOT.pom
[JENKINS] Archiving /home/hudson/genie.jts/.jenkins/jobs/GeoTools-Master/workspace/modules/plugin/geotiff/pom.xml to org.geotools/gt-geotiff/20-SNAPSHOT/gt-geotiff-20-SNAPSHOT.pom
[JENKINS] Archiving /home/hudson/genie.jts/.jenkins/jobs/GeoTools-Master/workspace/modules/plugin/geotiff/target/gt-geotiff-20-SNAPSHOT.jar to org.geotools/gt-geotiff/20-SNAPSHOT/gt-geotiff-20-SNAPSHOT.jar
[JENKINS] Archiving /home/hudson/genie.jts/.jenkins/jobs/GeoTools-Master/workspace/modules/plugin/geotiff/target/gt-geotiff-20-SNAPSHOT-sources.jar to org.geotools/gt-geotiff/20-SNAPSHOT/gt-geotiff-20-SNAPSHOT-sources.jar
[JENKINS] Archiving /home/hudson/genie.jts/.jenkins/jobs/GeoTools-Master/workspace/modules/plugin/jdbc/jdbc-oracle/pom.xml to org.geotools.jdbc/gt-jdbc-oracle/20-SNAPSHOT/gt-jdbc-oracle-20-SNAPSHOT.pom
[JENKINS] Archiving /home/hudson/genie.jts/.jenkins/jobs/GeoTools-Master/workspace/modules/plugin/jdbc/jdbc-oracle/target/gt-jdbc-oracle-20-SNAPSHOT.jar to org.geotools.jdbc/gt-jdbc-oracle/20-SNAPSHOT/gt-jdbc-oracle-20-SNAPSHOT.jar
[JENKINS] Archiving /home/hudson/genie.jts/.jenkins/jobs/GeoTools-Master/workspace/modules/plugin/jdbc/jdbc-oracle/target/gt-jdbc-oracle-20-SNAPSHOT-sources.jar to org.geotools.jdbc/gt-jdbc-oracle/20-SNAPSHOT/gt-jdbc-oracle-20-SNAPSHOT-sources.jar
[JENKINS] Archiving /home/hudson/genie.jts/.jenkins/jobs/GeoTools-Master/workspace/modules/plugin/imagemosaic/pom.xml to org.geotools/gt-imagemosaic/20-SNAPSHOT/gt-imagemosaic-20-SNAPSHOT.pom
[JENKINS] Archiving /home/hudson/genie.jts/.jenkins/jobs/GeoTools-Master/workspace/modules/plugin/jp2k/pom.xml to org.geotools/gt-jp2k/20-SNAPSHOT/gt-jp2k-20-SNAPSHOT.pom
[JENKINS] Archiving /home/hudson/genie.jts/.jenkins/jobs/GeoTools-Master/workspace/modules/plugin/imagepyramid/pom.xml to org.geotools/gt-imagepyramid/20-SNAPSHOT/gt-imagepyramid-20-SNAPSHOT.pom
[JENKINS] Archiving /home/hudson/genie.jts/.jenkins/jobs/GeoTools-Master/workspace/modules/library/referencing/pom.xml to org.geotools/gt-referencing/20-SNAPSHOT/gt-referencing-20-SNAPSHOT.pom
[JENKINS] Archiving /home/hudson/genie.jts/.jenkins/jobs/GeoTools-Master/workspace/modules/library/referencing/target/gt-referencing-20-SNAPSHOT.jar to org.geotools/gt-referencing/20-SNAPSHOT/gt-referencing-20-SNAPSHOT.jar
[JENKINS] Archiving /home/hudson/genie.jts/.jenkins/jobs/GeoTools-Master/workspace/modules/library/referencing/target/gt-referencing-20-SNAPSHOT-tests.jar to org.geotools/gt-referencing/20-SNAPSHOT/gt-referencing-20-SNAPSHOT-tests.jar
[JENKINS] Archiving /home/hudson/genie.jts/.jenkins/jobs/GeoTools-Master/workspace/modules/library/referencing/target/gt-referencing-20-SNAPSHOT-sources.jar to org.geotools/gt-referencing/20-SNAPSHOT/gt-referencing-20-SNAPSHOT-sources.jar
[JENKINS] Archiving /home/hudson/genie.jts/.jenkins/jobs/GeoTools-Master/workspace/modules/library/opengis/pom.xml to org.geotools/gt-opengis/20-SNAPSHOT/gt-opengis-20-SNAPSHOT.pom
[JENKINS] Archiving /home/hudson/genie.jts/.jenkins/jobs/GeoTools-Master/workspace/modules/library/opengis/target/gt-opengis-20-SNAPSHOT.jar to org.geotools/gt-opengis/20-SNAPSHOT/gt-opengis-20-SNAPSHOT.jar
[JENKINS] Archiving /home/hudson/genie.jts/.jenkins/jobs/GeoTools-Master/workspace/modules/library/opengis/target/gt-opengis-20-SNAPSHOT-sources.jar to org.geotools/gt-opengis/20-SNAPSHOT/gt-opengis-20-SNAPSHOT-sources.jar
[JENKINS] Archiving /home/hudson/genie.jts/.jenkins/jobs/GeoTools-Master/workspace/modules/plugin/epsg-wkt/pom.xml to org.geotools/gt-epsg-wkt/20-SNAPSHOT/gt-epsg-wkt-20-SNAPSHOT.pom
[JENKINS] Archiving /home/hudson/genie.jts/.jenkins/jobs/GeoTools-Master/workspace/modules/plugin/epsg-wkt/target/gt-epsg-wkt-20-SNAPSHOT.jar to org.geotools/gt-epsg-wkt/20-SNAPSHOT/gt-epsg-wkt-20-SNAPSHOT.jar
[JENKINS] Archiving /home/hudson/genie.jts/.jenkins/jobs/GeoTools-Master/workspace/modules/plugin/epsg-wkt/target/gt-epsg-wkt-20-SNAPSHOT-sources.jar to org.geotools/gt-epsg-wkt/20-SNAPSHOT/gt-epsg-wkt-20-SNAPSHOT-sources.jar
[JENKINS] Archiving /home/hudson/genie.jts/.jenkins/jobs/GeoTools-Master/workspace/modules/library/metadata/pom.xml to org.geotools/gt-metadata/20-SNAPSHOT/gt-metadata-20-SNAPSHOT.pom
[JENKINS] Archiving /home/hudson/genie.jts/.jenkins/jobs/GeoTools-Master/workspace/modules/library/metadata/target/gt-metadata-20-SNAPSHOT.jar to org.geotools/gt-metadata/20-SNAPSHOT/gt-metadata-20-SNAPSHOT.jar
[JENKINS] Archiving /home/hudson/genie.jts/.jenkins/jobs/GeoTools-Master/workspace/modules/library/metadata/target/gt-metadata-20-SNAPSHOT-sources.jar to org.geotools/gt-metadata/20-SNAPSHOT/gt-metadata-20-SNAPSHOT-sources.jar
[JENKINS] Archiving /home/hudson/genie.jts/.jenkins/jobs/GeoTools-Master/workspace/modules/plugin/jdbc/pom.xml to org.geotools.jdbc/gt-jdbc/20-SNAPSHOT/gt-jdbc-20-SNAPSHOT.pom
[JENKINS] Archiving /home/hudson/genie.jts/.jenkins/jobs/GeoTools-Master/workspace/modules/extension/validation/pom.xml to org.geotools/gt-validation/20-SNAPSHOT/gt-validation-20-SNAPSHOT.pom
[JENKINS] Archiving /home/hudson/genie.jts/.jenkins/jobs/GeoTools-Master/workspace/modules/unsupported/wfs-ng/pom.xml to org.geotools/gt-wfs-ng/20-SNAPSHOT/gt-wfs-ng-20-SNAPSHOT.pom
[JENKINS] Archiving /home/hudson/genie.jts/.jenkins/jobs/GeoTools-Master/workspace/modules/ogc/pom.xml to org.geotools/ogc/20-SNAPSHOT/ogc-20-SNAPSHOT.pom
[JENKINS] Archiving /home/hudson/genie.jts/.jenkins/jobs/GeoTools-Master/workspace/modules/extension/xsd/xsd-fes/pom.xml to org.geotools.xsd/gt-xsd-fes/20-SNAPSHOT/gt-xsd-fes-20-SNAPSHOT.pom
[JENKINS] Archiving /home/hudson/genie.jts/.jenkins/jobs/GeoTools-Master/workspace/modules/ogc/net.opengis.fes/pom.xml to org.geotools.ogc/net.opengis.fes/20-SNAPSHOT/net.opengis.fes-20-SNAPSHOT.pom
[JENKINS] Archiving /home/hudson/genie.jts/.jenkins/jobs/GeoTools-Master/workspace/modules/plugin/arcsde/datastore/pom.xml to org.geotools/gt-arcsde/20-SNAPSHOT/gt-arcsde-20-SNAPSHOT.pom
[JENKINS] Archiving /home/hudson/genie.jts/.jenkins/jobs/GeoTools-Master/workspace/modules/plugin/ogr/pom.xml to org.geotools/gt-ogr/20-SNAPSHOT/gt-ogr-20-SNAPSHOT.pom
[JENKINS] Archiving /home/hudson/genie.jts/.jenkins/jobs/GeoTools-Master/workspace/modules/extension/xsd/xsd-filter/pom.xml to org.geotools.xsd/gt-xsd-filter/20-SNAPSHOT/gt-xsd-filter-20-SNAPSHOT.pom
[JENKINS] Archiving /home/hudson/genie.jts/.jenkins/jobs/GeoTools-Master/workspace/modules/extension/app-schema/app-schema/pom.xml to org.geotools/gt-app-schema/20-SNAPSHOT/gt-app-schema-20-SNAPSHOT.pom
[JENKINS] Archiving /home/hudson/genie.jts/.jenkins/jobs/GeoTools-Master/workspace/modules/ogc/net.opengis.ows/pom.xml to org.geotools.ogc/net.opengis.ows/20-SNAPSHOT/net.opengis.ows-20-SNAPSHOT.pom
[JENKINS] Archiving /home/hudson/genie.jts/.jenkins/jobs/GeoTools-Master/workspace/modules/extension/wmts/pom.xml to org.geotools/gt-wmts/20-SNAPSHOT/gt-wmts-20-SNAPSHOT.pom
[JENKINS] Archiving /home/hudson/genie.jts/.jenkins/jobs/GeoTools-Master/workspace/modules/extension/ysld/pom.xml to org.geotools/gt-ysld/20-SNAPSHOT/gt-ysld-20-SNAPSHOT.pom
[JENKINS] Archiving /home/hudson/genie.jts/.jenkins/jobs/GeoTools-Master/workspace/modules/plugin/shapefile/pom.xml to org.geotools/gt-shapefile/20-SNAPSHOT/gt-shapefile-20-SNAPSHOT.pom
[JENKINS] Archiving /home/hudson/genie.jts/.jenkins/jobs/GeoTools-Master/workspace/modules/ogc/net.opengis.wfs/pom.xml to org.geotools.ogc/net.opengis.wfs/20-SNAPSHOT/net.opengis.wfs-20-SNAPSHOT.pom
[JENKINS] Archiving /home/hudson/genie.jts/.jenkins/jobs/GeoTools-Master/workspace/modules/library/coverage/pom.xml to org.geotools/gt-coverage/20-SNAPSHOT/gt-coverage-20-SNAPSHOT.pom
[JENKINS] Archiving /home/hudson/genie.jts/.jenkins/jobs/GeoTools-Master/workspace/modules/library/coverage/target/gt-coverage-20-SNAPSHOT.jar to org.geotools/gt-coverage/20-SNAPSHOT/gt-coverage-20-SNAPSHOT.jar
[JENKINS] Archiving /home/hudson/genie.jts/.jenkins/jobs/GeoTools-Master/workspace/modules/library/coverage/target/gt-coverage-20-SNAPSHOT-sources.jar to org.geotools/gt-coverage/20-SNAPSHOT/gt-coverage-20-SNAPSHOT-sources.jar
[JENKINS] Archiving /home/hudson/genie.jts/.jenkins/jobs/GeoTools-Master/workspace/modules/extension/xsd/xsd-wps/pom.xml to org.geotools.xsd/gt-xsd-wps/20-SNAPSHOT/gt-xsd-wps-20-SNAPSHOT.pom
[JENKINS] Archiving /home/hudson/genie.jts/.jenkins/jobs/GeoTools-Master/workspace/pom.xml to org.geotools/geotools/20-SNAPSHOT/geotools-20-SNAPSHOT.pom
[JENKINS] Archiving /home/hudson/genie.jts/.jenkins/jobs/GeoTools-Master/workspace/modules/library/jdbc/pom.xml to org.geotools/gt-jdbc/20-SNAPSHOT/gt-jdbc-20-SNAPSHOT.pom
[JENKINS] Archiving /home/hudson/genie.jts/.jenkins/jobs/GeoTools-Master/workspace/modules/library/jdbc/target/gt-jdbc-20-SNAPSHOT.jar to org.geotools/gt-jdbc/20-SNAPSHOT/gt-jdbc-20-SNAPSHOT.jar
[JENKINS] Archiving /home/hudson/genie.jts/.jenkins/jobs/GeoTools-Master/workspace/modules/library/jdbc/target/gt-jdbc-20-SNAPSHOT-tests.jar to org.geotools/gt-jdbc/20-SNAPSHOT/gt-jdbc-20-SNAPSHOT-tests.jar
[JENKINS] Archiving /home/hudson/genie.jts/.jenkins/jobs/GeoTools-Master/workspace/modules/library/jdbc/target/gt-jdbc-20-SNAPSHOT-sources.jar to org.geotools/gt-jdbc/20-SNAPSHOT/gt-jdbc-20-SNAPSHOT-sources.jar
[JENKINS] Archiving /home/hudson/genie.jts/.jenkins/jobs/GeoTools-Master/workspace/modules/extension/xsd/pom.xml to org.geotools.xsd/xsd/20-SNAPSHOT/xsd-20-SNAPSHOT.pom
[JENKINS] Archiving /home/hudson/genie.jts/.jenkins/jobs/GeoTools-Master/workspace/build/maven/jjtree-javacc/pom.xml to org.geotools.maven/jjtree-javacc/20-SNAPSHOT/jjtree-javacc-20-SNAPSHOT.pom
[JENKINS] Archiving /home/hudson/genie.jts/.jenkins/jobs/GeoTools-Master/workspace/build/maven/jjtree-javacc/target/jjtree-javacc-20-SNAPSHOT.jar to org.geotools.maven/jjtree-javacc/20-SNAPSHOT/jjtree-javacc-20-SNAPSHOT.jar
[JENKINS] Archiving /home/hudson/genie.jts/.jenkins/jobs/GeoTools-Master/workspace/build/maven/jjtree-javacc/target/jjtree-javacc-20-SNAPSHOT-sources.jar to org.geotools.maven/jjtree-javacc/20-SNAPSHOT/jjtree-javacc-20-SNAPSHOT-sources.jar
[JENKINS] Archiving /home/hudson/genie.jts/.jenkins/jobs/GeoTools-Master/workspace/modules/extension/app-schema/sample-data-access/pom.xml to org.geotools/gt-sample-data-access/20-SNAPSHOT/gt-sample-data-access-20-SNAPSHOT.pom
[JENKINS] Archiving /home/hudson/genie.jts/.jenkins/jobs/GeoTools-Master/workspace/modules/plugin/charts/pom.xml to org.geotools/gt-charts/20-SNAPSHOT/gt-charts-20-SNAPSHOT.pom
[JENKINS] Archiving /home/hudson/genie.jts/.jenkins/jobs/GeoTools-Master/workspace/modules/library/cql/pom.xml to org.geotools/gt-cql/20-SNAPSHOT/gt-cql-20-SNAPSHOT.pom
[JENKINS] Archiving /home/hudson/genie.jts/.jenkins/jobs/GeoTools-Master/workspace/modules/library/cql/target/gt-cql-20-SNAPSHOT.jar to org.geotools/gt-cql/20-SNAPSHOT/gt-cql-20-SNAPSHOT.jar
[JENKINS] Archiving /home/hudson/genie.jts/.jenkins/jobs/GeoTools-Master/workspace/modules/library/cql/target/gt-cql-20-SNAPSHOT-sources.jar to org.geotools/gt-cql/20-SNAPSHOT/gt-cql-20-SNAPSHOT-sources.jar
[JENKINS] Archiving /home/hudson/genie.jts/.jenkins/jobs/GeoTools-Master/workspace/modules/plugin/jdbc/jdbc-sqlserver/pom.xml to org.geotools.jdbc/gt-jdbc-sqlserver/20-SNAPSHOT/gt-jdbc-sqlserver-20-SNAPSHOT.pom
[JENKINS] Archiving /home/hudson/genie.jts/.jenkins/jobs/GeoTools-Master/workspace/modules/extension/app-schema/app-schema-resolver/pom.xml to org.geotools/gt-app-schema-resolver/20-SNAPSHOT/gt-app-schema-resolver-20-SNAPSHOT.pom
[JENKINS] Archiving /home/hudson/genie.jts/.jenkins/jobs/GeoTools-Master/workspace/modules/unsupported/pom.xml to org.geotools/unsupported/20-SNAPSHOT/unsupported-20-SNAPSHOT.pom
[JENKINS] Archiving /home/hudson/genie.jts/.jenkins/jobs/GeoTools-Master/workspace/modules/plugin/jdbc/jdbc-postgis/pom.xml to org.geotools.jdbc/gt-jdbc-postgis/20-SNAPSHOT/gt-jdbc-postgis-20-SNAPSHOT.pom
[JENKINS] Archiving /home/hudson/genie.jts/.jenkins/jobs/GeoTools-Master/workspace/modules/plugin/jdbc/jdbc-postgis/target/gt-jdbc-postgis-20-SNAPSHOT.jar to org.geotools.jdbc/gt-jdbc-postgis/20-SNAPSHOT/gt-jdbc-postgis-20-SNAPSHOT.jar
[JENKINS] Archiving /home/hudson/genie.jts/.jenkins/jobs/GeoTools-Master/workspace/modules/plugin/jdbc/jdbc-postgis/target/gt-jdbc-postgis-20-SNAPSHOT-sources.jar to org.geotools.jdbc/gt-jdbc-postgis/20-SNAPSHOT/gt-jdbc-postgis-20-SNAPSHOT-sources.jar
[JENKINS] Archiving /home/hudson/genie.jts/.jenkins/jobs/GeoTools-Master/workspace/modules/library/data/pom.xml to org.geotools/gt-data/20-SNAPSHOT/gt-data-20-SNAPSHOT.pom
[JENKINS] Archiving /home/hudson/genie.jts/.jenkins/jobs/GeoTools-Master/workspace/modules/library/data/target/gt-data-20-SNAPSHOT.jar to org.geotools/gt-data/20-SNAPSHOT/gt-data-20-SNAPSHOT.jar
[JENKINS] Archiving /home/hudson/genie.jts/.jenkins/jobs/GeoTools-Master/workspace/modules/library/data/target/gt-data-20-SNAPSHOT-sources.jar to org.geotools/gt-data/20-SNAPSHOT/gt-data-20-SNAPSHOT-sources.jar
[JENKINS] Archiving /home/hudson/genie.jts/.jenkins/jobs/GeoTools-Master/workspace/modules/plugin/jdbc/jdbc-mysql/pom.xml to org.geotools.jdbc/gt-jdbc-mysql/20-SNAPSHOT/gt-jdbc-mysql-20-SNAPSHOT.pom
[JENKINS] Archiving /home/hudson/genie.jts/.jenkins/jobs/GeoTools-Master/workspace/modules/plugin/svg/pom.xml to org.geotools/gt-svg/20-SNAPSHOT/gt-svg-20-SNAPSHOT.pom
[JENKINS] Archiving /home/hudson/genie.jts/.jenkins/jobs/GeoTools-Master/workspace/modules/extension/xsd/xsd-wms/pom.xml to org.geotools.xsd/gt-xsd-wms/20-SNAPSHOT/gt-xsd-wms-20-SNAPSHOT.pom
[JENKINS] Archiving /home/hudson/genie.jts/.jenkins/jobs/GeoTools-Master/workspace/modules/plugin/epsg-postgresql/pom.xml to org.geotools/gt-epsg-postgresql/20-SNAPSHOT/gt-epsg-postgresql-20-SNAPSHOT.pom
[JENKINS] Archiving /home/hudson/genie.jts/.jenkins/jobs/GeoTools-Master/workspace/modules/extension/brewer/pom.xml to org.geotools/gt-brewer/20-SNAPSHOT/gt-brewer-20-SNAPSHOT.pom
[JENKINS] Archiving /home/hudson/genie.jts/.jenkins/jobs/GeoTools-Master/workspace/modules/plugin/coverage-multidim/netcdf/pom.xml to org.geotools/gt-netcdf/20-SNAPSHOT/gt-netcdf-20-SNAPSHOT.pom
[JENKINS] Archiving /home/hudson/genie.jts/.jenkins/jobs/GeoTools-Master/workspace/modules/plugin/imageio-ext-gdal/pom.xml to org.geotools/gt-imageio-ext-gdal/20-SNAPSHOT/gt-imageio-ext-gdal-20-SNAPSHOT.pom
[JENKINS] Archiving /home/hudson/genie.jts/.jenkins/jobs/GeoTools-Master/workspace/modules/plugin/ogr/ogr-bridj/pom.xml to org.geotools/gt-ogr-bridj/20-SNAPSHOT/gt-ogr-bridj-20-SNAPSHOT.pom
[JENKINS] Archiving /home/hudson/genie.jts/.jenkins/jobs/GeoTools-Master/workspace/modules/pom.xml to org.geotools/modules/20-SNAPSHOT/modules-20-SNAPSHOT.pom
[JENKINS] Archiving /home/hudson/genie.jts/.jenkins/jobs/GeoTools-Master/workspace/modules/extension/graph/pom.xml to org.geotools/gt-graph/20-SNAPSHOT/gt-graph-20-SNAPSHOT.pom
[JENKINS] Archiving /home/hudson/genie.jts/.jenkins/jobs/GeoTools-Master/workspace/modules/extension/graph/target/gt-graph-20-SNAPSHOT.jar to org.geotools/gt-graph/20-SNAPSHOT/gt-graph-20-SNAPSHOT.jar
[JENKINS] Archiving /home/hudson/genie.jts/.jenkins/jobs/GeoTools-Master/workspace/modules/extension/graph/target/gt-graph-20-SNAPSHOT-sources.jar to org.geotools/gt-graph/20-SNAPSHOT/gt-graph-20-SNAPSHOT-sources.jar
[JENKINS] Archiving /home/hudson/genie.jts/.jenkins/jobs/GeoTools-Master/workspace/modules/unsupported/process-raster/pom.xml to org.geotools/gt-process-raster/20-SNAPSHOT/gt-process-raster-20-SNAPSHOT.pom
[JENKINS] Archiving /home/hudson/genie.jts/.jenkins/jobs/GeoTools-Master/workspace/modules/extension/wms/pom.xml to org.geotools/gt-wms/20-SNAPSHOT/gt-wms-20-SNAPSHOT.pom
[JENKINS] Archiving /home/hudson/genie.jts/.jenkins/jobs/GeoTools-Master/workspace/modules/plugin/arcsde/sde-dummy/pom.xml to org.geotools/gt-sde-dummy/20-SNAPSHOT/gt-sde-dummy-20-SNAPSHOT.pom
[JENKINS] Archiving /home/hudson/genie.jts/.jenkins/jobs/GeoTools-Master/workspace/modules/extension/pom.xml to org.geotools/extension/20-SNAPSHOT/extension-20-SNAPSHOT.pom
[JENKINS] Archiving /home/hudson/genie.jts/.jenkins/jobs/GeoTools-Master/workspace/modules/plugin/grassraster/pom.xml to org.geotools/gt-grassraster/20-SNAPSHOT/gt-grassraster-20-SNAPSHOT.pom
[JENKINS] Archiving /home/hudson/genie.jts/.jenkins/jobs/GeoTools-Master/workspace/modules/library/render/pom.xml to org.geotools/gt-render/20-SNAPSHOT/gt-render-20-SNAPSHOT.pom
[JENKINS] Archiving /home/hudson/genie.jts/.jenkins/jobs/GeoTools-Master/workspace/modules/ogc/net.opengis.wps/pom.xml to org.geotools.ogc/net.opengis.wps/20-SNAPSHOT/net.opengis.wps-20-SNAPSHOT.pom
[JENKINS] Archiving /home/hudson/genie.jts/.jenkins/jobs/GeoTools-Master/workspace/modules/unsupported/swt/pom.xml to org.geotools/gt-swt/20-SNAPSHOT/gt-swt-20-SNAPSHOT.pom
[JENKINS] Archiving /home/hudson/genie.jts/.jenkins/jobs/GeoTools-Master/workspace/modules/plugin/feature-pregeneralized/pom.xml to org.geotools/gt-feature-pregeneralized/20-SNAPSHOT/gt-feature-pregeneralized-20-SNAPSHOT.pom
[JENKINS] Archiving /home/hudson/genie.jts/.jenkins/jobs/GeoTools-Master/workspace/modules/plugin/gtopo30/pom.xml to org.geotools/gt-gtopo30/20-SNAPSHOT/gt-gtopo30-20-SNAPSHOT.pom
[JENKINS] Archiving /home/hudson/genie.jts/.jenkins/jobs/GeoTools-Master/workspace/modules/plugin/property/pom.xml to org.geotools/gt-property/20-SNAPSHOT/gt-property-20-SNAPSHOT.pom
[JENKINS] Archiving /home/hudson/genie.jts/.jenkins/jobs/GeoTools-Master/workspace/modules/plugin/property/target/gt-property-20-SNAPSHOT.jar to org.geotools/gt-property/20-SNAPSHOT/gt-property-20-SNAPSHOT.jar
[JENKINS] Archiving /home/hudson/genie.jts/.jenkins/jobs/GeoTools-Master/workspace/modules/plugin/property/target/gt-property-20-SNAPSHOT-sources.jar to org.geotools/gt-property/20-SNAPSHOT/gt-property-20-SNAPSHOT-sources.jar
[JENKINS] Archiving /home/hudson/genie.jts/.jenkins/jobs/GeoTools-Master/workspace/modules/extension/xsd/xsd-ows/pom.xml to org.geotools.xsd/gt-xsd-ows/20-SNAPSHOT/gt-xsd-ows-20-SNAPSHOT.pom
[JENKINS] Archiving /home/hudson/genie.jts/.jenkins/jobs/GeoTools-Master/workspace/modules/library/main/pom.xml to org.geotools/gt-main/20-SNAPSHOT/gt-main-20-SNAPSHOT.pom
[JENKINS] Archiving /home/hudson/genie.jts/.jenkins/jobs/GeoTools-Master/workspace/modules/library/main/target/gt-main-20-SNAPSHOT.jar to org.geotools/gt-main/20-SNAPSHOT/gt-main-20-SNAPSHOT.jar
[JENKINS] Archiving /home/hudson/genie.jts/.jenkins/jobs/GeoTools-Master/workspace/modules/library/main/target/gt-main-20-SNAPSHOT-tests.jar to org.geotools/gt-main/20-SNAPSHOT/gt-main-20-SNAPSHOT-tests.jar
[JENKINS] Archiving /home/hudson/genie.jts/.jenkins/jobs/GeoTools-Master/workspace/modules/library/main/target/gt-main-20-SNAPSHOT-sources.jar to org.geotools/gt-main/20-SNAPSHOT/gt-main-20-SNAPSHOT-sources.jar
[JENKINS] Archiving /home/hudson/genie.jts/.jenkins/jobs/GeoTools-Master/workspace/modules/extension/xsd/xsd-wfs/pom.xml to org.geotools.xsd/gt-xsd-wfs/20-SNAPSHOT/gt-xsd-wfs-20-SNAPSHOT.pom
channel stopped
Started calculate disk usage of build
Finished Calculation of disk usage of build in 0 seconds
Started calculate disk usage of workspace
Finished Calculation of disk usage of workspace in 0 seconds
Finished: FAILURE