FailedConsole Output

Skipping 0 KB.. Full Log
[INFO] 
[INFO] --- git-commit-id-plugin:2.1.15:revision (default) @ gt-shapefile ---
[INFO] 
[INFO] --- fmt-maven-plugin:2.4.0:format (default) @ gt-shapefile ---
[debug] Using AOSP style
[INFO] Processed 100 files (0 reformatted).
[INFO] Processed 102 files (0 reformatted).
[INFO] 
[INFO] --- maven-resources-plugin:2.6:resources (default-resources) @ gt-shapefile ---
[INFO] Using 'UTF-8' encoding to copy filtered resources.
[INFO] Copying 2 resources
[INFO] 
[INFO] --- maven-compiler-plugin:3.1:compile (default-compile) @ gt-shapefile ---
[INFO] Nothing to compile - all classes are up to date
[INFO] 
[INFO] --- maven-resources-plugin:2.6:testResources (default-testResources) @ gt-shapefile ---
[INFO] Using 'UTF-8' encoding to copy filtered resources.
[INFO] Copying 43 resources
[INFO] 
[INFO] --- maven-compiler-plugin:3.1:testCompile (default-testCompile) @ gt-shapefile ---
[INFO] Nothing to compile - all classes are up to date
[INFO] 
[INFO] --- maven-surefire-plugin:2.15:test (default-test) @ gt-shapefile ---
[INFO] Surefire report directory: /home/hudson/genie.jts/.jenkins/jobs/GeoTools-Master/workspace/modules/plugin/shapefile/target/surefire-reports

-------------------------------------------------------
 T E S T S
-------------------------------------------------------
Picked up JAVA_TOOL_OPTIONS: -Xmx2G -Djava.io.tmpdir=/tmp/genie.jts
Running org.geotools.data.directory.DataStoreCacheTest
[archsites, bugsites]
[/home/hudson/genie.jts/.jenkins/jobs/GeoTools-Master/workspace/modules/plugin/shapefile/target/test-classes/org/geotools/data/directory/test-data/shapes/bugsites.dbf, /home/hudson/genie.jts/.jenkins/jobs/GeoTools-Master/workspace/modules/plugin/shapefile/target/test-classes/org/geotools/data/directory/test-data/shapes/bugsites.shp, /home/hudson/genie.jts/.jenkins/jobs/GeoTools-Master/workspace/modules/plugin/shapefile/target/test-classes/org/geotools/data/directory/test-data/shapes/bugsites.shx, /home/hudson/genie.jts/.jenkins/jobs/GeoTools-Master/workspace/modules/plugin/shapefile/target/test-classes/org/geotools/data/directory/test-data/shapes/bugsites.prj, /home/hudson/genie.jts/.jenkins/jobs/GeoTools-Master/workspace/modules/plugin/shapefile/target/test-classes/org/geotools/data/directory/test-data/shapes/archsites.prj]
Tests run: 5, Failures: 0, Errors: 0, Skipped: 0, Time elapsed: 5.638 sec - in org.geotools.data.directory.DataStoreCacheTest
Running org.geotools.data.directory.DirectoryDataStoreFactoryTest
Tests run: 3, Failures: 0, Errors: 0, Skipped: 0, Time elapsed: 0.104 sec - in org.geotools.data.directory.DirectoryDataStoreFactoryTest
Running org.geotools.data.directory.DirectoryDataStoreTest
Tests run: 7, Failures: 0, Errors: 0, Skipped: 1, Time elapsed: 0.65 sec - in org.geotools.data.directory.DirectoryDataStoreTest
Running org.geotools.data.shapefile.DbaseFileTest
Jun 23, 2018 9:09:21 PM org.geotools.data.shapefile.dbf.DbaseFileHeader addColumn
WARNING: FieldName emptyString is longer than 10 characters, truncating to emptyStrin
Jun 23, 2018 9:09:21 PM org.geotools.data.shapefile.dbf.DbaseFileHeader addColumn
WARNING: FieldName emptyDouble is longer than 10 characters, truncating to emptyDoubl
Jun 23, 2018 9:09:21 PM org.geotools.data.shapefile.dbf.DbaseFileHeader addColumn
WARNING: FieldName emptyLogical is longer than 10 characters, truncating to emptyLogic
Jun 23, 2018 9:09:21 PM org.geotools.data.shapefile.dbf.DbaseFileHeader addColumn
WARNING: FieldName emptyString is longer than 10 characters, truncating to emptyStrin
Jun 23, 2018 9:09:21 PM org.geotools.data.shapefile.dbf.DbaseFileHeader addColumn
WARNING: FieldName emptyString is longer than 10 characters, truncating to emptyStrin
Jun 23, 2018 9:09:21 PM org.geotools.data.shapefile.dbf.DbaseFileHeader addColumn
WARNING: FieldName emptyDouble is longer than 10 characters, truncating to emptyDoubl
Jun 23, 2018 9:09:21 PM org.geotools.data.shapefile.dbf.DbaseFileHeader addColumn
WARNING: FieldName emptyLogical is longer than 10 characters, truncating to emptyLogic
Could not find a field named 'billy' for removal
Tests run: 8, Failures: 0, Errors: 0, Skipped: 0, Time elapsed: 0.245 sec - in org.geotools.data.shapefile.DbaseFileTest
Running org.geotools.data.shapefile.DbaseNullSupportTest
Tests run: 1, Failures: 0, Errors: 0, Skipped: 0, Time elapsed: 0.009 sec - in org.geotools.data.shapefile.DbaseNullSupportTest
Running org.geotools.data.shapefile.DuplicateColumnNameReaderTest
Tests run: 2, Failures: 0, Errors: 0, Skipped: 0, Time elapsed: 0.223 sec - in org.geotools.data.shapefile.DuplicateColumnNameReaderTest
Running org.geotools.data.shapefile.ServiceTest
Tests run: 3, Failures: 0, Errors: 0, Skipped: 0, Time elapsed: 0.004 sec - in org.geotools.data.shapefile.ServiceTest
Running org.geotools.data.shapefile.ShapefileDataStoreFactoryTest
Tests run: 3, Failures: 0, Errors: 0, Skipped: 0, Time elapsed: 0.022 sec - in org.geotools.data.shapefile.ShapefileDataStoreFactoryTest
Running org.geotools.data.shapefile.ShapefileDataStoreTest
Jun 23, 2018 9:09:22 PM org.geotools.data.shapefile.dbf.DbaseFileWriter$FieldFormatter getFieldString
WARNING: Writing DBF data, value 12,345,678,901,234,567,890,123,456,789 cannot be represented in size 19
Jun 23, 2018 9:09:22 PM org.geotools.data.shapefile.files.ShpFiles logCurrentLockers
SEVERE: The following locker still has a lock: read on file:/home/hudson/genie.jts/.jenkins/jobs/GeoTools-Master/workspace/modules/plugin/shapefile/target/test-classes/org/geotools/data/shapefile/test-data/dumper/custom.shp by org.geotools.data.shapefile.shp.ShapefileReader
Jun 23, 2018 9:09:22 PM org.geotools.data.shapefile.files.ShpFiles logCurrentLockers
SEVERE: The following locker still has a lock: read on file:/home/hudson/genie.jts/.jenkins/jobs/GeoTools-Master/workspace/modules/plugin/shapefile/target/test-classes/org/geotools/data/shapefile/test-data/dumper/custom.shx by org.geotools.data.shapefile.shp.IndexFile
Jun 23, 2018 9:09:22 PM org.geotools.data.shapefile.files.ShpFiles logCurrentLockers
SEVERE: The following locker still has a lock: read on file:/home/hudson/genie.jts/.jenkins/jobs/GeoTools-Master/workspace/modules/plugin/shapefile/target/test-classes/org/geotools/data/shapefile/test-data/dumper/custom.dbf by org.geotools.data.shapefile.dbf.DbaseFileReader
Jun 23, 2018 9:09:22 PM org.geotools.data.shapefile.ShapefileFeatureReader finalize
WARNING: There is code leaving shapefile readers unclosed, this might result in file system locks not being cleared. File is: custom
Jun 23, 2018 9:09:22 PM org.geotools.data.DefaultTransaction finalize
SEVERE: There's code leaving transaction unclosed. Call Transaction.close() after using them to ensure they do not hold state such as JDBC connections or file handles
Jun 23, 2018 9:09:22 PM org.geotools.data.DefaultTransaction finalize
SEVERE: Unclosed transaction handle is 'create'
Jun 23, 2018 9:09:22 PM org.geotools.data.shapefile.shp.ShapefileReader <init>
WARNING: Could not open the .shx file, continuing assuming the .shp file is not sparse
java.io.FileNotFoundException: /home/hudson/genie.jts/.jenkins/jobs/GeoTools-Master/workspace/modules/plugin/shapefile/target/test-classes/org/geotools/data/shapefile/test-data/shapes/stream.shx (No such file or directory)
	at java.io.RandomAccessFile.open0(Native Method)
	at java.io.RandomAccessFile.open(RandomAccessFile.java:316)
	at java.io.RandomAccessFile.<init>(RandomAccessFile.java:243)
	at org.geotools.data.shapefile.files.ShpFiles.getReadChannel(ShpFiles.java:758)
	at org.geotools.data.shapefile.shp.IndexFile.<init>(IndexFile.java:72)
	at org.geotools.data.shapefile.shp.ShapefileReader.<init>(ShapefileReader.java:267)
	at org.geotools.data.shapefile.ShapefileSetManager.openShapeReader(ShapefileSetManager.java:48)
	at org.geotools.data.shapefile.ShapefileFeatureSource.readAttributes(ShapefileFeatureSource.java:520)
	at org.geotools.data.shapefile.ShapefileFeatureSource.buildFeatureType(ShapefileFeatureSource.java:479)
	at org.geotools.data.shapefile.ShapefileFeatureStore.buildFeatureType(ShapefileFeatureStore.java:137)
	at org.geotools.data.store.ContentFeatureSource.getAbsoluteSchema(ContentFeatureSource.java:328)
	at org.geotools.data.store.ContentFeatureSource.getSchema(ContentFeatureSource.java:297)
	at org.geotools.data.store.ContentFeatureSource.resolvePropertyNames(ContentFeatureSource.java:1102)
	at org.geotools.data.store.ContentFeatureSource.getReader(ContentFeatureSource.java:572)
	at org.geotools.data.store.ContentDataStore.getFeatureReader(ContentDataStore.java:363)
	at org.geotools.data.shapefile.ShapefileDataStore.getFeatureReader(ShapefileDataStore.java:240)
	at org.geotools.data.shapefile.ShapefileDataStoreTest.testGetCount(ShapefileDataStoreTest.java:1413)
	at sun.reflect.NativeMethodAccessorImpl.invoke0(Native Method)
	at sun.reflect.NativeMethodAccessorImpl.invoke(NativeMethodAccessorImpl.java:62)
	at sun.reflect.DelegatingMethodAccessorImpl.invoke(DelegatingMethodAccessorImpl.java:43)
	at java.lang.reflect.Method.invoke(Method.java:498)
	at org.junit.runners.model.FrameworkMethod$1.runReflectiveCall(FrameworkMethod.java:47)
	at org.junit.internal.runners.model.ReflectiveCallable.run(ReflectiveCallable.java:12)
	at org.junit.runners.model.FrameworkMethod.invokeExplosively(FrameworkMethod.java:44)
	at org.junit.internal.runners.statements.InvokeMethod.evaluate(InvokeMethod.java:17)
	at org.junit.internal.runners.statements.RunAfters.evaluate(RunAfters.java:27)
	at org.junit.runners.ParentRunner.runLeaf(ParentRunner.java:271)
	at org.junit.runners.BlockJUnit4ClassRunner.runChild(BlockJUnit4ClassRunner.java:70)
	at org.junit.runners.BlockJUnit4ClassRunner.runChild(BlockJUnit4ClassRunner.java:50)
	at org.junit.runners.ParentRunner$3.run(ParentRunner.java:238)
	at org.junit.runners.ParentRunner$1.schedule(ParentRunner.java:63)
	at org.junit.runners.ParentRunner.runChildren(ParentRunner.java:236)
	at org.junit.runners.ParentRunner.access$000(ParentRunner.java:53)
	at org.junit.runners.ParentRunner$2.evaluate(ParentRunner.java:229)
	at org.junit.runners.ParentRunner.run(ParentRunner.java:309)
	at org.apache.maven.surefire.junit4.JUnit4Provider.execute(JUnit4Provider.java:264)
	at org.apache.maven.surefire.junit4.JUnit4Provider.executeTestSet(JUnit4Provider.java:153)
	at org.apache.maven.surefire.junit4.JUnit4Provider.invoke(JUnit4Provider.java:124)
	at org.apache.maven.surefire.booter.ForkedBooter.invokeProviderInSameClassLoader(ForkedBooter.java:200)
	at org.apache.maven.surefire.booter.ForkedBooter.runSuitesInProcess(ForkedBooter.java:153)
	at org.apache.maven.surefire.booter.ForkedBooter.main(ForkedBooter.java:103)

Jun 23, 2018 9:09:22 PM org.geotools.data.shapefile.shp.ShapefileReader <init>
WARNING: Could not open the .shx file, continuing assuming the .shp file is not sparse
java.io.FileNotFoundException: /home/hudson/genie.jts/.jenkins/jobs/GeoTools-Master/workspace/modules/plugin/shapefile/target/test-classes/org/geotools/data/shapefile/test-data/shapes/stream.shx (No such file or directory)
	at java.io.RandomAccessFile.open0(Native Method)
	at java.io.RandomAccessFile.open(RandomAccessFile.java:316)
	at java.io.RandomAccessFile.<init>(RandomAccessFile.java:243)
	at org.geotools.data.shapefile.files.ShpFiles.getReadChannel(ShpFiles.java:758)
	at org.geotools.data.shapefile.shp.IndexFile.<init>(IndexFile.java:72)
	at org.geotools.data.shapefile.shp.ShapefileReader.<init>(ShapefileReader.java:267)
	at org.geotools.data.shapefile.ShapefileSetManager.openShapeReader(ShapefileSetManager.java:48)
	at org.geotools.data.shapefile.ShapefileFeatureSource.getReaderInternal(ShapefileFeatureSource.java:369)
	at org.geotools.data.shapefile.ShapefileFeatureStore.getReaderInternal(ShapefileFeatureStore.java:132)
	at org.geotools.data.store.ContentFeatureSource.getReader(ContentFeatureSource.java:610)
	at org.geotools.data.store.ContentDataStore.getFeatureReader(ContentDataStore.java:363)
	at org.geotools.data.shapefile.ShapefileDataStore.getFeatureReader(ShapefileDataStore.java:240)
	at org.geotools.data.shapefile.ShapefileDataStoreTest.testGetCount(ShapefileDataStoreTest.java:1413)
	at sun.reflect.NativeMethodAccessorImpl.invoke0(Native Method)
	at sun.reflect.NativeMethodAccessorImpl.invoke(NativeMethodAccessorImpl.java:62)
	at sun.reflect.DelegatingMethodAccessorImpl.invoke(DelegatingMethodAccessorImpl.java:43)
	at java.lang.reflect.Method.invoke(Method.java:498)
	at org.junit.runners.model.FrameworkMethod$1.runReflectiveCall(FrameworkMethod.java:47)
	at org.junit.internal.runners.model.ReflectiveCallable.run(ReflectiveCallable.java:12)
	at org.junit.runners.model.FrameworkMethod.invokeExplosively(FrameworkMethod.java:44)
	at org.junit.internal.runners.statements.InvokeMethod.evaluate(InvokeMethod.java:17)
	at org.junit.internal.runners.statements.RunAfters.evaluate(RunAfters.java:27)
	at org.junit.runners.ParentRunner.runLeaf(ParentRunner.java:271)
	at org.junit.runners.BlockJUnit4ClassRunner.runChild(BlockJUnit4ClassRunner.java:70)
	at org.junit.runners.BlockJUnit4ClassRunner.runChild(BlockJUnit4ClassRunner.java:50)
	at org.junit.runners.ParentRunner$3.run(ParentRunner.java:238)
	at org.junit.runners.ParentRunner$1.schedule(ParentRunner.java:63)
	at org.junit.runners.ParentRunner.runChildren(ParentRunner.java:236)
	at org.junit.runners.ParentRunner.access$000(ParentRunner.java:53)
	at org.junit.runners.ParentRunner$2.evaluate(ParentRunner.java:229)
	at org.junit.runners.ParentRunner.run(ParentRunner.java:309)
	at org.apache.maven.surefire.junit4.JUnit4Provider.execute(JUnit4Provider.java:264)
	at org.apache.maven.surefire.junit4.JUnit4Provider.executeTestSet(JUnit4Provider.java:153)
	at org.apache.maven.surefire.junit4.JUnit4Provider.invoke(JUnit4Provider.java:124)
	at org.apache.maven.surefire.booter.ForkedBooter.invokeProviderInSameClassLoader(ForkedBooter.java:200)
	at org.apache.maven.surefire.booter.ForkedBooter.runSuitesInProcess(ForkedBooter.java:153)
	at org.apache.maven.surefire.booter.ForkedBooter.main(ForkedBooter.java:103)

Jun 23, 2018 9:09:22 PM org.geotools.data.shapefile.shp.ShapefileReader <init>
WARNING: Could not open the .shx file, continuing assuming the .shp file is not sparse
java.io.FileNotFoundException: /home/hudson/genie.jts/.jenkins/jobs/GeoTools-Master/workspace/modules/plugin/shapefile/target/test-classes/org/geotools/data/shapefile/test-data/shapes/stream.shx (No such file or directory)
	at java.io.RandomAccessFile.open0(Native Method)
	at java.io.RandomAccessFile.open(RandomAccessFile.java:316)
	at java.io.RandomAccessFile.<init>(RandomAccessFile.java:243)
	at org.geotools.data.shapefile.files.ShpFiles.getReadChannel(ShpFiles.java:758)
	at org.geotools.data.shapefile.shp.IndexFile.<init>(IndexFile.java:72)
	at org.geotools.data.shapefile.shp.ShapefileReader.<init>(ShapefileReader.java:267)
	at org.geotools.data.shapefile.ShapefileSetManager.openShapeReader(ShapefileSetManager.java:48)
	at org.geotools.data.shapefile.ShapefileFeatureSource.getCountInternal(ShapefileFeatureSource.java:290)
	at org.geotools.data.shapefile.ShapefileFeatureStore.getCountInternal(ShapefileFeatureStore.java:126)
	at org.geotools.data.store.ContentFeatureSource.getCount(ContentFeatureSource.java:464)
	at org.geotools.data.shapefile.ShapefileDataStore.getCount(ShapefileDataStore.java:245)
	at org.geotools.data.shapefile.ShapefileDataStoreTest.testGetCount(ShapefileDataStoreTest.java:1419)
	at sun.reflect.NativeMethodAccessorImpl.invoke0(Native Method)
	at sun.reflect.NativeMethodAccessorImpl.invoke(NativeMethodAccessorImpl.java:62)
	at sun.reflect.DelegatingMethodAccessorImpl.invoke(DelegatingMethodAccessorImpl.java:43)
	at java.lang.reflect.Method.invoke(Method.java:498)
	at org.junit.runners.model.FrameworkMethod$1.runReflectiveCall(FrameworkMethod.java:47)
	at org.junit.internal.runners.model.ReflectiveCallable.run(ReflectiveCallable.java:12)
	at org.junit.runners.model.FrameworkMethod.invokeExplosively(FrameworkMethod.java:44)
	at org.junit.internal.runners.statements.InvokeMethod.evaluate(InvokeMethod.java:17)
	at org.junit.internal.runners.statements.RunAfters.evaluate(RunAfters.java:27)
	at org.junit.runners.ParentRunner.runLeaf(ParentRunner.java:271)
	at org.junit.runners.BlockJUnit4ClassRunner.runChild(BlockJUnit4ClassRunner.java:70)
	at org.junit.runners.BlockJUnit4ClassRunner.runChild(BlockJUnit4ClassRunner.java:50)
	at org.junit.runners.ParentRunner$3.run(ParentRunner.java:238)
	at org.junit.runners.ParentRunner$1.schedule(ParentRunner.java:63)
	at org.junit.runners.ParentRunner.runChildren(ParentRunner.java:236)
	at org.junit.runners.ParentRunner.access$000(ParentRunner.java:53)
	at org.junit.runners.ParentRunner$2.evaluate(ParentRunner.java:229)
	at org.junit.runners.ParentRunner.run(ParentRunner.java:309)
	at org.apache.maven.surefire.junit4.JUnit4Provider.execute(JUnit4Provider.java:264)
	at org.apache.maven.surefire.junit4.JUnit4Provider.executeTestSet(JUnit4Provider.java:153)
	at org.apache.maven.surefire.junit4.JUnit4Provider.invoke(JUnit4Provider.java:124)
	at org.apache.maven.surefire.booter.ForkedBooter.invokeProviderInSameClassLoader(ForkedBooter.java:200)
	at org.apache.maven.surefire.booter.ForkedBooter.runSuitesInProcess(ForkedBooter.java:153)
	at org.apache.maven.surefire.booter.ForkedBooter.main(ForkedBooter.java:103)

Jun 23, 2018 9:09:22 PM org.geotools.data.shapefile.shp.ShapefileReader <init>
WARNING: Could not open the .shx file, continuing assuming the .shp file is not sparse
java.io.FileNotFoundException: /home/hudson/genie.jts/.jenkins/jobs/GeoTools-Master/workspace/modules/plugin/shapefile/target/test-classes/org/geotools/data/shapefile/test-data/shapes/stream.shx (No such file or directory)
	at java.io.RandomAccessFile.open0(Native Method)
	at java.io.RandomAccessFile.open(RandomAccessFile.java:316)
	at java.io.RandomAccessFile.<init>(RandomAccessFile.java:243)
	at org.geotools.data.shapefile.files.ShpFiles.getReadChannel(ShpFiles.java:758)
	at org.geotools.data.shapefile.shp.IndexFile.<init>(IndexFile.java:72)
	at org.geotools.data.shapefile.shp.ShapefileReader.<init>(ShapefileReader.java:267)
	at org.geotools.data.shapefile.ShapefileSetManager.openShapeReader(ShapefileSetManager.java:48)
	at org.geotools.data.shapefile.ShapefileFeatureSource.getCountInternal(ShapefileFeatureSource.java:290)
	at org.geotools.data.shapefile.ShapefileFeatureStore.getCountInternal(ShapefileFeatureStore.java:126)
	at org.geotools.data.store.ContentFeatureSource.getCount(ContentFeatureSource.java:464)
	at org.geotools.data.store.ContentFeatureCollection.size(ContentFeatureCollection.java:226)
	at org.geotools.data.shapefile.ShapefileDataStoreTest.testGetCount(ShapefileDataStoreTest.java:1424)
	at sun.reflect.NativeMethodAccessorImpl.invoke0(Native Method)
	at sun.reflect.NativeMethodAccessorImpl.invoke(NativeMethodAccessorImpl.java:62)
	at sun.reflect.DelegatingMethodAccessorImpl.invoke(DelegatingMethodAccessorImpl.java:43)
	at java.lang.reflect.Method.invoke(Method.java:498)
	at org.junit.runners.model.FrameworkMethod$1.runReflectiveCall(FrameworkMethod.java:47)
	at org.junit.internal.runners.model.ReflectiveCallable.run(ReflectiveCallable.java:12)
	at org.junit.runners.model.FrameworkMethod.invokeExplosively(FrameworkMethod.java:44)
	at org.junit.internal.runners.statements.InvokeMethod.evaluate(InvokeMethod.java:17)
	at org.junit.internal.runners.statements.RunAfters.evaluate(RunAfters.java:27)
	at org.junit.runners.ParentRunner.runLeaf(ParentRunner.java:271)
	at org.junit.runners.BlockJUnit4ClassRunner.runChild(BlockJUnit4ClassRunner.java:70)
	at org.junit.runners.BlockJUnit4ClassRunner.runChild(BlockJUnit4ClassRunner.java:50)
	at org.junit.runners.ParentRunner$3.run(ParentRunner.java:238)
	at org.junit.runners.ParentRunner$1.schedule(ParentRunner.java:63)
	at org.junit.runners.ParentRunner.runChildren(ParentRunner.java:236)
	at org.junit.runners.ParentRunner.access$000(ParentRunner.java:53)
	at org.junit.runners.ParentRunner$2.evaluate(ParentRunner.java:229)
	at org.junit.runners.ParentRunner.run(ParentRunner.java:309)
	at org.apache.maven.surefire.junit4.JUnit4Provider.execute(JUnit4Provider.java:264)
	at org.apache.maven.surefire.junit4.JUnit4Provider.executeTestSet(JUnit4Provider.java:153)
	at org.apache.maven.surefire.junit4.JUnit4Provider.invoke(JUnit4Provider.java:124)
	at org.apache.maven.surefire.booter.ForkedBooter.invokeProviderInSameClassLoader(ForkedBooter.java:200)
	at org.apache.maven.surefire.booter.ForkedBooter.runSuitesInProcess(ForkedBooter.java:153)
	at org.apache.maven.surefire.booter.ForkedBooter.main(ForkedBooter.java:103)

Jun 23, 2018 9:09:22 PM org.geotools.data.shapefile.shp.ShapefileReader <init>
WARNING: Could not open the .shx file, continuing assuming the .shp file is not sparse
java.io.FileNotFoundException: /home/hudson/genie.jts/.jenkins/jobs/GeoTools-Master/workspace/modules/plugin/shapefile/target/test-classes/org/geotools/data/shapefile/test-data/shapes/stream.shx (No such file or directory)
	at java.io.RandomAccessFile.open0(Native Method)
	at java.io.RandomAccessFile.open(RandomAccessFile.java:316)
	at java.io.RandomAccessFile.<init>(RandomAccessFile.java:243)
	at org.geotools.data.shapefile.files.ShpFiles.getReadChannel(ShpFiles.java:758)
	at org.geotools.data.shapefile.shp.IndexFile.<init>(IndexFile.java:72)
	at org.geotools.data.shapefile.shp.ShapefileReader.<init>(ShapefileReader.java:267)
	at org.geotools.data.shapefile.ShapefileSetManager.openShapeReader(ShapefileSetManager.java:48)
	at org.geotools.data.shapefile.ShapefileFeatureSource.getReaderInternal(ShapefileFeatureSource.java:369)
	at org.geotools.data.shapefile.ShapefileFeatureStore.getReaderInternal(ShapefileFeatureStore.java:132)
	at org.geotools.data.store.ContentFeatureSource.getReader(ContentFeatureSource.java:600)
	at org.geotools.data.store.ContentFeatureCollection.isEmpty(ContentFeatureCollection.java:312)
	at org.geotools.data.shapefile.ShapefileDataStoreTest.testGetCount(ShapefileDataStoreTest.java:1425)
	at sun.reflect.NativeMethodAccessorImpl.invoke0(Native Method)
	at sun.reflect.NativeMethodAccessorImpl.invoke(NativeMethodAccessorImpl.java:62)
	at sun.reflect.DelegatingMethodAccessorImpl.invoke(DelegatingMethodAccessorImpl.java:43)
	at java.lang.reflect.Method.invoke(Method.java:498)
	at org.junit.runners.model.FrameworkMethod$1.runReflectiveCall(FrameworkMethod.java:47)
	at org.junit.internal.runners.model.ReflectiveCallable.run(ReflectiveCallable.java:12)
	at org.junit.runners.model.FrameworkMethod.invokeExplosively(FrameworkMethod.java:44)
	at org.junit.internal.runners.statements.InvokeMethod.evaluate(InvokeMethod.java:17)
	at org.junit.internal.runners.statements.RunAfters.evaluate(RunAfters.java:27)
	at org.junit.runners.ParentRunner.runLeaf(ParentRunner.java:271)
	at org.junit.runners.BlockJUnit4ClassRunner.runChild(BlockJUnit4ClassRunner.java:70)
	at org.junit.runners.BlockJUnit4ClassRunner.runChild(BlockJUnit4ClassRunner.java:50)
	at org.junit.runners.ParentRunner$3.run(ParentRunner.java:238)
	at org.junit.runners.ParentRunner$1.schedule(ParentRunner.java:63)
	at org.junit.runners.ParentRunner.runChildren(ParentRunner.java:236)
	at org.junit.runners.ParentRunner.access$000(ParentRunner.java:53)
	at org.junit.runners.ParentRunner$2.evaluate(ParentRunner.java:229)
	at org.junit.runners.ParentRunner.run(ParentRunner.java:309)
	at org.apache.maven.surefire.junit4.JUnit4Provider.execute(JUnit4Provider.java:264)
	at org.apache.maven.surefire.junit4.JUnit4Provider.executeTestSet(JUnit4Provider.java:153)
	at org.apache.maven.surefire.junit4.JUnit4Provider.invoke(JUnit4Provider.java:124)
	at org.apache.maven.surefire.booter.ForkedBooter.invokeProviderInSameClassLoader(ForkedBooter.java:200)
	at org.apache.maven.surefire.booter.ForkedBooter.runSuitesInProcess(ForkedBooter.java:153)
	at org.apache.maven.surefire.booter.ForkedBooter.main(ForkedBooter.java:103)

Jun 23, 2018 9:09:22 PM org.geotools.data.shapefile.shp.ShapefileReader <init>
WARNING: Could not open the .shx file, continuing assuming the .shp file is not sparse
java.io.FileNotFoundException: /home/hudson/genie.jts/.jenkins/jobs/GeoTools-Master/workspace/modules/plugin/shapefile/target/test-classes/org/geotools/data/shapefile/test-data/shapes/stream.shx (No such file or directory)
	at java.io.RandomAccessFile.open0(Native Method)
	at java.io.RandomAccessFile.open(RandomAccessFile.java:316)
	at java.io.RandomAccessFile.<init>(RandomAccessFile.java:243)
	at org.geotools.data.shapefile.files.ShpFiles.getReadChannel(ShpFiles.java:758)
	at org.geotools.data.shapefile.shp.IndexFile.<init>(IndexFile.java:72)
	at org.geotools.data.shapefile.shp.ShapefileReader.<init>(ShapefileReader.java:267)
	at org.geotools.data.shapefile.ShapefileSetManager.openShapeReader(ShapefileSetManager.java:48)
	at org.geotools.data.shapefile.ShapefileFeatureSource.getReaderInternal(ShapefileFeatureSource.java:369)
	at org.geotools.data.shapefile.ShapefileFeatureStore.getReaderInternal(ShapefileFeatureStore.java:132)
	at org.geotools.data.store.ContentFeatureSource.getReader(ContentFeatureSource.java:610)
	at org.geotools.data.store.ContentFeatureCollection.size(ContentFeatureCollection.java:240)
	at org.geotools.data.shapefile.ShapefileDataStoreTest.testGetCount(ShapefileDataStoreTest.java:1440)
	at sun.reflect.NativeMethodAccessorImpl.invoke0(Native Method)
	at sun.reflect.NativeMethodAccessorImpl.invoke(NativeMethodAccessorImpl.java:62)
	at sun.reflect.DelegatingMethodAccessorImpl.invoke(DelegatingMethodAccessorImpl.java:43)
	at java.lang.reflect.Method.invoke(Method.java:498)
	at org.junit.runners.model.FrameworkMethod$1.runReflectiveCall(FrameworkMethod.java:47)
	at org.junit.internal.runners.model.ReflectiveCallable.run(ReflectiveCallable.java:12)
	at org.junit.runners.model.FrameworkMethod.invokeExplosively(FrameworkMethod.java:44)
	at org.junit.internal.runners.statements.InvokeMethod.evaluate(InvokeMethod.java:17)
	at org.junit.internal.runners.statements.RunAfters.evaluate(RunAfters.java:27)
	at org.junit.runners.ParentRunner.runLeaf(ParentRunner.java:271)
	at org.junit.runners.BlockJUnit4ClassRunner.runChild(BlockJUnit4ClassRunner.java:70)
	at org.junit.runners.BlockJUnit4ClassRunner.runChild(BlockJUnit4ClassRunner.java:50)
	at org.junit.runners.ParentRunner$3.run(ParentRunner.java:238)
	at org.junit.runners.ParentRunner$1.schedule(ParentRunner.java:63)
	at org.junit.runners.ParentRunner.runChildren(ParentRunner.java:236)
	at org.junit.runners.ParentRunner.access$000(ParentRunner.java:53)
	at org.junit.runners.ParentRunner$2.evaluate(ParentRunner.java:229)
	at org.junit.runners.ParentRunner.run(ParentRunner.java:309)
	at org.apache.maven.surefire.junit4.JUnit4Provider.execute(JUnit4Provider.java:264)
	at org.apache.maven.surefire.junit4.JUnit4Provider.executeTestSet(JUnit4Provider.java:153)
	at org.apache.maven.surefire.junit4.JUnit4Provider.invoke(JUnit4Provider.java:124)
	at org.apache.maven.surefire.booter.ForkedBooter.invokeProviderInSameClassLoader(ForkedBooter.java:200)
	at org.apache.maven.surefire.booter.ForkedBooter.runSuitesInProcess(ForkedBooter.java:153)
	at org.apache.maven.surefire.booter.ForkedBooter.main(ForkedBooter.java:103)

Jun 23, 2018 9:09:22 PM org.geotools.data.shapefile.shp.ShapefileReader <init>
WARNING: Could not open the .shx file, continuing assuming the .shp file is not sparse
java.io.FileNotFoundException: /home/hudson/genie.jts/.jenkins/jobs/GeoTools-Master/workspace/modules/plugin/shapefile/target/test-classes/org/geotools/data/shapefile/test-data/shapes/stream.shx (No such file or directory)
	at java.io.RandomAccessFile.open0(Native Method)
	at java.io.RandomAccessFile.open(RandomAccessFile.java:316)
	at java.io.RandomAccessFile.<init>(RandomAccessFile.java:243)
	at org.geotools.data.shapefile.files.ShpFiles.getReadChannel(ShpFiles.java:758)
	at org.geotools.data.shapefile.shp.IndexFile.<init>(IndexFile.java:72)
	at org.geotools.data.shapefile.shp.ShapefileReader.<init>(ShapefileReader.java:267)
	at org.geotools.data.shapefile.ShapefileSetManager.openShapeReader(ShapefileSetManager.java:48)
	at org.geotools.data.shapefile.ShapefileFeatureSource.getReaderInternal(ShapefileFeatureSource.java:369)
	at org.geotools.data.shapefile.ShapefileFeatureStore.getReaderInternal(ShapefileFeatureStore.java:132)
	at org.geotools.data.store.ContentFeatureSource.getReader(ContentFeatureSource.java:610)
	at org.geotools.data.store.ContentFeatureCollection.isEmpty(ContentFeatureCollection.java:312)
	at org.geotools.data.shapefile.ShapefileDataStoreTest.testGetCount(ShapefileDataStoreTest.java:1441)
	at sun.reflect.NativeMethodAccessorImpl.invoke0(Native Method)
	at sun.reflect.NativeMethodAccessorImpl.invoke(NativeMethodAccessorImpl.java:62)
	at sun.reflect.DelegatingMethodAccessorImpl.invoke(DelegatingMethodAccessorImpl.java:43)
	at java.lang.reflect.Method.invoke(Method.java:498)
	at org.junit.runners.model.FrameworkMethod$1.runReflectiveCall(FrameworkMethod.java:47)
	at org.junit.internal.runners.model.ReflectiveCallable.run(ReflectiveCallable.java:12)
	at org.junit.runners.model.FrameworkMethod.invokeExplosively(FrameworkMethod.java:44)
	at org.junit.internal.runners.statements.InvokeMethod.evaluate(InvokeMethod.java:17)
	at org.junit.internal.runners.statements.RunAfters.evaluate(RunAfters.java:27)
	at org.junit.runners.ParentRunner.runLeaf(ParentRunner.java:271)
	at org.junit.runners.BlockJUnit4ClassRunner.runChild(BlockJUnit4ClassRunner.java:70)
	at org.junit.runners.BlockJUnit4ClassRunner.runChild(BlockJUnit4ClassRunner.java:50)
	at org.junit.runners.ParentRunner$3.run(ParentRunner.java:238)
	at org.junit.runners.ParentRunner$1.schedule(ParentRunner.java:63)
	at org.junit.runners.ParentRunner.runChildren(ParentRunner.java:236)
	at org.junit.runners.ParentRunner.access$000(ParentRunner.java:53)
	at org.junit.runners.ParentRunner$2.evaluate(ParentRunner.java:229)
	at org.junit.runners.ParentRunner.run(ParentRunner.java:309)
	at org.apache.maven.surefire.junit4.JUnit4Provider.execute(JUnit4Provider.java:264)
	at org.apache.maven.surefire.junit4.JUnit4Provider.executeTestSet(JUnit4Provider.java:153)
	at org.apache.maven.surefire.junit4.JUnit4Provider.invoke(JUnit4Provider.java:124)
	at org.apache.maven.surefire.booter.ForkedBooter.invokeProviderInSameClassLoader(ForkedBooter.java:200)
	at org.apache.maven.surefire.booter.ForkedBooter.runSuitesInProcess(ForkedBooter.java:153)
	at org.apache.maven.surefire.booter.ForkedBooter.main(ForkedBooter.java:103)

Jun 23, 2018 9:09:22 PM org.geotools.data.shapefile.shp.ShapefileReader <init>
WARNING: Could not open the .shx file, continuing assuming the .shp file is not sparse
java.io.FileNotFoundException: /home/hudson/genie.jts/.jenkins/jobs/GeoTools-Master/workspace/modules/plugin/shapefile/target/test-classes/org/geotools/data/shapefile/test-data/shapes/stream.shx (No such file or directory)
	at java.io.RandomAccessFile.open0(Native Method)
	at java.io.RandomAccessFile.open(RandomAccessFile.java:316)
	at java.io.RandomAccessFile.<init>(RandomAccessFile.java:243)
	at org.geotools.data.shapefile.files.ShpFiles.getReadChannel(ShpFiles.java:758)
	at org.geotools.data.shapefile.shp.IndexFile.<init>(IndexFile.java:72)
	at org.geotools.data.shapefile.shp.ShapefileReader.<init>(ShapefileReader.java:267)
	at org.geotools.data.shapefile.ShapefileSetManager.openShapeReader(ShapefileSetManager.java:48)
	at org.geotools.data.shapefile.ShapefileFeatureSource.getCountInternal(ShapefileFeatureSource.java:290)
	at org.geotools.data.shapefile.ShapefileFeatureStore.getCountInternal(ShapefileFeatureStore.java:126)
	at org.geotools.data.store.ContentFeatureSource.getCount(ContentFeatureSource.java:464)
	at org.geotools.data.store.ContentFeatureCollection.size(ContentFeatureCollection.java:226)
	at org.geotools.data.shapefile.ShapefileDataStoreTest.testGetCount(ShapefileDataStoreTest.java:1448)
	at sun.reflect.NativeMethodAccessorImpl.invoke0(Native Method)
	at sun.reflect.NativeMethodAccessorImpl.invoke(NativeMethodAccessorImpl.java:62)
	at sun.reflect.DelegatingMethodAccessorImpl.invoke(DelegatingMethodAccessorImpl.java:43)
	at java.lang.reflect.Method.invoke(Method.java:498)
	at org.junit.runners.model.FrameworkMethod$1.runReflectiveCall(FrameworkMethod.java:47)
	at org.junit.internal.runners.model.ReflectiveCallable.run(ReflectiveCallable.java:12)
	at org.junit.runners.model.FrameworkMethod.invokeExplosively(FrameworkMethod.java:44)
	at org.junit.internal.runners.statements.InvokeMethod.evaluate(InvokeMethod.java:17)
	at org.junit.internal.runners.statements.RunAfters.evaluate(RunAfters.java:27)
	at org.junit.runners.ParentRunner.runLeaf(ParentRunner.java:271)
	at org.junit.runners.BlockJUnit4ClassRunner.runChild(BlockJUnit4ClassRunner.java:70)
	at org.junit.runners.BlockJUnit4ClassRunner.runChild(BlockJUnit4ClassRunner.java:50)
	at org.junit.runners.ParentRunner$3.run(ParentRunner.java:238)
	at org.junit.runners.ParentRunner$1.schedule(ParentRunner.java:63)
	at org.junit.runners.ParentRunner.runChildren(ParentRunner.java:236)
	at org.junit.runners.ParentRunner.access$000(ParentRunner.java:53)
	at org.junit.runners.ParentRunner$2.evaluate(ParentRunner.java:229)
	at org.junit.runners.ParentRunner.run(ParentRunner.java:309)
	at org.apache.maven.surefire.junit4.JUnit4Provider.execute(JUnit4Provider.java:264)
	at org.apache.maven.surefire.junit4.JUnit4Provider.executeTestSet(JUnit4Provider.java:153)
	at org.apache.maven.surefire.junit4.JUnit4Provider.invoke(JUnit4Provider.java:124)
	at org.apache.maven.surefire.booter.ForkedBooter.invokeProviderInSameClassLoader(ForkedBooter.java:200)
	at org.apache.maven.surefire.booter.ForkedBooter.runSuitesInProcess(ForkedBooter.java:153)
	at org.apache.maven.surefire.booter.ForkedBooter.main(ForkedBooter.java:103)

Jun 23, 2018 9:09:22 PM org.geotools.data.shapefile.shp.ShapefileReader <init>
WARNING: Could not open the .shx file, continuing assuming the .shp file is not sparse
java.io.FileNotFoundException: /home/hudson/genie.jts/.jenkins/jobs/GeoTools-Master/workspace/modules/plugin/shapefile/target/test-classes/org/geotools/data/shapefile/test-data/shapes/stream.shx (No such file or directory)
	at java.io.RandomAccessFile.open0(Native Method)
	at java.io.RandomAccessFile.open(RandomAccessFile.java:316)
	at java.io.RandomAccessFile.<init>(RandomAccessFile.java:243)
	at org.geotools.data.shapefile.files.ShpFiles.getReadChannel(ShpFiles.java:758)
	at org.geotools.data.shapefile.shp.IndexFile.<init>(IndexFile.java:72)
	at org.geotools.data.shapefile.shp.ShapefileReader.<init>(ShapefileReader.java:267)
	at org.geotools.data.shapefile.ShapefileSetManager.openShapeReader(ShapefileSetManager.java:48)
	at org.geotools.data.shapefile.ShapefileFeatureSource.getCountInternal(ShapefileFeatureSource.java:290)
	at org.geotools.data.shapefile.ShapefileFeatureStore.getCountInternal(ShapefileFeatureStore.java:126)
	at org.geotools.data.store.ContentFeatureSource.getCount(ContentFeatureSource.java:464)
	at org.geotools.data.shapefile.ShapefileDataStoreTest.testGetCount(ShapefileDataStoreTest.java:1449)
	at sun.reflect.NativeMethodAccessorImpl.invoke0(Native Method)
	at sun.reflect.NativeMethodAccessorImpl.invoke(NativeMethodAccessorImpl.java:62)
	at sun.reflect.DelegatingMethodAccessorImpl.invoke(DelegatingMethodAccessorImpl.java:43)
	at java.lang.reflect.Method.invoke(Method.java:498)
	at org.junit.runners.model.FrameworkMethod$1.runReflectiveCall(FrameworkMethod.java:47)
	at org.junit.internal.runners.model.ReflectiveCallable.run(ReflectiveCallable.java:12)
	at org.junit.runners.model.FrameworkMethod.invokeExplosively(FrameworkMethod.java:44)
	at org.junit.internal.runners.statements.InvokeMethod.evaluate(InvokeMethod.java:17)
	at org.junit.internal.runners.statements.RunAfters.evaluate(RunAfters.java:27)
	at org.junit.runners.ParentRunner.runLeaf(ParentRunner.java:271)
	at org.junit.runners.BlockJUnit4ClassRunner.runChild(BlockJUnit4ClassRunner.java:70)
	at org.junit.runners.BlockJUnit4ClassRunner.runChild(BlockJUnit4ClassRunner.java:50)
	at org.junit.runners.ParentRunner$3.run(ParentRunner.java:238)
	at org.junit.runners.ParentRunner$1.schedule(ParentRunner.java:63)
	at org.junit.runners.ParentRunner.runChildren(ParentRunner.java:236)
	at org.junit.runners.ParentRunner.access$000(ParentRunner.java:53)
	at org.junit.runners.ParentRunner$2.evaluate(ParentRunner.java:229)
	at org.junit.runners.ParentRunner.run(ParentRunner.java:309)
	at org.apache.maven.surefire.junit4.JUnit4Provider.execute(JUnit4Provider.java:264)
	at org.apache.maven.surefire.junit4.JUnit4Provider.executeTestSet(JUnit4Provider.java:153)
	at org.apache.maven.surefire.junit4.JUnit4Provider.invoke(JUnit4Provider.java:124)
	at org.apache.maven.surefire.booter.ForkedBooter.invokeProviderInSameClassLoader(ForkedBooter.java:200)
	at org.apache.maven.surefire.booter.ForkedBooter.runSuitesInProcess(ForkedBooter.java:153)
	at org.apache.maven.surefire.booter.ForkedBooter.main(ForkedBooter.java:103)

Jun 23, 2018 9:09:22 PM org.geotools.data.shapefile.shp.ShapefileReader <init>
WARNING: Could not open the .shx file, continuing assuming the .shp file is not sparse
java.io.FileNotFoundException: /home/hudson/genie.jts/.jenkins/jobs/GeoTools-Master/workspace/modules/plugin/shapefile/target/test-classes/org/geotools/data/shapefile/test-data/shapes/stream.shx (No such file or directory)
	at java.io.RandomAccessFile.open0(Native Method)
	at java.io.RandomAccessFile.open(RandomAccessFile.java:316)
	at java.io.RandomAccessFile.<init>(RandomAccessFile.java:243)
	at org.geotools.data.shapefile.files.ShpFiles.getReadChannel(ShpFiles.java:758)
	at org.geotools.data.shapefile.shp.IndexFile.<init>(IndexFile.java:72)
	at org.geotools.data.shapefile.shp.ShapefileReader.<init>(ShapefileReader.java:267)
	at org.geotools.data.shapefile.ShapefileSetManager.openShapeReader(ShapefileSetManager.java:48)
	at org.geotools.data.shapefile.ShapefileFeatureSource.getCountInternal(ShapefileFeatureSource.java:290)
	at org.geotools.data.shapefile.ShapefileFeatureStore.getCountInternal(ShapefileFeatureStore.java:126)
	at org.geotools.data.store.ContentFeatureSource.getCount(ContentFeatureSource.java:464)
	at org.geotools.data.store.ContentFeatureCollection.size(ContentFeatureCollection.java:226)
	at org.geotools.data.shapefile.ShapefileDataStoreTest.testGetCount(ShapefileDataStoreTest.java:1456)
	at sun.reflect.NativeMethodAccessorImpl.invoke0(Native Method)
	at sun.reflect.NativeMethodAccessorImpl.invoke(NativeMethodAccessorImpl.java:62)
	at sun.reflect.DelegatingMethodAccessorImpl.invoke(DelegatingMethodAccessorImpl.java:43)
	at java.lang.reflect.Method.invoke(Method.java:498)
	at org.junit.runners.model.FrameworkMethod$1.runReflectiveCall(FrameworkMethod.java:47)
	at org.junit.internal.runners.model.ReflectiveCallable.run(ReflectiveCallable.java:12)
	at org.junit.runners.model.FrameworkMethod.invokeExplosively(FrameworkMethod.java:44)
	at org.junit.internal.runners.statements.InvokeMethod.evaluate(InvokeMethod.java:17)
	at org.junit.internal.runners.statements.RunAfters.evaluate(RunAfters.java:27)
	at org.junit.runners.ParentRunner.runLeaf(ParentRunner.java:271)
	at org.junit.runners.BlockJUnit4ClassRunner.runChild(BlockJUnit4ClassRunner.java:70)
	at org.junit.runners.BlockJUnit4ClassRunner.runChild(BlockJUnit4ClassRunner.java:50)
	at org.junit.runners.ParentRunner$3.run(ParentRunner.java:238)
	at org.junit.runners.ParentRunner$1.schedule(ParentRunner.java:63)
	at org.junit.runners.ParentRunner.runChildren(ParentRunner.java:236)
	at org.junit.runners.ParentRunner.access$000(ParentRunner.java:53)
	at org.junit.runners.ParentRunner$2.evaluate(ParentRunner.java:229)
	at org.junit.runners.ParentRunner.run(ParentRunner.java:309)
	at org.apache.maven.surefire.junit4.JUnit4Provider.execute(JUnit4Provider.java:264)
	at org.apache.maven.surefire.junit4.JUnit4Provider.executeTestSet(JUnit4Provider.java:153)
	at org.apache.maven.surefire.junit4.JUnit4Provider.invoke(JUnit4Provider.java:124)
	at org.apache.maven.surefire.booter.ForkedBooter.invokeProviderInSameClassLoader(ForkedBooter.java:200)
	at org.apache.maven.surefire.booter.ForkedBooter.runSuitesInProcess(ForkedBooter.java:153)
	at org.apache.maven.surefire.booter.ForkedBooter.main(ForkedBooter.java:103)

Jun 23, 2018 9:09:22 PM org.geotools.data.shapefile.shp.ShapefileReader <init>
WARNING: Could not open the .shx file, continuing assuming the .shp file is not sparse
java.io.FileNotFoundException: /home/hudson/genie.jts/.jenkins/jobs/GeoTools-Master/workspace/modules/plugin/shapefile/target/test-classes/org/geotools/data/shapefile/test-data/shapes/stream.shx (No such file or directory)
	at java.io.RandomAccessFile.open0(Native Method)
	at java.io.RandomAccessFile.open(RandomAccessFile.java:316)
	at java.io.RandomAccessFile.<init>(RandomAccessFile.java:243)
	at org.geotools.data.shapefile.files.ShpFiles.getReadChannel(ShpFiles.java:758)
	at org.geotools.data.shapefile.shp.IndexFile.<init>(IndexFile.java:72)
	at org.geotools.data.shapefile.shp.ShapefileReader.<init>(ShapefileReader.java:267)
	at org.geotools.data.shapefile.ShapefileSetManager.openShapeReader(ShapefileSetManager.java:48)
	at org.geotools.data.shapefile.ShapefileFeatureSource.getCountInternal(ShapefileFeatureSource.java:290)
	at org.geotools.data.shapefile.ShapefileFeatureStore.getCountInternal(ShapefileFeatureStore.java:126)
	at org.geotools.data.store.ContentFeatureSource.getCount(ContentFeatureSource.java:464)
	at org.geotools.data.shapefile.ShapefileDataStoreTest.testGetCount(ShapefileDataStoreTest.java:1457)
	at sun.reflect.NativeMethodAccessorImpl.invoke0(Native Method)
	at sun.reflect.NativeMethodAccessorImpl.invoke(NativeMethodAccessorImpl.java:62)
	at sun.reflect.DelegatingMethodAccessorImpl.invoke(DelegatingMethodAccessorImpl.java:43)
	at java.lang.reflect.Method.invoke(Method.java:498)
	at org.junit.runners.model.FrameworkMethod$1.runReflectiveCall(FrameworkMethod.java:47)
	at org.junit.internal.runners.model.ReflectiveCallable.run(ReflectiveCallable.java:12)
	at org.junit.runners.model.FrameworkMethod.invokeExplosively(FrameworkMethod.java:44)
	at org.junit.internal.runners.statements.InvokeMethod.evaluate(InvokeMethod.java:17)
	at org.junit.internal.runners.statements.RunAfters.evaluate(RunAfters.java:27)
	at org.junit.runners.ParentRunner.runLeaf(ParentRunner.java:271)
	at org.junit.runners.BlockJUnit4ClassRunner.runChild(BlockJUnit4ClassRunner.java:70)
	at org.junit.runners.BlockJUnit4ClassRunner.runChild(BlockJUnit4ClassRunner.java:50)
	at org.junit.runners.ParentRunner$3.run(ParentRunner.java:238)
	at org.junit.runners.ParentRunner$1.schedule(ParentRunner.java:63)
	at org.junit.runners.ParentRunner.runChildren(ParentRunner.java:236)
	at org.junit.runners.ParentRunner.access$000(ParentRunner.java:53)
	at org.junit.runners.ParentRunner$2.evaluate(ParentRunner.java:229)
	at org.junit.runners.ParentRunner.run(ParentRunner.java:309)
	at org.apache.maven.surefire.junit4.JUnit4Provider.execute(JUnit4Provider.java:264)
	at org.apache.maven.surefire.junit4.JUnit4Provider.executeTestSet(JUnit4Provider.java:153)
	at org.apache.maven.surefire.junit4.JUnit4Provider.invoke(JUnit4Provider.java:124)
	at org.apache.maven.surefire.booter.ForkedBooter.invokeProviderInSameClassLoader(ForkedBooter.java:200)
	at org.apache.maven.surefire.booter.ForkedBooter.runSuitesInProcess(ForkedBooter.java:153)
	at org.apache.maven.surefire.booter.ForkedBooter.main(ForkedBooter.java:103)

Jun 23, 2018 9:09:22 PM org.geotools.data.shapefile.shp.ShapefileReader <init>
WARNING: Could not open the .shx file, continuing assuming the .shp file is not sparse
java.io.FileNotFoundException: /home/hudson/genie.jts/.jenkins/jobs/GeoTools-Master/workspace/modules/plugin/shapefile/target/test-classes/org/geotools/data/shapefile/test-data/shapes/stream.shx (No such file or directory)
	at java.io.RandomAccessFile.open0(Native Method)
	at java.io.RandomAccessFile.open(RandomAccessFile.java:316)
	at java.io.RandomAccessFile.<init>(RandomAccessFile.java:243)
	at org.geotools.data.shapefile.files.ShpFiles.getReadChannel(ShpFiles.java:758)
	at org.geotools.data.shapefile.shp.IndexFile.<init>(IndexFile.java:72)
	at org.geotools.data.shapefile.shp.ShapefileReader.<init>(ShapefileReader.java:267)
	at org.geotools.data.shapefile.ShapefileSetManager.openShapeReader(ShapefileSetManager.java:48)
	at org.geotools.data.shapefile.ShapefileFeatureSource.getCountInternal(ShapefileFeatureSource.java:290)
	at org.geotools.data.shapefile.ShapefileFeatureStore.getCountInternal(ShapefileFeatureStore.java:126)
	at org.geotools.data.store.ContentFeatureSource.getCount(ContentFeatureSource.java:464)
	at org.geotools.data.store.ContentFeatureCollection.size(ContentFeatureCollection.java:226)
	at org.geotools.data.shapefile.ShapefileDataStoreTest.testGetCount(ShapefileDataStoreTest.java:1465)
	at sun.reflect.NativeMethodAccessorImpl.invoke0(Native Method)
	at sun.reflect.NativeMethodAccessorImpl.invoke(NativeMethodAccessorImpl.java:62)
	at sun.reflect.DelegatingMethodAccessorImpl.invoke(DelegatingMethodAccessorImpl.java:43)
	at java.lang.reflect.Method.invoke(Method.java:498)
	at org.junit.runners.model.FrameworkMethod$1.runReflectiveCall(FrameworkMethod.java:47)
	at org.junit.internal.runners.model.ReflectiveCallable.run(ReflectiveCallable.java:12)
	at org.junit.runners.model.FrameworkMethod.invokeExplosively(FrameworkMethod.java:44)
	at org.junit.internal.runners.statements.InvokeMethod.evaluate(InvokeMethod.java:17)
	at org.junit.internal.runners.statements.RunAfters.evaluate(RunAfters.java:27)
	at org.junit.runners.ParentRunner.runLeaf(ParentRunner.java:271)
	at org.junit.runners.BlockJUnit4ClassRunner.runChild(BlockJUnit4ClassRunner.java:70)
	at org.junit.runners.BlockJUnit4ClassRunner.runChild(BlockJUnit4ClassRunner.java:50)
	at org.junit.runners.ParentRunner$3.run(ParentRunner.java:238)
	at org.junit.runners.ParentRunner$1.schedule(ParentRunner.java:63)
	at org.junit.runners.ParentRunner.runChildren(ParentRunner.java:236)
	at org.junit.runners.ParentRunner.access$000(ParentRunner.java:53)
	at org.junit.runners.ParentRunner$2.evaluate(ParentRunner.java:229)
	at org.junit.runners.ParentRunner.run(ParentRunner.java:309)
	at org.apache.maven.surefire.junit4.JUnit4Provider.execute(JUnit4Provider.java:264)
	at org.apache.maven.surefire.junit4.JUnit4Provider.executeTestSet(JUnit4Provider.java:153)
	at org.apache.maven.surefire.junit4.JUnit4Provider.invoke(JUnit4Provider.java:124)
	at org.apache.maven.surefire.booter.ForkedBooter.invokeProviderInSameClassLoader(ForkedBooter.java:200)
	at org.apache.maven.surefire.booter.ForkedBooter.runSuitesInProcess(ForkedBooter.java:153)
	at org.apache.maven.surefire.booter.ForkedBooter.main(ForkedBooter.java:103)

Jun 23, 2018 9:09:22 PM org.geotools.data.shapefile.shp.ShapefileReader <init>
WARNING: Could not open the .shx file, continuing assuming the .shp file is not sparse
java.io.FileNotFoundException: /home/hudson/genie.jts/.jenkins/jobs/GeoTools-Master/workspace/modules/plugin/shapefile/target/test-classes/org/geotools/data/shapefile/test-data/shapes/stream.shx (No such file or directory)
	at java.io.RandomAccessFile.open0(Native Method)
	at java.io.RandomAccessFile.open(RandomAccessFile.java:316)
	at java.io.RandomAccessFile.<init>(RandomAccessFile.java:243)
	at org.geotools.data.shapefile.files.ShpFiles.getReadChannel(ShpFiles.java:758)
	at org.geotools.data.shapefile.shp.IndexFile.<init>(IndexFile.java:72)
	at org.geotools.data.shapefile.shp.ShapefileReader.<init>(ShapefileReader.java:267)
	at org.geotools.data.shapefile.ShapefileSetManager.openShapeReader(ShapefileSetManager.java:48)
	at org.geotools.data.shapefile.ShapefileFeatureSource.getCountInternal(ShapefileFeatureSource.java:290)
	at org.geotools.data.shapefile.ShapefileFeatureStore.getCountInternal(ShapefileFeatureStore.java:126)
	at org.geotools.data.store.ContentFeatureSource.getCount(ContentFeatureSource.java:464)
	at org.geotools.data.shapefile.ShapefileDataStoreTest.testGetCount(ShapefileDataStoreTest.java:1466)
	at sun.reflect.NativeMethodAccessorImpl.invoke0(Native Method)
	at sun.reflect.NativeMethodAccessorImpl.invoke(NativeMethodAccessorImpl.java:62)
	at sun.reflect.DelegatingMethodAccessorImpl.invoke(DelegatingMethodAccessorImpl.java:43)
	at java.lang.reflect.Method.invoke(Method.java:498)
	at org.junit.runners.model.FrameworkMethod$1.runReflectiveCall(FrameworkMethod.java:47)
	at org.junit.internal.runners.model.ReflectiveCallable.run(ReflectiveCallable.java:12)
	at org.junit.runners.model.FrameworkMethod.invokeExplosively(FrameworkMethod.java:44)
	at org.junit.internal.runners.statements.InvokeMethod.evaluate(InvokeMethod.java:17)
	at org.junit.internal.runners.statements.RunAfters.evaluate(RunAfters.java:27)
	at org.junit.runners.ParentRunner.runLeaf(ParentRunner.java:271)
	at org.junit.runners.BlockJUnit4ClassRunner.runChild(BlockJUnit4ClassRunner.java:70)
	at org.junit.runners.BlockJUnit4ClassRunner.runChild(BlockJUnit4ClassRunner.java:50)
	at org.junit.runners.ParentRunner$3.run(ParentRunner.java:238)
	at org.junit.runners.ParentRunner$1.schedule(ParentRunner.java:63)
	at org.junit.runners.ParentRunner.runChildren(ParentRunner.java:236)
	at org.junit.runners.ParentRunner.access$000(ParentRunner.java:53)
	at org.junit.runners.ParentRunner$2.evaluate(ParentRunner.java:229)
	at org.junit.runners.ParentRunner.run(ParentRunner.java:309)
	at org.apache.maven.surefire.junit4.JUnit4Provider.execute(JUnit4Provider.java:264)
	at org.apache.maven.surefire.junit4.JUnit4Provider.executeTestSet(JUnit4Provider.java:153)
	at org.apache.maven.surefire.junit4.JUnit4Provider.invoke(JUnit4Provider.java:124)
	at org.apache.maven.surefire.booter.ForkedBooter.invokeProviderInSameClassLoader(ForkedBooter.java:200)
	at org.apache.maven.surefire.booter.ForkedBooter.runSuitesInProcess(ForkedBooter.java:153)
	at org.apache.maven.surefire.booter.ForkedBooter.main(ForkedBooter.java:103)

Jun 23, 2018 9:09:22 PM org.geotools.data.shapefile.shp.ShapefileReader <init>
WARNING: Could not open the .shx file, continuing assuming the .shp file is not sparse
java.io.FileNotFoundException: /home/hudson/genie.jts/.jenkins/jobs/GeoTools-Master/workspace/modules/plugin/shapefile/target/test-classes/org/geotools/data/shapefile/test-data/shapes/stream.shx (No such file or directory)
	at java.io.RandomAccessFile.open0(Native Method)
	at java.io.RandomAccessFile.open(RandomAccessFile.java:316)
	at java.io.RandomAccessFile.<init>(RandomAccessFile.java:243)
	at org.geotools.data.shapefile.files.ShpFiles.getReadChannel(ShpFiles.java:758)
	at org.geotools.data.shapefile.shp.IndexFile.<init>(IndexFile.java:72)
	at org.geotools.data.shapefile.shp.ShapefileReader.<init>(ShapefileReader.java:267)
	at org.geotools.data.shapefile.ShapefileSetManager.openShapeReader(ShapefileSetManager.java:48)
	at org.geotools.data.shapefile.ShapefileFeatureSource.getReaderInternal(ShapefileFeatureSource.java:369)
	at org.geotools.data.shapefile.ShapefileFeatureStore.getReaderInternal(ShapefileFeatureStore.java:132)
	at org.geotools.data.store.ContentFeatureSource.getReader(ContentFeatureSource.java:600)
	at org.geotools.data.store.ContentFeatureCollection.size(ContentFeatureCollection.java:240)
	at org.geotools.data.shapefile.ShapefileDataStoreTest.testGetCount(ShapefileDataStoreTest.java:1481)
	at sun.reflect.NativeMethodAccessorImpl.invoke0(Native Method)
	at sun.reflect.NativeMethodAccessorImpl.invoke(NativeMethodAccessorImpl.java:62)
	at sun.reflect.DelegatingMethodAccessorImpl.invoke(DelegatingMethodAccessorImpl.java:43)
	at java.lang.reflect.Method.invoke(Method.java:498)
	at org.junit.runners.model.FrameworkMethod$1.runReflectiveCall(FrameworkMethod.java:47)
	at org.junit.internal.runners.model.ReflectiveCallable.run(ReflectiveCallable.java:12)
	at org.junit.runners.model.FrameworkMethod.invokeExplosively(FrameworkMethod.java:44)
	at org.junit.internal.runners.statements.InvokeMethod.evaluate(InvokeMethod.java:17)
	at org.junit.internal.runners.statements.RunAfters.evaluate(RunAfters.java:27)
	at org.junit.runners.ParentRunner.runLeaf(ParentRunner.java:271)
	at org.junit.runners.BlockJUnit4ClassRunner.runChild(BlockJUnit4ClassRunner.java:70)
	at org.junit.runners.BlockJUnit4ClassRunner.runChild(BlockJUnit4ClassRunner.java:50)
	at org.junit.runners.ParentRunner$3.run(ParentRunner.java:238)
	at org.junit.runners.ParentRunner$1.schedule(ParentRunner.java:63)
	at org.junit.runners.ParentRunner.runChildren(ParentRunner.java:236)
	at org.junit.runners.ParentRunner.access$000(ParentRunner.java:53)
	at org.junit.runners.ParentRunner$2.evaluate(ParentRunner.java:229)
	at org.junit.runners.ParentRunner.run(ParentRunner.java:309)
	at org.apache.maven.surefire.junit4.JUnit4Provider.execute(JUnit4Provider.java:264)
	at org.apache.maven.surefire.junit4.JUnit4Provider.executeTestSet(JUnit4Provider.java:153)
	at org.apache.maven.surefire.junit4.JUnit4Provider.invoke(JUnit4Provider.java:124)
	at org.apache.maven.surefire.booter.ForkedBooter.invokeProviderInSameClassLoader(ForkedBooter.java:200)
	at org.apache.maven.surefire.booter.ForkedBooter.runSuitesInProcess(ForkedBooter.java:153)
	at org.apache.maven.surefire.booter.ForkedBooter.main(ForkedBooter.java:103)

Jun 23, 2018 9:09:22 PM org.geotools.data.shapefile.shp.ShapefileReader <init>
WARNING: Could not open the .shx file, continuing assuming the .shp file is not sparse
java.io.FileNotFoundException: /home/hudson/genie.jts/.jenkins/jobs/GeoTools-Master/workspace/modules/plugin/shapefile/target/test-classes/org/geotools/data/shapefile/test-data/shapes/stream.shx (No such file or directory)
	at java.io.RandomAccessFile.open0(Native Method)
	at java.io.RandomAccessFile.open(RandomAccessFile.java:316)
	at java.io.RandomAccessFile.<init>(RandomAccessFile.java:243)
	at org.geotools.data.shapefile.files.ShpFiles.getReadChannel(ShpFiles.java:758)
	at org.geotools.data.shapefile.shp.IndexFile.<init>(IndexFile.java:72)
	at org.geotools.data.shapefile.shp.ShapefileReader.<init>(ShapefileReader.java:267)
	at org.geotools.data.shapefile.ShapefileSetManager.openShapeReader(ShapefileSetManager.java:48)
	at org.geotools.data.shapefile.ShapefileFeatureSource.getReaderInternal(ShapefileFeatureSource.java:369)
	at org.geotools.data.shapefile.ShapefileFeatureStore.getReaderInternal(ShapefileFeatureStore.java:132)
	at org.geotools.data.store.ContentFeatureSource.getReader(ContentFeatureSource.java:600)
	at org.geotools.data.store.ContentFeatureCollection.isEmpty(ContentFeatureCollection.java:312)
	at org.geotools.data.shapefile.ShapefileDataStoreTest.testGetCount(ShapefileDataStoreTest.java:1482)
	at sun.reflect.NativeMethodAccessorImpl.invoke0(Native Method)
	at sun.reflect.NativeMethodAccessorImpl.invoke(NativeMethodAccessorImpl.java:62)
	at sun.reflect.DelegatingMethodAccessorImpl.invoke(DelegatingMethodAccessorImpl.java:43)
	at java.lang.reflect.Method.invoke(Method.java:498)
	at org.junit.runners.model.FrameworkMethod$1.runReflectiveCall(FrameworkMethod.java:47)
	at org.junit.internal.runners.model.ReflectiveCallable.run(ReflectiveCallable.java:12)
	at org.junit.runners.model.FrameworkMethod.invokeExplosively(FrameworkMethod.java:44)
	at org.junit.internal.runners.statements.InvokeMethod.evaluate(InvokeMethod.java:17)
	at org.junit.internal.runners.statements.RunAfters.evaluate(RunAfters.java:27)
	at org.junit.runners.ParentRunner.runLeaf(ParentRunner.java:271)
	at org.junit.runners.BlockJUnit4ClassRunner.runChild(BlockJUnit4ClassRunner.java:70)
	at org.junit.runners.BlockJUnit4ClassRunner.runChild(BlockJUnit4ClassRunner.java:50)
	at org.junit.runners.ParentRunner$3.run(ParentRunner.java:238)
	at org.junit.runners.ParentRunner$1.schedule(ParentRunner.java:63)
	at org.junit.runners.ParentRunner.runChildren(ParentRunner.java:236)
	at org.junit.runners.ParentRunner.access$000(ParentRunner.java:53)
	at org.junit.runners.ParentRunner$2.evaluate(ParentRunner.java:229)
	at org.junit.runners.ParentRunner.run(ParentRunner.java:309)
	at org.apache.maven.surefire.junit4.JUnit4Provider.execute(JUnit4Provider.java:264)
	at org.apache.maven.surefire.junit4.JUnit4Provider.executeTestSet(JUnit4Provider.java:153)
	at org.apache.maven.surefire.junit4.JUnit4Provider.invoke(JUnit4Provider.java:124)
	at org.apache.maven.surefire.booter.ForkedBooter.invokeProviderInSameClassLoader(ForkedBooter.java:200)
	at org.apache.maven.surefire.booter.ForkedBooter.runSuitesInProcess(ForkedBooter.java:153)
	at org.apache.maven.surefire.booter.ForkedBooter.main(ForkedBooter.java:103)

2018-06-23T21:09:23.171-0400  WARNING  Writing DBF data, value 12,345,678,901,234,567,890,123,456,789 cannot be represented in size 19
2018-06-23T21:09:23.202-0400  WARNING  Could not open the .shx file, continuing assuming the .shp file is not sparse
java.io.FileNotFoundException: /home/hudson/genie.jts/.jenkins/jobs/GeoTools-Master/workspace/modules/plugin/shapefile/target/test-classes/org/geotools/data/shapefile/test-data/shapes/stream.shx (No such file or directory)
	at java.io.RandomAccessFile.open0(Native Method)
	at java.io.RandomAccessFile.open(RandomAccessFile.java:316)
	at java.io.RandomAccessFile.<init>(RandomAccessFile.java:243)
	at org.geotools.data.shapefile.files.ShpFiles.getReadChannel(ShpFiles.java:758)
	at org.geotools.data.shapefile.shp.IndexFile.<init>(IndexFile.java:72)
	at org.geotools.data.shapefile.shp.ShapefileReader.<init>(ShapefileReader.java:267)
	at org.geotools.data.shapefile.ShapefileSetManager.openShapeReader(ShapefileSetManager.java:48)
	at org.geotools.data.shapefile.ShapefileFeatureSource.readAttributes(ShapefileFeatureSource.java:520)
	at org.geotools.data.shapefile.ShapefileFeatureSource.buildFeatureType(ShapefileFeatureSource.java:479)
	at org.geotools.data.shapefile.ShapefileFeatureStore.buildFeatureType(ShapefileFeatureStore.java:137)
	at org.geotools.data.store.ContentFeatureSource.getAbsoluteSchema(ContentFeatureSource.java:328)
	at org.geotools.data.store.ContentFeatureSource.getSchema(ContentFeatureSource.java:297)
	at org.geotools.data.store.ContentFeatureSource.getFeatures(ContentFeatureSource.java:1029)
	at org.geotools.data.store.ContentFeatureSource.getFeatures(ContentFeatureSource.java:106)
	at org.geotools.data.shapefile.ShapefileDataStoreTest.testGeometryFilter(ShapefileDataStoreTest.java:605)
	at sun.reflect.NativeMethodAccessorImpl.invoke0(Native Method)
	at sun.reflect.NativeMethodAccessorImpl.invoke(NativeMethodAccessorImpl.java:62)
	at sun.reflect.DelegatingMethodAccessorImpl.invoke(DelegatingMethodAccessorImpl.java:43)
	at java.lang.reflect.Method.invoke(Method.java:498)
	at org.junit.runners.model.FrameworkMethod$1.runReflectiveCall(FrameworkMethod.java:47)
	at org.junit.internal.runners.model.ReflectiveCallable.run(ReflectiveCallable.java:12)
	at org.junit.runners.model.FrameworkMethod.invokeExplosively(FrameworkMethod.java:44)
	at org.junit.internal.runners.statements.InvokeMethod.evaluate(InvokeMethod.java:17)
	at org.junit.internal.runners.statements.RunAfters.evaluate(RunAfters.java:27)
	at org.junit.runners.ParentRunner.runLeaf(ParentRunner.java:271)
	at org.junit.runners.BlockJUnit4ClassRunner.runChild(BlockJUnit4ClassRunner.java:70)
	at org.junit.runners.BlockJUnit4ClassRunner.runChild(BlockJUnit4ClassRunner.java:50)
	at org.junit.runners.ParentRunner$3.run(ParentRunner.java:238)
	at org.junit.runners.ParentRunner$1.schedule(ParentRunner.java:63)
	at org.junit.runners.ParentRunner.runChildren(ParentRunner.java:236)
	at org.junit.runners.ParentRunner.access$000(ParentRunner.java:53)
	at org.junit.runners.ParentRunner$2.evaluate(ParentRunner.java:229)
	at org.junit.runners.ParentRunner.run(ParentRunner.java:309)
	at org.apache.maven.surefire.junit4.JUnit4Provider.execute(JUnit4Provider.java:264)
	at org.apache.maven.surefire.junit4.JUnit4Provider.executeTestSet(JUnit4Provider.java:153)
	at org.apache.maven.surefire.junit4.JUnit4Provider.invoke(JUnit4Provider.java:124)
	at org.apache.maven.surefire.booter.ForkedBooter.invokeProviderInSameClassLoader(ForkedBooter.java:200)
	at org.apache.maven.surefire.booter.ForkedBooter.runSuitesInProcess(ForkedBooter.java:153)
	at org.apache.maven.surefire.booter.ForkedBooter.main(ForkedBooter.java:103)

2018-06-23T21:09:23.224-0400  WARNING  Writing DBF data, value 12,345,678,901,234,567,890,123,456,789 cannot be represented in size 19
2018-06-23T21:09:23.225-0400  WARNING  Writing DBF data, value 12,345,678,901,234,567,890,123,456,789 cannot be represented in size 19
2018-06-23T21:09:23.225-0400  WARNING  Writing DBF data, value 12,345,678,901,234,567,890,123,456,789 cannot be represented in size 19
2018-06-23T21:09:23.226-0400  WARNING  Writing DBF data, value 12,345,678,901,234,567,890,123,456,789 cannot be represented in size 19
2018-06-23T21:09:23.227-0400  WARNING  Writing DBF data, value 12,345,678,901,234,567,890,123,456,789 cannot be represented in size 19
2018-06-23T21:09:23.227-0400  WARNING  Writing DBF data, value 12,345,678,901,234,567,890,123,456,789 cannot be represented in size 19
2018-06-23T21:09:23.228-0400  WARNING  Writing DBF data, value 12,345,678,901,234,567,890,123,456,789 cannot be represented in size 19
2018-06-23T21:09:23.229-0400  WARNING  Writing DBF data, value 12,345,678,901,234,567,890,123,456,789 cannot be represented in size 19
2018-06-23T21:09:23.229-0400  WARNING  Writing DBF data, value 12,345,678,901,234,567,890,123,456,789 cannot be represented in size 19
2018-06-23T21:09:23.230-0400  WARNING  Writing DBF data, value 12,345,678,901,234,567,890,123,456,789 cannot be represented in size 19
2018-06-23T21:09:23.231-0400  WARNING  Writing DBF data, value 12,345,678,901,234,567,890,123,456,789 cannot be represented in size 19
2018-06-23T21:09:23.231-0400  WARNING  Writing DBF data, value 12,345,678,901,234,567,890,123,456,789 cannot be represented in size 19
2018-06-23T21:09:23.232-0400  WARNING  Writing DBF data, value 12,345,678,901,234,567,890,123,456,789 cannot be represented in size 19
2018-06-23T21:09:23.233-0400  WARNING  Writing DBF data, value 12,345,678,901,234,567,890,123,456,789 cannot be represented in size 19
2018-06-23T21:09:23.233-0400  WARNING  Writing DBF data, value 12,345,678,901,234,567,890,123,456,789 cannot be represented in size 19
2018-06-23T21:09:23.234-0400  WARNING  Writing DBF data, value 12,345,678,901,234,567,890,123,456,789 cannot be represented in size 19
2018-06-23T21:09:23.234-0400  WARNING  Writing DBF data, value 12,345,678,901,234,567,890,123,456,789 cannot be represented in size 19
2018-06-23T21:09:23.235-0400  WARNING  Writing DBF data, value 12,345,678,901,234,567,890,123,456,789 cannot be represented in size 19
2018-06-23T21:09:23.236-0400  WARNING  Writing DBF data, value 12,345,678,901,234,567,890,123,456,789 cannot be represented in size 19
2018-06-23T21:09:23.236-0400  WARNING  Writing DBF data, value 12,345,678,901,234,567,890,123,456,789 cannot be represented in size 19
2018-06-23T21:09:23.322-0400  SEVERE  There's code leaving transaction unclosed. Call Transaction.close() after using them to ensure they do not hold state such as JDBC connections or file handles
2018-06-23T21:09:23.323-0400  SEVERE  Unclosed transaction handle is 'org.geotools.data.shapefile.ShapefileDataStoreTest.testWrite Transaction'
2018-06-23T21:09:23.386-0400  WARNING  Writing DBF data, value 12,345,678,901,234,567,890,123,456,789 cannot be represented in size 19
2018-06-23T21:09:23.387-0400  WARNING  Writing DBF data, value 12,345,678,901,234,567,890,123,456,789 cannot be represented in size 19
2018-06-23T21:09:23.387-0400  WARNING  Writing DBF data, value 12,345,678,901,234,567,890,123,456,789 cannot be represented in size 19
2018-06-23T21:09:23.388-0400  WARNING  Writing DBF data, value 12,345,678,901,234,567,890,123,456,789 cannot be represented in size 19
2018-06-23T21:09:23.388-0400  WARNING  Writing DBF data, value 12,345,678,901,234,567,890,123,456,789 cannot be represented in size 19
2018-06-23T21:09:23.388-0400  WARNING  Writing DBF data, value 12,345,678,901,234,567,890,123,456,789 cannot be represented in size 19
2018-06-23T21:09:23.389-0400  WARNING  Writing DBF data, value 12,345,678,901,234,567,890,123,456,789 cannot be represented in size 19
2018-06-23T21:09:23.389-0400  WARNING  Writing DBF data, value 12,345,678,901,234,567,890,123,456,789 cannot be represented in size 19
2018-06-23T21:09:23.389-0400  WARNING  Writing DBF data, value 12,345,678,901,234,567,890,123,456,789 cannot be represented in size 19
2018-06-23T21:09:23.390-0400  WARNING  Writing DBF data, value 12,345,678,901,234,567,890,123,456,789 cannot be represented in size 19
2018-06-23T21:09:23.390-0400  WARNING  Writing DBF data, value 12,345,678,901,234,567,890,123,456,789 cannot be represented in size 19
2018-06-23T21:09:23.391-0400  WARNING  Writing DBF data, value 12,345,678,901,234,567,890,123,456,789 cannot be represented in size 19
2018-06-23T21:09:23.391-0400  WARNING  Writing DBF data, value 12,345,678,901,234,567,890,123,456,789 cannot be represented in size 19
2018-06-23T21:09:23.391-0400  WARNING  Writing DBF data, value 12,345,678,901,234,567,890,123,456,789 cannot be represented in size 19
2018-06-23T21:09:23.392-0400  WARNING  Writing DBF data, value 12,345,678,901,234,567,890,123,456,789 cannot be represented in size 19
2018-06-23T21:09:23.392-0400  WARNING  Writing DBF data, value 12,345,678,901,234,567,890,123,456,789 cannot be represented in size 19
2018-06-23T21:09:23.393-0400  WARNING  Writing DBF data, value 12,345,678,901,234,567,890,123,456,789 cannot be represented in size 19
2018-06-23T21:09:23.393-0400  WARNING  Writing DBF data, value 12,345,678,901,234,567,890,123,456,789 cannot be represented in size 19
2018-06-23T21:09:23.393-0400  WARNING  Writing DBF data, value 12,345,678,901,234,567,890,123,456,789 cannot be represented in size 19
2018-06-23T21:09:23.394-0400  WARNING  Writing DBF data, value 12,345,678,901,234,567,890,123,456,789 cannot be represented in size 19
2018-06-23T21:09:23.620-0400  WARNING  Writing DBF data, value 12,345,678,901,234,567,890,123,456,789 cannot be represented in size 19
2018-06-23T21:09:23.620-0400  WARNING  Writing DBF data, value 12,345,678,901,234,567,890,123,456,789 cannot be represented in size 19
2018-06-23T21:09:23.620-0400  WARNING  Writing DBF data, value 12,345,678,901,234,567,890,123,456,789 cannot be represented in size 19
2018-06-23T21:09:23.621-0400  WARNING  Writing DBF data, value 12,345,678,901,234,567,890,123,456,789 cannot be represented in size 19
2018-06-23T21:09:23.621-0400  WARNING  Writing DBF data, value 12,345,678,901,234,567,890,123,456,789 cannot be represented in size 19
2018-06-23T21:09:23.621-0400  WARNING  Writing DBF data, value 12,345,678,901,234,567,890,123,456,789 cannot be represented in size 19
2018-06-23T21:09:23.622-0400  WARNING  Writing DBF data, value 12,345,678,901,234,567,890,123,456,789 cannot be represented in size 19
2018-06-23T21:09:23.622-0400  WARNING  Writing DBF data, value 12,345,678,901,234,567,890,123,456,789 cannot be represented in size 19
2018-06-23T21:09:23.622-0400  WARNING  Writing DBF data, value 12,345,678,901,234,567,890,123,456,789 cannot be represented in size 19
2018-06-23T21:09:23.623-0400  WARNING  Writing DBF data, value 12,345,678,901,234,567,890,123,456,789 cannot be represented in size 19
2018-06-23T21:09:23.623-0400  WARNING  Writing DBF data, value 12,345,678,901,234,567,890,123,456,789 cannot be represented in size 19
2018-06-23T21:09:23.623-0400  WARNING  Writing DBF data, value 12,345,678,901,234,567,890,123,456,789 cannot be represented in size 19
2018-06-23T21:09:23.624-0400  WARNING  Writing DBF data, value 12,345,678,901,234,567,890,123,456,789 cannot be represented in size 19
2018-06-23T21:09:23.624-0400  WARNING  Writing DBF data, value 12,345,678,901,234,567,890,123,456,789 cannot be represented in size 19
2018-06-23T21:09:23.624-0400  WARNING  Writing DBF data, value 12,345,678,901,234,567,890,123,456,789 cannot be represented in size 19
2018-06-23T21:09:23.625-0400  WARNING  Writing DBF data, value 12,345,678,901,234,567,890,123,456,789 cannot be represented in size 19
2018-06-23T21:09:23.625-0400  WARNING  Writing DBF data, value 12,345,678,901,234,567,890,123,456,789 cannot be represented in size 19
2018-06-23T21:09:23.626-0400  WARNING  Writing DBF data, value 12,345,678,901,234,567,890,123,456,789 cannot be represented in size 19
2018-06-23T21:09:23.626-0400  WARNING  Writing DBF data, value 12,345,678,901,234,567,890,123,456,789 cannot be represented in size 19
2018-06-23T21:09:23.626-0400  WARNING  Writing DBF data, value 12,345,678,901,234,567,890,123,456,789 cannot be represented in size 19
2018-06-23T21:09:23.699-0400  WARNING  Writing DBF data, value 12,345,678,901,234,567,890,123,456,789 cannot be represented in size 19
2018-06-23T21:09:23.700-0400  WARNING  Writing DBF data, value 12,345,678,901,234,567,890,123,456,789 cannot be represented in size 19
2018-06-23T21:09:23.700-0400  WARNING  Writing DBF data, value 12,345,678,901,234,567,890,123,456,789 cannot be represented in size 19
2018-06-23T21:09:23.701-0400  WARNING  Writing DBF data, value 12,345,678,901,234,567,890,123,456,789 cannot be represented in size 19
2018-06-23T21:09:23.701-0400  WARNING  Writing DBF data, value 12,345,678,901,234,567,890,123,456,789 cannot be represented in size 19
2018-06-23T21:09:23.701-0400  WARNING  Writing DBF data, value 12,345,678,901,234,567,890,123,456,789 cannot be represented in size 19
2018-06-23T21:09:23.702-0400  WARNING  Writing DBF data, value 12,345,678,901,234,567,890,123,456,789 cannot be represented in size 19
2018-06-23T21:09:23.702-0400  WARNING  Writing DBF data, value 12,345,678,901,234,567,890,123,456,789 cannot be represented in size 19
2018-06-23T21:09:23.703-0400  WARNING  Writing DBF data, value 12,345,678,901,234,567,890,123,456,789 cannot be represented in size 19
2018-06-23T21:09:23.703-0400  WARNING  Writing DBF data, value 12,345,678,901,234,567,890,123,456,789 cannot be represented in size 19
2018-06-23T21:09:23.703-0400  WARNING  Writing DBF data, value 12,345,678,901,234,567,890,123,456,789 cannot be represented in size 19
2018-06-23T21:09:23.704-0400  WARNING  Writing DBF data, value 12,345,678,901,234,567,890,123,456,789 cannot be represented in size 19
2018-06-23T21:09:23.704-0400  WARNING  Writing DBF data, value 12,345,678,901,234,567,890,123,456,789 cannot be represented in size 19
2018-06-23T21:09:23.704-0400  WARNING  Writing DBF data, value 12,345,678,901,234,567,890,123,456,789 cannot be represented in size 19
2018-06-23T21:09:23.705-0400  WARNING  Writing DBF data, value 12,345,678,901,234,567,890,123,456,789 cannot be represented in size 19
2018-06-23T21:09:23.705-0400  WARNING  Writing DBF data, value 12,345,678,901,234,567,890,123,456,789 cannot be represented in size 19
2018-06-23T21:09:23.706-0400  WARNING  Writing DBF data, value 12,345,678,901,234,567,890,123,456,789 cannot be represented in size 19
2018-06-23T21:09:23.706-0400  WARNING  Writing DBF data, value 12,345,678,901,234,567,890,123,456,789 cannot be represented in size 19
2018-06-23T21:09:23.706-0400  WARNING  Writing DBF data, value 12,345,678,901,234,567,890,123,456,789 cannot be represented in size 19
2018-06-23T21:09:23.707-0400  WARNING  Writing DBF data, value 12,345,678,901,234,567,890,123,456,789 cannot be represented in size 19
2018-06-23T21:09:23.756-0400  SEVERE  There's code leaving transaction unclosed. Call Transaction.close() after using them to ensure they do not hold state such as JDBC connections or file handles
2018-06-23T21:09:23.756-0400  SEVERE  Unclosed transaction handle is 'org.geotools.data.shapefile.ShapefileDataStoreTest.testCountTransaction Transaction'
2018-06-23T21:09:23.765-0400  WARNING  Writing DBF data, value 12,345,678,901,234,567,890,123,456,789 cannot be represented in size 19
2018-06-23T21:09:23.766-0400  WARNING  Writing DBF data, value 12,345,678,901,234,567,890,123,456,789 cannot be represented in size 19
2018-06-23T21:09:23.766-0400  WARNING  Writing DBF data, value 12,345,678,901,234,567,890,123,456,789 cannot be represented in size 19
2018-06-23T21:09:23.766-0400  WARNING  Writing DBF data, value 12,345,678,901,234,567,890,123,456,789 cannot be represented in size 19
2018-06-23T21:09:23.767-0400  WARNING  Writing DBF data, value 12,345,678,901,234,567,890,123,456,789 cannot be represented in size 19
2018-06-23T21:09:23.767-0400  WARNING  Writing DBF data, value 12,345,678,901,234,567,890,123,456,789 cannot be represented in size 19
2018-06-23T21:09:23.767-0400  WARNING  Writing DBF data, value 12,345,678,901,234,567,890,123,456,789 cannot be represented in size 19
2018-06-23T21:09:23.768-0400  WARNING  Writing DBF data, value 12,345,678,901,234,567,890,123,456,789 cannot be represented in size 19
2018-06-23T21:09:23.768-0400  WARNING  Writing DBF data, value 12,345,678,901,234,567,890,123,456,789 cannot be represented in size 19
2018-06-23T21:09:23.768-0400  WARNING  Writing DBF data, value 12,345,678,901,234,567,890,123,456,789 cannot be represented in size 19
2018-06-23T21:09:23.769-0400  WARNING  Writing DBF data, value 12,345,678,901,234,567,890,123,456,789 cannot be represented in size 19
2018-06-23T21:09:23.769-0400  WARNING  Writing DBF data, value 12,345,678,901,234,567,890,123,456,789 cannot be represented in size 19
2018-06-23T21:09:23.769-0400  WARNING  Writing DBF data, value 12,345,678,901,234,567,890,123,456,789 cannot be represented in size 19
2018-06-23T21:09:23.770-0400  WARNING  Writing DBF data, value 12,345,678,901,234,567,890,123,456,789 cannot be represented in size 19
2018-06-23T21:09:23.770-0400  WARNING  Writing DBF data, value 12,345,678,901,234,567,890,123,456,789 cannot be represented in size 19
2018-06-23T21:09:23.770-0400  WARNING  Writing DBF data, value 12,345,678,901,234,567,890,123,456,789 cannot be represented in size 19
2018-06-23T21:09:23.771-0400  WARNING  Writing DBF data, value 12,345,678,901,234,567,890,123,456,789 cannot be represented in size 19
2018-06-23T21:09:23.771-0400  WARNING  Writing DBF data, value 12,345,678,901,234,567,890,123,456,789 cannot be represented in size 19
2018-06-23T21:09:23.772-0400  WARNING  Writing DBF data, value 12,345,678,901,234,567,890,123,456,789 cannot be represented in size 19
2018-06-23T21:09:23.772-0400  WARNING  Writing DBF data, value 12,345,678,901,234,567,890,123,456,789 cannot be represented in size 19
SimpleFeatureImpl:test-+()shp1384568808865916787=[SimpleFeatureImpl.Attribute: the_geom<Point id=test-+()shp1384568808865916787.1>=POINT (1 -1), SimpleFeatureImpl.Attribute: b<b id=test-+()shp1384568808865916787.1>=19, SimpleFeatureImpl.Attribute: c<c id=test-+()shp1384568808865916787.1>=19, SimpleFeatureImpl.Attribute: d<d id=test-+()shp1384568808865916787.1>=19.0, SimpleFeatureImpl.Attribute: e<e id=test-+()shp1384568808865916787.1>=19.0, SimpleFeatureImpl.Attribute: f<f id=test-+()shp1384568808865916787.1>=19, SimpleFeatureImpl.Attribute: g<g id=test-+()shp1384568808865916787.1>=Wed Dec 31 00:00:00 EST 1969, SimpleFeatureImpl.Attribute: h<h id=test-+()shp1384568808865916787.1>=true, SimpleFeatureImpl.Attribute: i<i id=test-+()shp1384568808865916787.1>=22.0, SimpleFeatureImpl.Attribute: j<j id=test-+()shp1384568808865916787.1>=1234567890123456789, SimpleFeatureImpl.Attribute: k<k id=test-+()shp1384568808865916787.1>=1.2345678901234568E26, SimpleFeatureImpl.Attribute: l<l id=test-+()shp1384568808865916787.1>=1234567890123456789, SimpleFeatureImpl.Attribute: m<m id=test-+()shp1384568808865916787.1>=Wed Dec 31 00:00:00 EST 1969, SimpleFeatureImpl.Attribute: n<n id=test-+()shp1384568808865916787.1>=f5eea453-9232-4ba1-9cd5-42907e44fa09]
SimpleFeatureImpl:test-+()shp1384568808865916787=[SimpleFeatureImpl.Attribute: the_geom<Point id=test-+()shp1384568808865916787.1>=POINT (1 -1), SimpleFeatureImpl.Attribute: b<b id=test-+()shp1384568808865916787.1>=18, SimpleFeatureImpl.Attribute: c<c id=test-+()shp1384568808865916787.1>=18, SimpleFeatureImpl.Attribute: d<d id=test-+()shp1384568808865916787.1>=18.0, SimpleFeatureImpl.Attribute: e<e id=test-+()shp1384568808865916787.1>=18.0, SimpleFeatureImpl.Attribute: f<f id=test-+()shp1384568808865916787.1>=18, SimpleFeatureImpl.Attribute: g<g id=test-+()shp1384568808865916787.1>=Wed Dec 31 00:00:00 EST 1969, SimpleFeatureImpl.Attribute: h<h id=test-+()shp1384568808865916787.1>=true, SimpleFeatureImpl.Attribute: i<i id=test-+()shp1384568808865916787.1>=22.0, SimpleFeatureImpl.Attribute: j<j id=test-+()shp1384568808865916787.1>=1234567890123456789, SimpleFeatureImpl.Attribute: k<k id=test-+()shp1384568808865916787.1>=1.2345678901234568E26, SimpleFeatureImpl.Attribute: l<l id=test-+()shp1384568808865916787.1>=1234567890123456789, SimpleFeatureImpl.Attribute: m<m id=test-+()shp1384568808865916787.1>=Wed Dec 31 00:00:00 EST 1969, SimpleFeatureImpl.Attribute: n<n id=test-+()shp1384568808865916787.1>=aca4877a-f238-4750-b1ad-6f074ea51c51]
SimpleFeatureImpl:test-+()shp1384568808865916787=[SimpleFeatureImpl.Attribute: the_geom<Point id=test-+()shp1384568808865916787.1>=POINT (1 -1), SimpleFeatureImpl.Attribute: b<b id=test-+()shp1384568808865916787.1>=17, SimpleFeatureImpl.Attribute: c<c id=test-+()shp1384568808865916787.1>=17, SimpleFeatureImpl.Attribute: d<d id=test-+()shp1384568808865916787.1>=17.0, SimpleFeatureImpl.Attribute: e<e id=test-+()shp1384568808865916787.1>=17.0, SimpleFeatureImpl.Attribute: f<f id=test-+()shp1384568808865916787.1>=17, SimpleFeatureImpl.Attribute: g<g id=test-+()shp1384568808865916787.1>=Wed Dec 31 00:00:00 EST 1969, SimpleFeatureImpl.Attribute: h<h id=test-+()shp1384568808865916787.1>=true, SimpleFeatureImpl.Attribute: i<i id=test-+()shp1384568808865916787.1>=22.0, SimpleFeatureImpl.Attribute: j<j id=test-+()shp1384568808865916787.1>=1234567890123456789, SimpleFeatureImpl.Attribute: k<k id=test-+()shp1384568808865916787.1>=1.2345678901234568E26, SimpleFeatureImpl.Attribute: l<l id=test-+()shp1384568808865916787.1>=1234567890123456789, SimpleFeatureImpl.Attribute: m<m id=test-+()shp1384568808865916787.1>=Wed Dec 31 00:00:00 EST 1969, SimpleFeatureImpl.Attribute: n<n id=test-+()shp1384568808865916787.1>=1fcb11fd-c340-4199-82a7-fad9463d6ea7]
SimpleFeatureImpl:test-+()shp1384568808865916787=[SimpleFeatureImpl.Attribute: the_geom<Point id=test-+()shp1384568808865916787.1>=POINT (1 -1), SimpleFeatureImpl.Attribute: b<b id=test-+()shp1384568808865916787.1>=16, SimpleFeatureImpl.Attribute: c<c id=test-+()shp1384568808865916787.1>=16, SimpleFeatureImpl.Attribute: d<d id=test-+()shp1384568808865916787.1>=16.0, SimpleFeatureImpl.Attribute: e<e id=test-+()shp1384568808865916787.1>=16.0, SimpleFeatureImpl.Attribute: f<f id=test-+()shp1384568808865916787.1>=16, SimpleFeatureImpl.Attribute: g<g id=test-+()shp1384568808865916787.1>=Wed Dec 31 00:00:00 EST 1969, SimpleFeatureImpl.Attribute: h<h id=test-+()shp1384568808865916787.1>=true, SimpleFeatureImpl.Attribute: i<i id=test-+()shp1384568808865916787.1>=22.0, SimpleFeatureImpl.Attribute: j<j id=test-+()shp1384568808865916787.1>=1234567890123456789, SimpleFeatureImpl.Attribute: k<k id=test-+()shp1384568808865916787.1>=1.2345678901234568E26, SimpleFeatureImpl.Attribute: l<l id=test-+()shp1384568808865916787.1>=1234567890123456789, SimpleFeatureImpl.Attribute: m<m id=test-+()shp1384568808865916787.1>=Wed Dec 31 00:00:00 EST 1969, SimpleFeatureImpl.Attribute: n<n id=test-+()shp1384568808865916787.1>=322c5838-97dd-4946-8e3a-10c9cdcfc94e]
SimpleFeatureImpl:test-+()shp1384568808865916787=[SimpleFeatureImpl.Attribute: the_geom<Point id=test-+()shp1384568808865916787.1>=POINT (1 -1), SimpleFeatureImpl.Attribute: b<b id=test-+()shp1384568808865916787.1>=15, SimpleFeatureImpl.Attribute: c<c id=test-+()shp1384568808865916787.1>=15, SimpleFeatureImpl.Attribute: d<d id=test-+()shp1384568808865916787.1>=15.0, SimpleFeatureImpl.Attribute: e<e id=test-+()shp1384568808865916787.1>=15.0, SimpleFeatureImpl.Attribute: f<f id=test-+()shp1384568808865916787.1>=15, SimpleFeatureImpl.Attribute: g<g id=test-+()shp1384568808865916787.1>=Wed Dec 31 00:00:00 EST 1969, SimpleFeatureImpl.Attribute: h<h id=test-+()shp1384568808865916787.1>=true, SimpleFeatureImpl.Attribute: i<i id=test-+()shp1384568808865916787.1>=22.0, SimpleFeatureImpl.Attribute: j<j id=test-+()shp1384568808865916787.1>=1234567890123456789, SimpleFeatureImpl.Attribute: k<k id=test-+()shp1384568808865916787.1>=1.2345678901234568E26, SimpleFeatureImpl.Attribute: l<l id=test-+()shp1384568808865916787.1>=1234567890123456789, SimpleFeatureImpl.Attribute: m<m id=test-+()shp1384568808865916787.1>=Wed Dec 31 00:00:00 EST 1969, SimpleFeatureImpl.Attribute: n<n id=test-+()shp1384568808865916787.1>=c001f2ba-8238-4975-8cc3-313912e13bb3]
SimpleFeatureImpl:test-+()shp1384568808865916787=[SimpleFeatureImpl.Attribute: the_geom<Point id=test-+()shp1384568808865916787.1>=POINT (1 -1), SimpleFeatureImpl.Attribute: b<b id=test-+()shp1384568808865916787.1>=14, SimpleFeatureImpl.Attribute: c<c id=test-+()shp1384568808865916787.1>=14, SimpleFeatureImpl.Attribute: d<d id=test-+()shp1384568808865916787.1>=14.0, SimpleFeatureImpl.Attribute: e<e id=test-+()shp1384568808865916787.1>=14.0, SimpleFeatureImpl.Attribute: f<f id=test-+()shp1384568808865916787.1>=14, SimpleFeatureImpl.Attribute: g<g id=test-+()shp1384568808865916787.1>=Wed Dec 31 00:00:00 EST 1969, SimpleFeatureImpl.Attribute: h<h id=test-+()shp1384568808865916787.1>=true, SimpleFeatureImpl.Attribute: i<i id=test-+()shp1384568808865916787.1>=22.0, SimpleFeatureImpl.Attribute: j<j id=test-+()shp1384568808865916787.1>=1234567890123456789, SimpleFeatureImpl.Attribute: k<k id=test-+()shp1384568808865916787.1>=1.2345678901234568E26, SimpleFeatureImpl.Attribute: l<l id=test-+()shp1384568808865916787.1>=1234567890123456789, SimpleFeatureImpl.Attribute: m<m id=test-+()shp1384568808865916787.1>=Wed Dec 31 00:00:00 EST 1969, SimpleFeatureImpl.Attribute: n<n id=test-+()shp1384568808865916787.1>=f6968c7e-c33c-45a9-a19e-715e1203ae2f]
SimpleFeatureImpl:test-+()shp1384568808865916787=[SimpleFeatureImpl.Attribute: the_geom<Point id=test-+()shp1384568808865916787.1>=POINT (1 -1), SimpleFeatureImpl.Attribute: b<b id=test-+()shp1384568808865916787.1>=13, SimpleFeatureImpl.Attribute: c<c id=test-+()shp1384568808865916787.1>=13, SimpleFeatureImpl.Attribute: d<d id=test-+()shp1384568808865916787.1>=13.0, SimpleFeatureImpl.Attribute: e<e id=test-+()shp1384568808865916787.1>=13.0, SimpleFeatureImpl.Attribute: f<f id=test-+()shp1384568808865916787.1>=13, SimpleFeatureImpl.Attribute: g<g id=test-+()shp1384568808865916787.1>=Wed Dec 31 00:00:00 EST 1969, SimpleFeatureImpl.Attribute: h<h id=test-+()shp1384568808865916787.1>=true, SimpleFeatureImpl.Attribute: i<i id=test-+()shp1384568808865916787.1>=22.0, SimpleFeatureImpl.Attribute: j<j id=test-+()shp1384568808865916787.1>=1234567890123456789, SimpleFeatureImpl.Attribute: k<k id=test-+()shp1384568808865916787.1>=1.2345678901234568E26, SimpleFeatureImpl.Attribute: l<l id=test-+()shp1384568808865916787.1>=1234567890123456789, SimpleFeatureImpl.Attribute: m<m id=test-+()shp1384568808865916787.1>=Wed Dec 31 00:00:00 EST 1969, SimpleFeatureImpl.Attribute: n<n id=test-+()shp1384568808865916787.1>=9301c477-3b67-479b-a3ac-ce921099057f]
SimpleFeatureImpl:test-+()shp1384568808865916787=[SimpleFeatureImpl.Attribute: the_geom<Point id=test-+()shp1384568808865916787.1>=POINT (1 -1), SimpleFeatureImpl.Attribute: b<b id=test-+()shp1384568808865916787.1>=12, SimpleFeatureImpl.Attribute: c<c id=test-+()shp1384568808865916787.1>=12, SimpleFeatureImpl.Attribute: d<d id=test-+()shp1384568808865916787.1>=12.0, SimpleFeatureImpl.Attribute: e<e id=test-+()shp1384568808865916787.1>=12.0, SimpleFeatureImpl.Attribute: f<f id=test-+()shp1384568808865916787.1>=12, SimpleFeatureImpl.Attribute: g<g id=test-+()shp1384568808865916787.1>=Wed Dec 31 00:00:00 EST 1969, SimpleFeatureImpl.Attribute: h<h id=test-+()shp1384568808865916787.1>=true, SimpleFeatureImpl.Attribute: i<i id=test-+()shp1384568808865916787.1>=22.0, SimpleFeatureImpl.Attribute: j<j id=test-+()shp1384568808865916787.1>=1234567890123456789, SimpleFeatureImpl.Attribute: k<k id=test-+()shp1384568808865916787.1>=1.2345678901234568E26, SimpleFeatureImpl.Attribute: l<l id=test-+()shp1384568808865916787.1>=1234567890123456789, SimpleFeatureImpl.Attribute: m<m id=test-+()shp1384568808865916787.1>=Wed Dec 31 00:00:00 EST 1969, SimpleFeatureImpl.Attribute: n<n id=test-+()shp1384568808865916787.1>=817253a2-af04-465b-9563-b0ec9f8c2704]
SimpleFeatureImpl:test-+()shp1384568808865916787=[SimpleFeatureImpl.Attribute: the_geom<Point id=test-+()shp1384568808865916787.1>=POINT (1 -1), SimpleFeatureImpl.Attribute: b<b id=test-+()shp1384568808865916787.1>=11, SimpleFeatureImpl.Attribute: c<c id=test-+()shp1384568808865916787.1>=11, SimpleFeatureImpl.Attribute: d<d id=test-+()shp1384568808865916787.1>=11.0, SimpleFeatureImpl.Attribute: e<e id=test-+()shp1384568808865916787.1>=11.0, SimpleFeatureImpl.Attribute: f<f id=test-+()shp1384568808865916787.1>=11, SimpleFeatureImpl.Attribute: g<g id=test-+()shp1384568808865916787.1>=Wed Dec 31 00:00:00 EST 1969, SimpleFeatureImpl.Attribute: h<h id=test-+()shp1384568808865916787.1>=true, SimpleFeatureImpl.Attribute: i<i id=test-+()shp1384568808865916787.1>=22.0, SimpleFeatureImpl.Attribute: j<j id=test-+()shp1384568808865916787.1>=1234567890123456789, SimpleFeatureImpl.Attribute: k<k id=test-+()shp1384568808865916787.1>=1.2345678901234568E26, SimpleFeatureImpl.Attribute: l<l id=test-+()shp1384568808865916787.1>=1234567890123456789, SimpleFeatureImpl.Attribute: m<m id=test-+()shp1384568808865916787.1>=Wed Dec 31 00:00:00 EST 1969, SimpleFeatureImpl.Attribute: n<n id=test-+()shp1384568808865916787.1>=c0404b7c-7002-4084-a65e-c16dafc053d4]
SimpleFeatureImpl:test-+()shp1384568808865916787=[SimpleFeatureImpl.Attribute: the_geom<Point id=test-+()shp1384568808865916787.1>=POINT (1 -1), SimpleFeatureImpl.Attribute: b<b id=test-+()shp1384568808865916787.1>=10, SimpleFeatureImpl.Attribute: c<c id=test-+()shp1384568808865916787.1>=10, SimpleFeatureImpl.Attribute: d<d id=test-+()shp1384568808865916787.1>=10.0, SimpleFeatureImpl.Attribute: e<e id=test-+()shp1384568808865916787.1>=10.0, SimpleFeatureImpl.Attribute: f<f id=test-+()shp1384568808865916787.1>=10, SimpleFeatureImpl.Attribute: g<g id=test-+()shp1384568808865916787.1>=Wed Dec 31 00:00:00 EST 1969, SimpleFeatureImpl.Attribute: h<h id=test-+()shp1384568808865916787.1>=true, SimpleFeatureImpl.Attribute: i<i id=test-+()shp1384568808865916787.1>=22.0, SimpleFeatureImpl.Attribute: j<j id=test-+()shp1384568808865916787.1>=1234567890123456789, SimpleFeatureImpl.Attribute: k<k id=test-+()shp1384568808865916787.1>=1.2345678901234568E26, SimpleFeatureImpl.Attribute: l<l id=test-+()shp1384568808865916787.1>=1234567890123456789, SimpleFeatureImpl.Attribute: m<m id=test-+()shp1384568808865916787.1>=Wed Dec 31 00:00:00 EST 1969, SimpleFeatureImpl.Attribute: n<n id=test-+()shp1384568808865916787.1>=16281c83-4413-460b-a8f7-9d51560edf24]
SimpleFeatureImpl:test-+()shp1384568808865916787=[SimpleFeatureImpl.Attribute: the_geom<Point id=test-+()shp1384568808865916787.1>=POINT (1 -1), SimpleFeatureImpl.Attribute: b<b id=test-+()shp1384568808865916787.1>=9, SimpleFeatureImpl.Attribute: c<c id=test-+()shp1384568808865916787.1>=9, SimpleFeatureImpl.Attribute: d<d id=test-+()shp1384568808865916787.1>=9.0, SimpleFeatureImpl.Attribute: e<e id=test-+()shp1384568808865916787.1>=9.0, SimpleFeatureImpl.Attribute: f<f id=test-+()shp1384568808865916787.1>=9, SimpleFeatureImpl.Attribute: g<g id=test-+()shp1384568808865916787.1>=Wed Dec 31 00:00:00 EST 1969, SimpleFeatureImpl.Attribute: h<h id=test-+()shp1384568808865916787.1>=true, SimpleFeatureImpl.Attribute: i<i id=test-+()shp1384568808865916787.1>=22.0, SimpleFeatureImpl.Attribute: j<j id=test-+()shp1384568808865916787.1>=1234567890123456789, SimpleFeatureImpl.Attribute: k<k id=test-+()shp1384568808865916787.1>=1.2345678901234568E26, SimpleFeatureImpl.Attribute: l<l id=test-+()shp1384568808865916787.1>=1234567890123456789, SimpleFeatureImpl.Attribute: m<m id=test-+()shp1384568808865916787.1>=Wed Dec 31 00:00:00 EST 1969, SimpleFeatureImpl.Attribute: n<n id=test-+()shp1384568808865916787.1>=ef2fb726-37ea-481d-a514-e0f696a62f73]
SimpleFeatureImpl:test-+()shp1384568808865916787=[SimpleFeatureImpl.Attribute: the_geom<Point id=test-+()shp1384568808865916787.1>=POINT (1 -1), SimpleFeatureImpl.Attribute: b<b id=test-+()shp1384568808865916787.1>=8, SimpleFeatureImpl.Attribute: c<c id=test-+()shp1384568808865916787.1>=8, SimpleFeatureImpl.Attribute: d<d id=test-+()shp1384568808865916787.1>=8.0, SimpleFeatureImpl.Attribute: e<e id=test-+()shp1384568808865916787.1>=8.0, SimpleFeatureImpl.Attribute: f<f id=test-+()shp1384568808865916787.1>=8, SimpleFeatureImpl.Attribute: g<g id=test-+()shp1384568808865916787.1>=Wed Dec 31 00:00:00 EST 1969, SimpleFeatureImpl.Attribute: h<h id=test-+()shp1384568808865916787.1>=true, SimpleFeatureImpl.Attribute: i<i id=test-+()shp1384568808865916787.1>=22.0, SimpleFeatureImpl.Attribute: j<j id=test-+()shp1384568808865916787.1>=1234567890123456789, SimpleFeatureImpl.Attribute: k<k id=test-+()shp1384568808865916787.1>=1.2345678901234568E26, SimpleFeatureImpl.Attribute: l<l id=test-+()shp1384568808865916787.1>=1234567890123456789, SimpleFeatureImpl.Attribute: m<m id=test-+()shp1384568808865916787.1>=Wed Dec 31 00:00:00 EST 1969, SimpleFeatureImpl.Attribute: n<n id=test-+()shp1384568808865916787.1>=d5acdd3d-1af1-4b4f-bfa8-6b786e67970b]
SimpleFeatureImpl:test-+()shp1384568808865916787=[SimpleFeatureImpl.Attribute: the_geom<Point id=test-+()shp1384568808865916787.1>=POINT (1 -1), SimpleFeatureImpl.Attribute: b<b id=test-+()shp1384568808865916787.1>=7, SimpleFeatureImpl.Attribute: c<c id=test-+()shp1384568808865916787.1>=7, SimpleFeatureImpl.Attribute: d<d id=test-+()shp1384568808865916787.1>=7.0, SimpleFeatureImpl.Attribute: e<e id=test-+()shp1384568808865916787.1>=7.0, SimpleFeatureImpl.Attribute: f<f id=test-+()shp1384568808865916787.1>=7, SimpleFeatureImpl.Attribute: g<g id=test-+()shp1384568808865916787.1>=Wed Dec 31 00:00:00 EST 1969, SimpleFeatureImpl.Attribute: h<h id=test-+()shp1384568808865916787.1>=true, SimpleFeatureImpl.Attribute: i<i id=test-+()shp1384568808865916787.1>=22.0, SimpleFeatureImpl.Attribute: j<j id=test-+()shp1384568808865916787.1>=1234567890123456789, SimpleFeatureImpl.Attribute: k<k id=test-+()shp1384568808865916787.1>=1.2345678901234568E26, SimpleFeatureImpl.Attribute: l<l id=test-+()shp1384568808865916787.1>=1234567890123456789, SimpleFeatureImpl.Attribute: m<m id=test-+()shp1384568808865916787.1>=Wed Dec 31 00:00:00 EST 1969, SimpleFeatureImpl.Attribute: n<n id=test-+()shp1384568808865916787.1>=d7feee06-522c-45b5-bdf2-301f7fc62345]
SimpleFeatureImpl:test-+()shp1384568808865916787=[SimpleFeatureImpl.Attribute: the_geom<Point id=test-+()shp1384568808865916787.1>=POINT (1 -1), SimpleFeatureImpl.Attribute: b<b id=test-+()shp1384568808865916787.1>=6, SimpleFeatureImpl.Attribute: c<c id=test-+()shp1384568808865916787.1>=6, SimpleFeatureImpl.Attribute: d<d id=test-+()shp1384568808865916787.1>=6.0, SimpleFeatureImpl.Attribute: e<e id=test-+()shp1384568808865916787.1>=6.0, SimpleFeatureImpl.Attribute: f<f id=test-+()shp1384568808865916787.1>=6, SimpleFeatureImpl.Attribute: g<g id=test-+()shp1384568808865916787.1>=Wed Dec 31 00:00:00 EST 1969, SimpleFeatureImpl.Attribute: h<h id=test-+()shp1384568808865916787.1>=true, SimpleFeatureImpl.Attribute: i<i id=test-+()shp1384568808865916787.1>=22.0, SimpleFeatureImpl.Attribute: j<j id=test-+()shp1384568808865916787.1>=1234567890123456789, SimpleFeatureImpl.Attribute: k<k id=test-+()shp1384568808865916787.1>=1.2345678901234568E26, SimpleFeatureImpl.Attribute: l<l id=test-+()shp1384568808865916787.1>=1234567890123456789, SimpleFeatureImpl.Attribute: m<m id=test-+()shp1384568808865916787.1>=Wed Dec 31 00:00:00 EST 1969, SimpleFeatureImpl.Attribute: n<n id=test-+()shp1384568808865916787.1>=d3922766-a009-4e1c-aa9e-143df64bea88]
SimpleFeatureImpl:test-+()shp1384568808865916787=[SimpleFeatureImpl.Attribute: the_geom<Point id=test-+()shp1384568808865916787.1>=POINT (1 -1), SimpleFeatureImpl.Attribute: b<b id=test-+()shp1384568808865916787.1>=5, SimpleFeatureImpl.Attribute: c<c id=test-+()shp1384568808865916787.1>=5, SimpleFeatureImpl.Attribute: d<d id=test-+()shp1384568808865916787.1>=5.0, SimpleFeatureImpl.Attribute: e<e id=test-+()shp1384568808865916787.1>=5.0, SimpleFeatureImpl.Attribute: f<f id=test-+()shp1384568808865916787.1>=5, SimpleFeatureImpl.Attribute: g<g id=test-+()shp1384568808865916787.1>=Wed Dec 31 00:00:00 EST 1969, SimpleFeatureImpl.Attribute: h<h id=test-+()shp1384568808865916787.1>=true, SimpleFeatureImpl.Attribute: i<i id=test-+()shp1384568808865916787.1>=22.0, SimpleFeatureImpl.Attribute: j<j id=test-+()shp1384568808865916787.1>=1234567890123456789, SimpleFeatureImpl.Attribute: k<k id=test-+()shp1384568808865916787.1>=1.2345678901234568E26, SimpleFeatureImpl.Attribute: l<l id=test-+()shp1384568808865916787.1>=1234567890123456789, SimpleFeatureImpl.Attribute: m<m id=test-+()shp1384568808865916787.1>=Wed Dec 31 00:00:00 EST 1969, SimpleFeatureImpl.Attribute: n<n id=test-+()shp1384568808865916787.1>=d1c877fc-9406-46dd-9031-128bdb8c0bbe]
SimpleFeatureImpl:test-+()shp1384568808865916787=[SimpleFeatureImpl.Attribute: the_geom<Point id=test-+()shp1384568808865916787.1>=POINT (1 -1), SimpleFeatureImpl.Attribute: b<b id=test-+()shp1384568808865916787.1>=4, SimpleFeatureImpl.Attribute: c<c id=test-+()shp1384568808865916787.1>=4, SimpleFeatureImpl.Attribute: d<d id=test-+()shp1384568808865916787.1>=4.0, SimpleFeatureImpl.Attribute: e<e id=test-+()shp1384568808865916787.1>=4.0, SimpleFeatureImpl.Attribute: f<f id=test-+()shp1384568808865916787.1>=4, SimpleFeatureImpl.Attribute: g<g id=test-+()shp1384568808865916787.1>=Wed Dec 31 00:00:00 EST 1969, SimpleFeatureImpl.Attribute: h<h id=test-+()shp1384568808865916787.1>=true, SimpleFeatureImpl.Attribute: i<i id=test-+()shp1384568808865916787.1>=22.0, SimpleFeatureImpl.Attribute: j<j id=test-+()shp1384568808865916787.1>=1234567890123456789, SimpleFeatureImpl.Attribute: k<k id=test-+()shp1384568808865916787.1>=1.2345678901234568E26, SimpleFeatureImpl.Attribute: l<l id=test-+()shp1384568808865916787.1>=1234567890123456789, SimpleFeatureImpl.Attribute: m<m id=test-+()shp1384568808865916787.1>=Wed Dec 31 00:00:00 EST 1969, SimpleFeatureImpl.Attribute: n<n id=test-+()shp1384568808865916787.1>=3bd5c119-0449-4043-95d0-f12fb4f257f8]
SimpleFeatureImpl:test-+()shp1384568808865916787=[SimpleFeatureImpl.Attribute: the_geom<Point id=test-+()shp1384568808865916787.1>=POINT (1 -1), SimpleFeatureImpl.Attribute: b<b id=test-+()shp1384568808865916787.1>=3, SimpleFeatureImpl.Attribute: c<c id=test-+()shp1384568808865916787.1>=3, SimpleFeatureImpl.Attribute: d<d id=test-+()shp1384568808865916787.1>=3.0, SimpleFeatureImpl.Attribute: e<e id=test-+()shp1384568808865916787.1>=3.0, SimpleFeatureImpl.Attribute: f<f id=test-+()shp1384568808865916787.1>=3, SimpleFeatureImpl.Attribute: g<g id=test-+()shp1384568808865916787.1>=Wed Dec 31 00:00:00 EST 1969, SimpleFeatureImpl.Attribute: h<h id=test-+()shp1384568808865916787.1>=true, SimpleFeatureImpl.Attribute: i<i id=test-+()shp1384568808865916787.1>=22.0, SimpleFeatureImpl.Attribute: j<j id=test-+()shp1384568808865916787.1>=1234567890123456789, SimpleFeatureImpl.Attribute: k<k id=test-+()shp1384568808865916787.1>=1.2345678901234568E26, SimpleFeatureImpl.Attribute: l<l id=test-+()shp1384568808865916787.1>=1234567890123456789, SimpleFeatureImpl.Attribute: m<m id=test-+()shp1384568808865916787.1>=Wed Dec 31 00:00:00 EST 1969, SimpleFeatureImpl.Attribute: n<n id=test-+()shp1384568808865916787.1>=4e06f5db-b0ff-49fc-b4ff-8ec1b2f13a26]
SimpleFeatureImpl:test-+()shp1384568808865916787=[SimpleFeatureImpl.Attribute: the_geom<Point id=test-+()shp1384568808865916787.1>=POINT (1 -1), SimpleFeatureImpl.Attribute: b<b id=test-+()shp1384568808865916787.1>=2, SimpleFeatureImpl.Attribute: c<c id=test-+()shp1384568808865916787.1>=2, SimpleFeatureImpl.Attribute: d<d id=test-+()shp1384568808865916787.1>=2.0, SimpleFeatureImpl.Attribute: e<e id=test-+()shp1384568808865916787.1>=2.0, SimpleFeatureImpl.Attribute: f<f id=test-+()shp1384568808865916787.1>=2, SimpleFeatureImpl.Attribute: g<g id=test-+()shp1384568808865916787.1>=Wed Dec 31 00:00:00 EST 1969, SimpleFeatureImpl.Attribute: h<h id=test-+()shp1384568808865916787.1>=true, SimpleFeatureImpl.Attribute: i<i id=test-+()shp1384568808865916787.1>=22.0, SimpleFeatureImpl.Attribute: j<j id=test-+()shp1384568808865916787.1>=1234567890123456789, SimpleFeatureImpl.Attribute: k<k id=test-+()shp1384568808865916787.1>=1.2345678901234568E26, SimpleFeatureImpl.Attribute: l<l id=test-+()shp1384568808865916787.1>=1234567890123456789, SimpleFeatureImpl.Attribute: m<m id=test-+()shp1384568808865916787.1>=Wed Dec 31 00:00:00 EST 1969, SimpleFeatureImpl.Attribute: n<n id=test-+()shp1384568808865916787.1>=0399016c-ab53-4ece-84f2-eb745a5508ad]
SimpleFeatureImpl:test-+()shp1384568808865916787=[SimpleFeatureImpl.Attribute: the_geom<Point id=test-+()shp1384568808865916787.1>=POINT (1 -1), SimpleFeatureImpl.Attribute: b<b id=test-+()shp1384568808865916787.1>=1, SimpleFeatureImpl.Attribute: c<c id=test-+()shp1384568808865916787.1>=1, SimpleFeatureImpl.Attribute: d<d id=test-+()shp1384568808865916787.1>=1.0, SimpleFeatureImpl.Attribute: e<e id=test-+()shp1384568808865916787.1>=1.0, SimpleFeatureImpl.Attribute: f<f id=test-+()shp1384568808865916787.1>=1, SimpleFeatureImpl.Attribute: g<g id=test-+()shp1384568808865916787.1>=Wed Dec 31 00:00:00 EST 1969, SimpleFeatureImpl.Attribute: h<h id=test-+()shp1384568808865916787.1>=true, SimpleFeatureImpl.Attribute: i<i id=test-+()shp1384568808865916787.1>=22.0, SimpleFeatureImpl.Attribute: j<j id=test-+()shp1384568808865916787.1>=1234567890123456789, SimpleFeatureImpl.Attribute: k<k id=test-+()shp1384568808865916787.1>=1.2345678901234568E26, SimpleFeatureImpl.Attribute: l<l id=test-+()shp1384568808865916787.1>=1234567890123456789, SimpleFeatureImpl.Attribute: m<m id=test-+()shp1384568808865916787.1>=Wed Dec 31 00:00:00 EST 1969, SimpleFeatureImpl.Attribute: n<n id=test-+()shp1384568808865916787.1>=d5317897-d789-48aa-94d6-6536882d0161]
SimpleFeatureImpl:test-+()shp1384568808865916787=[SimpleFeatureImpl.Attribute: the_geom<Point id=test-+()shp1384568808865916787.1>=POINT (1 -1), SimpleFeatureImpl.Attribute: b<b id=test-+()shp1384568808865916787.1>=0, SimpleFeatureImpl.Attribute: c<c id=test-+()shp1384568808865916787.1>=0, SimpleFeatureImpl.Attribute: d<d id=test-+()shp1384568808865916787.1>=0.0, SimpleFeatureImpl.Attribute: e<e id=test-+()shp1384568808865916787.1>=0.0, SimpleFeatureImpl.Attribute: f<f id=test-+()shp1384568808865916787.1>=0, SimpleFeatureImpl.Attribute: g<g id=test-+()shp1384568808865916787.1>=Wed Dec 31 00:00:00 EST 1969, SimpleFeatureImpl.Attribute: h<h id=test-+()shp1384568808865916787.1>=true, SimpleFeatureImpl.Attribute: i<i id=test-+()shp1384568808865916787.1>=22.0, SimpleFeatureImpl.Attribute: j<j id=test-+()shp1384568808865916787.1>=1234567890123456789, SimpleFeatureImpl.Attribute: k<k id=test-+()shp1384568808865916787.1>=1.2345678901234568E26, SimpleFeatureImpl.Attribute: l<l id=test-+()shp1384568808865916787.1>=1234567890123456789, SimpleFeatureImpl.Attribute: m<m id=test-+()shp1384568808865916787.1>=Wed Dec 31 00:00:00 EST 1969, SimpleFeatureImpl.Attribute: n<n id=test-+()shp1384568808865916787.1>=21cad319-fb06-49bc-b20d-f2968863ef49]
2018-06-23T21:09:24.368-0400  WARNING  Writing DBF data, value 12,345,678,901,234,567,890,123,456,789 cannot be represented in size 19
2018-06-23T21:09:24.369-0400  WARNING  Writing DBF data, value 12,345,678,901,234,567,890,123,456,789 cannot be represented in size 19
2018-06-23T21:09:24.369-0400  WARNING  Writing DBF data, value 12,345,678,901,234,567,890,123,456,789 cannot be represented in size 19
2018-06-23T21:09:24.370-0400  WARNING  Writing DBF data, value 12,345,678,901,234,567,890,123,456,789 cannot be represented in size 19
2018-06-23T21:09:24.370-0400  WARNING  Writing DBF data, value 12,345,678,901,234,567,890,123,456,789 cannot be represented in size 19
2018-06-23T21:09:24.370-0400  WARNING  Writing DBF data, value 12,345,678,901,234,567,890,123,456,789 cannot be represented in size 19
2018-06-23T21:09:24.371-0400  WARNING  Writing DBF data, value 12,345,678,901,234,567,890,123,456,789 cannot be represented in size 19
2018-06-23T21:09:24.371-0400  WARNING  Writing DBF data, value 12,345,678,901,234,567,890,123,456,789 cannot be represented in size 19
2018-06-23T21:09:24.371-0400  WARNING  Writing DBF data, value 12,345,678,901,234,567,890,123,456,789 cannot be represented in size 19
2018-06-23T21:09:24.372-0400  WARNING  Writing DBF data, value 12,345,678,901,234,567,890,123,456,789 cannot be represented in size 19
2018-06-23T21:09:24.372-0400  WARNING  Writing DBF data, value 12,345,678,901,234,567,890,123,456,789 cannot be represented in size 19
2018-06-23T21:09:24.372-0400  WARNING  Writing DBF data, value 12,345,678,901,234,567,890,123,456,789 cannot be represented in size 19
2018-06-23T21:09:24.373-0400  WARNING  Writing DBF data, value 12,345,678,901,234,567,890,123,456,789 cannot be represented in size 19
2018-06-23T21:09:24.373-0400  WARNING  Writing DBF data, value 12,345,678,901,234,567,890,123,456,789 cannot be represented in size 19
2018-06-23T21:09:24.373-0400  WARNING  Writing DBF data, value 12,345,678,901,234,567,890,123,456,789 cannot be represented in size 19
2018-06-23T21:09:24.374-0400  WARNING  Writing DBF data, value 12,345,678,901,234,567,890,123,456,789 cannot be represented in size 19
2018-06-23T21:09:24.374-0400  WARNING  Writing DBF data, value 12,345,678,901,234,567,890,123,456,789 cannot be represented in size 19
2018-06-23T21:09:24.374-0400  WARNING  Writing DBF data, value 12,345,678,901,234,567,890,123,456,789 cannot be represented in size 19
2018-06-23T21:09:24.375-0400  WARNING  Writing DBF data, value 12,345,678,901,234,567,890,123,456,789 cannot be represented in size 19
2018-06-23T21:09:24.375-0400  WARNING  Writing DBF data, value 12,345,678,901,234,567,890,123,456,789 cannot be represented in size 19
2018-06-23T21:09:24.643-0400  WARNING  Writing DBF data, value 12,345,678,901,234,567,890,123,456,789 cannot be represented in size 19
2018-06-23T21:09:24.643-0400  WARNING  Writing DBF data, value 12,345,678,901,234,567,890,123,456,789 cannot be represented in size 19
2018-06-23T21:09:24.644-0400  WARNING  Writing DBF data, value 12,345,678,901,234,567,890,123,456,789 cannot be represented in size 19
2018-06-23T21:09:24.644-0400  WARNING  Writing DBF data, value 12,345,678,901,234,567,890,123,456,789 cannot be represented in size 19
2018-06-23T21:09:24.644-0400  WARNING  Writing DBF data, value 12,345,678,901,234,567,890,123,456,789 cannot be represented in size 19
2018-06-23T21:09:24.645-0400  WARNING  Writing DBF data, value 12,345,678,901,234,567,890,123,456,789 cannot be represented in size 19
2018-06-23T21:09:24.645-0400  WARNING  Writing DBF data, value 12,345,678,901,234,567,890,123,456,789 cannot be represented in size 19
2018-06-23T21:09:24.646-0400  WARNING  Writing DBF data, value 12,345,678,901,234,567,890,123,456,789 cannot be represented in size 19
2018-06-23T21:09:24.646-0400  WARNING  Writing DBF data, value 12,345,678,901,234,567,890,123,456,789 cannot be represented in size 19
2018-06-23T21:09:24.646-0400  WARNING  Writing DBF data, value 12,345,678,901,234,567,890,123,456,789 cannot be represented in size 19
2018-06-23T21:09:24.647-0400  WARNING  Writing DBF data, value 12,345,678,901,234,567,890,123,456,789 cannot be represented in size 19
2018-06-23T21:09:24.647-0400  WARNING  Writing DBF data, value 12,345,678,901,234,567,890,123,456,789 cannot be represented in size 19
2018-06-23T21:09:24.648-0400  WARNING  Writing DBF data, value 12,345,678,901,234,567,890,123,456,789 cannot be represented in size 19
2018-06-23T21:09:24.648-0400  WARNING  Writing DBF data, value 12,345,678,901,234,567,890,123,456,789 cannot be represented in size 19
2018-06-23T21:09:24.648-0400  WARNING  Writing DBF data, value 12,345,678,901,234,567,890,123,456,789 cannot be represented in size 19
2018-06-23T21:09:24.649-0400  WARNING  Writing DBF data, value 12,345,678,901,234,567,890,123,456,789 cannot be represented in size 19
2018-06-23T21:09:24.649-0400  WARNING  Writing DBF data, value 12,345,678,901,234,567,890,123,456,789 cannot be represented in size 19
2018-06-23T21:09:24.649-0400  WARNING  Writing DBF data, value 12,345,678,901,234,567,890,123,456,789 cannot be represented in size 19
2018-06-23T21:09:24.650-0400  WARNING  Writing DBF data, value 12,345,678,901,234,567,890,123,456,789 cannot be represented in size 19
2018-06-23T21:09:24.650-0400  WARNING  Writing DBF data, value 12,345,678,901,234,567,890,123,456,789 cannot be represented in size 19
2018-06-23T21:09:24.853-0400  WARNING  Writing DBF data, value 12,345,678,901,234,567,890,123,456,789 cannot be represented in size 19
2018-06-23T21:09:24.853-0400  WARNING  Writing DBF data, value 12,345,678,901,234,567,890,123,456,789 cannot be represented in size 19
2018-06-23T21:09:24.854-0400  WARNING  Writing DBF data, value 12,345,678,901,234,567,890,123,456,789 cannot be represented in size 19
2018-06-23T21:09:24.854-0400  WARNING  Writing DBF data, value 12,345,678,901,234,567,890,123,456,789 cannot be represented in size 19
2018-06-23T21:09:24.855-0400  WARNING  Writing DBF data, value 12,345,678,901,234,567,890,123,456,789 cannot be represented in size 19
2018-06-23T21:09:24.855-0400  WARNING  Writing DBF data, value 12,345,678,901,234,567,890,123,456,789 cannot be represented in size 19
2018-06-23T21:09:24.856-0400  WARNING  Writing DBF data, value 12,345,678,901,234,567,890,123,456,789 cannot be represented in size 19
2018-06-23T21:09:24.856-0400  WARNING  Writing DBF data, value 12,345,678,901,234,567,890,123,456,789 cannot be represented in size 19
2018-06-23T21:09:24.856-0400  WARNING  Writing DBF data, value 12,345,678,901,234,567,890,123,456,789 cannot be represented in size 19
2018-06-23T21:09:24.857-0400  WARNING  Writing DBF data, value 12,345,678,901,234,567,890,123,456,789 cannot be represented in size 19
2018-06-23T21:09:24.857-0400  WARNING  Writing DBF data, value 12,345,678,901,234,567,890,123,456,789 cannot be represented in size 19
2018-06-23T21:09:24.857-0400  WARNING  Writing DBF data, value 12,345,678,901,234,567,890,123,456,789 cannot be represented in size 19
2018-06-23T21:09:24.858-0400  WARNING  Writing DBF data, value 12,345,678,901,234,567,890,123,456,789 cannot be represented in size 19
2018-06-23T21:09:24.858-0400  WARNING  Writing DBF data, value 12,345,678,901,234,567,890,123,456,789 cannot be represented in size 19
2018-06-23T21:09:24.858-0400  WARNING  Writing DBF data, value 12,345,678,901,234,567,890,123,456,789 cannot be represented in size 19
2018-06-23T21:09:24.859-0400  WARNING  Writing DBF data, value 12,345,678,901,234,567,890,123,456,789 cannot be represented in size 19
2018-06-23T21:09:24.859-0400  WARNING  Writing DBF data, value 12,345,678,901,234,567,890,123,456,789 cannot be represented in size 19
2018-06-23T21:09:24.859-0400  WARNING  Writing DBF data, value 12,345,678,901,234,567,890,123,456,789 cannot be represented in size 19
2018-06-23T21:09:24.860-0400  WARNING  Writing DBF data, value 12,345,678,901,234,567,890,123,456,789 cannot be represented in size 19
2018-06-23T21:09:24.860-0400  WARNING  Writing DBF data, value 12,345,678,901,234,567,890,123,456,789 cannot be represented in size 19
Tests run: 52, Failures: 0, Errors: 0, Skipped: 0, Time elapsed: 2.849 sec - in org.geotools.data.shapefile.ShapefileDataStoreTest
Running org.geotools.data.shapefile.ShapefileDumperTest
Tests run: 14, Failures: 0, Errors: 0, Skipped: 0, Time elapsed: 0.755 sec - in org.geotools.data.shapefile.ShapefileDumperTest
Running org.geotools.data.shapefile.ShapefileNullHandlingTest
Tests run: 1, Failures: 0, Errors: 0, Skipped: 0, Time elapsed: 0.015 sec - in org.geotools.data.shapefile.ShapefileNullHandlingTest
Running org.geotools.data.shapefile.ShapefileQuadTreeReadWriteTest
2018-06-23T21:09:33.113-0400  WARNING  Could not open the .shx file, continuing assuming the .shp file is not sparse
java.io.FileNotFoundException: /home/hudson/genie.jts/.jenkins/jobs/GeoTools-Master/workspace/modules/plugin/shapefile/target/test-classes/org/geotools/data/shapefile/test-data/shapes/stream.shx (No such file or directory)
	at java.io.RandomAccessFile.open0(Native Method)
	at java.io.RandomAccessFile.open(RandomAccessFile.java:316)
	at java.io.RandomAccessFile.<init>(RandomAccessFile.java:243)
	at org.geotools.data.shapefile.files.ShpFiles.getReadChannel(ShpFiles.java:758)
	at org.geotools.data.shapefile.shp.IndexFile.<init>(IndexFile.java:72)
	at org.geotools.data.shapefile.shp.ShapefileReader.<init>(ShapefileReader.java:267)
	at org.geotools.data.shapefile.ShapefileSetManager.openShapeReader(ShapefileSetManager.java:48)
	at org.geotools.data.shapefile.ShapefileFeatureSource.readAttributes(ShapefileFeatureSource.java:520)
	at org.geotools.data.shapefile.ShapefileFeatureSource.buildFeatureType(ShapefileFeatureSource.java:479)
	at org.geotools.data.shapefile.ShapefileFeatureStore.buildFeatureType(ShapefileFeatureStore.java:137)
	at org.geotools.data.store.ContentFeatureSource.getAbsoluteSchema(ContentFeatureSource.java:328)
	at org.geotools.data.store.ContentFeatureSource.getSchema(ContentFeatureSource.java:297)
	at org.geotools.data.store.ContentFeatureSource.getSchema(ContentFeatureSource.java:106)
	at org.geotools.data.shapefile.ShapefileQuadTreeReadWriteTest.testWriteTwice(ShapefileQuadTreeReadWriteTest.java:100)
	at sun.reflect.NativeMethodAccessorImpl.invoke0(Native Method)
	at sun.reflect.NativeMethodAccessorImpl.invoke(NativeMethodAccessorImpl.java:62)
	at sun.reflect.DelegatingMethodAccessorImpl.invoke(DelegatingMethodAccessorImpl.java:43)
	at java.lang.reflect.Method.invoke(Method.java:498)
	at org.junit.runners.model.FrameworkMethod$1.runReflectiveCall(FrameworkMethod.java:47)
	at org.junit.internal.runners.model.ReflectiveCallable.run(ReflectiveCallable.java:12)
	at org.junit.runners.model.FrameworkMethod.invokeExplosively(FrameworkMethod.java:44)
	at org.junit.internal.runners.statements.InvokeMethod.evaluate(InvokeMethod.java:17)
	at org.junit.internal.runners.statements.RunAfters.evaluate(RunAfters.java:27)
	at org.junit.runners.ParentRunner.runLeaf(ParentRunner.java:271)
	at org.junit.runners.BlockJUnit4ClassRunner.runChild(BlockJUnit4ClassRunner.java:70)
	at org.junit.runners.BlockJUnit4ClassRunner.runChild(BlockJUnit4ClassRunner.java:50)
	at org.junit.runners.ParentRunner$3.run(ParentRunner.java:238)
	at org.junit.runners.ParentRunner$1.schedule(ParentRunner.java:63)
	at org.junit.runners.ParentRunner.runChildren(ParentRunner.java:236)
	at org.junit.runners.ParentRunner.access$000(ParentRunner.java:53)
	at org.junit.runners.ParentRunner$2.evaluate(ParentRunner.java:229)
	at org.junit.runners.ParentRunner.run(ParentRunner.java:309)
	at org.apache.maven.surefire.junit4.JUnit4Provider.execute(JUnit4Provider.java:264)
	at org.apache.maven.surefire.junit4.JUnit4Provider.executeTestSet(JUnit4Provider.java:153)
	at org.apache.maven.surefire.junit4.JUnit4Provider.invoke(JUnit4Provider.java:124)
	at org.apache.maven.surefire.booter.ForkedBooter.invokeProviderInSameClassLoader(ForkedBooter.java:200)
	at org.apache.maven.surefire.booter.ForkedBooter.runSuitesInProcess(ForkedBooter.java:153)
	at org.apache.maven.surefire.booter.ForkedBooter.main(ForkedBooter.java:103)

2018-06-23T21:09:33.146-0400  WARNING  Could not open the .shx file, continuing assuming the .shp file is not sparse
java.io.FileNotFoundException: /home/hudson/genie.jts/.jenkins/jobs/GeoTools-Master/workspace/modules/plugin/shapefile/target/test-classes/org/geotools/data/shapefile/test-data/shapes/stream.shx (No such file or directory)
	at java.io.RandomAccessFile.open0(Native Method)
	at java.io.RandomAccessFile.open(RandomAccessFile.java:316)
	at java.io.RandomAccessFile.<init>(RandomAccessFile.java:243)
	at org.geotools.data.shapefile.files.ShpFiles.getReadChannel(ShpFiles.java:758)
	at org.geotools.data.shapefile.shp.IndexFile.<init>(IndexFile.java:72)
	at org.geotools.data.shapefile.shp.ShapefileReader.<init>(ShapefileReader.java:267)
	at org.geotools.data.shapefile.ShapefileSetManager.openShapeReader(ShapefileSetManager.java:48)
	at org.geotools.data.shapefile.ShapefileFeatureSource.getReaderInternal(ShapefileFeatureSource.java:369)
	at org.geotools.data.shapefile.ShapefileFeatureStore.getReaderInternal(ShapefileFeatureStore.java:132)
	at org.geotools.data.store.ContentFeatureSource.getReader(ContentFeatureSource.java:610)
	at org.geotools.data.store.ContentFeatureCollection.features(ContentFeatureCollection.java:164)
	at org.geotools.data.store.ContentFeatureCollection.features(ContentFeatureCollection.java:53)
	at org.geotools.data.store.ContentFeatureStore.addFeatures(ContentFeatureStore.java:254)
	at org.geotools.data.shapefile.ShapefileQuadTreeReadWriteTest.doubleWrite(ShapefileQuadTreeReadWriteTest.java:133)
	at org.geotools.data.shapefile.ShapefileQuadTreeReadWriteTest.testWriteTwice(ShapefileQuadTreeReadWriteTest.java:105)
	at sun.reflect.NativeMethodAccessorImpl.invoke0(Native Method)
	at sun.reflect.NativeMethodAccessorImpl.invoke(NativeMethodAccessorImpl.java:62)
	at sun.reflect.DelegatingMethodAccessorImpl.invoke(DelegatingMethodAccessorImpl.java:43)
	at java.lang.reflect.Method.invoke(Method.java:498)
	at org.junit.runners.model.FrameworkMethod$1.runReflectiveCall(FrameworkMethod.java:47)
	at org.junit.internal.runners.model.ReflectiveCallable.run(ReflectiveCallable.java:12)
	at org.junit.runners.model.FrameworkMethod.invokeExplosively(FrameworkMethod.java:44)
	at org.junit.internal.runners.statements.InvokeMethod.evaluate(InvokeMethod.java:17)
	at org.junit.internal.runners.statements.RunAfters.evaluate(RunAfters.java:27)
	at org.junit.runners.ParentRunner.runLeaf(ParentRunner.java:271)
	at org.junit.runners.BlockJUnit4ClassRunner.runChild(BlockJUnit4ClassRunner.java:70)
	at org.junit.runners.BlockJUnit4ClassRunner.runChild(BlockJUnit4ClassRunner.java:50)
	at org.junit.runners.ParentRunner$3.run(ParentRunner.java:238)
	at org.junit.runners.ParentRunner$1.schedule(ParentRunner.java:63)
	at org.junit.runners.ParentRunner.runChildren(ParentRunner.java:236)
	at org.junit.runners.ParentRunner.access$000(ParentRunner.java:53)
	at org.junit.runners.ParentRunner$2.evaluate(ParentRunner.java:229)
	at org.junit.runners.ParentRunner.run(ParentRunner.java:309)
	at org.apache.maven.surefire.junit4.JUnit4Provider.execute(JUnit4Provider.java:264)
	at org.apache.maven.surefire.junit4.JUnit4Provider.executeTestSet(JUnit4Provider.java:153)
	at org.apache.maven.surefire.junit4.JUnit4Provider.invoke(JUnit4Provider.java:124)
	at org.apache.maven.surefire.booter.ForkedBooter.invokeProviderInSameClassLoader(ForkedBooter.java:200)
	at org.apache.maven.surefire.booter.ForkedBooter.runSuitesInProcess(ForkedBooter.java:153)
	at org.apache.maven.surefire.booter.ForkedBooter.main(ForkedBooter.java:103)

2018-06-23T21:09:33.203-0400  WARNING  Could not open the .shx file, continuing assuming the .shp file is not sparse
java.io.FileNotFoundException: /home/hudson/genie.jts/.jenkins/jobs/GeoTools-Master/workspace/modules/plugin/shapefile/target/test-classes/org/geotools/data/shapefile/test-data/shapes/stream.shx (No such file or directory)
	at java.io.RandomAccessFile.open0(Native Method)
	at java.io.RandomAccessFile.open(RandomAccessFile.java:316)
	at java.io.RandomAccessFile.<init>(RandomAccessFile.java:243)
	at org.geotools.data.shapefile.files.ShpFiles.getReadChannel(ShpFiles.java:758)
	at org.geotools.data.shapefile.shp.IndexFile.<init>(IndexFile.java:72)
	at org.geotools.data.shapefile.shp.ShapefileReader.<init>(ShapefileReader.java:267)
	at org.geotools.data.shapefile.ShapefileSetManager.openShapeReader(ShapefileSetManager.java:48)
	at org.geotools.data.shapefile.ShapefileFeatureSource.getCountInternal(ShapefileFeatureSource.java:290)
	at org.geotools.data.shapefile.ShapefileFeatureStore.getCountInternal(ShapefileFeatureStore.java:126)
	at org.geotools.data.store.ContentFeatureSource.getCount(ContentFeatureSource.java:464)
	at org.geotools.data.store.ContentFeatureCollection.size(ContentFeatureCollection.java:226)
	at org.geotools.data.shapefile.ShapefileQuadTreeReadWriteTest.doubleWrite(ShapefileQuadTreeReadWriteTest.java:134)
	at org.geotools.data.shapefile.ShapefileQuadTreeReadWriteTest.testWriteTwice(ShapefileQuadTreeReadWriteTest.java:105)
	at sun.reflect.NativeMethodAccessorImpl.invoke0(Native Method)
	at sun.reflect.NativeMethodAccessorImpl.invoke(NativeMethodAccessorImpl.java:62)
	at sun.reflect.DelegatingMethodAccessorImpl.invoke(DelegatingMethodAccessorImpl.java:43)
	at java.lang.reflect.Method.invoke(Method.java:498)
	at org.junit.runners.model.FrameworkMethod$1.runReflectiveCall(FrameworkMethod.java:47)
	at org.junit.internal.runners.model.ReflectiveCallable.run(ReflectiveCallable.java:12)
	at org.junit.runners.model.FrameworkMethod.invokeExplosively(FrameworkMethod.java:44)
	at org.junit.internal.runners.statements.InvokeMethod.evaluate(InvokeMethod.java:17)
	at org.junit.internal.runners.statements.RunAfters.evaluate(RunAfters.java:27)
	at org.junit.runners.ParentRunner.runLeaf(ParentRunner.java:271)
	at org.junit.runners.BlockJUnit4ClassRunner.runChild(BlockJUnit4ClassRunner.java:70)
	at org.junit.runners.BlockJUnit4ClassRunner.runChild(BlockJUnit4ClassRunner.java:50)
	at org.junit.runners.ParentRunner$3.run(ParentRunner.java:238)
	at org.junit.runners.ParentRunner$1.schedule(ParentRunner.java:63)
	at org.junit.runners.ParentRunner.runChildren(ParentRunner.java:236)
	at org.junit.runners.ParentRunner.access$000(ParentRunner.java:53)
	at org.junit.runners.ParentRunner$2.evaluate(ParentRunner.java:229)
	at org.junit.runners.ParentRunner.run(ParentRunner.java:309)
	at org.apache.maven.surefire.junit4.JUnit4Provider.execute(JUnit4Provider.java:264)
	at org.apache.maven.surefire.junit4.JUnit4Provider.executeTestSet(JUnit4Provider.java:153)
	at org.apache.maven.surefire.junit4.JUnit4Provider.invoke(JUnit4Provider.java:124)
	at org.apache.maven.surefire.booter.ForkedBooter.invokeProviderInSameClassLoader(ForkedBooter.java:200)
	at org.apache.maven.surefire.booter.ForkedBooter.runSuitesInProcess(ForkedBooter.java:153)
	at org.apache.maven.surefire.booter.ForkedBooter.main(ForkedBooter.java:103)

2018-06-23T21:09:33.215-0400  WARNING  Could not open the .shx file, continuing assuming the .shp file is not sparse
java.io.FileNotFoundException: /home/hudson/genie.jts/.jenkins/jobs/GeoTools-Master/workspace/modules/plugin/shapefile/target/test-classes/org/geotools/data/shapefile/test-data/shapes/stream.shx (No such file or directory)
	at java.io.RandomAccessFile.open0(Native Method)
	at java.io.RandomAccessFile.open(RandomAccessFile.java:316)
	at java.io.RandomAccessFile.<init>(RandomAccessFile.java:243)
	at org.geotools.data.shapefile.files.ShpFiles.getReadChannel(ShpFiles.java:758)
	at org.geotools.data.shapefile.shp.IndexFile.<init>(IndexFile.java:72)
	at org.geotools.data.shapefile.shp.ShapefileReader.<init>(ShapefileReader.java:267)
	at org.geotools.data.shapefile.ShapefileSetManager.openShapeReader(ShapefileSetManager.java:48)
	at org.geotools.data.shapefile.ShapefileFeatureSource.getReaderInternal(ShapefileFeatureSource.java:369)
	at org.geotools.data.shapefile.ShapefileFeatureStore.getReaderInternal(ShapefileFeatureStore.java:132)
	at org.geotools.data.store.ContentFeatureSource.getReader(ContentFeatureSource.java:610)
	at org.geotools.data.store.ContentFeatureCollection.features(ContentFeatureCollection.java:164)
	at org.geotools.data.store.ContentFeatureCollection.features(ContentFeatureCollection.java:53)
	at org.geotools.data.store.ContentFeatureStore.addFeatures(ContentFeatureStore.java:254)
	at org.geotools.data.shapefile.ShapefileQuadTreeReadWriteTest.doubleWrite(ShapefileQuadTreeReadWriteTest.java:135)
	at org.geotools.data.shapefile.ShapefileQuadTreeReadWriteTest.testWriteTwice(ShapefileQuadTreeReadWriteTest.java:105)
	at sun.reflect.NativeMethodAccessorImpl.invoke0(Native Method)
	at sun.reflect.NativeMethodAccessorImpl.invoke(NativeMethodAccessorImpl.java:62)
	at sun.reflect.DelegatingMethodAccessorImpl.invoke(DelegatingMethodAccessorImpl.java:43)
	at java.lang.reflect.Method.invoke(Method.java:498)
	at org.junit.runners.model.FrameworkMethod$1.runReflectiveCall(FrameworkMethod.java:47)
	at org.junit.internal.runners.model.ReflectiveCallable.run(ReflectiveCallable.java:12)
	at org.junit.runners.model.FrameworkMethod.invokeExplosively(FrameworkMethod.java:44)
	at org.junit.internal.runners.statements.InvokeMethod.evaluate(InvokeMethod.java:17)
	at org.junit.internal.runners.statements.RunAfters.evaluate(RunAfters.java:27)
	at org.junit.runners.ParentRunner.runLeaf(ParentRunner.java:271)
	at org.junit.runners.BlockJUnit4ClassRunner.runChild(BlockJUnit4ClassRunner.java:70)
	at org.junit.runners.BlockJUnit4ClassRunner.runChild(BlockJUnit4ClassRunner.java:50)
	at org.junit.runners.ParentRunner$3.run(ParentRunner.java:238)
	at org.junit.runners.ParentRunner$1.schedule(ParentRunner.java:63)
	at org.junit.runners.ParentRunner.runChildren(ParentRunner.java:236)
	at org.junit.runners.ParentRunner.access$000(ParentRunner.java:53)
	at org.junit.runners.ParentRunner$2.evaluate(ParentRunner.java:229)
	at org.junit.runners.ParentRunner.run(ParentRunner.java:309)
	at org.apache.maven.surefire.junit4.JUnit4Provider.execute(JUnit4Provider.java:264)
	at org.apache.maven.surefire.junit4.JUnit4Provider.executeTestSet(JUnit4Provider.java:153)
	at org.apache.maven.surefire.junit4.JUnit4Provider.invoke(JUnit4Provider.java:124)
	at org.apache.maven.surefire.booter.ForkedBooter.invokeProviderInSameClassLoader(ForkedBooter.java:200)
	at org.apache.maven.surefire.booter.ForkedBooter.runSuitesInProcess(ForkedBooter.java:153)
	at org.apache.maven.surefire.booter.ForkedBooter.main(ForkedBooter.java:103)

2018-06-23T21:09:33.259-0400  WARNING  Could not open the .shx file, continuing assuming the .shp file is not sparse
java.io.FileNotFoundException: /home/hudson/genie.jts/.jenkins/jobs/GeoTools-Master/workspace/modules/plugin/shapefile/target/test-classes/org/geotools/data/shapefile/test-data/shapes/stream.shx (No such file or directory)
	at java.io.RandomAccessFile.open0(Native Method)
	at java.io.RandomAccessFile.open(RandomAccessFile.java:316)
	at java.io.RandomAccessFile.<init>(RandomAccessFile.java:243)
	at org.geotools.data.shapefile.files.ShpFiles.getReadChannel(ShpFiles.java:758)
	at org.geotools.data.shapefile.shp.IndexFile.<init>(IndexFile.java:72)
	at org.geotools.data.shapefile.shp.ShapefileReader.<init>(ShapefileReader.java:267)
	at org.geotools.data.shapefile.ShapefileSetManager.openShapeReader(ShapefileSetManager.java:48)
	at org.geotools.data.shapefile.ShapefileFeatureSource.getCountInternal(ShapefileFeatureSource.java:290)
	at org.geotools.data.shapefile.ShapefileFeatureStore.getCountInternal(ShapefileFeatureStore.java:126)
	at org.geotools.data.store.ContentFeatureSource.getCount(ContentFeatureSource.java:464)
	at org.geotools.data.store.ContentFeatureCollection.size(ContentFeatureCollection.java:226)
	at org.geotools.data.shapefile.ShapefileQuadTreeReadWriteTest.doubleWrite(ShapefileQuadTreeReadWriteTest.java:137)
	at org.geotools.data.shapefile.ShapefileQuadTreeReadWriteTest.testWriteTwice(ShapefileQuadTreeReadWriteTest.java:105)
	at sun.reflect.NativeMethodAccessorImpl.invoke0(Native Method)
	at sun.reflect.NativeMethodAccessorImpl.invoke(NativeMethodAccessorImpl.java:62)
	at sun.reflect.DelegatingMethodAccessorImpl.invoke(DelegatingMethodAccessorImpl.java:43)
	at java.lang.reflect.Method.invoke(Method.java:498)
	at org.junit.runners.model.FrameworkMethod$1.runReflectiveCall(FrameworkMethod.java:47)
	at org.junit.internal.runners.model.ReflectiveCallable.run(ReflectiveCallable.java:12)
	at org.junit.runners.model.FrameworkMethod.invokeExplosively(FrameworkMethod.java:44)
	at org.junit.internal.runners.statements.InvokeMethod.evaluate(InvokeMethod.java:17)
	at org.junit.internal.runners.statements.RunAfters.evaluate(RunAfters.java:27)
	at org.junit.runners.ParentRunner.runLeaf(ParentRunner.java:271)
	at org.junit.runners.BlockJUnit4ClassRunner.runChild(BlockJUnit4ClassRunner.java:70)
	at org.junit.runners.BlockJUnit4ClassRunner.runChild(BlockJUnit4ClassRunner.java:50)
	at org.junit.runners.ParentRunner$3.run(ParentRunner.java:238)
	at org.junit.runners.ParentRunner$1.schedule(ParentRunner.java:63)
	at org.junit.runners.ParentRunner.runChildren(ParentRunner.java:236)
	at org.junit.runners.ParentRunner.access$000(ParentRunner.java:53)
	at org.junit.runners.ParentRunner$2.evaluate(ParentRunner.java:229)
	at org.junit.runners.ParentRunner.run(ParentRunner.java:309)
	at org.apache.maven.surefire.junit4.JUnit4Provider.execute(JUnit4Provider.java:264)
	at org.apache.maven.surefire.junit4.JUnit4Provider.executeTestSet(JUnit4Provider.java:153)
	at org.apache.maven.surefire.junit4.JUnit4Provider.invoke(JUnit4Provider.java:124)
	at org.apache.maven.surefire.booter.ForkedBooter.invokeProviderInSameClassLoader(ForkedBooter.java:200)
	at org.apache.maven.surefire.booter.ForkedBooter.runSuitesInProcess(ForkedBooter.java:153)
	at org.apache.maven.surefire.booter.ForkedBooter.main(ForkedBooter.java:103)

2018-06-23T21:09:33.282-0400  WARNING  Could not open the .shx file, continuing assuming the .shp file is not sparse
java.io.FileNotFoundException: /home/hudson/genie.jts/.jenkins/jobs/GeoTools-Master/workspace/modules/plugin/shapefile/target/test-classes/org/geotools/data/shapefile/test-data/shapes/stream.shx (No such file or directory)
	at java.io.RandomAccessFile.open0(Native Method)
	at java.io.RandomAccessFile.open(RandomAccessFile.java:316)
	at java.io.RandomAccessFile.<init>(RandomAccessFile.java:243)
	at org.geotools.data.shapefile.files.ShpFiles.getReadChannel(ShpFiles.java:758)
	at org.geotools.data.shapefile.shp.IndexFile.<init>(IndexFile.java:72)
	at org.geotools.data.shapefile.shp.ShapefileReader.<init>(ShapefileReader.java:267)
	at org.geotools.data.shapefile.ShapefileSetManager.openShapeReader(ShapefileSetManager.java:48)
	at org.geotools.data.shapefile.ShapefileFeatureSource.getReaderInternal(ShapefileFeatureSource.java:369)
	at org.geotools.data.shapefile.ShapefileFeatureStore.getReaderInternal(ShapefileFeatureStore.java:132)
	at org.geotools.data.store.ContentFeatureSource.getReader(ContentFeatureSource.java:610)
	at org.geotools.data.store.ContentFeatureCollection.features(ContentFeatureCollection.java:164)
	at org.geotools.data.store.ContentFeatureCollection.features(ContentFeatureCollection.java:53)
	at org.geotools.data.store.ContentFeatureStore.addFeatures(ContentFeatureStore.java:254)
	at org.geotools.data.shapefile.ShapefileQuadTreeReadWriteTest.doubleWrite(ShapefileQuadTreeReadWriteTest.java:133)
	at org.geotools.data.shapefile.ShapefileQuadTreeReadWriteTest.testWriteTwice(ShapefileQuadTreeReadWriteTest.java:106)
	at sun.reflect.NativeMethodAccessorImpl.invoke0(Native Method)
	at sun.reflect.NativeMethodAccessorImpl.invoke(NativeMethodAccessorImpl.java:62)
	at sun.reflect.DelegatingMethodAccessorImpl.invoke(DelegatingMethodAccessorImpl.java:43)
	at java.lang.reflect.Method.invoke(Method.java:498)
	at org.junit.runners.model.FrameworkMethod$1.runReflectiveCall(FrameworkMethod.java:47)
	at org.junit.internal.runners.model.ReflectiveCallable.run(ReflectiveCallable.java:12)
	at org.junit.runners.model.FrameworkMethod.invokeExplosively(FrameworkMethod.java:44)
	at org.junit.internal.runners.statements.InvokeMethod.evaluate(InvokeMethod.java:17)
	at org.junit.internal.runners.statements.RunAfters.evaluate(RunAfters.java:27)
	at org.junit.runners.ParentRunner.runLeaf(ParentRunner.java:271)
	at org.junit.runners.BlockJUnit4ClassRunner.runChild(BlockJUnit4ClassRunner.java:70)
	at org.junit.runners.BlockJUnit4ClassRunner.runChild(BlockJUnit4ClassRunner.java:50)
	at org.junit.runners.ParentRunner$3.run(ParentRunner.java:238)
	at org.junit.runners.ParentRunner$1.schedule(ParentRunner.java:63)
	at org.junit.runners.ParentRunner.runChildren(ParentRunner.java:236)
	at org.junit.runners.ParentRunner.access$000(ParentRunner.java:53)
	at org.junit.runners.ParentRunner$2.evaluate(ParentRunner.java:229)
	at org.junit.runners.ParentRunner.run(ParentRunner.java:309)
	at org.apache.maven.surefire.junit4.JUnit4Provider.execute(JUnit4Provider.java:264)
	at org.apache.maven.surefire.junit4.JUnit4Provider.executeTestSet(JUnit4Provider.java:153)
	at org.apache.maven.surefire.junit4.JUnit4Provider.invoke(JUnit4Provider.java:124)
	at org.apache.maven.surefire.booter.ForkedBooter.invokeProviderInSameClassLoader(ForkedBooter.java:200)
	at org.apache.maven.surefire.booter.ForkedBooter.runSuitesInProcess(ForkedBooter.java:153)
	at org.apache.maven.surefire.booter.ForkedBooter.main(ForkedBooter.java:103)

2018-06-23T21:09:33.322-0400  WARNING  Could not open the .shx file, continuing assuming the .shp file is not sparse
java.io.FileNotFoundException: /home/hudson/genie.jts/.jenkins/jobs/GeoTools-Master/workspace/modules/plugin/shapefile/target/test-classes/org/geotools/data/shapefile/test-data/shapes/stream.shx (No such file or directory)
	at java.io.RandomAccessFile.open0(Native Method)
	at java.io.RandomAccessFile.open(RandomAccessFile.java:316)
	at java.io.RandomAccessFile.<init>(RandomAccessFile.java:243)
	at org.geotools.data.shapefile.files.ShpFiles.getReadChannel(ShpFiles.java:758)
	at org.geotools.data.shapefile.shp.IndexFile.<init>(IndexFile.java:72)
	at org.geotools.data.shapefile.shp.ShapefileReader.<init>(ShapefileReader.java:267)
	at org.geotools.data.shapefile.ShapefileSetManager.openShapeReader(ShapefileSetManager.java:48)
	at org.geotools.data.shapefile.ShapefileFeatureSource.getCountInternal(ShapefileFeatureSource.java:290)
	at org.geotools.data.shapefile.ShapefileFeatureStore.getCountInternal(ShapefileFeatureStore.java:126)
	at org.geotools.data.store.ContentFeatureSource.getCount(ContentFeatureSource.java:464)
	at org.geotools.data.store.ContentFeatureCollection.size(ContentFeatureCollection.java:226)
	at org.geotools.data.shapefile.ShapefileQuadTreeReadWriteTest.doubleWrite(ShapefileQuadTreeReadWriteTest.java:134)
	at org.geotools.data.shapefile.ShapefileQuadTreeReadWriteTest.testWriteTwice(ShapefileQuadTreeReadWriteTest.java:106)
	at sun.reflect.NativeMethodAccessorImpl.invoke0(Native Method)
	at sun.reflect.NativeMethodAccessorImpl.invoke(NativeMethodAccessorImpl.java:62)
	at sun.reflect.DelegatingMethodAccessorImpl.invoke(DelegatingMethodAccessorImpl.java:43)
	at java.lang.reflect.Method.invoke(Method.java:498)
	at org.junit.runners.model.FrameworkMethod$1.runReflectiveCall(FrameworkMethod.java:47)
	at org.junit.internal.runners.model.ReflectiveCallable.run(ReflectiveCallable.java:12)
	at org.junit.runners.model.FrameworkMethod.invokeExplosively(FrameworkMethod.java:44)
	at org.junit.internal.runners.statements.InvokeMethod.evaluate(InvokeMethod.java:17)
	at org.junit.internal.runners.statements.RunAfters.evaluate(RunAfters.java:27)
	at org.junit.runners.ParentRunner.runLeaf(ParentRunner.java:271)
	at org.junit.runners.BlockJUnit4ClassRunner.runChild(BlockJUnit4ClassRunner.java:70)
	at org.junit.runners.BlockJUnit4ClassRunner.runChild(BlockJUnit4ClassRunner.java:50)
	at org.junit.runners.ParentRunner$3.run(ParentRunner.java:238)
	at org.junit.runners.ParentRunner$1.schedule(ParentRunner.java:63)
	at org.junit.runners.ParentRunner.runChildren(ParentRunner.java:236)
	at org.junit.runners.ParentRunner.access$000(ParentRunner.java:53)
	at org.junit.runners.ParentRunner$2.evaluate(ParentRunner.java:229)
	at org.junit.runners.ParentRunner.run(ParentRunner.java:309)
	at org.apache.maven.surefire.junit4.JUnit4Provider.execute(JUnit4Provider.java:264)
	at org.apache.maven.surefire.junit4.JUnit4Provider.executeTestSet(JUnit4Provider.java:153)
	at org.apache.maven.surefire.junit4.JUnit4Provider.invoke(JUnit4Provider.java:124)
	at org.apache.maven.surefire.booter.ForkedBooter.invokeProviderInSameClassLoader(ForkedBooter.java:200)
	at org.apache.maven.surefire.booter.ForkedBooter.runSuitesInProcess(ForkedBooter.java:153)
	at org.apache.maven.surefire.booter.ForkedBooter.main(ForkedBooter.java:103)

2018-06-23T21:09:33.333-0400  WARNING  Could not open the .shx file, continuing assuming the .shp file is not sparse
java.io.FileNotFoundException: /home/hudson/genie.jts/.jenkins/jobs/GeoTools-Master/workspace/modules/plugin/shapefile/target/test-classes/org/geotools/data/shapefile/test-data/shapes/stream.shx (No such file or directory)
	at java.io.RandomAccessFile.open0(Native Method)
	at java.io.RandomAccessFile.open(RandomAccessFile.java:316)
	at java.io.RandomAccessFile.<init>(RandomAccessFile.java:243)
	at org.geotools.data.shapefile.files.ShpFiles.getReadChannel(ShpFiles.java:758)
	at org.geotools.data.shapefile.shp.IndexFile.<init>(IndexFile.java:72)
	at org.geotools.data.shapefile.shp.ShapefileReader.<init>(ShapefileReader.java:267)
	at org.geotools.data.shapefile.ShapefileSetManager.openShapeReader(ShapefileSetManager.java:48)
	at org.geotools.data.shapefile.ShapefileFeatureSource.getReaderInternal(ShapefileFeatureSource.java:369)
	at org.geotools.data.shapefile.ShapefileFeatureStore.getReaderInternal(ShapefileFeatureStore.java:132)
	at org.geotools.data.store.ContentFeatureSource.getReader(ContentFeatureSource.java:610)
	at org.geotools.data.store.ContentFeatureCollection.features(ContentFeatureCollection.java:164)
	at org.geotools.data.store.ContentFeatureCollection.features(ContentFeatureCollection.java:53)
	at org.geotools.data.store.ContentFeatureStore.addFeatures(ContentFeatureStore.java:254)
	at org.geotools.data.shapefile.ShapefileQuadTreeReadWriteTest.doubleWrite(ShapefileQuadTreeReadWriteTest.java:135)
	at org.geotools.data.shapefile.ShapefileQuadTreeReadWriteTest.testWriteTwice(ShapefileQuadTreeReadWriteTest.java:106)
	at sun.reflect.NativeMethodAccessorImpl.invoke0(Native Method)
	at sun.reflect.NativeMethodAccessorImpl.invoke(NativeMethodAccessorImpl.java:62)
	at sun.reflect.DelegatingMethodAccessorImpl.invoke(DelegatingMethodAccessorImpl.java:43)
	at java.lang.reflect.Method.invoke(Method.java:498)
	at org.junit.runners.model.FrameworkMethod$1.runReflectiveCall(FrameworkMethod.java:47)
	at org.junit.internal.runners.model.ReflectiveCallable.run(ReflectiveCallable.java:12)
	at org.junit.runners.model.FrameworkMethod.invokeExplosively(FrameworkMethod.java:44)
	at org.junit.internal.runners.statements.InvokeMethod.evaluate(InvokeMethod.java:17)
	at org.junit.internal.runners.statements.RunAfters.evaluate(RunAfters.java:27)
	at org.junit.runners.ParentRunner.runLeaf(ParentRunner.java:271)
	at org.junit.runners.BlockJUnit4ClassRunner.runChild(BlockJUnit4ClassRunner.java:70)
	at org.junit.runners.BlockJUnit4ClassRunner.runChild(BlockJUnit4ClassRunner.java:50)
	at org.junit.runners.ParentRunner$3.run(ParentRunner.java:238)
	at org.junit.runners.ParentRunner$1.schedule(ParentRunner.java:63)
	at org.junit.runners.ParentRunner.runChildren(ParentRunner.java:236)
	at org.junit.runners.ParentRunner.access$000(ParentRunner.java:53)
	at org.junit.runners.ParentRunner$2.evaluate(ParentRunner.java:229)
	at org.junit.runners.ParentRunner.run(ParentRunner.java:309)
	at org.apache.maven.surefire.junit4.JUnit4Provider.execute(JUnit4Provider.java:264)
	at org.apache.maven.surefire.junit4.JUnit4Provider.executeTestSet(JUnit4Provider.java:153)
	at org.apache.maven.surefire.junit4.JUnit4Provider.invoke(JUnit4Provider.java:124)
	at org.apache.maven.surefire.booter.ForkedBooter.invokeProviderInSameClassLoader(ForkedBooter.java:200)
	at org.apache.maven.surefire.booter.ForkedBooter.runSuitesInProcess(ForkedBooter.java:153)
	at org.apache.maven.surefire.booter.ForkedBooter.main(ForkedBooter.java:103)

2018-06-23T21:09:33.376-0400  WARNING  Could not open the .shx file, continuing assuming the .shp file is not sparse
java.io.FileNotFoundException: /home/hudson/genie.jts/.jenkins/jobs/GeoTools-Master/workspace/modules/plugin/shapefile/target/test-classes/org/geotools/data/shapefile/test-data/shapes/stream.shx (No such file or directory)
	at java.io.RandomAccessFile.open0(Native Method)
	at java.io.RandomAccessFile.open(RandomAccessFile.java:316)
	at java.io.RandomAccessFile.<init>(RandomAccessFile.java:243)
	at org.geotools.data.shapefile.files.ShpFiles.getReadChannel(ShpFiles.java:758)
	at org.geotools.data.shapefile.shp.IndexFile.<init>(IndexFile.java:72)
	at org.geotools.data.shapefile.shp.ShapefileReader.<init>(ShapefileReader.java:267)
	at org.geotools.data.shapefile.ShapefileSetManager.openShapeReader(ShapefileSetManager.java:48)
	at org.geotools.data.shapefile.ShapefileFeatureSource.getCountInternal(ShapefileFeatureSource.java:290)
	at org.geotools.data.shapefile.ShapefileFeatureStore.getCountInternal(ShapefileFeatureStore.java:126)
	at org.geotools.data.store.ContentFeatureSource.getCount(ContentFeatureSource.java:464)
	at org.geotools.data.store.ContentFeatureCollection.size(ContentFeatureCollection.java:226)
	at org.geotools.data.shapefile.ShapefileQuadTreeReadWriteTest.doubleWrite(ShapefileQuadTreeReadWriteTest.java:137)
	at org.geotools.data.shapefile.ShapefileQuadTreeReadWriteTest.testWriteTwice(ShapefileQuadTreeReadWriteTest.java:106)
	at sun.reflect.NativeMethodAccessorImpl.invoke0(Native Method)
	at sun.reflect.NativeMethodAccessorImpl.invoke(NativeMethodAccessorImpl.java:62)
	at sun.reflect.DelegatingMethodAccessorImpl.invoke(DelegatingMethodAccessorImpl.java:43)
	at java.lang.reflect.Method.invoke(Method.java:498)
	at org.junit.runners.model.FrameworkMethod$1.runReflectiveCall(FrameworkMethod.java:47)
	at org.junit.internal.runners.model.ReflectiveCallable.run(ReflectiveCallable.java:12)
	at org.junit.runners.model.FrameworkMethod.invokeExplosively(FrameworkMethod.java:44)
	at org.junit.internal.runners.statements.InvokeMethod.evaluate(InvokeMethod.java:17)
	at org.junit.internal.runners.statements.RunAfters.evaluate(RunAfters.java:27)
	at org.junit.runners.ParentRunner.runLeaf(ParentRunner.java:271)
	at org.junit.runners.BlockJUnit4ClassRunner.runChild(BlockJUnit4ClassRunner.java:70)
	at org.junit.runners.BlockJUnit4ClassRunner.runChild(BlockJUnit4ClassRunner.java:50)
	at org.junit.runners.ParentRunner$3.run(ParentRunner.java:238)
	at org.junit.runners.ParentRunner$1.schedule(ParentRunner.java:63)
	at org.junit.runners.ParentRunner.runChildren(ParentRunner.java:236)
	at org.junit.runners.ParentRunner.access$000(ParentRunner.java:53)
	at org.junit.runners.ParentRunner$2.evaluate(ParentRunner.java:229)
	at org.junit.runners.ParentRunner.run(ParentRunner.java:309)
	at org.apache.maven.surefire.junit4.JUnit4Provider.execute(JUnit4Provider.java:264)
	at org.apache.maven.surefire.junit4.JUnit4Provider.executeTestSet(JUnit4Provider.java:153)
	at org.apache.maven.surefire.junit4.JUnit4Provider.invoke(JUnit4Provider.java:124)
	at org.apache.maven.surefire.booter.ForkedBooter.invokeProviderInSameClassLoader(ForkedBooter.java:200)
	at org.apache.maven.surefire.booter.ForkedBooter.runSuitesInProcess(ForkedBooter.java:153)
	at org.apache.maven.surefire.booter.ForkedBooter.main(ForkedBooter.java:103)

Tests run: 4, Failures: 0, Errors: 0, Skipped: 0, Time elapsed: 7.757 sec - in org.geotools.data.shapefile.ShapefileQuadTreeReadWriteTest
Running org.geotools.data.shapefile.ShapefileReadWriteTest
Tests run: 7, Failures: 0, Errors: 0, Skipped: 0, Time elapsed: 8.547 sec - in org.geotools.data.shapefile.ShapefileReadWriteTest
Running org.geotools.data.shapefile.ShapefileTest
2018-06-23T21:09:42.039-0400  WARNING  Could not open the .shx file, continuing assuming the .shp file is not sparse
java.io.FileNotFoundException: JAR entry org/geotools/test-data/shapes/extraAtEnd.shx not found in /home/hudson/genie.jts/.jenkins/jobs/GeoTools-Master/workspace/modules/library/sample-data/target/gt-sample-data-20-SNAPSHOT.jar
	at sun.net.www.protocol.jar.JarURLConnection.connect(JarURLConnection.java:144)
	at sun.net.www.protocol.jar.JarURLConnection.getInputStream(JarURLConnection.java:152)
	at org.geotools.data.shapefile.files.ShpFiles.getReadChannel(ShpFiles.java:762)
	at org.geotools.data.shapefile.shp.IndexFile.<init>(IndexFile.java:72)
	at org.geotools.data.shapefile.shp.ShapefileReader.<init>(ShapefileReader.java:267)
	at org.geotools.data.shapefile.shp.ShapefileReader.<init>(ShapefileReader.java:238)
	at org.geotools.data.shapefile.ShapefileTest.loadShapes(ShapefileTest.java:279)
	at org.geotools.data.shapefile.ShapefileTest.testExtraAtEnd(ShapefileTest.java:120)
	at sun.reflect.NativeMethodAccessorImpl.invoke0(Native Method)
	at sun.reflect.NativeMethodAccessorImpl.invoke(NativeMethodAccessorImpl.java:62)
	at sun.reflect.DelegatingMethodAccessorImpl.invoke(DelegatingMethodAccessorImpl.java:43)
	at java.lang.reflect.Method.invoke(Method.java:498)
	at org.junit.runners.model.FrameworkMethod$1.runReflectiveCall(FrameworkMethod.java:47)
	at org.junit.internal.runners.model.ReflectiveCallable.run(ReflectiveCallable.java:12)
	at org.junit.runners.model.FrameworkMethod.invokeExplosively(FrameworkMethod.java:44)
	at org.junit.internal.runners.statements.InvokeMethod.evaluate(InvokeMethod.java:17)
	at org.junit.internal.runners.statements.RunAfters.evaluate(RunAfters.java:27)
	at org.junit.runners.ParentRunner.runLeaf(ParentRunner.java:271)
	at org.junit.runners.BlockJUnit4ClassRunner.runChild(BlockJUnit4ClassRunner.java:70)
	at org.junit.runners.BlockJUnit4ClassRunner.runChild(BlockJUnit4ClassRunner.java:50)
	at org.junit.runners.ParentRunner$3.run(ParentRunner.java:238)
	at org.junit.runners.ParentRunner$1.schedule(ParentRunner.java:63)
	at org.junit.runners.ParentRunner.runChildren(ParentRunner.java:236)
	at org.junit.runners.ParentRunner.access$000(ParentRunner.java:53)
	at org.junit.runners.ParentRunner$2.evaluate(ParentRunner.java:229)
	at org.junit.runners.ParentRunner.run(ParentRunner.java:309)
	at org.apache.maven.surefire.junit4.JUnit4Provider.execute(JUnit4Provider.java:264)
	at org.apache.maven.surefire.junit4.JUnit4Provider.executeTestSet(JUnit4Provider.java:153)
	at org.apache.maven.surefire.junit4.JUnit4Provider.invoke(JUnit4Provider.java:124)
	at org.apache.maven.surefire.booter.ForkedBooter.invokeProviderInSameClassLoader(ForkedBooter.java:200)
	at org.apache.maven.surefire.booter.ForkedBooter.runSuitesInProcess(ForkedBooter.java:153)
	at org.apache.maven.surefire.booter.ForkedBooter.main(ForkedBooter.java:103)

2018-06-23T21:09:42.040-0400  WARNING  Could not open the .shx file, continuing assuming the .shp file is not sparse
java.io.FileNotFoundException: JAR entry org/geotools/test-data/shapes/extraAtEnd.shx not found in /home/hudson/genie.jts/.jenkins/jobs/GeoTools-Master/workspace/modules/library/sample-data/target/gt-sample-data-20-SNAPSHOT.jar
	at sun.net.www.protocol.jar.JarURLConnection.connect(JarURLConnection.java:144)
	at sun.net.www.protocol.jar.JarURLConnection.getInputStream(JarURLConnection.java:152)
	at org.geotools.data.shapefile.files.ShpFiles.getReadChannel(ShpFiles.java:762)
	at org.geotools.data.shapefile.shp.IndexFile.<init>(IndexFile.java:72)
	at org.geotools.data.shapefile.shp.ShapefileReader.<init>(ShapefileReader.java:267)
	at org.geotools.data.shapefile.shp.ShapefileReader.<init>(ShapefileReader.java:238)
	at org.geotools.data.shapefile.ShapefileTest.loadMemoryMapped(ShapefileTest.java:477)
	at org.geotools.data.shapefile.ShapefileTest.testExtraAtEnd(ShapefileTest.java:121)
	at sun.reflect.NativeMethodAccessorImpl.invoke0(Native Method)
	at sun.reflect.NativeMethodAccessorImpl.invoke(NativeMethodAccessorImpl.java:62)
	at sun.reflect.DelegatingMethodAccessorImpl.invoke(DelegatingMethodAccessorImpl.java:43)
	at java.lang.reflect.Method.invoke(Method.java:498)
	at org.junit.runners.model.FrameworkMethod$1.runReflectiveCall(FrameworkMethod.java:47)
	at org.junit.internal.runners.model.ReflectiveCallable.run(ReflectiveCallable.java:12)
	at org.junit.runners.model.FrameworkMethod.invokeExplosively(FrameworkMethod.java:44)
	at org.junit.internal.runners.statements.InvokeMethod.evaluate(InvokeMethod.java:17)
	at org.junit.internal.runners.statements.RunAfters.evaluate(RunAfters.java:27)
	at org.junit.runners.ParentRunner.runLeaf(ParentRunner.java:271)
	at org.junit.runners.BlockJUnit4ClassRunner.runChild(BlockJUnit4ClassRunner.java:70)
	at org.junit.runners.BlockJUnit4ClassRunner.runChild(BlockJUnit4ClassRunner.java:50)
	at org.junit.runners.ParentRunner$3.run(ParentRunner.java:238)
	at org.junit.runners.ParentRunner$1.schedule(ParentRunner.java:63)
	at org.junit.runners.ParentRunner.runChildren(ParentRunner.java:236)
	at org.junit.runners.ParentRunner.access$000(ParentRunner.java:53)
	at org.junit.runners.ParentRunner$2.evaluate(ParentRunner.java:229)
	at org.junit.runners.ParentRunner.run(ParentRunner.java:309)
	at org.apache.maven.surefire.junit4.JUnit4Provider.execute(JUnit4Provider.java:264)
	at org.apache.maven.surefire.junit4.JUnit4Provider.executeTestSet(JUnit4Provider.java:153)
	at org.apache.maven.surefire.junit4.JUnit4Provider.invoke(JUnit4Provider.java:124)
	at org.apache.maven.surefire.booter.ForkedBooter.invokeProviderInSameClassLoader(ForkedBooter.java:200)
	at org.apache.maven.surefire.booter.ForkedBooter.runSuitesInProcess(ForkedBooter.java:153)
	at org.apache.maven.surefire.booter.ForkedBooter.main(ForkedBooter.java:103)

Tests run: 18, Failures: 0, Errors: 0, Skipped: 0, Time elapsed: 0.24 sec - in org.geotools.data.shapefile.ShapefileTest
Running org.geotools.data.shapefile.ShpFileTypesTest
Tests run: 7, Failures: 0, Errors: 0, Skipped: 0, Time elapsed: 0 sec - in org.geotools.data.shapefile.ShpFileTypesTest
Running org.geotools.data.shapefile.ShpFilesLockingTest
Tests run: 5, Failures: 2, Errors: 0, Skipped: 0, Time elapsed: 0.122 sec <<< FAILURE! - in org.geotools.data.shapefile.ShpFilesLockingTest
testAcquireWriteFile(org.geotools.data.shapefile.ShpFilesLockingTest)  Time elapsed: 0.009 sec  <<< FAILURE!
org.junit.ComparisonFailure: expected:</[jobs/genie.jt]s/geotools-master/wo...> but was:</[home/hudson/genie.jts/.jenkins/job]s/geotools-master/wo...>
	at org.junit.Assert.assertEquals(Assert.java:115)
	at org.junit.Assert.assertEquals(Assert.java:144)
	at org.geotools.data.shapefile.ShpFilesLockingTest.testAcquireWriteFile(ShpFilesLockingTest.java:86)

testAcquireReadFile(org.geotools.data.shapefile.ShpFilesLockingTest)  Time elapsed: 0.002 sec  <<< FAILURE!
org.junit.ComparisonFailure: expected:</[jobs/genie.jt]s/geotools-master/wo...> but was:</[home/hudson/genie.jts/.jenkins/job]s/geotools-master/wo...>
	at org.junit.Assert.assertEquals(Assert.java:115)
	at org.junit.Assert.assertEquals(Assert.java:144)
	at org.geotools.data.shapefile.ShpFilesLockingTest.testAcquireReadFile(ShpFilesLockingTest.java:63)

Running org.geotools.data.shapefile.ShpFilesTest
Tests run: 11, Failures: 0, Errors: 0, Skipped: 0, Time elapsed: 0.008 sec - in org.geotools.data.shapefile.ShpFilesTest
Running org.geotools.data.shapefile.StorageFileTest
Tests run: 4, Failures: 0, Errors: 0, Skipped: 0, Time elapsed: 0.006 sec - in org.geotools.data.shapefile.StorageFileTest
Running org.geotools.data.shapefile.dbf.DbaseFieldFormatterTest
2018-06-23T21:09:42.344-0400  WARNING  Writing DBF data, value 12,345.678 cannot be represented in size 6
2018-06-23T21:09:42.345-0400  WARNING  Writing DBF data, value 31,415,926,535.898 cannot be represented in size 4
                            12345678->   12345678.000000000000000000000000
                                   0->                                   0
              1.7976931348623157E308->              1.7976931348623157E308
                            4.9E-324->   0.0000000000000000000000000000000
                                 NaN->                                 NaN
                                   0->   0.0000000000000000000000000000000
                           12345.678->   12345.678000000000000000000000000
                3.141592653589793E10->   31415926535.897930000000000000000
                              42.123->   42.123000000000000000000000000000
                                  -1->                                  -1
                   3.141592653589793->   3.1415926535897930000000000000000
                          -987654321->   -987654321.0000000000000000000000
                   3.141592653589793->                                 3.1
2018-06-23T21:09:42.350-0400  WARNING  Writing DBF data, value 3.142 cannot be represented in size 2
2018-06-23T21:09:42.351-0400  WARNING  Writing DBF data, value -3.142 cannot be represented in size 3
                          -987654321->                          -987654321
2018-06-23T21:09:42.351-0400  WARNING  Writing DBF data, value 12,345,678 cannot be represented in size 6
                                1999->   1999.0000000000000000000000000000
                            12345678->                            12345678
                              1999.0->   1999.0000000000000000000000000000
                                1999->                                1999
                                  -1->   -1.000000000000000000000000000000
                         -1.00001E38->                         -1.00001E38
                         -1.00001E38->                         -1.00001E38
               3.141592653589793E100->               3.141592653589793E100
                             -1.0E39->                             -1.0E39
Tests run: 28, Failures: 0, Errors: 0, Skipped: 0, Time elapsed: 0.01 sec - in org.geotools.data.shapefile.dbf.DbaseFieldFormatterTest
Running org.geotools.data.shapefile.dbf.DbaseFileReaderTest
Tests run: 1, Failures: 0, Errors: 0, Skipped: 0, Time elapsed: 0.084 sec - in org.geotools.data.shapefile.dbf.DbaseFileReaderTest
Running org.geotools.data.shapefile.fid.FidIndexerTest
Tests run: 1, Failures: 0, Errors: 0, Skipped: 0, Time elapsed: 0.01 sec - in org.geotools.data.shapefile.fid.FidIndexerTest
Running org.geotools.data.shapefile.fid.FidQueryTest
2018-06-23T21:09:42.493-0400  SEVERE  The following locker still has a lock: read on file:/home/hudson/genie.jts/.jenkins/jobs/GeoTools-Master/workspace/modules/plugin/shapefile/somefile.shp by org.geotools.data.shapefile.ShpFilesLockingTest
2018-06-23T21:09:42.493-0400  SEVERE  The following locker still has a lock: write on file:/home/hudson/genie.jts/.jenkins/jobs/GeoTools-Master/workspace/modules/plugin/shapefile/somefile.shp by org.geotools.data.shapefile.ShpFilesLockingTest
Tests run: 4, Failures: 0, Errors: 0, Skipped: 0, Time elapsed: 0.148 sec - in org.geotools.data.shapefile.fid.FidQueryTest
Running org.geotools.data.shapefile.fid.IndexedFidReaderTest
Tests run: 6, Failures: 0, Errors: 0, Skipped: 0, Time elapsed: 0.022 sec - in org.geotools.data.shapefile.fid.IndexedFidReaderTest
Running org.geotools.data.shapefile.fid.IndexedFidWriterTest
Tests run: 4, Failures: 0, Errors: 0, Skipped: 0, Time elapsed: 0.011 sec - in org.geotools.data.shapefile.fid.IndexedFidWriterTest
Running org.geotools.data.shapefile.shp.JTSUtilitiesTest
Tests run: 1, Failures: 0, Errors: 0, Skipped: 0, Time elapsed: 0 sec - in org.geotools.data.shapefile.shp.JTSUtilitiesTest
Running org.geotools.data.shapefile.shp.PolygonHandler2Test
Tests run: 2, Failures: 0, Errors: 0, Skipped: 0, Time elapsed: 0.002 sec - in org.geotools.data.shapefile.shp.PolygonHandler2Test
Running org.geotools.data.shapefile.shp.PolygonHandlerTest
Tests run: 2, Failures: 0, Errors: 0, Skipped: 0, Time elapsed: 0.001 sec - in org.geotools.data.shapefile.shp.PolygonHandlerTest
Running org.geotools.data.shapefile.shp.xml.ShpXmlFileReaderTest
Tests run: 1, Failures: 0, Errors: 0, Skipped: 0, Time elapsed: 0.111 sec - in org.geotools.data.shapefile.shp.xml.ShpXmlFileReaderTest

Results :

Failed tests: 
  ShpFilesLockingTest.testAcquireWriteFile:86 expected:</[jobs/genie.jt]s/geotools-master/wo...> but was:</[home/hudson/genie.jts/.jenkins/job]s/geotools-master/wo...>
  ShpFilesLockingTest.testAcquireReadFile:63 expected:</[jobs/genie.jt]s/geotools-master/wo...> but was:</[home/hudson/genie.jts/.jenkins/job]s/geotools-master/wo...>

Tests run: 205, Failures: 2, Errors: 0, Skipped: 1

[JENKINS] Recording test results