FailedConsole Output

Skipping 564 KB.. Full Log
ng.reflect.Method.invoke(Method.java:498)
	at org.junit.runners.model.FrameworkMethod$1.runReflectiveCall(FrameworkMethod.java:47)
	at org.junit.internal.runners.model.ReflectiveCallable.run(ReflectiveCallable.java:12)
	at org.junit.runners.model.FrameworkMethod.invokeExplosively(FrameworkMethod.java:44)
	at org.junit.internal.runners.statements.InvokeMethod.evaluate(InvokeMethod.java:17)
	at org.junit.internal.runners.statements.RunAfters.evaluate(RunAfters.java:27)
	at org.junit.runners.ParentRunner.runLeaf(ParentRunner.java:271)
	at org.junit.runners.BlockJUnit4ClassRunner.runChild(BlockJUnit4ClassRunner.java:70)
	at org.junit.runners.BlockJUnit4ClassRunner.runChild(BlockJUnit4ClassRunner.java:50)
	at org.junit.runners.ParentRunner$3.run(ParentRunner.java:238)
	at org.junit.runners.ParentRunner$1.schedule(ParentRunner.java:63)
	at org.junit.runners.ParentRunner.runChildren(ParentRunner.java:236)
	at org.junit.runners.ParentRunner.access$000(ParentRunner.java:53)
	at org.junit.runners.ParentRunner$2.evaluate(ParentRunner.java:229)
	at org.junit.runners.ParentRunner.run(ParentRunner.java:309)
	at org.apache.maven.surefire.junit4.JUnit4Provider.execute(JUnit4Provider.java:264)
	at org.apache.maven.surefire.junit4.JUnit4Provider.executeTestSet(JUnit4Provider.java:153)
	at org.apache.maven.surefire.junit4.JUnit4Provider.invoke(JUnit4Provider.java:124)
	at org.apache.maven.surefire.booter.ForkedBooter.invokeProviderInSameClassLoader(ForkedBooter.java:200)
	at org.apache.maven.surefire.booter.ForkedBooter.runSuitesInProcess(ForkedBooter.java:153)
	at org.apache.maven.surefire.booter.ForkedBooter.main(ForkedBooter.java:103)

2018-06-28T19:49:03.827-0400  WARNING  Could not open the .shx file, continuing assuming the .shp file is not sparse
java.io.FileNotFoundException: /home/hudson/genie.jts/.jenkins/jobs/GeoTools-1.15.0/workspace/modules/plugin/shapefile/target/test-classes/org/geotools/data/shapefile/test-data/shapes/stream.shx (No such file or directory)
	at java.io.RandomAccessFile.open0(Native Method)
	at java.io.RandomAccessFile.open(RandomAccessFile.java:316)
	at java.io.RandomAccessFile.<init>(RandomAccessFile.java:243)
	at org.geotools.data.shapefile.files.ShpFiles.getReadChannel(ShpFiles.java:758)
	at org.geotools.data.shapefile.shp.IndexFile.<init>(IndexFile.java:72)
	at org.geotools.data.shapefile.shp.ShapefileReader.<init>(ShapefileReader.java:267)
	at org.geotools.data.shapefile.ShapefileSetManager.openShapeReader(ShapefileSetManager.java:48)
	at org.geotools.data.shapefile.ShapefileFeatureSource.getCountInternal(ShapefileFeatureSource.java:290)
	at org.geotools.data.shapefile.ShapefileFeatureStore.getCountInternal(ShapefileFeatureStore.java:126)
	at org.geotools.data.store.ContentFeatureSource.getCount(ContentFeatureSource.java:464)
	at org.geotools.data.store.ContentFeatureCollection.size(ContentFeatureCollection.java:226)
	at org.geotools.data.shapefile.ShapefileQuadTreeReadWriteTest.doubleWrite(ShapefileQuadTreeReadWriteTest.java:134)
	at org.geotools.data.shapefile.ShapefileQuadTreeReadWriteTest.testWriteTwice(ShapefileQuadTreeReadWriteTest.java:105)
	at sun.reflect.NativeMethodAccessorImpl.invoke0(Native Method)
	at sun.reflect.NativeMethodAccessorImpl.invoke(NativeMethodAccessorImpl.java:62)
	at sun.reflect.DelegatingMethodAccessorImpl.invoke(DelegatingMethodAccessorImpl.java:43)
	at java.lang.reflect.Method.invoke(Method.java:498)
	at org.junit.runners.model.FrameworkMethod$1.runReflectiveCall(FrameworkMethod.java:47)
	at org.junit.internal.runners.model.ReflectiveCallable.run(ReflectiveCallable.java:12)
	at org.junit.runners.model.FrameworkMethod.invokeExplosively(FrameworkMethod.java:44)
	at org.junit.internal.runners.statements.InvokeMethod.evaluate(InvokeMethod.java:17)
	at org.junit.internal.runners.statements.RunAfters.evaluate(RunAfters.java:27)
	at org.junit.runners.ParentRunner.runLeaf(ParentRunner.java:271)
	at org.junit.runners.BlockJUnit4ClassRunner.runChild(BlockJUnit4ClassRunner.java:70)
	at org.junit.runners.BlockJUnit4ClassRunner.runChild(BlockJUnit4ClassRunner.java:50)
	at org.junit.runners.ParentRunner$3.run(ParentRunner.java:238)
	at org.junit.runners.ParentRunner$1.schedule(ParentRunner.java:63)
	at org.junit.runners.ParentRunner.runChildren(ParentRunner.java:236)
	at org.junit.runners.ParentRunner.access$000(ParentRunner.java:53)
	at org.junit.runners.ParentRunner$2.evaluate(ParentRunner.java:229)
	at org.junit.runners.ParentRunner.run(ParentRunner.java:309)
	at org.apache.maven.surefire.junit4.JUnit4Provider.execute(JUnit4Provider.java:264)
	at org.apache.maven.surefire.junit4.JUnit4Provider.executeTestSet(JUnit4Provider.java:153)
	at org.apache.maven.surefire.junit4.JUnit4Provider.invoke(JUnit4Provider.java:124)
	at org.apache.maven.surefire.booter.ForkedBooter.invokeProviderInSameClassLoader(ForkedBooter.java:200)
	at org.apache.maven.surefire.booter.ForkedBooter.runSuitesInProcess(ForkedBooter.java:153)
	at org.apache.maven.surefire.booter.ForkedBooter.main(ForkedBooter.java:103)

2018-06-28T19:49:03.835-0400  WARNING  Could not open the .shx file, continuing assuming the .shp file is not sparse
java.io.FileNotFoundException: /home/hudson/genie.jts/.jenkins/jobs/GeoTools-1.15.0/workspace/modules/plugin/shapefile/target/test-classes/org/geotools/data/shapefile/test-data/shapes/stream.shx (No such file or directory)
	at java.io.RandomAccessFile.open0(Native Method)
	at java.io.RandomAccessFile.open(RandomAccessFile.java:316)
	at java.io.RandomAccessFile.<init>(RandomAccessFile.java:243)
	at org.geotools.data.shapefile.files.ShpFiles.getReadChannel(ShpFiles.java:758)
	at org.geotools.data.shapefile.shp.IndexFile.<init>(IndexFile.java:72)
	at org.geotools.data.shapefile.shp.ShapefileReader.<init>(ShapefileReader.java:267)
	at org.geotools.data.shapefile.ShapefileSetManager.openShapeReader(ShapefileSetManager.java:48)
	at org.geotools.data.shapefile.ShapefileFeatureSource.getReaderInternal(ShapefileFeatureSource.java:369)
	at org.geotools.data.shapefile.ShapefileFeatureStore.getReaderInternal(ShapefileFeatureStore.java:132)
	at org.geotools.data.store.ContentFeatureSource.getReader(ContentFeatureSource.java:610)
	at org.geotools.data.store.ContentFeatureCollection.features(ContentFeatureCollection.java:164)
	at org.geotools.data.store.ContentFeatureCollection.features(ContentFeatureCollection.java:53)
	at org.geotools.data.store.ContentFeatureStore.addFeatures(ContentFeatureStore.java:254)
	at org.geotools.data.shapefile.ShapefileQuadTreeReadWriteTest.doubleWrite(ShapefileQuadTreeReadWriteTest.java:135)
	at org.geotools.data.shapefile.ShapefileQuadTreeReadWriteTest.testWriteTwice(ShapefileQuadTreeReadWriteTest.java:105)
	at sun.reflect.NativeMethodAccessorImpl.invoke0(Native Method)
	at sun.reflect.NativeMethodAccessorImpl.invoke(NativeMethodAccessorImpl.java:62)
	at sun.reflect.DelegatingMethodAccessorImpl.invoke(DelegatingMethodAccessorImpl.java:43)
	at java.lang.reflect.Method.invoke(Method.java:498)
	at org.junit.runners.model.FrameworkMethod$1.runReflectiveCall(FrameworkMethod.java:47)
	at org.junit.internal.runners.model.ReflectiveCallable.run(ReflectiveCallable.java:12)
	at org.junit.runners.model.FrameworkMethod.invokeExplosively(FrameworkMethod.java:44)
	at org.junit.internal.runners.statements.InvokeMethod.evaluate(InvokeMethod.java:17)
	at org.junit.internal.runners.statements.RunAfters.evaluate(RunAfters.java:27)
	at org.junit.runners.ParentRunner.runLeaf(ParentRunner.java:271)
	at org.junit.runners.BlockJUnit4ClassRunner.runChild(BlockJUnit4ClassRunner.java:70)
	at org.junit.runners.BlockJUnit4ClassRunner.runChild(BlockJUnit4ClassRunner.java:50)
	at org.junit.runners.ParentRunner$3.run(ParentRunner.java:238)
	at org.junit.runners.ParentRunner$1.schedule(ParentRunner.java:63)
	at org.junit.runners.ParentRunner.runChildren(ParentRunner.java:236)
	at org.junit.runners.ParentRunner.access$000(ParentRunner.java:53)
	at org.junit.runners.ParentRunner$2.evaluate(ParentRunner.java:229)
	at org.junit.runners.ParentRunner.run(ParentRunner.java:309)
	at org.apache.maven.surefire.junit4.JUnit4Provider.execute(JUnit4Provider.java:264)
	at org.apache.maven.surefire.junit4.JUnit4Provider.executeTestSet(JUnit4Provider.java:153)
	at org.apache.maven.surefire.junit4.JUnit4Provider.invoke(JUnit4Provider.java:124)
	at org.apache.maven.surefire.booter.ForkedBooter.invokeProviderInSameClassLoader(ForkedBooter.java:200)
	at org.apache.maven.surefire.booter.ForkedBooter.runSuitesInProcess(ForkedBooter.java:153)
	at org.apache.maven.surefire.booter.ForkedBooter.main(ForkedBooter.java:103)

2018-06-28T19:49:03.866-0400  WARNING  Could not open the .shx file, continuing assuming the .shp file is not sparse
java.io.FileNotFoundException: /home/hudson/genie.jts/.jenkins/jobs/GeoTools-1.15.0/workspace/modules/plugin/shapefile/target/test-classes/org/geotools/data/shapefile/test-data/shapes/stream.shx (No such file or directory)
	at java.io.RandomAccessFile.open0(Native Method)
	at java.io.RandomAccessFile.open(RandomAccessFile.java:316)
	at java.io.RandomAccessFile.<init>(RandomAccessFile.java:243)
	at org.geotools.data.shapefile.files.ShpFiles.getReadChannel(ShpFiles.java:758)
	at org.geotools.data.shapefile.shp.IndexFile.<init>(IndexFile.java:72)
	at org.geotools.data.shapefile.shp.ShapefileReader.<init>(ShapefileReader.java:267)
	at org.geotools.data.shapefile.ShapefileSetManager.openShapeReader(ShapefileSetManager.java:48)
	at org.geotools.data.shapefile.ShapefileFeatureSource.getCountInternal(ShapefileFeatureSource.java:290)
	at org.geotools.data.shapefile.ShapefileFeatureStore.getCountInternal(ShapefileFeatureStore.java:126)
	at org.geotools.data.store.ContentFeatureSource.getCount(ContentFeatureSource.java:464)
	at org.geotools.data.store.ContentFeatureCollection.size(ContentFeatureCollection.java:226)
	at org.geotools.data.shapefile.ShapefileQuadTreeReadWriteTest.doubleWrite(ShapefileQuadTreeReadWriteTest.java:137)
	at org.geotools.data.shapefile.ShapefileQuadTreeReadWriteTest.testWriteTwice(ShapefileQuadTreeReadWriteTest.java:105)
	at sun.reflect.NativeMethodAccessorImpl.invoke0(Native Method)
	at sun.reflect.NativeMethodAccessorImpl.invoke(NativeMethodAccessorImpl.java:62)
	at sun.reflect.DelegatingMethodAccessorImpl.invoke(DelegatingMethodAccessorImpl.java:43)
	at java.lang.reflect.Method.invoke(Method.java:498)
	at org.junit.runners.model.FrameworkMethod$1.runReflectiveCall(FrameworkMethod.java:47)
	at org.junit.internal.runners.model.ReflectiveCallable.run(ReflectiveCallable.java:12)
	at org.junit.runners.model.FrameworkMethod.invokeExplosively(FrameworkMethod.java:44)
	at org.junit.internal.runners.statements.InvokeMethod.evaluate(InvokeMethod.java:17)
	at org.junit.internal.runners.statements.RunAfters.evaluate(RunAfters.java:27)
	at org.junit.runners.ParentRunner.runLeaf(ParentRunner.java:271)
	at org.junit.runners.BlockJUnit4ClassRunner.runChild(BlockJUnit4ClassRunner.java:70)
	at org.junit.runners.BlockJUnit4ClassRunner.runChild(BlockJUnit4ClassRunner.java:50)
	at org.junit.runners.ParentRunner$3.run(ParentRunner.java:238)
	at org.junit.runners.ParentRunner$1.schedule(ParentRunner.java:63)
	at org.junit.runners.ParentRunner.runChildren(ParentRunner.java:236)
	at org.junit.runners.ParentRunner.access$000(ParentRunner.java:53)
	at org.junit.runners.ParentRunner$2.evaluate(ParentRunner.java:229)
	at org.junit.runners.ParentRunner.run(ParentRunner.java:309)
	at org.apache.maven.surefire.junit4.JUnit4Provider.execute(JUnit4Provider.java:264)
	at org.apache.maven.surefire.junit4.JUnit4Provider.executeTestSet(JUnit4Provider.java:153)
	at org.apache.maven.surefire.junit4.JUnit4Provider.invoke(JUnit4Provider.java:124)
	at org.apache.maven.surefire.booter.ForkedBooter.invokeProviderInSameClassLoader(ForkedBooter.java:200)
	at org.apache.maven.surefire.booter.ForkedBooter.runSuitesInProcess(ForkedBooter.java:153)
	at org.apache.maven.surefire.booter.ForkedBooter.main(ForkedBooter.java:103)

2018-06-28T19:49:03.900-0400  WARNING  Could not open the .shx file, continuing assuming the .shp file is not sparse
java.io.FileNotFoundException: /home/hudson/genie.jts/.jenkins/jobs/GeoTools-1.15.0/workspace/modules/plugin/shapefile/target/test-classes/org/geotools/data/shapefile/test-data/shapes/stream.shx (No such file or directory)
	at java.io.RandomAccessFile.open0(Native Method)
	at java.io.RandomAccessFile.open(RandomAccessFile.java:316)
	at java.io.RandomAccessFile.<init>(RandomAccessFile.java:243)
	at org.geotools.data.shapefile.files.ShpFiles.getReadChannel(ShpFiles.java:758)
	at org.geotools.data.shapefile.shp.IndexFile.<init>(IndexFile.java:72)
	at org.geotools.data.shapefile.shp.ShapefileReader.<init>(ShapefileReader.java:267)
	at org.geotools.data.shapefile.ShapefileSetManager.openShapeReader(ShapefileSetManager.java:48)
	at org.geotools.data.shapefile.ShapefileFeatureSource.getReaderInternal(ShapefileFeatureSource.java:369)
	at org.geotools.data.shapefile.ShapefileFeatureStore.getReaderInternal(ShapefileFeatureStore.java:132)
	at org.geotools.data.store.ContentFeatureSource.getReader(ContentFeatureSource.java:610)
	at org.geotools.data.store.ContentFeatureCollection.features(ContentFeatureCollection.java:164)
	at org.geotools.data.store.ContentFeatureCollection.features(ContentFeatureCollection.java:53)
	at org.geotools.data.store.ContentFeatureStore.addFeatures(ContentFeatureStore.java:254)
	at org.geotools.data.shapefile.ShapefileQuadTreeReadWriteTest.doubleWrite(ShapefileQuadTreeReadWriteTest.java:133)
	at org.geotools.data.shapefile.ShapefileQuadTreeReadWriteTest.testWriteTwice(ShapefileQuadTreeReadWriteTest.java:106)
	at sun.reflect.NativeMethodAccessorImpl.invoke0(Native Method)
	at sun.reflect.NativeMethodAccessorImpl.invoke(NativeMethodAccessorImpl.java:62)
	at sun.reflect.DelegatingMethodAccessorImpl.invoke(DelegatingMethodAccessorImpl.java:43)
	at java.lang.reflect.Method.invoke(Method.java:498)
	at org.junit.runners.model.FrameworkMethod$1.runReflectiveCall(FrameworkMethod.java:47)
	at org.junit.internal.runners.model.ReflectiveCallable.run(ReflectiveCallable.java:12)
	at org.junit.runners.model.FrameworkMethod.invokeExplosively(FrameworkMethod.java:44)
	at org.junit.internal.runners.statements.InvokeMethod.evaluate(InvokeMethod.java:17)
	at org.junit.internal.runners.statements.RunAfters.evaluate(RunAfters.java:27)
	at org.junit.runners.ParentRunner.runLeaf(ParentRunner.java:271)
	at org.junit.runners.BlockJUnit4ClassRunner.runChild(BlockJUnit4ClassRunner.java:70)
	at org.junit.runners.BlockJUnit4ClassRunner.runChild(BlockJUnit4ClassRunner.java:50)
	at org.junit.runners.ParentRunner$3.run(ParentRunner.java:238)
	at org.junit.runners.ParentRunner$1.schedule(ParentRunner.java:63)
	at org.junit.runners.ParentRunner.runChildren(ParentRunner.java:236)
	at org.junit.runners.ParentRunner.access$000(ParentRunner.java:53)
	at org.junit.runners.ParentRunner$2.evaluate(ParentRunner.java:229)
	at org.junit.runners.ParentRunner.run(ParentRunner.java:309)
	at org.apache.maven.surefire.junit4.JUnit4Provider.execute(JUnit4Provider.java:264)
	at org.apache.maven.surefire.junit4.JUnit4Provider.executeTestSet(JUnit4Provider.java:153)
	at org.apache.maven.surefire.junit4.JUnit4Provider.invoke(JUnit4Provider.java:124)
	at org.apache.maven.surefire.booter.ForkedBooter.invokeProviderInSameClassLoader(ForkedBooter.java:200)
	at org.apache.maven.surefire.booter.ForkedBooter.runSuitesInProcess(ForkedBooter.java:153)
	at org.apache.maven.surefire.booter.ForkedBooter.main(ForkedBooter.java:103)

2018-06-28T19:49:03.945-0400  WARNING  Could not open the .shx file, continuing assuming the .shp file is not sparse
java.io.FileNotFoundException: /home/hudson/genie.jts/.jenkins/jobs/GeoTools-1.15.0/workspace/modules/plugin/shapefile/target/test-classes/org/geotools/data/shapefile/test-data/shapes/stream.shx (No such file or directory)
	at java.io.RandomAccessFile.open0(Native Method)
	at java.io.RandomAccessFile.open(RandomAccessFile.java:316)
	at java.io.RandomAccessFile.<init>(RandomAccessFile.java:243)
	at org.geotools.data.shapefile.files.ShpFiles.getReadChannel(ShpFiles.java:758)
	at org.geotools.data.shapefile.shp.IndexFile.<init>(IndexFile.java:72)
	at org.geotools.data.shapefile.shp.ShapefileReader.<init>(ShapefileReader.java:267)
	at org.geotools.data.shapefile.ShapefileSetManager.openShapeReader(ShapefileSetManager.java:48)
	at org.geotools.data.shapefile.ShapefileFeatureSource.getCountInternal(ShapefileFeatureSource.java:290)
	at org.geotools.data.shapefile.ShapefileFeatureStore.getCountInternal(ShapefileFeatureStore.java:126)
	at org.geotools.data.store.ContentFeatureSource.getCount(ContentFeatureSource.java:464)
	at org.geotools.data.store.ContentFeatureCollection.size(ContentFeatureCollection.java:226)
	at org.geotools.data.shapefile.ShapefileQuadTreeReadWriteTest.doubleWrite(ShapefileQuadTreeReadWriteTest.java:134)
	at org.geotools.data.shapefile.ShapefileQuadTreeReadWriteTest.testWriteTwice(ShapefileQuadTreeReadWriteTest.java:106)
	at sun.reflect.NativeMethodAccessorImpl.invoke0(Native Method)
	at sun.reflect.NativeMethodAccessorImpl.invoke(NativeMethodAccessorImpl.java:62)
	at sun.reflect.DelegatingMethodAccessorImpl.invoke(DelegatingMethodAccessorImpl.java:43)
	at java.lang.reflect.Method.invoke(Method.java:498)
	at org.junit.runners.model.FrameworkMethod$1.runReflectiveCall(FrameworkMethod.java:47)
	at org.junit.internal.runners.model.ReflectiveCallable.run(ReflectiveCallable.java:12)
	at org.junit.runners.model.FrameworkMethod.invokeExplosively(FrameworkMethod.java:44)
	at org.junit.internal.runners.statements.InvokeMethod.evaluate(InvokeMethod.java:17)
	at org.junit.internal.runners.statements.RunAfters.evaluate(RunAfters.java:27)
	at org.junit.runners.ParentRunner.runLeaf(ParentRunner.java:271)
	at org.junit.runners.BlockJUnit4ClassRunner.runChild(BlockJUnit4ClassRunner.java:70)
	at org.junit.runners.BlockJUnit4ClassRunner.runChild(BlockJUnit4ClassRunner.java:50)
	at org.junit.runners.ParentRunner$3.run(ParentRunner.java:238)
	at org.junit.runners.ParentRunner$1.schedule(ParentRunner.java:63)
	at org.junit.runners.ParentRunner.runChildren(ParentRunner.java:236)
	at org.junit.runners.ParentRunner.access$000(ParentRunner.java:53)
	at org.junit.runners.ParentRunner$2.evaluate(ParentRunner.java:229)
	at org.junit.runners.ParentRunner.run(ParentRunner.java:309)
	at org.apache.maven.surefire.junit4.JUnit4Provider.execute(JUnit4Provider.java:264)
	at org.apache.maven.surefire.junit4.JUnit4Provider.executeTestSet(JUnit4Provider.java:153)
	at org.apache.maven.surefire.junit4.JUnit4Provider.invoke(JUnit4Provider.java:124)
	at org.apache.maven.surefire.booter.ForkedBooter.invokeProviderInSameClassLoader(ForkedBooter.java:200)
	at org.apache.maven.surefire.booter.ForkedBooter.runSuitesInProcess(ForkedBooter.java:153)
	at org.apache.maven.surefire.booter.ForkedBooter.main(ForkedBooter.java:103)

2018-06-28T19:49:03.967-0400  WARNING  Could not open the .shx file, continuing assuming the .shp file is not sparse
java.io.FileNotFoundException: /home/hudson/genie.jts/.jenkins/jobs/GeoTools-1.15.0/workspace/modules/plugin/shapefile/target/test-classes/org/geotools/data/shapefile/test-data/shapes/stream.shx (No such file or directory)
	at java.io.RandomAccessFile.open0(Native Method)
	at java.io.RandomAccessFile.open(RandomAccessFile.java:316)
	at java.io.RandomAccessFile.<init>(RandomAccessFile.java:243)
	at org.geotools.data.shapefile.files.ShpFiles.getReadChannel(ShpFiles.java:758)
	at org.geotools.data.shapefile.shp.IndexFile.<init>(IndexFile.java:72)
	at org.geotools.data.shapefile.shp.ShapefileReader.<init>(ShapefileReader.java:267)
	at org.geotools.data.shapefile.ShapefileSetManager.openShapeReader(ShapefileSetManager.java:48)
	at org.geotools.data.shapefile.ShapefileFeatureSource.getReaderInternal(ShapefileFeatureSource.java:369)
	at org.geotools.data.shapefile.ShapefileFeatureStore.getReaderInternal(ShapefileFeatureStore.java:132)
	at org.geotools.data.store.ContentFeatureSource.getReader(ContentFeatureSource.java:610)
	at org.geotools.data.store.ContentFeatureCollection.features(ContentFeatureCollection.java:164)
	at org.geotools.data.store.ContentFeatureCollection.features(ContentFeatureCollection.java:53)
	at org.geotools.data.store.ContentFeatureStore.addFeatures(ContentFeatureStore.java:254)
	at org.geotools.data.shapefile.ShapefileQuadTreeReadWriteTest.doubleWrite(ShapefileQuadTreeReadWriteTest.java:135)
	at org.geotools.data.shapefile.ShapefileQuadTreeReadWriteTest.testWriteTwice(ShapefileQuadTreeReadWriteTest.java:106)
	at sun.reflect.NativeMethodAccessorImpl.invoke0(Native Method)
	at sun.reflect.NativeMethodAccessorImpl.invoke(NativeMethodAccessorImpl.java:62)
	at sun.reflect.DelegatingMethodAccessorImpl.invoke(DelegatingMethodAccessorImpl.java:43)
	at java.lang.reflect.Method.invoke(Method.java:498)
	at org.junit.runners.model.FrameworkMethod$1.runReflectiveCall(FrameworkMethod.java:47)
	at org.junit.internal.runners.model.ReflectiveCallable.run(ReflectiveCallable.java:12)
	at org.junit.runners.model.FrameworkMethod.invokeExplosively(FrameworkMethod.java:44)
	at org.junit.internal.runners.statements.InvokeMethod.evaluate(InvokeMethod.java:17)
	at org.junit.internal.runners.statements.RunAfters.evaluate(RunAfters.java:27)
	at org.junit.runners.ParentRunner.runLeaf(ParentRunner.java:271)
	at org.junit.runners.BlockJUnit4ClassRunner.runChild(BlockJUnit4ClassRunner.java:70)
	at org.junit.runners.BlockJUnit4ClassRunner.runChild(BlockJUnit4ClassRunner.java:50)
	at org.junit.runners.ParentRunner$3.run(ParentRunner.java:238)
	at org.junit.runners.ParentRunner$1.schedule(ParentRunner.java:63)
	at org.junit.runners.ParentRunner.runChildren(ParentRunner.java:236)
	at org.junit.runners.ParentRunner.access$000(ParentRunner.java:53)
	at org.junit.runners.ParentRunner$2.evaluate(ParentRunner.java:229)
	at org.junit.runners.ParentRunner.run(ParentRunner.java:309)
	at org.apache.maven.surefire.junit4.JUnit4Provider.execute(JUnit4Provider.java:264)
	at org.apache.maven.surefire.junit4.JUnit4Provider.executeTestSet(JUnit4Provider.java:153)
	at org.apache.maven.surefire.junit4.JUnit4Provider.invoke(JUnit4Provider.java:124)
	at org.apache.maven.surefire.booter.ForkedBooter.invokeProviderInSameClassLoader(ForkedBooter.java:200)
	at org.apache.maven.surefire.booter.ForkedBooter.runSuitesInProcess(ForkedBooter.java:153)
	at org.apache.maven.surefire.booter.ForkedBooter.main(ForkedBooter.java:103)

2018-06-28T19:49:04.003-0400  WARNING  Could not open the .shx file, continuing assuming the .shp file is not sparse
java.io.FileNotFoundException: /home/hudson/genie.jts/.jenkins/jobs/GeoTools-1.15.0/workspace/modules/plugin/shapefile/target/test-classes/org/geotools/data/shapefile/test-data/shapes/stream.shx (No such file or directory)
	at java.io.RandomAccessFile.open0(Native Method)
	at java.io.RandomAccessFile.open(RandomAccessFile.java:316)
	at java.io.RandomAccessFile.<init>(RandomAccessFile.java:243)
	at org.geotools.data.shapefile.files.ShpFiles.getReadChannel(ShpFiles.java:758)
	at org.geotools.data.shapefile.shp.IndexFile.<init>(IndexFile.java:72)
	at org.geotools.data.shapefile.shp.ShapefileReader.<init>(ShapefileReader.java:267)
	at org.geotools.data.shapefile.ShapefileSetManager.openShapeReader(ShapefileSetManager.java:48)
	at org.geotools.data.shapefile.ShapefileFeatureSource.getCountInternal(ShapefileFeatureSource.java:290)
	at org.geotools.data.shapefile.ShapefileFeatureStore.getCountInternal(ShapefileFeatureStore.java:126)
	at org.geotools.data.store.ContentFeatureSource.getCount(ContentFeatureSource.java:464)
	at org.geotools.data.store.ContentFeatureCollection.size(ContentFeatureCollection.java:226)
	at org.geotools.data.shapefile.ShapefileQuadTreeReadWriteTest.doubleWrite(ShapefileQuadTreeReadWriteTest.java:137)
	at org.geotools.data.shapefile.ShapefileQuadTreeReadWriteTest.testWriteTwice(ShapefileQuadTreeReadWriteTest.java:106)
	at sun.reflect.NativeMethodAccessorImpl.invoke0(Native Method)
	at sun.reflect.NativeMethodAccessorImpl.invoke(NativeMethodAccessorImpl.java:62)
	at sun.reflect.DelegatingMethodAccessorImpl.invoke(DelegatingMethodAccessorImpl.java:43)
	at java.lang.reflect.Method.invoke(Method.java:498)
	at org.junit.runners.model.FrameworkMethod$1.runReflectiveCall(FrameworkMethod.java:47)
	at org.junit.internal.runners.model.ReflectiveCallable.run(ReflectiveCallable.java:12)
	at org.junit.runners.model.FrameworkMethod.invokeExplosively(FrameworkMethod.java:44)
	at org.junit.internal.runners.statements.InvokeMethod.evaluate(InvokeMethod.java:17)
	at org.junit.internal.runners.statements.RunAfters.evaluate(RunAfters.java:27)
	at org.junit.runners.ParentRunner.runLeaf(ParentRunner.java:271)
	at org.junit.runners.BlockJUnit4ClassRunner.runChild(BlockJUnit4ClassRunner.java:70)
	at org.junit.runners.BlockJUnit4ClassRunner.runChild(BlockJUnit4ClassRunner.java:50)
	at org.junit.runners.ParentRunner$3.run(ParentRunner.java:238)
	at org.junit.runners.ParentRunner$1.schedule(ParentRunner.java:63)
	at org.junit.runners.ParentRunner.runChildren(ParentRunner.java:236)
	at org.junit.runners.ParentRunner.access$000(ParentRunner.java:53)
	at org.junit.runners.ParentRunner$2.evaluate(ParentRunner.java:229)
	at org.junit.runners.ParentRunner.run(ParentRunner.java:309)
	at org.apache.maven.surefire.junit4.JUnit4Provider.execute(JUnit4Provider.java:264)
	at org.apache.maven.surefire.junit4.JUnit4Provider.executeTestSet(JUnit4Provider.java:153)
	at org.apache.maven.surefire.junit4.JUnit4Provider.invoke(JUnit4Provider.java:124)
	at org.apache.maven.surefire.booter.ForkedBooter.invokeProviderInSameClassLoader(ForkedBooter.java:200)
	at org.apache.maven.surefire.booter.ForkedBooter.runSuitesInProcess(ForkedBooter.java:153)
	at org.apache.maven.surefire.booter.ForkedBooter.main(ForkedBooter.java:103)

Tests run: 4, Failures: 0, Errors: 0, Skipped: 0, Time elapsed: 0.713 sec - in org.geotools.data.shapefile.ShapefileQuadTreeReadWriteTest
Running org.geotools.data.shapefile.ShapefileReadWriteTest
Tests run: 7, Failures: 0, Errors: 0, Skipped: 0, Time elapsed: 1.207 sec - in org.geotools.data.shapefile.ShapefileReadWriteTest
Running org.geotools.data.shapefile.ShapefileTest
2018-06-28T19:49:05.259-0400  WARNING  Could not open the .shx file, continuing assuming the .shp file is not sparse
java.io.FileNotFoundException: JAR entry org/geotools/test-data/shapes/extraAtEnd.shx not found in /home/hudson/genie.jts/.jenkins/jobs/GeoTools-1.15.0/workspace/modules/library/sample-data/target/gt-sample-data-20-SNAPSHOT.jar
	at sun.net.www.protocol.jar.JarURLConnection.connect(JarURLConnection.java:144)
	at sun.net.www.protocol.jar.JarURLConnection.getInputStream(JarURLConnection.java:152)
	at org.geotools.data.shapefile.files.ShpFiles.getReadChannel(ShpFiles.java:762)
	at org.geotools.data.shapefile.shp.IndexFile.<init>(IndexFile.java:72)
	at org.geotools.data.shapefile.shp.ShapefileReader.<init>(ShapefileReader.java:267)
	at org.geotools.data.shapefile.shp.ShapefileReader.<init>(ShapefileReader.java:238)
	at org.geotools.data.shapefile.ShapefileTest.loadShapes(ShapefileTest.java:279)
	at org.geotools.data.shapefile.ShapefileTest.testExtraAtEnd(ShapefileTest.java:120)
	at sun.reflect.NativeMethodAccessorImpl.invoke0(Native Method)
	at sun.reflect.NativeMethodAccessorImpl.invoke(NativeMethodAccessorImpl.java:62)
	at sun.reflect.DelegatingMethodAccessorImpl.invoke(DelegatingMethodAccessorImpl.java:43)
	at java.lang.reflect.Method.invoke(Method.java:498)
	at org.junit.runners.model.FrameworkMethod$1.runReflectiveCall(FrameworkMethod.java:47)
	at org.junit.internal.runners.model.ReflectiveCallable.run(ReflectiveCallable.java:12)
	at org.junit.runners.model.FrameworkMethod.invokeExplosively(FrameworkMethod.java:44)
	at org.junit.internal.runners.statements.InvokeMethod.evaluate(InvokeMethod.java:17)
	at org.junit.internal.runners.statements.RunAfters.evaluate(RunAfters.java:27)
	at org.junit.runners.ParentRunner.runLeaf(ParentRunner.java:271)
	at org.junit.runners.BlockJUnit4ClassRunner.runChild(BlockJUnit4ClassRunner.java:70)
	at org.junit.runners.BlockJUnit4ClassRunner.runChild(BlockJUnit4ClassRunner.java:50)
	at org.junit.runners.ParentRunner$3.run(ParentRunner.java:238)
	at org.junit.runners.ParentRunner$1.schedule(ParentRunner.java:63)
	at org.junit.runners.ParentRunner.runChildren(ParentRunner.java:236)
	at org.junit.runners.ParentRunner.access$000(ParentRunner.java:53)
	at org.junit.runners.ParentRunner$2.evaluate(ParentRunner.java:229)
	at org.junit.runners.ParentRunner.run(ParentRunner.java:309)
	at org.apache.maven.surefire.junit4.JUnit4Provider.execute(JUnit4Provider.java:264)
	at org.apache.maven.surefire.junit4.JUnit4Provider.executeTestSet(JUnit4Provider.java:153)
	at org.apache.maven.surefire.junit4.JUnit4Provider.invoke(JUnit4Provider.java:124)
	at org.apache.maven.surefire.booter.ForkedBooter.invokeProviderInSameClassLoader(ForkedBooter.java:200)
	at org.apache.maven.surefire.booter.ForkedBooter.runSuitesInProcess(ForkedBooter.java:153)
	at org.apache.maven.surefire.booter.ForkedBooter.main(ForkedBooter.java:103)

2018-06-28T19:49:05.260-0400  WARNING  Could not open the .shx file, continuing assuming the .shp file is not sparse
java.io.FileNotFoundException: JAR entry org/geotools/test-data/shapes/extraAtEnd.shx not found in /home/hudson/genie.jts/.jenkins/jobs/GeoTools-1.15.0/workspace/modules/library/sample-data/target/gt-sample-data-20-SNAPSHOT.jar
	at sun.net.www.protocol.jar.JarURLConnection.connect(JarURLConnection.java:144)
	at sun.net.www.protocol.jar.JarURLConnection.getInputStream(JarURLConnection.java:152)
	at org.geotools.data.shapefile.files.ShpFiles.getReadChannel(ShpFiles.java:762)
	at org.geotools.data.shapefile.shp.IndexFile.<init>(IndexFile.java:72)
	at org.geotools.data.shapefile.shp.ShapefileReader.<init>(ShapefileReader.java:267)
	at org.geotools.data.shapefile.shp.ShapefileReader.<init>(ShapefileReader.java:238)
	at org.geotools.data.shapefile.ShapefileTest.loadMemoryMapped(ShapefileTest.java:477)
	at org.geotools.data.shapefile.ShapefileTest.testExtraAtEnd(ShapefileTest.java:121)
	at sun.reflect.NativeMethodAccessorImpl.invoke0(Native Method)
	at sun.reflect.NativeMethodAccessorImpl.invoke(NativeMethodAccessorImpl.java:62)
	at sun.reflect.DelegatingMethodAccessorImpl.invoke(DelegatingMethodAccessorImpl.java:43)
	at java.lang.reflect.Method.invoke(Method.java:498)
	at org.junit.runners.model.FrameworkMethod$1.runReflectiveCall(FrameworkMethod.java:47)
	at org.junit.internal.runners.model.ReflectiveCallable.run(ReflectiveCallable.java:12)
	at org.junit.runners.model.FrameworkMethod.invokeExplosively(FrameworkMethod.java:44)
	at org.junit.internal.runners.statements.InvokeMethod.evaluate(InvokeMethod.java:17)
	at org.junit.internal.runners.statements.RunAfters.evaluate(RunAfters.java:27)
	at org.junit.runners.ParentRunner.runLeaf(ParentRunner.java:271)
	at org.junit.runners.BlockJUnit4ClassRunner.runChild(BlockJUnit4ClassRunner.java:70)
	at org.junit.runners.BlockJUnit4ClassRunner.runChild(BlockJUnit4ClassRunner.java:50)
	at org.junit.runners.ParentRunner$3.run(ParentRunner.java:238)
	at org.junit.runners.ParentRunner$1.schedule(ParentRunner.java:63)
	at org.junit.runners.ParentRunner.runChildren(ParentRunner.java:236)
	at org.junit.runners.ParentRunner.access$000(ParentRunner.java:53)
	at org.junit.runners.ParentRunner$2.evaluate(ParentRunner.java:229)
	at org.junit.runners.ParentRunner.run(ParentRunner.java:309)
	at org.apache.maven.surefire.junit4.JUnit4Provider.execute(JUnit4Provider.java:264)
	at org.apache.maven.surefire.junit4.JUnit4Provider.executeTestSet(JUnit4Provider.java:153)
	at org.apache.maven.surefire.junit4.JUnit4Provider.invoke(JUnit4Provider.java:124)
	at org.apache.maven.surefire.booter.ForkedBooter.invokeProviderInSameClassLoader(ForkedBooter.java:200)
	at org.apache.maven.surefire.booter.ForkedBooter.runSuitesInProcess(ForkedBooter.java:153)
	at org.apache.maven.surefire.booter.ForkedBooter.main(ForkedBooter.java:103)

Tests run: 18, Failures: 0, Errors: 0, Skipped: 0, Time elapsed: 0.079 sec - in org.geotools.data.shapefile.ShapefileTest
Running org.geotools.data.shapefile.ShpFileTypesTest
Tests run: 7, Failures: 0, Errors: 0, Skipped: 0, Time elapsed: 0.001 sec - in org.geotools.data.shapefile.ShpFileTypesTest
Running org.geotools.data.shapefile.ShpFilesLockingTest
Tests run: 3, Failures: 0, Errors: 0, Skipped: 0, Time elapsed: 0.005 sec - in org.geotools.data.shapefile.ShpFilesLockingTest
Running org.geotools.data.shapefile.ShpFilesTest
Tests run: 11, Failures: 0, Errors: 0, Skipped: 0, Time elapsed: 0.094 sec - in org.geotools.data.shapefile.ShpFilesTest
Running org.geotools.data.shapefile.StorageFileTest
Tests run: 4, Failures: 0, Errors: 0, Skipped: 0, Time elapsed: 0.015 sec - in org.geotools.data.shapefile.StorageFileTest
Running org.geotools.data.shapefile.dbf.DbaseFieldFormatterTest
2018-06-28T19:49:05.432-0400  WARNING  Writing DBF data, value 12,345.678 cannot be represented in size 6
2018-06-28T19:49:05.432-0400  WARNING  Writing DBF data, value 31,415,926,535.898 cannot be represented in size 4
                            12345678->   12345678.000000000000000000000000
                                   0->                                   0
              1.7976931348623157E308->              1.7976931348623157E308
                            4.9E-324->   0.0000000000000000000000000000000
                                 NaN->                                 NaN
                                   0->   0.0000000000000000000000000000000
                           12345.678->   12345.678000000000000000000000000
                3.141592653589793E10->   31415926535.897930000000000000000
                              42.123->   42.123000000000000000000000000000
                                  -1->                                  -1
                   3.141592653589793->   3.1415926535897930000000000000000
                          -987654321->   -987654321.0000000000000000000000
                   3.141592653589793->                                 3.1
2018-06-28T19:49:05.436-0400  WARNING  Writing DBF data, value 3.142 cannot be represented in size 2
2018-06-28T19:49:05.436-0400  WARNING  Writing DBF data, value -3.142 cannot be represented in size 3
                          -987654321->                          -987654321
2018-06-28T19:49:05.437-0400  WARNING  Writing DBF data, value 12,345,678 cannot be represented in size 6
                                1999->   1999.0000000000000000000000000000
                            12345678->                            12345678
                              1999.0->   1999.0000000000000000000000000000
                                1999->                                1999
                                  -1->   -1.000000000000000000000000000000
                         -1.00001E38->                         -1.00001E38
                         -1.00001E38->                         -1.00001E38
               3.141592653589793E100->               3.141592653589793E100
                             -1.0E39->                             -1.0E39
Tests run: 28, Failures: 0, Errors: 0, Skipped: 0, Time elapsed: 0.008 sec - in org.geotools.data.shapefile.dbf.DbaseFieldFormatterTest
Running org.geotools.data.shapefile.dbf.DbaseFileReaderTest
Tests run: 1, Failures: 0, Errors: 0, Skipped: 0, Time elapsed: 0 sec - in org.geotools.data.shapefile.dbf.DbaseFileReaderTest
Running org.geotools.data.shapefile.fid.FidIndexerTest
Tests run: 1, Failures: 0, Errors: 0, Skipped: 0, Time elapsed: 0.006 sec - in org.geotools.data.shapefile.fid.FidIndexerTest
Running org.geotools.data.shapefile.fid.FidQueryTest
Tests run: 4, Failures: 0, Errors: 0, Skipped: 0, Time elapsed: 0.109 sec - in org.geotools.data.shapefile.fid.FidQueryTest
Running org.geotools.data.shapefile.fid.IndexedFidReaderTest
Tests run: 6, Failures: 0, Errors: 0, Skipped: 0, Time elapsed: 0.024 sec - in org.geotools.data.shapefile.fid.IndexedFidReaderTest
Running org.geotools.data.shapefile.fid.IndexedFidWriterTest
Tests run: 4, Failures: 0, Errors: 0, Skipped: 0, Time elapsed: 0.01 sec - in org.geotools.data.shapefile.fid.IndexedFidWriterTest
Running org.geotools.data.shapefile.shp.JTSUtilitiesTest
Tests run: 1, Failures: 0, Errors: 0, Skipped: 0, Time elapsed: 0 sec - in org.geotools.data.shapefile.shp.JTSUtilitiesTest
Running org.geotools.data.shapefile.shp.PolygonHandler2Test
Tests run: 2, Failures: 0, Errors: 0, Skipped: 0, Time elapsed: 0.001 sec - in org.geotools.data.shapefile.shp.PolygonHandler2Test
Running org.geotools.data.shapefile.shp.PolygonHandlerTest
Tests run: 2, Failures: 0, Errors: 0, Skipped: 0, Time elapsed: 0.001 sec - in org.geotools.data.shapefile.shp.PolygonHandlerTest
Running org.geotools.data.shapefile.shp.xml.ShpXmlFileReaderTest
Tests run: 1, Failures: 0, Errors: 0, Skipped: 0, Time elapsed: 0.047 sec - in org.geotools.data.shapefile.shp.xml.ShpXmlFileReaderTest

Results :

Tests run: 203, Failures: 0, Errors: 0, Skipped: 1

[JENKINS] Recording test results
[INFO] 
[INFO] --- maven-jar-plugin:2.4:jar (default-jar) @ gt-shapefile ---
[INFO] Building jar: /home/hudson/genie.jts/.jenkins/jobs/GeoTools-1.15.0/workspace/modules/plugin/shapefile/target/gt-shapefile-20-SNAPSHOT.jar
[INFO] 
[INFO] >>> maven-source-plugin:2.2.1:jar (attach-sources) > generate-sources @ gt-shapefile >>>
[INFO] 
[INFO] --- git-commit-id-plugin:2.1.15:revision (default) @ gt-shapefile ---
[WARNING] Failed to getClass for org.apache.maven.plugin.source.SourceJarMojo
[INFO] 
[INFO] <<< maven-source-plugin:2.2.1:jar (attach-sources) < generate-sources @ gt-shapefile <<<
[INFO] 
[INFO] 
[INFO] --- maven-source-plugin:2.2.1:jar (attach-sources) @ gt-shapefile ---
[INFO] Building jar: /home/hudson/genie.jts/.jenkins/jobs/GeoTools-1.15.0/workspace/modules/plugin/shapefile/target/gt-shapefile-20-SNAPSHOT-sources.jar
[INFO] 
[INFO] --- maven-install-plugin:2.4:install (default-install) @ gt-shapefile ---
[INFO] Installing /home/hudson/genie.jts/.jenkins/jobs/GeoTools-1.15.0/workspace/modules/plugin/shapefile/target/gt-shapefile-20-SNAPSHOT.jar to /opt/public/hipp/homes/genie.jts/.m2/repository/org/geotools/gt-shapefile/20-SNAPSHOT/gt-shapefile-20-SNAPSHOT.jar
[INFO] Installing /home/hudson/genie.jts/.jenkins/jobs/GeoTools-1.15.0/workspace/modules/plugin/shapefile/pom.xml to /opt/public/hipp/homes/genie.jts/.m2/repository/org/geotools/gt-shapefile/20-SNAPSHOT/gt-shapefile-20-SNAPSHOT.pom
[INFO] Installing /home/hudson/genie.jts/.jenkins/jobs/GeoTools-1.15.0/workspace/modules/plugin/shapefile/target/gt-shapefile-20-SNAPSHOT-sources.jar to /opt/public/hipp/homes/genie.jts/.m2/repository/org/geotools/gt-shapefile/20-SNAPSHOT/gt-shapefile-20-SNAPSHOT-sources.jar
Started calculate disk usage of build
Finished Calculation of disk usage of build in 0 seconds
Started calculate disk usage of workspace
Finished Calculation of disk usage of workspace in 0 seconds
[INFO] 
[INFO] ---------------------< org.geotools:gt-transform >----------------------
[INFO] Building Feature transforming feature source wrapper 20-SNAPSHOT [34/130]
[INFO] --------------------------------[ jar ]---------------------------------
[INFO] 
[INFO] --- maven-clean-plugin:2.5:clean (default-clean) @ gt-transform ---
[INFO] 
[INFO] --- git-commit-id-plugin:2.1.15:revision (default) @ gt-transform ---
[INFO] 
[INFO] --- fmt-maven-plugin:2.4.0:format (default) @ gt-transform ---
[debug] Using AOSP style
[INFO] Processed 22 files (0 reformatted).
[INFO] 
[INFO] --- maven-resources-plugin:2.6:resources (default-resources) @ gt-transform ---
[INFO] Using 'UTF-8' encoding to copy filtered resources.
[INFO] skip non existing resourceDirectory /home/hudson/genie.jts/.jenkins/jobs/GeoTools-1.15.0/workspace/modules/extension/transform/src/main/resources
[INFO] 
[INFO] --- maven-compiler-plugin:3.1:compile (default-compile) @ gt-transform ---
[INFO] Changes detected - recompiling the module!
[INFO] Compiling 16 source files to /home/hudson/genie.jts/.jenkins/jobs/GeoTools-1.15.0/workspace/modules/extension/transform/target/classes
[INFO] 
[INFO] --- maven-resources-plugin:2.6:testResources (default-testResources) @ gt-transform ---
[INFO] Using 'UTF-8' encoding to copy filtered resources.
[INFO] Copying 1 resource
[INFO] 
[INFO] --- maven-compiler-plugin:3.1:testCompile (default-testCompile) @ gt-transform ---
[INFO] Changes detected - recompiling the module!
[INFO] Compiling 6 source files to /home/hudson/genie.jts/.jenkins/jobs/GeoTools-1.15.0/workspace/modules/extension/transform/target/test-classes
[INFO] 
[INFO] --- maven-surefire-plugin:2.15:test (default-test) @ gt-transform ---
[INFO] Surefire report directory: /home/hudson/genie.jts/.jenkins/jobs/GeoTools-1.15.0/workspace/modules/extension/transform/target/surefire-reports

-------------------------------------------------------
 T E S T S
-------------------------------------------------------
Picked up JAVA_TOOL_OPTIONS: -Xmx2G -Djava.io.tmpdir=/tmp/genie.jts
Running org.geotools.data.transform.CRSEvaluatorTest
Tests run: 6, Failures: 0, Errors: 0, Skipped: 0, Time elapsed: 0.739 sec - in org.geotools.data.transform.CRSEvaluatorTest
Running org.geotools.data.transform.TransformDataStoreTest
Tests run: 6, Failures: 0, Errors: 0, Skipped: 0, Time elapsed: 0.013 sec - in org.geotools.data.transform.TransformDataStoreTest
Running org.geotools.data.transform.TransformFeatureSourceTest
Tests run: 21, Failures: 0, Errors: 0, Skipped: 0, Time elapsed: 0.241 sec - in org.geotools.data.transform.TransformFeatureSourceTest
Running org.geotools.data.transform.TransformFeatureStoreTest
Tests run: 13, Failures: 0, Errors: 0, Skipped: 0, Time elapsed: 0.162 sec - in org.geotools.data.transform.TransformFeatureStoreTest
Running org.geotools.data.transform.TransformerTest
Tests run: 1, Failures: 0, Errors: 0, Skipped: 0, Time elapsed: 0.001 sec - in org.geotools.data.transform.TransformerTest

Results :

Tests run: 47, Failures: 0, Errors: 0, Skipped: 0

[JENKINS] Recording test results
[INFO] 
[INFO] --- maven-jar-plugin:2.4:jar (default-jar) @ gt-transform ---
[INFO] Building jar: /home/hudson/genie.jts/.jenkins/jobs/GeoTools-1.15.0/workspace/modules/extension/transform/target/gt-transform-20-SNAPSHOT.jar
[INFO] 
[INFO] >>> maven-source-plugin:2.2.1:jar (attach-sources) > generate-sources @ gt-transform >>>
[INFO] 
[INFO] --- git-commit-id-plugin:2.1.15:revision (default) @ gt-transform ---
[WARNING] Failed to getClass for org.apache.maven.plugin.source.SourceJarMojo
[INFO] 
[INFO] <<< maven-source-plugin:2.2.1:jar (attach-sources) < generate-sources @ gt-transform <<<
[INFO] 
[INFO] 
[INFO] --- maven-source-plugin:2.2.1:jar (attach-sources) @ gt-transform ---
[INFO] Building jar: /home/hudson/genie.jts/.jenkins/jobs/GeoTools-1.15.0/workspace/modules/extension/transform/target/gt-transform-20-SNAPSHOT-sources.jar
[INFO] 
[INFO] --- maven-install-plugin:2.4:install (default-install) @ gt-transform ---
[INFO] Installing /home/hudson/genie.jts/.jenkins/jobs/GeoTools-1.15.0/workspace/modules/extension/transform/target/gt-transform-20-SNAPSHOT.jar to /opt/public/hipp/homes/genie.jts/.m2/repository/org/geotools/gt-transform/20-SNAPSHOT/gt-transform-20-SNAPSHOT.jar
[INFO] Installing /home/hudson/genie.jts/.jenkins/jobs/GeoTools-1.15.0/workspace/modules/extension/transform/pom.xml to /opt/public/hipp/homes/genie.jts/.m2/repository/org/geotools/gt-transform/20-SNAPSHOT/gt-transform-20-SNAPSHOT.pom
[INFO] Installing /home/hudson/genie.jts/.jenkins/jobs/GeoTools-1.15.0/workspace/modules/extension/transform/target/gt-transform-20-SNAPSHOT-sources.jar to /opt/public/hipp/homes/genie.jts/.m2/repository/org/geotools/gt-transform/20-SNAPSHOT/gt-transform-20-SNAPSHOT-sources.jar
Started calculate disk usage of build
Finished Calculation of disk usage of build in 0 seconds
Started calculate disk usage of workspace
Finished Calculation of disk usage of workspace in 0 seconds
[INFO] 
[INFO] -----------------------< org.geotools:gt-image >------------------------
[INFO] Building WorldImage datasource module 20-SNAPSHOT               [35/130]
[INFO] --------------------------------[ jar ]---------------------------------
[INFO] 
[INFO] --- maven-clean-plugin:2.5:clean (default-clean) @ gt-image ---
[INFO] 
[INFO] --- git-commit-id-plugin:2.1.15:revision (default) @ gt-image ---
[INFO] 
[INFO] --- fmt-maven-plugin:2.4.0:format (default) @ gt-image ---
[debug] Using AOSP style
[INFO] Processed 9 files (0 reformatted).
[INFO] 
[INFO] --- maven-resources-plugin:2.6:resources (default-resources) @ gt-image ---
[INFO] Using 'UTF-8' encoding to copy filtered resources.
[INFO] Copying 1 resource
[INFO] 
[INFO] --- maven-compiler-plugin:3.1:compile (default-compile) @ gt-image ---
[INFO] Changes detected - recompiling the module!
[INFO] Compiling 4 source files to /home/hudson/genie.jts/.jenkins/jobs/GeoTools-1.15.0/workspace/modules/plugin/image/target/classes
[INFO] 
[INFO] --- maven-resources-plugin:2.6:testResources (default-testResources) @ gt-image ---
[INFO] Using 'UTF-8' encoding to copy filtered resources.
[INFO] Copying 13 resources
[INFO] 
[INFO] --- maven-compiler-plugin:3.1:testCompile (default-testCompile) @ gt-image ---
[INFO] Changes detected - recompiling the module!
[INFO] Compiling 5 source files to /home/hudson/genie.jts/.jenkins/jobs/GeoTools-1.15.0/workspace/modules/plugin/image/target/test-classes
[INFO] 
[INFO] --- maven-surefire-plugin:2.15:test (default-test) @ gt-image ---
[INFO] Surefire report directory: /home/hudson/genie.jts/.jenkins/jobs/GeoTools-1.15.0/workspace/modules/plugin/image/target/surefire-reports

-------------------------------------------------------
 T E S T S
-------------------------------------------------------
Picked up JAVA_TOOL_OPTIONS: -Xmx2G -Djava.io.tmpdir=/tmp/genie.jts
Running org.geotools.gce.image.ServiceTest
Tests run: 1, Failures: 0, Errors: 0, Skipped: 0, Time elapsed: 0.302 sec - in org.geotools.gce.image.ServiceTest
Running org.geotools.gce.image.WorldImageFormatTest
Tests run: 1, Failures: 0, Errors: 0, Skipped: 0, Time elapsed: 0.084 sec - in org.geotools.gce.image.WorldImageFormatTest
Running org.geotools.gce.image.WorldImageReaderTest
Jun 28, 2018 7:49:19 PM org.geotools.gce.image.WorldImageReaderTest read
INFO: /home/hudson/genie.jts/.jenkins/jobs/GeoTools-1.15.0/workspace/modules/plugin/image/target/test-classes/org/geotools/gce/image/test-data/Pk50095.tif
Jun 28, 2018 7:49:19 PM org.geotools.gce.image.WorldImageReaderTest read
INFO: /home/hudson/genie.jts/.jenkins/jobs/GeoTools-1.15.0/workspace/modules/plugin/image/target/test-classes/org/geotools/gce/image/test-data/box_gcp.tif
Jun 28, 2018 7:49:19 PM org.geotools.gce.image.WorldImageReader prepareWorldImageGridToWorldTransform
WARNING: Could not find a world transform file for box_gcp, assuming the identity transform
Jun 28, 2018 7:49:19 PM org.geotools.gce.image.WorldImageReaderTest read
INFO: /home/hudson/genie.jts/.jenkins/jobs/GeoTools-1.15.0/workspace/modules/plugin/image/target/test-classes/org/geotools/gce/image/test-data/etopo.tif
Jun 28, 2018 7:49:19 PM org.geotools.gce.image.WorldImageReaderTest read
INFO: /home/hudson/genie.jts/.jenkins/jobs/GeoTools-1.15.0/workspace/modules/plugin/image/target/test-classes/org/geotools/gce/image/test-data/usa.tif
Tests run: 5, Failures: 0, Errors: 0, Skipped: 0, Time elapsed: 0.46 sec - in org.geotools.gce.image.WorldImageReaderTest
Running org.geotools.gce.image.WorldImageWriterTest
Jun 28, 2018 7:49:19 PM org.geotools.image.ImageWorker <clinit>
INFO: Warp/affine reduction enabled: true
Jun 28, 2018 7:49:19 PM org.geotools.gce.image.WorldImageReader prepareWorldImageGridToWorldTransform
WARNING: Could not find a world transform file for box_gcp, assuming the identity transform
Jun 28, 2018 7:49:19 PM org.geotools.gce.image.WorldImageReader prepareWorldImageGridToWorldTransform
WARNING: Could not find a world transform file for box_gcp, assuming the identity transform
Jun 28, 2018 7:49:19 PM org.geotools.gce.image.WorldImageWriterTest testWrite
INFO: Format is tiff
 Testing ability to write Pk50095.tif as url Pk50095.tiftemp4823925557872890462.tiff and file Pk50095.tiftemp7455958806623863081.tiff
 Testing ability to write box_gcp.tif as url box_gcp.tiftemp8083935811318105500.tiff and file box_gcp.tiftemp3716919257807823532.tiff
 Testing ability to write etopo.tif as url etopo.tiftemp8270484359157056069.tiff and file etopo.tiftemp4511482751116221280.tiff
 Testing ability to write usa.tif as url usa.tiftemp3257612699124602301.tiff and file usa.tiftemp277165960995232895.tiff

Jun 28, 2018 7:49:19 PM org.geotools.gce.image.WorldImageReader prepareWorldImageGridToWorldTransform
WARNING: Could not find a world transform file for box_gcp, assuming the identity transform
Jun 28, 2018 7:49:19 PM org.geotools.gce.image.WorldImageReader prepareWorldImageGridToWorldTransform
WARNING: Could not find a world transform file for box_gcp, assuming the identity transform
Jun 28, 2018 7:49:19 PM org.geotools.gce.image.WorldImageWriterTest testWrite
INFO: Format is gif
 Testing ability to write Pk50095.tif as url Pk50095.tiftemp7562282360707625579.gif and file Pk50095.tiftemp3190646026657782003.gif
 Testing ability to write box_gcp.tif as url box_gcp.tiftemp7942943200909633452.gif and file box_gcp.tiftemp4271201584916929804.gif
 Testing ability to write etopo.tif as url etopo.tiftemp924906847186657057.gif and file etopo.tiftemp4469194240578713950.gif
 Testing ability to write usa.tif as url usa.tiftemp2171052636426134560.gif and file usa.tiftemp2116198039231699455.gif

Jun 28, 2018 7:49:20 PM org.geotools.gce.image.WorldImageReader prepareWorldImageGridToWorldTransform
WARNING: Could not find a world transform file for box_gcp, assuming the identity transform
Jun 28, 2018 7:49:20 PM org.geotools.gce.image.WorldImageReader prepareWorldImageGridToWorldTransform
WARNING: Could not find a world transform file for box_gcp, assuming the identity transform
Jun 28, 2018 7:49:20 PM org.geotools.gce.image.WorldImageWriterTest testWrite
INFO: Format is png
 Testing ability to write Pk50095.tif as url Pk50095.tiftemp5224911307784603774.png and file Pk50095.tiftemp4686727598377968317.png
 Testing ability to write box_gcp.tif as url box_gcp.tiftemp837285002708123641.png and file box_gcp.tiftemp7448914338063532309.png
 Testing ability to write etopo.tif as url etopo.tiftemp646371526349916653.png and file etopo.tiftemp7300153138364044744.png
 Testing ability to write usa.tif as url usa.tiftemp8895057735214144038.png and file usa.tiftemp445322823398634588.png

Jun 28, 2018 7:49:20 PM org.geotools.gce.image.WorldImageReader prepareWorldImageGridToWorldTransform
WARNING: Could not find a world transform file for box_gcp, assuming the identity transform
Jun 28, 2018 7:49:20 PM org.geotools.gce.image.WorldImageReader prepareWorldImageGridToWorldTransform
WARNING: Could not find a world transform file for box_gcp, assuming the identity transform
Jun 28, 2018 7:49:20 PM org.geotools.gce.image.WorldImageWriterTest testWrite
INFO: Format is bmp
 Testing ability to write Pk50095.tif as url Pk50095.tiftemp942504378469615033.bmp and file Pk50095.tiftemp2845357703450096501.bmp
 Testing ability to write box_gcp.tif as url box_gcp.tiftemp1865597142730360938.bmp and file box_gcp.tiftemp9080974526745085419.bmp
 Testing ability to write etopo.tif as url etopo.tiftemp5180982359047985872.bmp and file etopo.tiftemp8453352678116928187.bmp
 Testing ability to write usa.tif as url usa.tiftemp1239752810976544828.bmp and file usa.tiftemp6806156951449874618.bmp

Jun 28, 2018 7:49:20 PM org.geotools.gce.image.WorldImageReader prepareWorldImageGridToWorldTransform
WARNING: Could not find a world transform file for box_gcp, assuming the identity transform
Jun 28, 2018 7:49:20 PM org.geotools.gce.image.WorldImageReader prepareWorldImageGridToWorldTransform
WARNING: Could not find a world transform file for box_gcp, assuming the identity transform
Jun 28, 2018 7:49:20 PM org.geotools.gce.image.WorldImageWriterTest testWrite
INFO: Format is jpeg
 Testing ability to write Pk50095.tif as url Pk50095.tiftemp1929930723988765712.jpeg and file Pk50095.tiftemp7674440397742197974.jpeg
 Testing ability to write box_gcp.tif as url box_gcp.tiftemp8217368777728275843.jpeg and file box_gcp.tiftemp2878973321540691258.jpeg
 Testing ability to write etopo.tif as url etopo.tiftemp2630448554614768208.jpeg and file etopo.tiftemp5533857820426747198.jpeg
 Testing ability to write usa.tif as url usa.tiftemp7353348741942974184.jpeg and file usa.tiftemp1130310264899627028.jpeg

Tests run: 1, Failures: 0, Errors: 0, Skipped: 0, Time elapsed: 0.776 sec - in org.geotools.gce.image.WorldImageWriterTest

Results :

Tests run: 8, Failures: 0, Errors: 0, Skipped: 0

[JENKINS] Recording test results
[INFO] 
[INFO] --- maven-jar-plugin:2.4:jar (default-jar) @ gt-image ---
[INFO] Building jar: /home/hudson/genie.jts/.jenkins/jobs/GeoTools-1.15.0/workspace/modules/plugin/image/target/gt-image-20-SNAPSHOT.jar
[INFO] 
[INFO] >>> maven-source-plugin:2.2.1:jar (attach-sources) > generate-sources @ gt-image >>>
[INFO] 
[INFO] --- git-commit-id-plugin:2.1.15:revision (default) @ gt-image ---
[WARNING] Failed to getClass for org.apache.maven.plugin.source.SourceJarMojo
[INFO] 
[INFO] <<< maven-source-plugin:2.2.1:jar (attach-sources) < generate-sources @ gt-image <<<
[INFO] 
[INFO] 
[INFO] --- maven-source-plugin:2.2.1:jar (attach-sources) @ gt-image ---
[INFO] Building jar: /home/hudson/genie.jts/.jenkins/jobs/GeoTools-1.15.0/workspace/modules/plugin/image/target/gt-image-20-SNAPSHOT-sources.jar
[INFO] 
[INFO] --- maven-install-plugin:2.4:install (default-install) @ gt-image ---
[INFO] Installing /home/hudson/genie.jts/.jenkins/jobs/GeoTools-1.15.0/workspace/modules/plugin/image/target/gt-image-20-SNAPSHOT.jar to /opt/public/hipp/homes/genie.jts/.m2/repository/org/geotools/gt-image/20-SNAPSHOT/gt-image-20-SNAPSHOT.jar
[INFO] Installing /home/hudson/genie.jts/.jenkins/jobs/GeoTools-1.15.0/workspace/modules/plugin/image/pom.xml to /opt/public/hipp/homes/genie.jts/.m2/repository/org/geotools/gt-image/20-SNAPSHOT/gt-image-20-SNAPSHOT.pom
[INFO] Installing /home/hudson/genie.jts/.jenkins/jobs/GeoTools-1.15.0/workspace/modules/plugin/image/target/gt-image-20-SNAPSHOT-sources.jar to /opt/public/hipp/homes/genie.jts/.m2/repository/org/geotools/gt-image/20-SNAPSHOT/gt-image-20-SNAPSHOT-sources.jar
Started calculate disk usage of build
Finished Calculation of disk usage of build in 0 seconds
Started calculate disk usage of workspace
Finished Calculation of disk usage of workspace in 0 seconds
[INFO] 
[INFO] --------------------< org.geotools:gt-imagemosaic >---------------------
[INFO] Building imagemosaic datasource module 20-SNAPSHOT              [36/130]
[INFO] --------------------------------[ jar ]---------------------------------
[INFO] Downloading from central.maven.org: http://central.maven.org/maven2/com/oracle/ojdbc14/10.2.0.3.0/ojdbc14-10.2.0.3.0.pom
[INFO] Downloaded from central.maven.org: http://central.maven.org/maven2/com/oracle/ojdbc14/10.2.0.3.0/ojdbc14-10.2.0.3.0.pom (903 B at 3.0 kB/s)
[INFO] Downloading from central.maven.org: http://central.maven.org/maven2/commons-beanutils/commons-beanutils/1.9.2/commons-beanutils-1.9.2.pom
[INFO] Downloaded from central.maven.org: http://central.maven.org/maven2/commons-beanutils/commons-beanutils/1.9.2/commons-beanutils-1.9.2.pom (14 kB at 152 kB/s)
[INFO] Downloading from central.maven.org: http://central.maven.org/maven2/org/apache/commons/commons-parent/33/commons-parent-33.pom
[INFO] Downloaded from central.maven.org: http://central.maven.org/maven2/org/apache/commons/commons-parent/33/commons-parent-33.pom (53 kB at 510 kB/s)
[INFO] Downloading from central.maven.org: http://central.maven.org/maven2/net/sf/ehcache/ehcache/2.10.3/ehcache-2.10.3.pom
[INFO] Downloaded from central.maven.org: http://central.maven.org/maven2/net/sf/ehcache/ehcache/2.10.3/ehcache-2.10.3.pom (19 kB at 263 kB/s)
[INFO] Downloading from central.maven.org: http://central.maven.org/maven2/net/sf/ehcache/ehcache-root/2.10.3/ehcache-root-2.10.3.pom
[INFO] Downloaded from central.maven.org: http://central.maven.org/maven2/net/sf/ehcache/ehcache-root/2.10.3/ehcache-root-2.10.3.pom (17 kB at 243 kB/s)
[INFO] Downloading from central.maven.org: http://central.maven.org/maven2/net/sf/ehcache/ehcache-parent/2.18/ehcache-parent-2.18.pom
[INFO] Downloaded from central.maven.org: http://central.maven.org/maven2/net/sf/ehcache/ehcache-parent/2.18/ehcache-parent-2.18.pom (17 kB at 238 kB/s)
[INFO] Downloading from central.maven.org: http://central.maven.org/maven2/com/oracle/ojdbc14/10.2.0.3.0/ojdbc14-10.2.0.3.0.jar
[INFO] Downloading from central.maven.org: http://central.maven.org/maven2/commons-beanutils/commons-beanutils/1.9.2/commons-beanutils-1.9.2-noclassprop.jar
[INFO] Downloading from central.maven.org: http://central.maven.org/maven2/net/sf/ehcache/ehcache/2.10.3/ehcache-2.10.3.jar
[INFO] Downloaded from central.maven.org: http://central.maven.org/maven2/net/sf/ehcache/ehcache/2.10.3/ehcache-2.10.3.jar (8.9 MB at 7.1 MB/s)
[INFO] Downloading from osgeo: http://download.osgeo.org/webdav/geotools/com/oracle/ojdbc14/10.2.0.3.0/ojdbc14-10.2.0.3.0.jar
[INFO] Downloading from osgeo: http://download.osgeo.org/webdav/geotools/commons-beanutils/commons-beanutils/1.9.2/commons-beanutils-1.9.2-noclassprop.jar
[INFO] Downloading from boundless: https://repo.boundlessgeo.com/main/com/oracle/ojdbc14/10.2.0.3.0/ojdbc14-10.2.0.3.0.jar
[INFO] Downloading from boundless: https://repo.boundlessgeo.com/main/commons-beanutils/commons-beanutils/1.9.2/commons-beanutils-1.9.2-noclassprop.jar
[INFO] Downloaded from boundless: https://repo.boundlessgeo.com/main/commons-beanutils/commons-beanutils/1.9.2/commons-beanutils-1.9.2-noclassprop.jar (234 kB at 355 kB/s)
[INFO] Downloaded from boundless: https://repo.boundlessgeo.com/main/com/oracle/ojdbc14/10.2.0.3.0/ojdbc14-10.2.0.3.0.jar (1.5 MB at 1.8 MB/s)
[INFO] 
[INFO] --- maven-clean-plugin:2.5:clean (default-clean) @ gt-imagemosaic ---
[INFO] 
[INFO] --- git-commit-id-plugin:2.1.15:revision (default) @ gt-imagemosaic ---
[INFO] 
[INFO] --- fmt-maven-plugin:2.4.0:format (default) @ gt-imagemosaic ---
[debug] Using AOSP style
[INFO] Processed 100 files (0 reformatted).
[INFO] Processed 165 files (0 reformatted).
[INFO] 
[INFO] --- maven-resources-plugin:2.6:resources (default-resources) @ gt-imagemosaic ---
[INFO] Using 'UTF-8' encoding to copy filtered resources.
[INFO] Copying 7 resources
[INFO] 
[INFO] --- maven-compiler-plugin:3.1:compile (default-compile) @ gt-imagemosaic ---
[INFO] Changes detected - recompiling the module!
[INFO] Compiling 135 source files to /home/hudson/genie.jts/.jenkins/jobs/GeoTools-1.15.0/workspace/modules/plugin/imagemosaic/target/classes
[INFO] 
[INFO] --- maven-resources-plugin:2.6:testResources (default-testResources) @ gt-imagemosaic ---
[INFO] Using 'UTF-8' encoding to copy filtered resources.
[INFO] Copying 404 resources
[INFO] 
[INFO] --- maven-compiler-plugin:3.1:testCompile (default-testCompile) @ gt-imagemosaic ---
[INFO] Changes detected - recompiling the module!
[INFO] Compiling 30 source files to /home/hudson/genie.jts/.jenkins/jobs/GeoTools-1.15.0/workspace/modules/plugin/imagemosaic/target/test-classes
[WARNING] Picked up JAVA_TOOL_OPTIONS: -Xmx2G -Djava.io.tmpdir=/tmp/genie.jts
/home/hudson/genie.jts/.jenkins/jobs/GeoTools-1.15.0/workspace/modules/plugin/imagemosaic/src/test/java/org/geotools/gce/imagemosaic/remote/RemoteImageInputStreamSPI.java:[19,26] FileImageInputStreamSpi is internal proprietary API and may be removed in a future release
[WARNING] /home/hudson/genie.jts/.jenkins/jobs/GeoTools-1.15.0/workspace/modules/plugin/imagemosaic/src/test/java/org/geotools/gce/imagemosaic/remote/RemoteImageInputStreamSPI.java:[32,12] FileImageInputStreamSpi is internal proprietary API and may be removed in a future release
[WARNING] /home/hudson/genie.jts/.jenkins/jobs/GeoTools-1.15.0/workspace/modules/plugin/imagemosaic/src/test/java/org/geotools/gce/imagemosaic/remote/RemoteImageInputStreamSPI.java:[32,51] FileImageInputStreamSpi is internal proprietary API and may be removed in a future release
[INFO] 
[INFO] --- maven-surefire-plugin:2.15:test (default-test) @ gt-imagemosaic ---
[INFO] Surefire report directory: /home/hudson/genie.jts/.jenkins/jobs/GeoTools-1.15.0/workspace/modules/plugin/imagemosaic/target/surefire-reports

-------------------------------------------------------
 T E S T S
-------------------------------------------------------
Picked up JAVA_TOOL_OPTIONS: -Xmx2G -Djava.io.tmpdir=/tmp/genie.jts
Running org.geotools.gce.imagemosaic.CatalogBuilderTest
Tests run: 3, Failures: 0, Errors: 0, Skipped: 2, Time elapsed: 0.554 sec - in org.geotools.gce.imagemosaic.CatalogBuilderTest
Running org.geotools.gce.imagemosaic.DateRangeVisitorTest
Tests run: 5, Failures: 0, Errors: 0, Skipped: 0, Time elapsed: 0.089 sec - in org.geotools.gce.imagemosaic.DateRangeVisitorTest
Running org.geotools.gce.imagemosaic.DefaultSubmosaicProducerSPITest
Jun 28, 2018 7:49:35 PM org.geotools.gce.imagemosaic.Utils loadMosaicProperties
INFO: Required key Levels not found.
Jun 28, 2018 7:49:36 PM org.geotools.gce.imagemosaic.ImageMosaicEventHandlers fireEvent
INFO: Now indexing file dem_large_warped.tif
2018-06-28T19:49:37.348-0400  WARNING  Possible use of "Transverse_Mercator (Inverse transform)" projection outside its valid area.
Latitude 7982°39.7'N is out of range (±90°).
Tests run: 2, Failures: 0, Errors: 0, Skipped: 0, Time elapsed: 1.574 sec - in org.geotools.gce.imagemosaic.DefaultSubmosaicProducerSPITest
Running org.geotools.gce.imagemosaic.GranuleDescriptorTest
Tests run: 1, Failures: 0, Errors: 0, Skipped: 0, Time elapsed: 0.076 sec - in org.geotools.gce.imagemosaic.GranuleDescriptorTest
Running org.geotools.gce.imagemosaic.GranuleHandlerSPITest
Tests run: 1, Failures: 0, Errors: 0, Skipped: 0, Time elapsed: 0 sec - in org.geotools.gce.imagemosaic.GranuleHandlerSPITest
Running org.geotools.gce.imagemosaic.GranuleTest
2018-06-28T19:49:37.587-0400  WARNING  Using forced coordinate reference system 
2018-06-28T19:49:37.601-0400  WARNING  Using forced coordinate reference system 
2018-06-28T19:49:37.608-0400  WARNING  Using forced coordinate reference system 
2018-06-28T19:49:37.614-0400  WARNING  Using forced coordinate reference system 
2018-06-28T19:49:37.626-0400  WARNING  Using forced coordinate reference system 
2018-06-28T19:49:37.640-0400  WARNING  Using forced coordinate reference system 
2018-06-28T19:49:37.653-0400  WARNING  Using forced coordinate reference system 
2018-06-28T19:49:37.665-0400  WARNING  Using forced coordinate reference system 
2018-06-28T19:49:37.676-0400  WARNING  Using forced coordinate reference system 
2018-06-28T19:49:37.687-0400  WARNING  Using forced coordinate reference system 
2018-06-28T19:49:37.697-0400  WARNING  Using forced coordinate reference system 
2018-06-28T19:49:37.706-0400  WARNING  Using forced coordinate reference system 
2018-06-28T19:49:37.714-0400  WARNING  Using forced coordinate reference system 
2018-06-28T19:49:37.721-0400  WARNING  Using forced coordinate reference system 
2018-06-28T19:49:37.728-0400  WARNING  Using forced coordinate reference system 
2018-06-28T19:49:37.736-0400  WARNING  Using forced coordinate reference system 
2018-06-28T19:49:37.745-0400  WARNING  Using forced coordinate reference system 
2018-06-28T19:49:37.771-0400  WARNING  Using forced coordinate reference system 
2018-06-28T19:49:37.781-0400  WARNING  Using forced coordinate reference system 
2018-06-28T19:49:37.789-0400  WARNING  Using forced coordinate reference system 
2018-06-28T19:49:37.797-0400  WARNING  Using forced coordinate reference system 
2018-06-28T19:49:37.805-0400  WARNING  Using forced coordinate reference system 
2018-06-28T19:49:37.813-0400  WARNING  Using forced coordinate reference system 
2018-06-28T19:49:37.820-0400  WARNING  Using forced coordinate reference system 
2018-06-28T19:49:37.992-0400  WARNING  Unable to find sample image for path /home/hudson/genie.jts/.jenkins/jobs/GeoTools-1.15.0/workspace/modules/plugin/imagemosaic/target/test-classes/org/geotools/gce/imagemosaic/test-data/crs_nztm/sample_image
2018-06-28T19:49:37.993-0400  WARNING  Unable to find sample image for path file:/home/hudson/genie.jts/.jenkins/jobs/GeoTools-1.15.0/workspace/modules/plugin/imagemosaic/target/test-classes/org/geotools/gce/imagemosaic/test-data/crs_nztm/mosaic.shp
Tests run: 3, Failures: 0, Errors: 0, Skipped: 0, Time elapsed: 0.534 sec - in org.geotools.gce.imagemosaic.GranuleTest
Running org.geotools.gce.imagemosaic.HeterogenousCRSTest
Tests run: 14, Failures: 0, Errors: 0, Skipped: 1, Time elapsed: 3.777 sec - in org.geotools.gce.imagemosaic.HeterogenousCRSTest
Running org.geotools.gce.imagemosaic.ImageMosaicEgrTest
Tests run: 8, Failures: 0, Errors: 0, Skipped: 0, Time elapsed: 5.081 sec - in org.geotools.gce.imagemosaic.ImageMosaicEgrTest
Running org.geotools.gce.imagemosaic.ImageMosaicFootprintsTest
2018-06-28T19:49:51.934-0400  WARNING  Unable to find sample image for path /home/hudson/genie.jts/.jenkins/jobs/GeoTools-1.15.0/workspace/modules/plugin/imagemosaic/target/test-classes/org/geotools/gce/imagemosaic/test-data/footprintMosaic/sample_image
2018-06-28T19:49:51.935-0400  WARNING  Unable to find sample image for path file:/home/hudson/genie.jts/.jenkins/jobs/GeoTools-1.15.0/workspace/modules/plugin/imagemosaic/target/test-classes/org/geotools/gce/imagemosaic/test-data/footprintMosaic/rgb.shp
2018-06-28T19:49:51.963-0400  WARNING  Unable to find sample image for path /home/hudson/genie.jts/.jenkins/jobs/GeoTools-1.15.0/workspace/modules/plugin/imagemosaic/target/test-classes/org/geotools/gce/imagemosaic/test-data/footprintMosaic/sample_image
2018-06-28T19:49:51.963-0400  WARNING  Unable to find sample image for path file:/home/hudson/genie.jts/.jenkins/jobs/GeoTools-1.15.0/workspace/modules/plugin/imagemosaic/target/test-classes/org/geotools/gce/imagemosaic/test-data/footprintMosaic/rgb.shp
2018-06-28T19:49:52.412-0400  WARNING  This granule catalog was not properly dispose as it still points to:ServiceInfo 
 description=Features from ShapefileDataStore
Tests run: 27, Failures: 0, Errors: 6, Skipped: 0, Time elapsed: 8.317 sec <<< FAILURE! - in org.geotools.gce.imagemosaic.ImageMosaicFootprintsTest
testMaskingWithBufferAndFootprint(org.geotools.gce.imagemosaic.ImageMosaicFootprintsTest)  Time elapsed: 0.141 sec  <<< ERROR!
java.lang.ClassCastException: javax.media.jai.ROI cannot be cast to it.geosolutions.jaiext.vectorbin.ROIGeometry
	at org.geotools.gce.imagemosaic.ImageMosaicFootprintsTest.maskCoverage(ImageMosaicFootprintsTest.java:480)
	at org.geotools.gce.imagemosaic.ImageMosaicFootprintsTest.testMaskingWithBufferAndFootprint(ImageMosaicFootprintsTest.java:381)

testMaskingWithBuffer(org.geotools.gce.imagemosaic.ImageMosaicFootprintsTest)  Time elapsed: 0.056 sec  <<< ERROR!
java.lang.ClassCastException: javax.media.jai.ROI cannot be cast to it.geosolutions.jaiext.vectorbin.ROIGeometry
	at org.geotools.gce.imagemosaic.ImageMosaicFootprintsTest.maskCoverage(ImageMosaicFootprintsTest.java:480)
	at org.geotools.gce.imagemosaic.ImageMosaicFootprintsTest.testMaskingWithBuffer(ImageMosaicFootprintsTest.java:375)

testMaskingDecimationWithBufferAndFootprint(org.geotools.gce.imagemosaic.ImageMosaicFootprintsTest)  Time elapsed: 0.22 sec  <<< ERROR!
java.lang.ClassCastException: javax.media.jai.ROI cannot be cast to it.geosolutions.jaiext.vectorbin.ROIGeometry
	at org.geotools.gce.imagemosaic.ImageMosaicFootprintsTest.maskCoverage(ImageMosaicFootprintsTest.java:480)
	at org.geotools.gce.imagemosaic.ImageMosaicFootprintsTest.testMaskingDecimationWithBufferAndFootprint(ImageMosaicFootprintsTest.java:391)

testMasking(org.geotools.gce.imagemosaic.ImageMosaicFootprintsTest)  Time elapsed: 0.785 sec  <<< ERROR!
java.lang.ClassCastException: javax.media.jai.ROI cannot be cast to it.geosolutions.jaiext.vectorbin.ROIGeometry
	at org.geotools.gce.imagemosaic.ImageMosaicFootprintsTest.maskCoverage(ImageMosaicFootprintsTest.java:480)
	at org.geotools.gce.imagemosaic.ImageMosaicFootprintsTest.testMasking(ImageMosaicFootprintsTest.java:363)

testMaskingWithFootprint(org.geotools.gce.imagemosaic.ImageMosaicFootprintsTest)  Time elapsed: 0.146 sec  <<< ERROR!
java.lang.ClassCastException: javax.media.jai.ROI cannot be cast to it.geosolutions.jaiext.vectorbin.ROIGeometry
	at org.geotools.gce.imagemosaic.ImageMosaicFootprintsTest.maskCoverage(ImageMosaicFootprintsTest.java:480)
	at org.geotools.gce.imagemosaic.ImageMosaicFootprintsTest.testMaskingWithFootprint(ImageMosaicFootprintsTest.java:369)

testMaskWithBackground(org.geotools.gce.imagemosaic.ImageMosaicFootprintsTest)  Time elapsed: 0.197 sec  <<< ERROR!
java.lang.ClassCastException: javax.media.jai.ROI cannot be cast to it.geosolutions.jaiext.vectorbin.ROIGeometry
	at org.geotools.gce.imagemosaic.ImageMosaicFootprintsTest.testMaskWithBackground(ImageMosaicFootprintsTest.java:607)

Running org.geotools.gce.imagemosaic.ImageMosaicReaderTest
2018-06-28T19:49:55.600-0400  WARNING  Using forced coordinate reference system 
2018-06-28T19:49:55.615-0400  WARNING  Using forced coordinate reference system 
2018-06-28T19:49:55.622-0400  WARNING  Using forced coordinate reference system 
2018-06-28T19:49:55.962-0400  WARNING  Using forced coordinate reference system 
2018-06-28T19:49:55.973-0400  WARNING  Using forced coordinate reference system 
2018-06-28T19:49:55.978-0400  WARNING  Using forced coordinate reference system 
2018-06-28T19:49:56.188-0400  WARNING  Using forced coordinate reference system 
2018-06-28T19:49:56.204-0400  WARNING  Using forced coordinate reference system 
2018-06-28T19:49:56.211-0400  WARNING  Using forced coordinate reference system 
2018-06-28T19:49:56.406-0400  WARNING  Unable to find sample image for path /home/hudson/genie.jts/.jenkins/jobs/GeoTools-1.15.0/workspace/modules/plugin/imagemosaic/target/test-classes/org/geotools/gce/imagemosaic/test-data/empty_mosaic/sample_image
2018-06-28T19:49:56.406-0400  WARNING  Unable to find sample image for path file:/home/hudson/genie.jts/.jenkins/jobs/GeoTools-1.15.0/workspace/modules/plugin/imagemosaic/target/test-classes/org/geotools/gce/imagemosaic/test-data/empty_mosaic/empty_mosaic.shp
2018-06-28T19:49:56.416-0400  WARNING  Unable to find sample image for path /home/hudson/genie.jts/.jenkins/jobs/GeoTools-1.15.0/workspace/modules/plugin/imagemosaic/target/test-classes/org/geotools/gce/imagemosaic/test-data/empty_mosaic/sample_image
2018-06-28T19:49:56.416-0400  WARNING  Unable to find sample image for path file:/home/hudson/genie.jts/.jenkins/jobs/GeoTools-1.15.0/workspace/modules/plugin/imagemosaic/target/test-classes/org/geotools/gce/imagemosaic/test-data/empty_mosaic/empty_mosaic.shp
2018-06-28T19:49:56.520-0400  WARNING  This granule catalog was not properly dispose as it still points to:ServiceInfo 
 description=Features from ShapefileDataStore
2018-06-28T19:49:56.532-0400  WARNING  Could not find a world transform file for addedGranule, assuming the identity transform
2018-06-28T19:49:58.275-0400  WARNING  Using forced coordinate reference system 
2018-06-28T19:50:00.293-0400  WARNING  Using forced coordinate reference system 
2018-06-28T19:50:00.449-0400  WARNING  Using forced coordinate reference system 
2018-06-28T19:50:00.460-0400  WARNING  Using forced coordinate reference system 
2018-06-28T19:50:00.469-0400  WARNING  Using forced coordinate reference system 
2018-06-28T19:50:00.477-0400  WARNING  Using forced coordinate reference system 
2018-06-28T19:50:00.485-0400  WARNING  Using forced coordinate reference system 
2018-06-28T19:50:00.491-0400  WARNING  Using forced coordinate reference system 
2018-06-28T19:50:00.498-0400  WARNING  Using forced coordinate reference system 
2018-06-28T19:50:00.504-0400  WARNING  Using forced coordinate reference system 
2018-06-28T19:50:00.511-0400  WARNING  Using forced coordinate reference system 
2018-06-28T19:50:00.517-0400  WARNING  Using forced coordinate reference system 
2018-06-28T19:50:00.524-0400  WARNING  Using forced coordinate reference system 
2018-06-28T19:50:00.530-0400  WARNING  Using forced coordinate reference system 
2018-06-28T19:50:00.535-0400  WARNING  Using forced coordinate reference system 
2018-06-28T19:50:00.541-0400  WARNING  Using forced coordinate reference system 
2018-06-28T19:50:00.546-0400  WARNING  Using forced coordinate reference system 
2018-06-28T19:50:00.552-0400  WARNING  Using forced coordinate reference system 
2018-06-28T19:50:00.557-0400  WARNING  Using forced coordinate reference system 
2018-06-28T19:50:00.562-0400  WARNING  Using forced coordinate reference system 
2018-06-28T19:50:00.568-0400  WARNING  Using forced coordinate reference system 
2018-06-28T19:50:00.595-0400  WARNING  Using forced coordinate reference system 
2018-06-28T19:50:00.602-0400  WARNING  Using forced coordinate reference system 
2018-06-28T19:50:00.608-0400  WARNING  Using forced coordinate reference system 
2018-06-28T19:50:00.614-0400  WARNING  Using forced coordinate reference system 
2018-06-28T19:50:06.010-0400  WARNING  This granule catalog was not properly dispose as it still points to:ServiceInfo 
 description=Features from ShapefileDataStore
2018-06-28T19:50:07.205-0400  SEVERE  Schema 'stop-it' already exists
java.lang.IllegalArgumentException: Schema 'stop-it' already exists
	at org.geotools.jdbc.JDBCDataStore.createSchema(JDBCDataStore.java:761)
	at org.geotools.jdbc.JDBCDataStore.createSchema(JDBCDataStore.java:149)
	at org.geotools.gce.imagemosaic.catalog.AbstractGTDataStoreGranuleCatalog.createType(AbstractGTDataStoreGranuleCatalog.java:624)
	at org.geotools.gce.imagemosaic.catalog.GTDataStoreGranuleCatalog.createType(GTDataStoreGranuleCatalog.java:36)
	at org.geotools.gce.imagemosaic.catalog.CachingDataStoreGranuleCatalog.createType(CachingDataStoreGranuleCatalog.java:95)
	at org.geotools.gce.imagemosaic.RasterManager.createStore(RasterManager.java:1454)
	at org.geotools.gce.imagemosaic.ImageMosaicReader.createCoverage(ImageMosaicReader.java:1200)
	at org.geotools.gce.imagemosaic.ImageMosaicConfigHandler.updateConfiguration(ImageMosaicConfigHandler.java:1635)
	at org.geotools.gce.imagemosaic.ImageMosaicWalker.handleFile(ImageMosaicWalker.java:263)
	at org.geotools.gce.imagemosaic.ImageMosaicDirectoryWalker$MosaicDirectoryWalker.handleFile(ImageMosaicDirectoryWalker.java:97)
	at org.apache.commons.io.DirectoryWalker.walk(DirectoryWalker.java:367)
	at org.apache.commons.io.DirectoryWalker.walk(DirectoryWalker.java:335)
	at org.geotools.gce.imagemosaic.ImageMosaicDirectoryWalker$MosaicDirectoryWalker.<init>(ImageMosaicDirectoryWalker.java:118)
	at org.geotools.gce.imagemosaic.ImageMosaicDirectoryWalker.run(ImageMosaicDirectoryWalker.java:204)
	at org.geotools.gce.imagemosaic.Utils.createMosaic(Utils.java:494)
	at org.geotools.gce.imagemosaic.Utils.checkSource(Utils.java:1507)
	at org.geotools.gce.imagemosaic.ImageMosaicReader.initReaderFromURL(ImageMosaicReader.java:566)
	at org.geotools.gce.imagemosaic.ImageMosaicReader.<init>(ImageMosaicReader.java:511)
	at org.geotools.gce.imagemosaic.ImageMosaicFormat.getReader(ImageMosaicFormat.java:566)
	at org.geotools.gce.imagemosaic.ImageMosaicFormat.getReader(ImageMosaicFormat.java:302)
	at org.geotools.gce.imagemosaic.ImageMosaicFormat.getReader(ImageMosaicFormat.java:108)
	at org.geotools.gce.imagemosaic.ImageMosaicReaderTest.testStopCreationWhileWalkingMosaicDir(ImageMosaicReaderTest.java:4310)
	at sun.reflect.NativeMethodAccessorImpl.invoke0(Native Method)
	at sun.reflect.NativeMethodAccessorImpl.invoke(NativeMethodAccessorImpl.java:62)
	at sun.reflect.DelegatingMethodAccessorImpl.invoke(DelegatingMethodAccessorImpl.java:43)
	at java.lang.reflect.Method.invoke(Method.java:498)
	at org.junit.runners.model.FrameworkMethod$1.runReflectiveCall(FrameworkMethod.java:47)
	at org.junit.internal.runners.model.ReflectiveCallable.run(ReflectiveCallable.java:12)
	at org.junit.runners.model.FrameworkMethod.invokeExplosively(FrameworkMethod.java:44)
	at org.junit.internal.runners.statements.InvokeMethod.evaluate(InvokeMethod.java:17)
	at org.junit.internal.runners.statements.RunBefores.evaluate(RunBefores.java:26)
	at org.junit.internal.runners.statements.RunAfters.evaluate(RunAfters.java:27)
	at org.junit.rules.ExternalResource$1.evaluate(ExternalResource.java:48)
	at org.junit.rules.RunRules.evaluate(RunRules.java:20)
	at org.junit.runners.ParentRunner.runLeaf(ParentRunner.java:271)
	at org.junit.runners.BlockJUnit4ClassRunner.runChild(BlockJUnit4ClassRunner.java:70)
	at org.junit.runners.BlockJUnit4ClassRunner.runChild(BlockJUnit4ClassRunner.java:50)
	at org.junit.runners.ParentRunner$3.run(ParentRunner.java:238)
	at org.junit.runners.ParentRunner$1.schedule(ParentRunner.java:63)
	at org.junit.runners.ParentRunner.runChildren(ParentRunner.java:236)
	at org.junit.runners.ParentRunner.access$000(ParentRunner.java:53)
	at org.junit.runners.ParentRunner$2.evaluate(ParentRunner.java:229)
	at org.junit.internal.runners.statements.RunBefores.evaluate(RunBefores.java:26)
	at org.junit.internal.runners.statements.RunAfters.evaluate(RunAfters.java:27)
	at org.junit.runners.ParentRunner.run(ParentRunner.java:309)
	at junit.framework.JUnit4TestAdapter.run(JUnit4TestAdapter.java:38)
	at org.junit.internal.runners.JUnit38ClassRunner.run(JUnit38ClassRunner.java:84)
	at org.apache.maven.surefire.junit4.JUnit4Provider.execute(JUnit4Provider.java:264)
	at org.apache.maven.surefire.junit4.JUnit4Provider.executeTestSet(JUnit4Provider.java:153)
	at org.apache.maven.surefire.junit4.JUnit4Provider.invoke(JUnit4Provider.java:124)
	at org.apache.maven.surefire.booter.ForkedBooter.invokeProviderInSameClassLoader(ForkedBooter.java:200)
	at org.apache.maven.surefire.booter.ForkedBooter.runSuitesInProcess(ForkedBooter.java:153)
	at org.apache.maven.surefire.booter.ForkedBooter.main(ForkedBooter.java:103)

2018-06-28T19:50:07.207-0400  WARNING  Failure occurred while collecting the granules
org.apache.commons.io.DirectoryWalker$CancelException: Operation Cancelled
	at org.apache.commons.io.DirectoryWalker.checkIfCancelled(DirectoryWalker.java:395)
	at org.apache.commons.io.DirectoryWalker.walk(DirectoryWalker.java:368)
	at org.apache.commons.io.DirectoryWalker.walk(DirectoryWalker.java:335)
	at org.geotools.gce.imagemosaic.ImageMosaicDirectoryWalker$MosaicDirectoryWalker.<init>(ImageMosaicDirectoryWalker.java:118)
	at org.geotools.gce.imagemosaic.ImageMosaicDirectoryWalker.run(ImageMosaicDirectoryWalker.java:204)
	at org.geotools.gce.imagemosaic.Utils.createMosaic(Utils.java:494)
	at org.geotools.gce.imagemosaic.Utils.checkSource(Utils.java:1507)
	at org.geotools.gce.imagemosaic.ImageMosaicReader.initReaderFromURL(ImageMosaicReader.java:566)
	at org.geotools.gce.imagemosaic.ImageMosaicReader.<init>(ImageMosaicReader.java:511)
	at org.geotools.gce.imagemosaic.ImageMosaicFormat.getReader(ImageMosaicFormat.java:566)
	at org.geotools.gce.imagemosaic.ImageMosaicFormat.getReader(ImageMosaicFormat.java:302)
	at org.geotools.gce.imagemosaic.ImageMosaicFormat.getReader(ImageMosaicFormat.java:108)
	at org.geotools.gce.imagemosaic.ImageMosaicReaderTest.testStopCreationWhileWalkingMosaicDir(ImageMosaicReaderTest.java:4310)
	at sun.reflect.NativeMethodAccessorImpl.invoke0(Native Method)
	at sun.reflect.NativeMethodAccessorImpl.invoke(NativeMethodAccessorImpl.java:62)
	at sun.reflect.DelegatingMethodAccessorImpl.invoke(DelegatingMethodAccessorImpl.java:43)
	at java.lang.reflect.Method.invoke(Method.java:498)
	at org.junit.runners.model.FrameworkMethod$1.runReflectiveCall(FrameworkMethod.java:47)
	at org.junit.internal.runners.model.ReflectiveCallable.run(ReflectiveCallable.java:12)
	at org.junit.runners.model.FrameworkMethod.invokeExplosively(FrameworkMethod.java:44)
	at org.junit.internal.runners.statements.InvokeMethod.evaluate(InvokeMethod.java:17)
	at org.junit.internal.runners.statements.RunBefores.evaluate(RunBefores.java:26)
	at org.junit.internal.runners.statements.RunAfters.evaluate(RunAfters.java:27)
	at org.junit.rules.ExternalResource$1.evaluate(ExternalResource.java:48)
	at org.junit.rules.RunRules.evaluate(RunRules.java:20)
	at org.junit.runners.ParentRunner.runLeaf(ParentRunner.java:271)
	at org.junit.runners.BlockJUnit4ClassRunner.runChild(BlockJUnit4ClassRunner.java:70)
	at org.junit.runners.BlockJUnit4ClassRunner.runChild(BlockJUnit4ClassRunner.java:50)
	at org.junit.runners.ParentRunner$3.run(ParentRunner.java:238)
	at org.junit.runners.ParentRunner$1.schedule(ParentRunner.java:63)
	at org.junit.runners.ParentRunner.runChildren(ParentRunner.java:236)
	at org.junit.runners.ParentRunner.access$000(ParentRunner.java:53)
	at org.junit.runners.ParentRunner$2.evaluate(ParentRunner.java:229)
	at org.junit.internal.runners.statements.RunBefores.evaluate(RunBefores.java:26)
	at org.junit.internal.runners.statements.RunAfters.evaluate(RunAfters.java:27)
	at org.junit.runners.ParentRunner.run(ParentRunner.java:309)
	at junit.framework.JUnit4TestAdapter.run(JUnit4TestAdapter.java:38)
	at org.junit.internal.runners.JUnit38ClassRunner.run(JUnit38ClassRunner.java:84)
	at org.apache.maven.surefire.junit4.JUnit4Provider.execute(JUnit4Provider.java:264)
	at org.apache.maven.surefire.junit4.JUnit4Provider.executeTestSet(JUnit4Provider.java:153)
	at org.apache.maven.surefire.junit4.JUnit4Provider.invoke(JUnit4Provider.java:124)
	at org.apache.maven.surefire.booter.ForkedBooter.invokeProviderInSameClassLoader(ForkedBooter.java:200)
	at org.apache.maven.surefire.booter.ForkedBooter.runSuitesInProcess(ForkedBooter.java:153)
	at org.apache.maven.surefire.booter.ForkedBooter.main(ForkedBooter.java:103)

2018-06-28T19:50:08.851-0400  WARNING  FieldName polarization is longer than 10 characters, truncating to polarizati
2018-06-28T19:50:09.199-0400  WARNING  Using forced coordinate reference system 
2018-06-28T19:50:09.482-0400  WARNING  Unable to find sample image for path /home/hudson/genie.jts/.jenkins/jobs/GeoTools-1.15.0/workspace/modules/plugin/imagemosaic/target/test-classes/org/geotools/gce/imagemosaic/test-data/emptyMosaicXML/sample_image
2018-06-28T19:50:09.482-0400  WARNING  Unable to find sample image for path file:/home/hudson/genie.jts/.jenkins/jobs/GeoTools-1.15.0/workspace/modules/plugin/imagemosaic/target/test-classes/org/geotools/gce/imagemosaic/test-data/emptyMosaicXML/datastore.properties
2018-06-28T19:50:09.819-0400  SEVERE  There's code using JDBC based datastore and not disposing them. This may lead to temporary loss of database connections. Please make sure all data access code calls DataStore.dispose() before freeing all references to it
2018-06-28T19:50:09.828-0400  WARNING  This granule catalog was not properly dispose as it still points to:ServiceInfo 
 description=Features from JDBCDataStore
2018-06-28T19:50:09.981-0400  WARNING  Could not find a world transform file for global_mosaic_0, assuming the identity transform
[passA2006128211927.tiff, passA2006128194218.tiff]
2018-06-28T19:50:11.763-0400  SEVERE  /home/hudson/genie.jts/.jenkins/jobs/GeoTools-1.15.0/workspace/modules/plugin/imagemosaic/target/test-classes/org/geotools/gce/imagemosaic/test-data/rgb/datastore.properties (No such file or directory)
java.io.FileNotFoundException: /home/hudson/genie.jts/.jenkins/jobs/GeoTools-1.15.0/workspace/modules/plugin/imagemosaic/target/test-classes/org/geotools/gce/imagemosaic/test-data/rgb/datastore.properties (No such file or directory)
	at java.io.FileInputStream.open0(Native Method)
	at java.io.FileInputStream.open(FileInputStream.java:195)
	at java.io.FileInputStream.<init>(FileInputStream.java:138)
	at java.io.FileInputStream.<init>(FileInputStream.java:93)
	at sun.net.www.protocol.file.FileURLConnection.connect(FileURLConnection.java:90)
	at sun.net.www.protocol.file.FileURLConnection.getInputStream(FileURLConnection.java:188)
	at java.net.URL.openStream(URL.java:1045)
	at org.geotools.resources.coverage.CoverageUtilities.loadPropertiesFromURL(CoverageUtilities.java:560)
	at org.geotools.gce.imagemosaic.ImageMosaicConfigHandler.createGranuleCatalogProperties(ImageMosaicConfigHandler.java:375)
	at org.geotools.gce.imagemosaic.ImageMosaicReader.initReaderFromURL(ImageMosaicReader.java:638)
	at org.geotools.gce.imagemosaic.ImageMosaicReader.<init>(ImageMosaicReader.java:511)
	at org.geotools.gce.imagemosaic.ImageMosaicFormat.getReader(ImageMosaicFormat.java:566)
	at org.geotools.gce.imagemosaic.ImageMosaicFormat.checkForUrl(ImageMosaicFormat.java:380)
	at org.geotools.gce.imagemosaic.ImageMosaicFormat.accepts(ImageMosaicFormat.java:317)
	at org.geotools.coverage.grid.io.GridFormatFinder.findFormats(GridFormatFinder.java:154)
	at org.geotools.coverage.grid.io.GridFormatFinder.findFormat(GridFormatFinder.java:193)
	at org.geotools.gce.imagemosaic.TestUtils.getFormat(TestUtils.java:168)
	at org.geotools.gce.imagemosaic.TestUtils.getFormat(TestUtils.java:153)
	at org.geotools.gce.imagemosaic.ImageMosaicReaderTest.testFilteredGranuleFootprint(ImageMosaicReaderTest.java:5120)
	at sun.reflect.NativeMethodAccessorImpl.invoke0(Native Method)
	at sun.reflect.NativeMethodAccessorImpl.invoke(NativeMethodAccessorImpl.java:62)
	at sun.reflect.DelegatingMethodAccessorImpl.invoke(DelegatingMethodAccessorImpl.java:43)
	at java.lang.reflect.Method.invoke(Method.java:498)
	at org.junit.runners.model.FrameworkMethod$1.runReflectiveCall(FrameworkMethod.java:47)
	at org.junit.internal.runners.model.ReflectiveCallable.run(ReflectiveCallable.java:12)
	at org.junit.runners.model.FrameworkMethod.invokeExplosively(FrameworkMethod.java:44)
	at org.junit.internal.runners.statements.InvokeMethod.evaluate(InvokeMethod.java:17)
	at org.junit.internal.runners.statements.RunBefores.evaluate(RunBefores.java:26)
	at org.junit.internal.runners.statements.RunAfters.evaluate(RunAfters.java:27)
	at org.junit.rules.ExternalResource$1.evaluate(ExternalResource.java:48)
	at org.junit.rules.RunRules.evaluate(RunRules.java:20)
	at org.junit.runners.ParentRunner.runLeaf(ParentRunner.java:271)
	at org.junit.runners.BlockJUnit4ClassRunner.runChild(BlockJUnit4ClassRunner.java:70)
	at org.junit.runners.BlockJUnit4ClassRunner.runChild(BlockJUnit4ClassRunner.java:50)
	at org.junit.runners.ParentRunner$3.run(ParentRunner.java:238)
	at org.junit.runners.ParentRunner$1.schedule(ParentRunner.java:63)
	at org.junit.runners.ParentRunner.runChildren(ParentRunner.java:236)
	at org.junit.runners.ParentRunner.access$000(ParentRunner.java:53)
	at org.junit.runners.ParentRunner$2.evaluate(ParentRunner.java:229)
	at org.junit.internal.runners.statements.RunBefores.evaluate(RunBefores.java:26)
	at org.junit.internal.runners.statements.RunAfters.evaluate(RunAfters.java:27)
	at org.junit.runners.ParentRunner.run(ParentRunner.java:309)
	at junit.framework.JUnit4TestAdapter.run(JUnit4TestAdapter.java:38)
	at org.junit.internal.runners.JUnit38ClassRunner.run(JUnit38ClassRunner.java:84)
	at org.apache.maven.surefire.junit4.JUnit4Provider.execute(JUnit4Provider.java:264)
	at org.apache.maven.surefire.junit4.JUnit4Provider.executeTestSet(JUnit4Provider.java:153)
	at org.apache.maven.surefire.junit4.JUnit4Provider.invoke(JUnit4Provider.java:124)
	at org.apache.maven.surefire.booter.ForkedBooter.invokeProviderInSameClassLoader(ForkedBooter.java:200)
	at org.apache.maven.surefire.booter.ForkedBooter.runSuitesInProcess(ForkedBooter.java:153)
	at org.apache.maven.surefire.booter.ForkedBooter.main(ForkedBooter.java:103)

2018-06-28T19:50:12.353-0400  WARNING  Using forced coordinate reference system 
2018-06-28T19:50:12.367-0400  WARNING  Using forced coordinate reference system 
2018-06-28T19:50:15.085-0400  WARNING  Unable to find sample image for path /home/hudson/genie.jts/.jenkins/jobs/GeoTools-1.15.0/workspace/modules/plugin/imagemosaic/target/test-classes/org/geotools/gce/imagemosaic/test-data/emptyMosaic/sample_image
2018-06-28T19:50:15.086-0400  WARNING  Unable to find sample image for path file:/home/hudson/genie.jts/.jenkins/jobs/GeoTools-1.15.0/workspace/modules/plugin/imagemosaic/target/test-classes/org/geotools/gce/imagemosaic/test-data/emptyMosaic/datastore.properties
2018-06-28T19:50:17.272-0400  WARNING  Column geom has no crs
2018-06-28T19:50:19.121-0400  WARNING  Unable to drop catalog for SPI H2
2018-06-28T19:50:19.728-0400  WARNING  Unable to find sample image for path /home/hudson/genie.jts/.jenkins/jobs/GeoTools-1.15.0/workspace/modules/plugin/imagemosaic/target/test-classes/org/geotools/gce/imagemosaic/test-data/empty_mosaic/sample_image
2018-06-28T19:50:19.728-0400  WARNING  Unable to find sample image for path file:/home/hudson/genie.jts/.jenkins/jobs/GeoTools-1.15.0/workspace/modules/plugin/imagemosaic/target/test-classes/org/geotools/gce/imagemosaic/test-data/empty_mosaic/empty_mosaic_with_caching.shp
2018-06-28T19:50:22.188-0400  WARNING  Unable to drop catalog for SPI H2
2018-06-28T19:50:22.510-0400  WARNING  Using forced coordinate reference system 
2018-06-28T19:50:22.531-0400  WARNING  Using forced coordinate reference system 
Tests run: 80, Failures: 1, Errors: 0, Skipped: 0, Time elapsed: 29.438 sec <<< FAILURE! - in org.geotools.gce.imagemosaic.ImageMosaicReaderTest
testImageMosaicConfigFilePath(org.geotools.gce.imagemosaic.ImageMosaicReaderTest)  Time elapsed: 0.063 sec  <<< FAILURE!
org.junit.ComparisonFailure: expected:</[]home/hudson/genie.jt...> but was:</[jobs/genie.jts/GeoTools-1.15.0/workspace/modules/plugin/imagemosaic/target/test-classes/org/geotools/gce/imagemosaic/test-data/merge///]home/hudson/genie.jt...>
	at org.junit.Assert.assertEquals(Assert.java:115)
	at org.junit.Assert.assertEquals(Assert.java:144)
	at org.geotools.gce.imagemosaic.ImageMosaicReaderTest.testImageMosaicConfigFilePath(ImageMosaicReaderTest.java:1376)

Running org.geotools.gce.imagemosaic.ImageMosaicRepositoryTest
2018-06-28T19:50:25.164-0400  WARNING  This granule catalog was not properly dispose as it still points to:ServiceInfo 
 description=Features from ShapefileDataStore
2018-06-28T19:50:25.164-0400  WARNING  This granule catalog was not properly dispose as it still points to:ServiceInfo 
 description=Features from ShapefileDataStore
2018-06-28T19:50:25.165-0400  WARNING  This granule catalog was not properly dispose as it still points to:ServiceInfo file:/tmp/genie.jts/junit7125048610421627918/rgbaShapefile
 publisher=genie.jts
 schema=http://www.opengis.net/gml
 description=Features from Directory /tmp/genie.jts/junit7125048610421627918/rgbaShapefile
2018-06-28T19:50:25.165-0400  WARNING  This granule catalog was not properly dispose as it still points to:ServiceInfo file:/tmp/genie.jts/junit7125048610421627918/rgbaShapefile
 publisher=genie.jts
 schema=http://www.opengis.net/gml
 description=Features from Directory /tmp/genie.jts/junit7125048610421627918/rgbaShapefile
Tests run: 4, Failures: 0, Errors: 0, Skipped: 0, Time elapsed: 0.64 sec - in org.geotools.gce.imagemosaic.ImageMosaicRepositoryTest
Running org.geotools.gce.imagemosaic.ImageMosaicServiceTest
Tests run: 1, Failures: 0, Errors: 0, Skipped: 0, Time elapsed: 0.001 sec - in org.geotools.gce.imagemosaic.ImageMosaicServiceTest
Running org.geotools.gce.imagemosaic.MergeBehaviorTest
Tests run: 1, Failures: 0, Errors: 0, Skipped: 0, Time elapsed: 0 sec - in org.geotools.gce.imagemosaic.MergeBehaviorTest
Running org.geotools.gce.imagemosaic.MultiResolutionTest
2018-06-28T19:50:25.436-0400  WARNING  Unable to find sample image for path /home/hudson/genie.jts/.jenkins/jobs/GeoTools-1.15.0/workspace/modules/plugin/imagemosaic/target/test-classes/org/geotools/gce/imagemosaic/test-data/multiresolution/sample_image
2018-06-28T19:50:25.436-0400  WARNING  Unable to find sample image for path file:/home/hudson/genie.jts/.jenkins/jobs/GeoTools-1.15.0/workspace/modules/plugin/imagemosaic/target/test-classes/org/geotools/gce/imagemosaic/test-data/multiresolution/sf.shp
Tests run: 4, Failures: 0, Errors: 0, Skipped: 0, Time elapsed: 0.202 sec - in org.geotools.gce.imagemosaic.MultiResolutionTest
Running org.geotools.gce.imagemosaic.OverviewsControllerTest
Tests run: 1, Failures: 0, Errors: 0, Skipped: 0, Time elapsed: 0.028 sec - in org.geotools.gce.imagemosaic.OverviewsControllerTest
Running org.geotools.gce.imagemosaic.PathTypeTest
Tests run: 2, Failures: 0, Errors: 0, Skipped: 0, Time elapsed: 0 sec - in org.geotools.gce.imagemosaic.PathTypeTest
Running org.geotools.gce.imagemosaic.PropertiesCollectorTest
Tests run: 3, Failures: 0, Errors: 0, Skipped: 0, Time elapsed: 0.001 sec - in org.geotools.gce.imagemosaic.PropertiesCollectorTest
Running org.geotools.gce.imagemosaic.RasterLayerRequestTest
Tests run: 1, Failures: 0, Errors: 0, Skipped: 0, Time elapsed: 0.055 sec - in org.geotools.gce.imagemosaic.RasterLayerRequestTest
Running org.geotools.gce.imagemosaic.RasterLayerResponseTest
Tests run: 2, Failures: 0, Errors: 0, Skipped: 0, Time elapsed: 0.093 sec - in org.geotools.gce.imagemosaic.RasterLayerResponseTest
Running org.geotools.gce.imagemosaic.RemoteTest
Tests run: 1, Failures: 0, Errors: 0, Skipped: 0, Time elapsed: 0.017 sec - in org.geotools.gce.imagemosaic.RemoteTest
Running org.geotools.gce.imagemosaic.SpatialRequestHelperTest
2018-06-28T19:50:25.736-0400  WARNING  Unable to compute requested resolution, using highest available
Tests run: 8, Failures: 0, Errors: 0, Skipped: 0, Time elapsed: 0.019 sec - in org.geotools.gce.imagemosaic.SpatialRequestHelperTest
Running org.geotools.gce.imagemosaic.egr.BinarizatorTest
Tests run: 5, Failures: 0, Errors: 0, Skipped: 1, Time elapsed: 0.002 sec - in org.geotools.gce.imagemosaic.egr.BinarizatorTest
Running org.geotools.gce.imagemosaic.properties.string.StringFileNameExtractorTest
Tests run: 3, Failures: 0, Errors: 0, Skipped: 0, Time elapsed: 0.002 sec - in org.geotools.gce.imagemosaic.properties.string.StringFileNameExtractorTest
Running org.geotools.gce.imagemosaic.properties.time.TimeParserTest
Tests run: 37, Failures: 0, Errors: 0, Skipped: 0, Time elapsed: 0.024 sec - in org.geotools.gce.imagemosaic.properties.time.TimeParserTest
Running org.geotools.gce.imagemosaic.properties.time.TimestampFileNameExtractorTest
Tests run: 5, Failures: 0, Errors: 0, Skipped: 0, Time elapsed: 0.004 sec - in org.geotools.gce.imagemosaic.properties.time.TimestampFileNameExtractorTest

Results :

Failed tests: 
  ImageMosaicReaderTest.testImageMosaicConfigFilePath:1376->Assert.assertEquals:144->Assert.assertEquals:115 expected:</[]home/hudson/genie.jt...> but was:</[jobs/genie.jts/GeoTools-1.15.0/workspace/modules/plugin/imagemosaic/target/test-classes/org/geotools/gce/imagemosaic/test-data/merge///]home/hudson/genie.jt...>

Tests in error: 
  ImageMosaicFootprintsTest.testMaskingWithBufferAndFootprint:381->maskCoverage:480 ClassCast
  ImageMosaicFootprintsTest.testMaskingWithBuffer:375->maskCoverage:480 ClassCast
  ImageMosaicFootprintsTest.testMaskingDecimationWithBufferAndFootprint:391->maskCoverage:480 ClassCast
  ImageMosaicFootprintsTest.testMasking:363->maskCoverage:480 ClassCast javax.me...
  ImageMosaicFootprintsTest.testMaskingWithFootprint:369->maskCoverage:480 ClassCast
  ImageMosaicFootprintsTest.testMaskWithBackground:607 ClassCast javax.media.jai...

Tests run: 222, Failures: 1, Errors: 6, Skipped: 4

[JENKINS] Recording test results
Started calculate disk usage of build
Finished Calculation of disk usage of build in 0 seconds
Started calculate disk usage of workspace
Finished Calculation of disk usage of workspace in 0 seconds
[INFO] ------------------------------------------------------------------------
[INFO] Reactor Summary:
[INFO] 
[INFO] GeoTools 20-SNAPSHOT ............................... SUCCESS [  4.217 s]
[INFO] Build tools for Geotools 2 ......................... SUCCESS [  0.334 s]
[INFO] Maven plugins for Geotools 2 ....................... SUCCESS [  0.328 s]
[INFO] JAR files collector ................................ SUCCESS [  5.599 s]
[INFO] Cross-modules javadoc .............................. SUCCESS [  7.190 s]
[INFO] JJTree and JavaCC compilers plugin ................. SUCCESS [  5.015 s]
[INFO] Geotools modules ................................... SUCCESS [  0.290 s]
[INFO] Geotools libraries ................................. SUCCESS [  0.323 s]
[INFO] Open GIS Interfaces ................................ SUCCESS [  6.974 s]
[INFO] Metadata ........................................... SUCCESS [ 11.361 s]
[INFO] Sample data module ................................. SUCCESS [  2.875 s]
[INFO] Referencing services ............................... SUCCESS [ 12.392 s]
[INFO] API interfaces ..................................... SUCCESS [  7.525 s]
[INFO] Geotools plugins ................................... SUCCESS [  0.289 s]
[INFO] EPSG Authority Service using HSQL database ......... SUCCESS [ 21.902 s]
[INFO] Main module ........................................ SUCCESS [ 21.567 s]
[INFO] Geotools extensions ................................ SUCCESS [  0.280 s]
[INFO] XML Parsing ........................................ SUCCESS [  0.326 s]
[INFO] XML Parsing ........................................ SUCCESS [  6.762 s]
[INFO] Feature Based Graphs and Networks .................. SUCCESS [  7.944 s]
[INFO] XML Code Generation Support ........................ SUCCESS [  3.006 s]
[INFO] EPSG Authority Service using WKT file .............. SUCCESS [  3.981 s]
[INFO] OGC CQL to Filter parser ........................... SUCCESS [  6.965 s]
[INFO] Grid Coverage module ............................... SUCCESS [ 36.278 s]
[INFO] DataStore Support .................................. SUCCESS [  5.780 s]
[INFO] Property File DataStore ............................ SUCCESS [  5.842 s]
[INFO] GeoTIFF grid coverage exchange module .............. SUCCESS [  8.176 s]
[INFO] JDBC DataStore Support ............................. SUCCESS [  8.835 s]
[INFO] JDBC DataStore Plugins ............................. SUCCESS [  0.309 s]
[INFO] H2 DataStore ....................................... SUCCESS [01:14 min]
[INFO] Oracle DataStore ................................... SUCCESS [  4.066 s]
[INFO] PostGIS DataStore .................................. SUCCESS [  5.159 s]
[INFO] Shapefile module ................................... SUCCESS [ 21.642 s]
[INFO] Feature transforming feature source wrapper ........ SUCCESS [  4.519 s]
[INFO] WorldImage datasource module ....................... SUCCESS [  5.397 s]
[INFO] imagemosaic datasource module ...................... FAILURE [01:05 min]
[INFO] ArcGrid datasource module .......................... SKIPPED
[INFO] GML2 XML Support ................................... SKIPPED
[INFO] GML3 XML Support ................................... SKIPPED
[INFO] Filter XML Support ................................. SKIPPED
[INFO] SLD XML Support .................................... SKIPPED
[INFO] Render ............................................. SKIPPED
[INFO] OGC Web Service Models ............................. SKIPPED
[INFO] Xlink Model ........................................ SKIPPED
[INFO] Open Web Services Model ............................ SKIPPED
[INFO] Filter Encoding Specification Model ................ SKIPPED
[INFO] Web Feature Service Model .......................... SKIPPED
[INFO] OWS XML Support .................................... SKIPPED
[INFO] Filter Encoding Specification XML Support .......... SKIPPED
[INFO] WFS XML Support .................................... SKIPPED
[INFO] XML Parsing Support ................................ SKIPPED
[INFO] Web Processing Service Model ....................... SKIPPED
[INFO] Web Coverage Service Model ......................... SKIPPED
[INFO] Catalog Services for the Web Model ................. SKIPPED
[INFO] Web Map Tile Service model ......................... SKIPPED
[INFO] ArcSDE plugin ...................................... SKIPPED
[INFO] ArcSDE dummy api ................................... SKIPPED
[INFO] ArcSDE support classes ............................. SKIPPED
[INFO] ArcSDE DataStore plugin ............................ SKIPPED
[INFO] Dynamic symbolizer module based on JFreeChart and Eastwood SKIPPED
[INFO] Extensions to EPSG authority factory ............... SKIPPED
[INFO] EPSG Authority Service using PostgreSQL database ... SKIPPED
[INFO] Feature-Pregeneralized ............................. SKIPPED
[INFO] grass raster datasource module ..................... SKIPPED
[INFO] GTopo30 datasource module .......................... SKIPPED
[INFO] ImageI/O-Ext based grid coverage readers ........... SKIPPED
[INFO] imagepyramid datasource module ..................... SKIPPED
[INFO] imagemosaic-jdbc module ............................ SKIPPED
[INFO] DB2 DataStore ...................................... SKIPPED
[INFO] MySQL DataStore .................................... SKIPPED
[INFO] SQL Server DataStore ............................... SKIPPED
[INFO] SpatiaLite DataStore ............................... SKIPPED
[INFO] Teradata DataStore ................................. SKIPPED
[INFO] JP2K based grid coverage readers ................... SKIPPED
[INFO] OGR DataStore Module ............................... SKIPPED
[INFO] Core OGR DataStore Module .......................... SKIPPED
[INFO] Bridj OGR DataStore Module ......................... SKIPPED
[INFO] JNI OGR DataStore Module ........................... SKIPPED
[INFO] Vertical coordinate transformations ................ SKIPPED
[INFO] Dynamic symbolizers for SVG symbols ................ SKIPPED
[INFO] Coverage Multidimensional Module ................... SKIPPED
[INFO] API interfaces ..................................... SKIPPED
[INFO] NetCDF gridcoverage module ......................... SKIPPED
[INFO] GRIB gridcoverage module ........................... SKIPPED
[INFO] GeoPackage Module .................................. SKIPPED
[INFO] Application Schema Support ......................... SKIPPED
[INFO] Application Schema Resolver ........................ SKIPPED
[INFO] Complex Features Support ........................... SKIPPED
[INFO] Application Schema DataAccess ...................... SKIPPED
[INFO] MongoDB DataStore .................................. SKIPPED
[INFO] Sample DataAccess .................................. SKIPPED
[INFO] Brewer module ...................................... SKIPPED
[INFO] Vector grids ....................................... SKIPPED
[INFO] Validation Processor and Framework ................. SKIPPED
[INFO] Web Map Server client .............................. SKIPPED
[INFO] Geotools unsupported ............................... SKIPPED
[INFO] Process ............................................ SKIPPED
[INFO] Swing widgets ...................................... SKIPPED
[INFO] Tile Client ........................................ SKIPPED
[INFO] WMTS XML Support ................................... SKIPPED
[INFO] Web Map Tile Service Client ........................ SKIPPED
[INFO] KML XML Support .................................... SKIPPED
[INFO] WCS XML Support .................................... SKIPPED
[INFO] WPS XML Support .................................... SKIPPED
[INFO] WMS XML Support .................................... SKIPPED
[INFO] CSW XML Support .................................... SKIPPED
[INFO] Process Feature .................................... SKIPPED
[INFO] Process Raster ..................................... SKIPPED
[INFO] YSLD Parser/Encoder ................................ SKIPPED
[INFO] SWT widgets ........................................ SKIPPED
[INFO] GeoJSON Support .................................... SKIPPED
[INFO] Process Geometry ................................... SKIPPED
[INFO] MBTiles Module ..................................... SKIPPED
[INFO] WFS client module (NG) ............................. SKIPPED
[INFO] ISO 19107 implementation using JTS ................. SKIPPED
[INFO] Geometries ......................................... SKIPPED
[INFO] Web Processing Service ............................. SKIPPED
[INFO] Application Schema Support (Unsupported Modules) ... SKIPPED
[INFO] SOLR module ........................................ SKIPPED
[INFO] Geobuf DataStore ................................... SKIPPED
[INFO] Cartographic CSS parser ............................ SKIPPED
[INFO] GeoJSON Datastore .................................. SKIPPED
[INFO] Mapbox Styles Support .............................. SKIPPED
[INFO] CSVDataStore ....................................... SKIPPED
[INFO] EPSG Authority Factory for Oracle .................. SKIPPED
[INFO] Next Generation JDBC DataStores .................... SKIPPED
[INFO] Simple Feature Service store ....................... SKIPPED
[INFO] Aggregating DataStore .............................. SKIPPED
[INFO] gt-s3-geotiff ...................................... SKIPPED
[INFO] GeoTools Documentation 20-SNAPSHOT ................. SKIPPED
[INFO] ------------------------------------------------------------------------
[INFO] BUILD FAILURE
[INFO] ------------------------------------------------------------------------
[INFO] Total time: 06:52 min
[INFO] Finished at: 2018-06-28T19:50:35-04:00
[INFO] ------------------------------------------------------------------------
Waiting for Jenkins to finish collecting data
[ERROR] Failed to execute goal org.apache.maven.plugins:maven-surefire-plugin:2.15:test (default-test) on project gt-imagemosaic: There are test failures.
[ERROR] 
[ERROR] Please refer to /home/hudson/genie.jts/.jenkins/jobs/GeoTools-1.15.0/workspace/modules/plugin/imagemosaic/target/surefire-reports for the individual test results.
[ERROR] -> [Help 1]
[ERROR] 
[ERROR] To see the full stack trace of the errors, re-run Maven with the -e switch.
[ERROR] Re-run Maven using the -X switch to enable full debug logging.
[ERROR] 
[ERROR] For more information about the errors and possible solutions, please read the following articles:
[ERROR] [Help 1] http://cwiki.apache.org/confluence/display/MAVEN/MojoFailureException
[ERROR] 
[ERROR] After correcting the problems, you can resume the build with the command
[ERROR]   mvn <goals> -rf :gt-imagemosaic
[JENKINS] Archiving /home/hudson/genie.jts/.jenkins/jobs/GeoTools-1.15.0/workspace/modules/ogc/net.opengis.wcs/pom.xml to org.geotools.ogc/net.opengis.wcs/20-SNAPSHOT/net.opengis.wcs-20-SNAPSHOT.pom
[JENKINS] Archiving /home/hudson/genie.jts/.jenkins/jobs/GeoTools-1.15.0/workspace/modules/plugin/ogr/ogr-core/pom.xml to org.geotools/gt-ogr-core/20-SNAPSHOT/gt-ogr-core-20-SNAPSHOT.pom
[JENKINS] Archiving /home/hudson/genie.jts/.jenkins/jobs/GeoTools-1.15.0/workspace/docs/pom.xml to org.geotools/docs/20-SNAPSHOT/docs-20-SNAPSHOT.pom
[JENKINS] Archiving /home/hudson/genie.jts/.jenkins/jobs/GeoTools-1.15.0/workspace/build/maven/pom.xml to org.geotools.maven/maven/20-SNAPSHOT/maven-20-SNAPSHOT.pom
[JENKINS] Archiving /home/hudson/genie.jts/.jenkins/jobs/GeoTools-1.15.0/workspace/modules/plugin/referencing3D/pom.xml to org.geotools/gt-referencing3D/20-SNAPSHOT/gt-referencing3D-20-SNAPSHOT.pom
[JENKINS] Archiving /home/hudson/genie.jts/.jenkins/jobs/GeoTools-1.15.0/workspace/modules/unsupported/s3-geotiff/pom.xml to org.geotools/gt-s3-geotiff/20-SNAPSHOT/gt-s3-geotiff-20-SNAPSHOT.pom
[JENKINS] Archiving /home/hudson/genie.jts/.jenkins/jobs/GeoTools-1.15.0/workspace/modules/unsupported/jts-wrapper/pom.xml to org.geotools/gt-jts-wrapper/20-SNAPSHOT/gt-jts-wrapper-20-SNAPSHOT.pom
[JENKINS] Archiving /home/hudson/genie.jts/.jenkins/jobs/GeoTools-1.15.0/workspace/modules/ogc/org.w3.xlink/pom.xml to org.geotools.ogc/org.w3.xlink/20-SNAPSHOT/org.w3.xlink-20-SNAPSHOT.pom
[JENKINS] Archiving /home/hudson/genie.jts/.jenkins/jobs/GeoTools-1.15.0/workspace/modules/plugin/arcsde/common/pom.xml to org.geotools/gt-arcsde-common/20-SNAPSHOT/gt-arcsde-common-20-SNAPSHOT.pom
[JENKINS] Archiving /home/hudson/genie.jts/.jenkins/jobs/GeoTools-1.15.0/workspace/modules/plugin/imagemosaic-jdbc/pom.xml to org.geotools/gt-imagemosaic-jdbc/20-SNAPSHOT/gt-imagemosaic-jdbc-20-SNAPSHOT.pom
[JENKINS] Archiving /home/hudson/genie.jts/.jenkins/jobs/GeoTools-1.15.0/workspace/modules/unsupported/feature-aggregate/pom.xml to org.geotools.unsupported/gt-feature-aggregate/20-SNAPSHOT/gt-feature-aggregate-20-SNAPSHOT.pom
[JENKINS] Archiving /home/hudson/genie.jts/.jenkins/jobs/GeoTools-1.15.0/workspace/modules/unsupported/epsg-oracle/pom.xml to org.geotools/gt-epsg-oracle/20-SNAPSHOT/gt-epsg-oracle-20-SNAPSHOT.pom
[JENKINS] Archiving /home/hudson/genie.jts/.jenkins/jobs/GeoTools-1.15.0/workspace/modules/library/xml/pom.xml to org.geotools/gt-xml/20-SNAPSHOT/gt-xml-20-SNAPSHOT.pom
[JENKINS] Archiving /home/hudson/genie.jts/.jenkins/jobs/GeoTools-1.15.0/workspace/build/maven/javadoc/pom.xml to org.geotools.maven/javadoc/20-SNAPSHOT/javadoc-20-SNAPSHOT.pom
[JENKINS] Archiving /home/hudson/genie.jts/.jenkins/jobs/GeoTools-1.15.0/workspace/build/maven/javadoc/target/javadoc-20-SNAPSHOT.jar to org.geotools.maven/javadoc/20-SNAPSHOT/javadoc-20-SNAPSHOT.jar
[JENKINS] Archiving /home/hudson/genie.jts/.jenkins/jobs/GeoTools-1.15.0/workspace/build/maven/javadoc/target/javadoc-20-SNAPSHOT-sources.jar to org.geotools.maven/javadoc/20-SNAPSHOT/javadoc-20-SNAPSHOT-sources.jar
[JENKINS] Archiving /home/hudson/genie.jts/.jenkins/jobs/GeoTools-1.15.0/workspace/modules/library/api/pom.xml to org.geotools/gt-api/20-SNAPSHOT/gt-api-20-SNAPSHOT.pom
[JENKINS] Archiving /home/hudson/genie.jts/.jenkins/jobs/GeoTools-1.15.0/workspace/modules/library/api/target/gt-api-20-SNAPSHOT.jar to org.geotools/gt-api/20-SNAPSHOT/gt-api-20-SNAPSHOT.jar
[JENKINS] Archiving /home/hudson/genie.jts/.jenkins/jobs/GeoTools-1.15.0/workspace/modules/library/api/target/gt-api-20-SNAPSHOT-sources.jar to org.geotools/gt-api/20-SNAPSHOT/gt-api-20-SNAPSHOT-sources.jar
[JENKINS] Archiving /home/hudson/genie.jts/.jenkins/jobs/GeoTools-1.15.0/workspace/modules/extension/xsd/xsd-sld/pom.xml to org.geotools.xsd/gt-xsd-sld/20-SNAPSHOT/gt-xsd-sld-20-SNAPSHOT.pom
[JENKINS] Archiving /home/hudson/genie.jts/.jenkins/jobs/GeoTools-1.15.0/workspace/modules/plugin/jdbc/jdbc-teradata/pom.xml to org.geotools.jdbc/gt-jdbc-teradata/20-SNAPSHOT/gt-jdbc-teradata-20-SNAPSHOT.pom
[JENKINS] Archiving /home/hudson/genie.jts/.jenkins/jobs/GeoTools-1.15.0/workspace/modules/extension/xsd/xsd-core/pom.xml to org.geotools.xsd/gt-xsd-core/20-SNAPSHOT/gt-xsd-core-20-SNAPSHOT.pom
[JENKINS] Archiving /home/hudson/genie.jts/.jenkins/jobs/GeoTools-1.15.0/workspace/modules/extension/xsd/xsd-core/target/gt-xsd-core-20-SNAPSHOT.jar to org.geotools.xsd/gt-xsd-core/20-SNAPSHOT/gt-xsd-core-20-SNAPSHOT.jar
[JENKINS] Archiving /home/hudson/genie.jts/.jenkins/jobs/GeoTools-1.15.0/workspace/modules/extension/xsd/xsd-core/target/gt-xsd-core-20-SNAPSHOT-sources.jar to org.geotools.xsd/gt-xsd-core/20-SNAPSHOT/gt-xsd-core-20-SNAPSHOT-sources.jar
[JENKINS] Archiving /home/hudson/genie.jts/.jenkins/jobs/GeoTools-1.15.0/workspace/modules/plugin/epsg-hsql/pom.xml to org.geotools/gt-epsg-hsql/20-SNAPSHOT/gt-epsg-hsql-20-SNAPSHOT.pom
[JENKINS] Archiving /home/hudson/genie.jts/.jenkins/jobs/GeoTools-1.15.0/workspace/modules/plugin/epsg-hsql/target/gt-epsg-hsql-20-SNAPSHOT.jar to org.geotools/gt-epsg-hsql/20-SNAPSHOT/gt-epsg-hsql-20-SNAPSHOT.jar
[JENKINS] Archiving /home/hudson/genie.jts/.jenkins/jobs/GeoTools-1.15.0/workspace/modules/plugin/epsg-hsql/target/gt-epsg-hsql-20-SNAPSHOT-sources.jar to org.geotools/gt-epsg-hsql/20-SNAPSHOT/gt-epsg-hsql-20-SNAPSHOT-sources.jar
[JENKINS] Archiving /home/hudson/genie.jts/.jenkins/jobs/GeoTools-1.15.0/workspace/modules/extension/xsd/xsd-wcs/pom.xml to org.geotools.xsd/gt-xsd-wcs/20-SNAPSHOT/gt-xsd-wcs-20-SNAPSHOT.pom
[JENKINS] Archiving /home/hudson/genie.jts/.jenkins/jobs/GeoTools-1.15.0/workspace/modules/extension/tile-client/pom.xml to org.geotools/gt-tile-client/20-SNAPSHOT/gt-tile-client-20-SNAPSHOT.pom
[JENKINS] Archiving /home/hudson/genie.jts/.jenkins/jobs/GeoTools-1.15.0/workspace/modules/plugin/jdbc/jdbc-spatialite/pom.xml to org.geotools.jdbc/gt-jdbc-spatialite/20-SNAPSHOT/gt-jdbc-spatialite-20-SNAPSHOT.pom
[JENKINS] Archiving /home/hudson/genie.jts/.jenkins/jobs/GeoTools-1.15.0/workspace/modules/unsupported/process-feature/pom.xml to org.geotools/gt-process-feature/20-SNAPSHOT/gt-process-feature-20-SNAPSHOT.pom
[JENKINS] Archiving /home/hudson/genie.jts/.jenkins/jobs/GeoTools-1.15.0/workspace/modules/ogc/net.opengis.csw/pom.xml to org.geotools.ogc/net.opengis.csw/20-SNAPSHOT/net.opengis.csw-20-SNAPSHOT.pom
[JENKINS] Archiving /home/hudson/genie.jts/.jenkins/jobs/GeoTools-1.15.0/workspace/modules/plugin/jdbc/jdbc-db2/pom.xml to org.geotools.jdbc/gt-jdbc-db2/20-SNAPSHOT/gt-jdbc-db2-20-SNAPSHOT.pom
[JENKINS] Archiving /home/hudson/genie.jts/.jenkins/jobs/GeoTools-1.15.0/workspace/modules/extension/xsd/xsd-gml2/pom.xml to org.geotools.xsd/gt-xsd-gml2/20-SNAPSHOT/gt-xsd-gml2-20-SNAPSHOT.pom
[JENKINS] Archiving /home/hudson/genie.jts/.jenkins/jobs/GeoTools-1.15.0/workspace/modules/plugin/coverage-multidim/coverage-api/pom.xml to org.geotools/gt-coverage-api/20-SNAPSHOT/gt-coverage-api-20-SNAPSHOT.pom
[JENKINS] Archiving /home/hudson/genie.jts/.jenkins/jobs/GeoTools-1.15.0/workspace/modules/extension/xsd/xsd-gml3/pom.xml to org.geotools.xsd/gt-xsd-gml3/20-SNAPSHOT/gt-xsd-gml3-20-SNAPSHOT.pom
[JENKINS] Archiving /home/hudson/genie.jts/.jenkins/jobs/GeoTools-1.15.0/workspace/modules/unsupported/process-geometry/pom.xml to org.geotools/gt-process-geometry/20-SNAPSHOT/gt-process-geometry-20-SNAPSHOT.pom
[JENKINS] Archiving /home/hudson/genie.jts/.jenkins/jobs/GeoTools-1.15.0/workspace/modules/unsupported/mbtiles/pom.xml to org.geotools/gt-mbtiles/20-SNAPSHOT/gt-mbtiles-20-SNAPSHOT.pom
[JENKINS] Archiving /home/hudson/genie.jts/.jenkins/jobs/GeoTools-1.15.0/workspace/modules/unsupported/geometry/pom.xml to org.geotools/gt-geometry/20-SNAPSHOT/gt-geometry-20-SNAPSHOT.pom
[JENKINS] Archiving /home/hudson/genie.jts/.jenkins/jobs/GeoTools-1.15.0/workspace/modules/plugin/ogr/ogr-jni/pom.xml to org.geotools/gt-ogr-jni/20-SNAPSHOT/gt-ogr-jni-20-SNAPSHOT.pom
[JENKINS] Archiving /home/hudson/genie.jts/.jenkins/jobs/GeoTools-1.15.0/workspace/modules/unsupported/jdbc-ng/pom.xml to org.geotools/gt-jdbc-ng/20-SNAPSHOT/gt-jdbc-ng-20-SNAPSHOT.pom
[JENKINS] Archiving /home/hudson/genie.jts/.jenkins/jobs/GeoTools-1.15.0/workspace/modules/library/pom.xml to org.geotools/library/20-SNAPSHOT/library-20-SNAPSHOT.pom
[JENKINS] Archiving /home/hudson/genie.jts/.jenkins/jobs/GeoTools-1.15.0/workspace/modules/plugin/epsg-extension/pom.xml to org.geotools/gt-epsg-extension/20-SNAPSHOT/gt-epsg-extension-20-SNAPSHOT.pom
[JENKINS] Archiving /home/hudson/genie.jts/.jenkins/jobs/GeoTools-1.15.0/workspace/modules/extension/xsd/xsd-kml/pom.xml to org.geotools.xsd/gt-xsd-kml/20-SNAPSHOT/gt-xsd-kml-20-SNAPSHOT.pom
[JENKINS] Archiving /home/hudson/genie.jts/.jenkins/jobs/GeoTools-1.15.0/workspace/modules/extension/complex/pom.xml to org.geotools/gt-complex/20-SNAPSHOT/gt-complex-20-SNAPSHOT.pom
[JENKINS] Archiving /home/hudson/genie.jts/.jenkins/jobs/GeoTools-1.15.0/workspace/modules/plugin/image/pom.xml to org.geotools/gt-image/20-SNAPSHOT/gt-image-20-SNAPSHOT.pom
[JENKINS] Archiving /home/hudson/genie.jts/.jenkins/jobs/GeoTools-1.15.0/workspace/modules/plugin/image/target/gt-image-20-SNAPSHOT.jar to org.geotools/gt-image/20-SNAPSHOT/gt-image-20-SNAPSHOT.jar
[JENKINS] Archiving /home/hudson/genie.jts/.jenkins/jobs/GeoTools-1.15.0/workspace/modules/plugin/image/target/gt-image-20-SNAPSHOT-sources.jar to org.geotools/gt-image/20-SNAPSHOT/gt-image-20-SNAPSHOT-sources.jar
[JENKINS] Archiving /home/hudson/genie.jts/.jenkins/jobs/GeoTools-1.15.0/workspace/modules/extension/transform/pom.xml to org.geotools/gt-transform/20-SNAPSHOT/gt-transform-20-SNAPSHOT.pom
[JENKINS] Archiving /home/hudson/genie.jts/.jenkins/jobs/GeoTools-1.15.0/workspace/modules/extension/transform/target/gt-transform-20-SNAPSHOT.jar to org.geotools/gt-transform/20-SNAPSHOT/gt-transform-20-SNAPSHOT.jar
[JENKINS] Archiving /home/hudson/genie.jts/.jenkins/jobs/GeoTools-1.15.0/workspace/modules/extension/transform/target/gt-transform-20-SNAPSHOT-sources.jar to org.geotools/gt-transform/20-SNAPSHOT/gt-transform-20-SNAPSHOT-sources.jar
[JENKINS] Archiving /home/hudson/genie.jts/.jenkins/jobs/GeoTools-1.15.0/workspace/modules/extension/xsd/xsd-wmts/pom.xml to org.geotools.xsd/gt-xsd-wmts/20-SNAPSHOT/gt-xsd-wmts-20-SNAPSHOT.pom
[JENKINS] Archiving /home/hudson/genie.jts/.jenkins/jobs/GeoTools-1.15.0/workspace/modules/plugin/arcsde/pom.xml to org.geotools/arcsde-plugin/20-SNAPSHOT/arcsde-plugin-20-SNAPSHOT.pom
[JENKINS] Archiving /home/hudson/genie.jts/.jenkins/jobs/GeoTools-1.15.0/workspace/modules/unsupported/process/pom.xml to org.geotools/gt-process/20-SNAPSHOT/gt-process-20-SNAPSHOT.pom
[JENKINS] Archiving /home/hudson/genie.jts/.jenkins/jobs/GeoTools-1.15.0/workspace/modules/plugin/jdbc/jdbc-h2/pom.xml to org.geotools.jdbc/gt-jdbc-h2/20-SNAPSHOT/gt-jdbc-h2-20-SNAPSHOT.pom
[JENKINS] Archiving /home/hudson/genie.jts/.jenkins/jobs/GeoTools-1.15.0/workspace/modules/plugin/jdbc/jdbc-h2/target/gt-jdbc-h2-20-SNAPSHOT.jar to org.geotools.jdbc/gt-jdbc-h2/20-SNAPSHOT/gt-jdbc-h2-20-SNAPSHOT.jar
[JENKINS] Archiving /home/hudson/genie.jts/.jenkins/jobs/GeoTools-1.15.0/workspace/modules/plugin/jdbc/jdbc-h2/target/gt-jdbc-h2-20-SNAPSHOT-sources.jar to org.geotools.jdbc/gt-jdbc-h2/20-SNAPSHOT/gt-jdbc-h2-20-SNAPSHOT-sources.jar
[JENKINS] Archiving /home/hudson/genie.jts/.jenkins/jobs/GeoTools-1.15.0/workspace/modules/library/sample-data/pom.xml to org.geotools/gt-sample-data/20-SNAPSHOT/gt-sample-data-20-SNAPSHOT.pom
[JENKINS] Archiving /home/hudson/genie.jts/.jenkins/jobs/GeoTools-1.15.0/workspace/modules/library/sample-data/target/gt-sample-data-20-SNAPSHOT.jar to org.geotools/gt-sample-data/20-SNAPSHOT/gt-sample-data-20-SNAPSHOT.jar
[JENKINS] Archiving /home/hudson/genie.jts/.jenkins/jobs/GeoTools-1.15.0/workspace/modules/library/sample-data/target/gt-sample-data-20-SNAPSHOT-sources.jar to org.geotools/gt-sample-data/20-SNAPSHOT/gt-sample-data-20-SNAPSHOT-sources.jar
[JENKINS] Archiving /home/hudson/genie.jts/.jenkins/jobs/GeoTools-1.15.0/workspace/modules/plugin/geopkg/pom.xml to org.geotools/gt-geopkg/20-SNAPSHOT/gt-geopkg-20-SNAPSHOT.pom
[JENKINS] Archiving /home/hudson/genie.jts/.jenkins/jobs/GeoTools-1.15.0/workspace/modules/unsupported/mbstyle/pom.xml to org.geotools/gt-mbstyle/20-SNAPSHOT/gt-mbstyle-20-SNAPSHOT.pom
[JENKINS] Archiving /home/hudson/genie.jts/.jenkins/jobs/GeoTools-1.15.0/workspace/modules/unsupported/csv/pom.xml to org.geotools/gt-csv/20-SNAPSHOT/gt-csv-20-SNAPSHOT.pom
[JENKINS] Archiving /home/hudson/genie.jts/.jenkins/jobs/GeoTools-1.15.0/workspace/modules/plugin/pom.xml to org.geotools/plugin/20-SNAPSHOT/plugin-20-SNAPSHOT.pom
[JENKINS] Archiving /home/hudson/genie.jts/.jenkins/jobs/GeoTools-1.15.0/workspace/modules/extension/app-schema/pom.xml to org.geotools/app-schema/20-SNAPSHOT/app-schema-20-SNAPSHOT.pom
[JENKINS] Archiving /home/hudson/genie.jts/.jenkins/jobs/GeoTools-1.15.0/workspace/modules/unsupported/geojson/pom.xml to org.geotools/gt-geojson/20-SNAPSHOT/gt-geojson-20-SNAPSHOT.pom
[JENKINS] Archiving /home/hudson/genie.jts/.jenkins/jobs/GeoTools-1.15.0/workspace/modules/plugin/coverage-multidim/grib/pom.xml to org.geotools/gt-grib/20-SNAPSHOT/gt-grib-20-SNAPSHOT.pom
[JENKINS] Archiving /home/hudson/genie.jts/.jenkins/jobs/GeoTools-1.15.0/workspace/modules/plugin/arcgrid/pom.xml to org.geotools/gt-arcgrid/20-SNAPSHOT/gt-arcgrid-20-SNAPSHOT.pom
[JENKINS] Archiving /home/hudson/genie.jts/.jenkins/jobs/GeoTools-1.15.0/workspace/modules/plugin/coverage-multidim/pom.xml to org.geotools/gt-coverage-multidim/20-SNAPSHOT/gt-coverage-multidim-20-SNAPSHOT.pom
[JENKINS] Archiving /home/hudson/genie.jts/.jenkins/jobs/GeoTools-1.15.0/workspace/modules/extension/grid/pom.xml to org.geotools/gt-grid/20-SNAPSHOT/gt-grid-20-SNAPSHOT.pom
[JENKINS] Archiving /home/hudson/genie.jts/.jenkins/jobs/GeoTools-1.15.0/workspace/build/maven/jar-collector/pom.xml to org.geotools.maven/jar-collector/20-SNAPSHOT/jar-collector-20-SNAPSHOT.pom
[JENKINS] Archiving /home/hudson/genie.jts/.jenkins/jobs/GeoTools-1.15.0/workspace/build/maven/jar-collector/target/jar-collector-20-SNAPSHOT.jar to org.geotools.maven/jar-collector/20-SNAPSHOT/jar-collector-20-SNAPSHOT.jar
[JENKINS] Archiving /home/hudson/genie.jts/.jenkins/jobs/GeoTools-1.15.0/workspace/build/maven/jar-collector/target/jar-collector-20-SNAPSHOT-sources.jar to org.geotools.maven/jar-collector/20-SNAPSHOT/jar-collector-20-SNAPSHOT-sources.jar
[JENKINS] Archiving /home/hudson/genie.jts/.jenkins/jobs/GeoTools-1.15.0/workspace/build/pom.xml to org.geotools.maven/build/20-SNAPSHOT/build-20-SNAPSHOT.pom
[JENKINS] Archiving /home/hudson/genie.jts/.jenkins/jobs/GeoTools-1.15.0/workspace/modules/unsupported/swing/pom.xml to org.geotools/gt-swing/20-SNAPSHOT/gt-swing-20-SNAPSHOT.pom
[JENKINS] Archiving /home/hudson/genie.jts/.jenkins/jobs/GeoTools-1.15.0/workspace/modules/plugin/mongodb/pom.xml to org.geotools/gt-mongodb/20-SNAPSHOT/gt-mongodb-20-SNAPSHOT.pom
[JENKINS] Archiving /home/hudson/genie.jts/.jenkins/jobs/GeoTools-1.15.0/workspace/modules/ogc/net.opengis.wmts/pom.xml to org.geotools.ogc/net.opengis.wmts/20-SNAPSHOT/net.opengis.wmts-20-SNAPSHOT.pom
[JENKINS] Archiving /home/hudson/genie.jts/.jenkins/jobs/GeoTools-1.15.0/workspace/build/maven/xmlcodegen/pom.xml to org.geotools.maven/xmlcodegen/20-SNAPSHOT/xmlcodegen-20-SNAPSHOT.pom
[JENKINS] Archiving /home/hudson/genie.jts/.jenkins/jobs/GeoTools-1.15.0/workspace/build/maven/xmlcodegen/target/xmlcodegen-20-SNAPSHOT.jar to org.geotools.maven/xmlcodegen/20-SNAPSHOT/xmlcodegen-20-SNAPSHOT.jar
[JENKINS] Archiving /home/hudson/genie.jts/.jenkins/jobs/GeoTools-1.15.0/workspace/build/maven/xmlcodegen/target/xmlcodegen-20-SNAPSHOT-sources.jar to org.geotools.maven/xmlcodegen/20-SNAPSHOT/xmlcodegen-20-SNAPSHOT-sources.jar
[JENKINS] Archiving /home/hudson/genie.jts/.jenkins/jobs/GeoTools-1.15.0/workspace/modules/extension/xsd/xsd-csw/pom.xml to org.geotools.xsd/gt-xsd-csw/20-SNAPSHOT/gt-xsd-csw-20-SNAPSHOT.pom
[JENKINS] Archiving /home/hudson/genie.jts/.jenkins/jobs/GeoTools-1.15.0/workspace/modules/plugin/geotiff/pom.xml to org.geotools/gt-geotiff/20-SNAPSHOT/gt-geotiff-20-SNAPSHOT.pom
[JENKINS] Archiving /home/hudson/genie.jts/.jenkins/jobs/GeoTools-1.15.0/workspace/modules/plugin/geotiff/target/gt-geotiff-20-SNAPSHOT.jar to org.geotools/gt-geotiff/20-SNAPSHOT/gt-geotiff-20-SNAPSHOT.jar
[JENKINS] Archiving /home/hudson/genie.jts/.jenkins/jobs/GeoTools-1.15.0/workspace/modules/plugin/geotiff/target/gt-geotiff-20-SNAPSHOT-sources.jar to org.geotools/gt-geotiff/20-SNAPSHOT/gt-geotiff-20-SNAPSHOT-sources.jar
[JENKINS] Archiving /home/hudson/genie.jts/.jenkins/jobs/GeoTools-1.15.0/workspace/modules/plugin/jdbc/jdbc-oracle/pom.xml to org.geotools.jdbc/gt-jdbc-oracle/20-SNAPSHOT/gt-jdbc-oracle-20-SNAPSHOT.pom
[JENKINS] Archiving /home/hudson/genie.jts/.jenkins/jobs/GeoTools-1.15.0/workspace/modules/plugin/jdbc/jdbc-oracle/target/gt-jdbc-oracle-20-SNAPSHOT.jar to org.geotools.jdbc/gt-jdbc-oracle/20-SNAPSHOT/gt-jdbc-oracle-20-SNAPSHOT.jar
[JENKINS] Archiving /home/hudson/genie.jts/.jenkins/jobs/GeoTools-1.15.0/workspace/modules/plugin/jdbc/jdbc-oracle/target/gt-jdbc-oracle-20-SNAPSHOT-sources.jar to org.geotools.jdbc/gt-jdbc-oracle/20-SNAPSHOT/gt-jdbc-oracle-20-SNAPSHOT-sources.jar
[JENKINS] Archiving /home/hudson/genie.jts/.jenkins/jobs/GeoTools-1.15.0/workspace/modules/plugin/imagemosaic/pom.xml to org.geotools/gt-imagemosaic/20-SNAPSHOT/gt-imagemosaic-20-SNAPSHOT.pom
[JENKINS] Archiving /home/hudson/genie.jts/.jenkins/jobs/GeoTools-1.15.0/workspace/modules/plugin/jp2k/pom.xml to org.geotools/gt-jp2k/20-SNAPSHOT/gt-jp2k-20-SNAPSHOT.pom
[JENKINS] Archiving /home/hudson/genie.jts/.jenkins/jobs/GeoTools-1.15.0/workspace/modules/unsupported/css/pom.xml to org.geotools/gt-css/20-SNAPSHOT/gt-css-20-SNAPSHOT.pom
[JENKINS] Archiving /home/hudson/genie.jts/.jenkins/jobs/GeoTools-1.15.0/workspace/modules/plugin/imagepyramid/pom.xml to org.geotools/gt-imagepyramid/20-SNAPSHOT/gt-imagepyramid-20-SNAPSHOT.pom
[JENKINS] Archiving /home/hudson/genie.jts/.jenkins/jobs/GeoTools-1.15.0/workspace/modules/library/referencing/pom.xml to org.geotools/gt-referencing/20-SNAPSHOT/gt-referencing-20-SNAPSHOT.pom
[JENKINS] Archiving /home/hudson/genie.jts/.jenkins/jobs/GeoTools-1.15.0/workspace/modules/library/referencing/target/gt-referencing-20-SNAPSHOT.jar to org.geotools/gt-referencing/20-SNAPSHOT/gt-referencing-20-SNAPSHOT.jar
[JENKINS] Archiving /home/hudson/genie.jts/.jenkins/jobs/GeoTools-1.15.0/workspace/modules/library/referencing/target/gt-referencing-20-SNAPSHOT-tests.jar to org.geotools/gt-referencing/20-SNAPSHOT/gt-referencing-20-SNAPSHOT-tests.jar
[JENKINS] Archiving /home/hudson/genie.jts/.jenkins/jobs/GeoTools-1.15.0/workspace/modules/library/referencing/target/gt-referencing-20-SNAPSHOT-sources.jar to org.geotools/gt-referencing/20-SNAPSHOT/gt-referencing-20-SNAPSHOT-sources.jar
[JENKINS] Archiving /home/hudson/genie.jts/.jenkins/jobs/GeoTools-1.15.0/workspace/modules/library/opengis/pom.xml to org.geotools/gt-opengis/20-SNAPSHOT/gt-opengis-20-SNAPSHOT.pom
[JENKINS] Archiving /home/hudson/genie.jts/.jenkins/jobs/GeoTools-1.15.0/workspace/modules/library/opengis/target/gt-opengis-20-SNAPSHOT.jar to org.geotools/gt-opengis/20-SNAPSHOT/gt-opengis-20-SNAPSHOT.jar
[JENKINS] Archiving /home/hudson/genie.jts/.jenkins/jobs/GeoTools-1.15.0/workspace/modules/library/opengis/target/gt-opengis-20-SNAPSHOT-sources.jar to org.geotools/gt-opengis/20-SNAPSHOT/gt-opengis-20-SNAPSHOT-sources.jar
[JENKINS] Archiving /home/hudson/genie.jts/.jenkins/jobs/GeoTools-1.15.0/workspace/modules/plugin/epsg-wkt/pom.xml to org.geotools/gt-epsg-wkt/20-SNAPSHOT/gt-epsg-wkt-20-SNAPSHOT.pom
[JENKINS] Archiving /home/hudson/genie.jts/.jenkins/jobs/GeoTools-1.15.0/workspace/modules/plugin/epsg-wkt/target/gt-epsg-wkt-20-SNAPSHOT.jar to org.geotools/gt-epsg-wkt/20-SNAPSHOT/gt-epsg-wkt-20-SNAPSHOT.jar
[JENKINS] Archiving /home/hudson/genie.jts/.jenkins/jobs/GeoTools-1.15.0/workspace/modules/plugin/epsg-wkt/target/gt-epsg-wkt-20-SNAPSHOT-sources.jar to org.geotools/gt-epsg-wkt/20-SNAPSHOT/gt-epsg-wkt-20-SNAPSHOT-sources.jar
[JENKINS] Archiving /home/hudson/genie.jts/.jenkins/jobs/GeoTools-1.15.0/workspace/modules/library/metadata/pom.xml to org.geotools/gt-metadata/20-SNAPSHOT/gt-metadata-20-SNAPSHOT.pom
[JENKINS] Archiving /home/hudson/genie.jts/.jenkins/jobs/GeoTools-1.15.0/workspace/modules/library/metadata/target/gt-metadata-20-SNAPSHOT.jar to org.geotools/gt-metadata/20-SNAPSHOT/gt-metadata-20-SNAPSHOT.jar
[JENKINS] Archiving /home/hudson/genie.jts/.jenkins/jobs/GeoTools-1.15.0/workspace/modules/library/metadata/target/gt-metadata-20-SNAPSHOT-sources.jar to org.geotools/gt-metadata/20-SNAPSHOT/gt-metadata-20-SNAPSHOT-sources.jar
[JENKINS] Archiving /home/hudson/genie.jts/.jenkins/jobs/GeoTools-1.15.0/workspace/modules/plugin/jdbc/pom.xml to org.geotools.jdbc/gt-jdbc/20-SNAPSHOT/gt-jdbc-20-SNAPSHOT.pom
[JENKINS] Archiving /home/hudson/genie.jts/.jenkins/jobs/GeoTools-1.15.0/workspace/modules/extension/validation/pom.xml to org.geotools/gt-validation/20-SNAPSHOT/gt-validation-20-SNAPSHOT.pom
[JENKINS] Archiving /home/hudson/genie.jts/.jenkins/jobs/GeoTools-1.15.0/workspace/modules/unsupported/wfs-ng/pom.xml to org.geotools/gt-wfs-ng/20-SNAPSHOT/gt-wfs-ng-20-SNAPSHOT.pom
[JENKINS] Archiving /home/hudson/genie.jts/.jenkins/jobs/GeoTools-1.15.0/workspace/modules/ogc/pom.xml to org.geotools/ogc/20-SNAPSHOT/ogc-20-SNAPSHOT.pom
[JENKINS] Archiving /home/hudson/genie.jts/.jenkins/jobs/GeoTools-1.15.0/workspace/modules/extension/xsd/xsd-fes/pom.xml to org.geotools.xsd/gt-xsd-fes/20-SNAPSHOT/gt-xsd-fes-20-SNAPSHOT.pom
[JENKINS] Archiving /home/hudson/genie.jts/.jenkins/jobs/GeoTools-1.15.0/workspace/modules/ogc/net.opengis.fes/pom.xml to org.geotools.ogc/net.opengis.fes/20-SNAPSHOT/net.opengis.fes-20-SNAPSHOT.pom
[JENKINS] Archiving /home/hudson/genie.jts/.jenkins/jobs/GeoTools-1.15.0/workspace/modules/plugin/arcsde/datastore/pom.xml to org.geotools/gt-arcsde/20-SNAPSHOT/gt-arcsde-20-SNAPSHOT.pom
[JENKINS] Archiving /home/hudson/genie.jts/.jenkins/jobs/GeoTools-1.15.0/workspace/modules/plugin/ogr/pom.xml to org.geotools/gt-ogr/20-SNAPSHOT/gt-ogr-20-SNAPSHOT.pom
[JENKINS] Archiving /home/hudson/genie.jts/.jenkins/jobs/GeoTools-1.15.0/workspace/modules/unsupported/solr/pom.xml to org.geotools/gt-solr/20-SNAPSHOT/gt-solr-20-SNAPSHOT.pom
[JENKINS] Archiving /home/hudson/genie.jts/.jenkins/jobs/GeoTools-1.15.0/workspace/modules/extension/xsd/xsd-filter/pom.xml to org.geotools.xsd/gt-xsd-filter/20-SNAPSHOT/gt-xsd-filter-20-SNAPSHOT.pom
[JENKINS] Archiving /home/hudson/genie.jts/.jenkins/jobs/GeoTools-1.15.0/workspace/modules/extension/app-schema/app-schema/pom.xml to org.geotools/gt-app-schema/20-SNAPSHOT/gt-app-schema-20-SNAPSHOT.pom
[JENKINS] Archiving /home/hudson/genie.jts/.jenkins/jobs/GeoTools-1.15.0/workspace/modules/ogc/net.opengis.ows/pom.xml to org.geotools.ogc/net.opengis.ows/20-SNAPSHOT/net.opengis.ows-20-SNAPSHOT.pom
[JENKINS] Archiving /home/hudson/genie.jts/.jenkins/jobs/GeoTools-1.15.0/workspace/modules/extension/wmts/pom.xml to org.geotools/gt-wmts/20-SNAPSHOT/gt-wmts-20-SNAPSHOT.pom
[JENKINS] Archiving /home/hudson/genie.jts/.jenkins/jobs/GeoTools-1.15.0/workspace/modules/extension/ysld/pom.xml to org.geotools/gt-ysld/20-SNAPSHOT/gt-ysld-20-SNAPSHOT.pom
[JENKINS] Archiving /home/hudson/genie.jts/.jenkins/jobs/GeoTools-1.15.0/workspace/modules/plugin/shapefile/pom.xml to org.geotools/gt-shapefile/20-SNAPSHOT/gt-shapefile-20-SNAPSHOT.pom
[JENKINS] Archiving /home/hudson/genie.jts/.jenkins/jobs/GeoTools-1.15.0/workspace/modules/plugin/shapefile/target/gt-shapefile-20-SNAPSHOT.jar to org.geotools/gt-shapefile/20-SNAPSHOT/gt-shapefile-20-SNAPSHOT.jar
[JENKINS] Archiving /home/hudson/genie.jts/.jenkins/jobs/GeoTools-1.15.0/workspace/modules/plugin/shapefile/target/gt-shapefile-20-SNAPSHOT-sources.jar to org.geotools/gt-shapefile/20-SNAPSHOT/gt-shapefile-20-SNAPSHOT-sources.jar
[JENKINS] Archiving /home/hudson/genie.jts/.jenkins/jobs/GeoTools-1.15.0/workspace/modules/ogc/net.opengis.wfs/pom.xml to org.geotools.ogc/net.opengis.wfs/20-SNAPSHOT/net.opengis.wfs-20-SNAPSHOT.pom
[JENKINS] Archiving /home/hudson/genie.jts/.jenkins/jobs/GeoTools-1.15.0/workspace/modules/library/coverage/pom.xml to org.geotools/gt-coverage/20-SNAPSHOT/gt-coverage-20-SNAPSHOT.pom
[JENKINS] Archiving /home/hudson/genie.jts/.jenkins/jobs/GeoTools-1.15.0/workspace/modules/library/coverage/target/gt-coverage-20-SNAPSHOT.jar to org.geotools/gt-coverage/20-SNAPSHOT/gt-coverage-20-SNAPSHOT.jar
[JENKINS] Archiving /home/hudson/genie.jts/.jenkins/jobs/GeoTools-1.15.0/workspace/modules/library/coverage/target/gt-coverage-20-SNAPSHOT-sources.jar to org.geotools/gt-coverage/20-SNAPSHOT/gt-coverage-20-SNAPSHOT-sources.jar
[JENKINS] Archiving /home/hudson/genie.jts/.jenkins/jobs/GeoTools-1.15.0/workspace/modules/extension/xsd/xsd-wps/pom.xml to org.geotools.xsd/gt-xsd-wps/20-SNAPSHOT/gt-xsd-wps-20-SNAPSHOT.pom
[JENKINS] Archiving /home/hudson/genie.jts/.jenkins/jobs/GeoTools-1.15.0/workspace/pom.xml to org.geotools/geotools/20-SNAPSHOT/geotools-20-SNAPSHOT.pom
[JENKINS] Archiving /home/hudson/genie.jts/.jenkins/jobs/GeoTools-1.15.0/workspace/modules/library/jdbc/pom.xml to org.geotools/gt-jdbc/20-SNAPSHOT/gt-jdbc-20-SNAPSHOT.pom
[JENKINS] Archiving /home/hudson/genie.jts/.jenkins/jobs/GeoTools-1.15.0/workspace/modules/library/jdbc/target/gt-jdbc-20-SNAPSHOT.jar to org.geotools/gt-jdbc/20-SNAPSHOT/gt-jdbc-20-SNAPSHOT.jar
[JENKINS] Archiving /home/hudson/genie.jts/.jenkins/jobs/GeoTools-1.15.0/workspace/modules/library/jdbc/target/gt-jdbc-20-SNAPSHOT-tests.jar to org.geotools/gt-jdbc/20-SNAPSHOT/gt-jdbc-20-SNAPSHOT-tests.jar
[JENKINS] Archiving /home/hudson/genie.jts/.jenkins/jobs/GeoTools-1.15.0/workspace/modules/library/jdbc/target/gt-jdbc-20-SNAPSHOT-sources.jar to org.geotools/gt-jdbc/20-SNAPSHOT/gt-jdbc-20-SNAPSHOT-sources.jar
[JENKINS] Archiving /home/hudson/genie.jts/.jenkins/jobs/GeoTools-1.15.0/workspace/modules/extension/xsd/pom.xml to org.geotools.xsd/xsd/20-SNAPSHOT/xsd-20-SNAPSHOT.pom
[JENKINS] Archiving /home/hudson/genie.jts/.jenkins/jobs/GeoTools-1.15.0/workspace/build/maven/jjtree-javacc/pom.xml to org.geotools.maven/jjtree-javacc/20-SNAPSHOT/jjtree-javacc-20-SNAPSHOT.pom
[JENKINS] Archiving /home/hudson/genie.jts/.jenkins/jobs/GeoTools-1.15.0/workspace/build/maven/jjtree-javacc/target/jjtree-javacc-20-SNAPSHOT.jar to org.geotools.maven/jjtree-javacc/20-SNAPSHOT/jjtree-javacc-20-SNAPSHOT.jar
[JENKINS] Archiving /home/hudson/genie.jts/.jenkins/jobs/GeoTools-1.15.0/workspace/build/maven/jjtree-javacc/target/jjtree-javacc-20-SNAPSHOT-sources.jar to org.geotools.maven/jjtree-javacc/20-SNAPSHOT/jjtree-javacc-20-SNAPSHOT-sources.jar
[JENKINS] Archiving /home/hudson/genie.jts/.jenkins/jobs/GeoTools-1.15.0/workspace/modules/extension/app-schema/sample-data-access/pom.xml to org.geotools/gt-sample-data-access/20-SNAPSHOT/gt-sample-data-access-20-SNAPSHOT.pom
[JENKINS] Archiving /home/hudson/genie.jts/.jenkins/jobs/GeoTools-1.15.0/workspace/modules/unsupported/wps/pom.xml to org.geotools/gt-wps/20-SNAPSHOT/gt-wps-20-SNAPSHOT.pom
[JENKINS] Archiving /home/hudson/genie.jts/.jenkins/jobs/GeoTools-1.15.0/workspace/modules/plugin/charts/pom.xml to org.geotools/gt-charts/20-SNAPSHOT/gt-charts-20-SNAPSHOT.pom
[JENKINS] Archiving /home/hudson/genie.jts/.jenkins/jobs/GeoTools-1.15.0/workspace/modules/library/cql/pom.xml to org.geotools/gt-cql/20-SNAPSHOT/gt-cql-20-SNAPSHOT.pom
[JENKINS] Archiving /home/hudson/genie.jts/.jenkins/jobs/GeoTools-1.15.0/workspace/modules/library/cql/target/gt-cql-20-SNAPSHOT.jar to org.geotools/gt-cql/20-SNAPSHOT/gt-cql-20-SNAPSHOT.jar
[JENKINS] Archiving /home/hudson/genie.jts/.jenkins/jobs/GeoTools-1.15.0/workspace/modules/library/cql/target/gt-cql-20-SNAPSHOT-sources.jar to org.geotools/gt-cql/20-SNAPSHOT/gt-cql-20-SNAPSHOT-sources.jar
[JENKINS] Archiving /home/hudson/genie.jts/.jenkins/jobs/GeoTools-1.15.0/workspace/modules/plugin/jdbc/jdbc-sqlserver/pom.xml to org.geotools.jdbc/gt-jdbc-sqlserver/20-SNAPSHOT/gt-jdbc-sqlserver-20-SNAPSHOT.pom
[JENKINS] Archiving /home/hudson/genie.jts/.jenkins/jobs/GeoTools-1.15.0/workspace/modules/extension/app-schema/app-schema-resolver/pom.xml to org.geotools/gt-app-schema-resolver/20-SNAPSHOT/gt-app-schema-resolver-20-SNAPSHOT.pom
[JENKINS] Archiving /home/hudson/genie.jts/.jenkins/jobs/GeoTools-1.15.0/workspace/modules/unsupported/pom.xml to org.geotools/unsupported/20-SNAPSHOT/unsupported-20-SNAPSHOT.pom
[JENKINS] Archiving /home/hudson/genie.jts/.jenkins/jobs/GeoTools-1.15.0/workspace/modules/plugin/jdbc/jdbc-postgis/pom.xml to org.geotools.jdbc/gt-jdbc-postgis/20-SNAPSHOT/gt-jdbc-postgis-20-SNAPSHOT.pom
[JENKINS] Archiving /home/hudson/genie.jts/.jenkins/jobs/GeoTools-1.15.0/workspace/modules/plugin/jdbc/jdbc-postgis/target/gt-jdbc-postgis-20-SNAPSHOT.jar to org.geotools.jdbc/gt-jdbc-postgis/20-SNAPSHOT/gt-jdbc-postgis-20-SNAPSHOT.jar
[JENKINS] Archiving /home/hudson/genie.jts/.jenkins/jobs/GeoTools-1.15.0/workspace/modules/plugin/jdbc/jdbc-postgis/target/gt-jdbc-postgis-20-SNAPSHOT-sources.jar to org.geotools.jdbc/gt-jdbc-postgis/20-SNAPSHOT/gt-jdbc-postgis-20-SNAPSHOT-sources.jar
[JENKINS] Archiving /home/hudson/genie.jts/.jenkins/jobs/GeoTools-1.15.0/workspace/modules/library/data/pom.xml to org.geotools/gt-data/20-SNAPSHOT/gt-data-20-SNAPSHOT.pom
[JENKINS] Archiving /home/hudson/genie.jts/.jenkins/jobs/GeoTools-1.15.0/workspace/modules/library/data/target/gt-data-20-SNAPSHOT.jar to org.geotools/gt-data/20-SNAPSHOT/gt-data-20-SNAPSHOT.jar
[JENKINS] Archiving /home/hudson/genie.jts/.jenkins/jobs/GeoTools-1.15.0/workspace/modules/library/data/target/gt-data-20-SNAPSHOT-sources.jar to org.geotools/gt-data/20-SNAPSHOT/gt-data-20-SNAPSHOT-sources.jar
[JENKINS] Archiving /home/hudson/genie.jts/.jenkins/jobs/GeoTools-1.15.0/workspace/modules/plugin/jdbc/jdbc-mysql/pom.xml to org.geotools.jdbc/gt-jdbc-mysql/20-SNAPSHOT/gt-jdbc-mysql-20-SNAPSHOT.pom
[JENKINS] Archiving /home/hudson/genie.jts/.jenkins/jobs/GeoTools-1.15.0/workspace/modules/plugin/svg/pom.xml to org.geotools/gt-svg/20-SNAPSHOT/gt-svg-20-SNAPSHOT.pom
[JENKINS] Archiving /home/hudson/genie.jts/.jenkins/jobs/GeoTools-1.15.0/workspace/modules/extension/xsd/xsd-wms/pom.xml to org.geotools.xsd/gt-xsd-wms/20-SNAPSHOT/gt-xsd-wms-20-SNAPSHOT.pom
[JENKINS] Archiving /home/hudson/genie.jts/.jenkins/jobs/GeoTools-1.15.0/workspace/modules/plugin/epsg-postgresql/pom.xml to org.geotools/gt-epsg-postgresql/20-SNAPSHOT/gt-epsg-postgresql-20-SNAPSHOT.pom
[JENKINS] Archiving /home/hudson/genie.jts/.jenkins/jobs/GeoTools-1.15.0/workspace/modules/unsupported/geobuf/pom.xml to org.geotools/gt-geobuf/20-SNAPSHOT/gt-geobuf-20-SNAPSHOT.pom
[JENKINS] Archiving /home/hudson/genie.jts/.jenkins/jobs/GeoTools-1.15.0/workspace/modules/extension/brewer/pom.xml to org.geotools/gt-brewer/20-SNAPSHOT/gt-brewer-20-SNAPSHOT.pom
[JENKINS] Archiving /home/hudson/genie.jts/.jenkins/jobs/GeoTools-1.15.0/workspace/modules/plugin/coverage-multidim/netcdf/pom.xml to org.geotools/gt-netcdf/20-SNAPSHOT/gt-netcdf-20-SNAPSHOT.pom
[JENKINS] Archiving /home/hudson/genie.jts/.jenkins/jobs/GeoTools-1.15.0/workspace/modules/plugin/imageio-ext-gdal/pom.xml to org.geotools/gt-imageio-ext-gdal/20-SNAPSHOT/gt-imageio-ext-gdal-20-SNAPSHOT.pom
[JENKINS] Archiving /home/hudson/genie.jts/.jenkins/jobs/GeoTools-1.15.0/workspace/modules/plugin/ogr/ogr-bridj/pom.xml to org.geotools/gt-ogr-bridj/20-SNAPSHOT/gt-ogr-bridj-20-SNAPSHOT.pom
[JENKINS] Archiving /home/hudson/genie.jts/.jenkins/jobs/GeoTools-1.15.0/workspace/modules/pom.xml to org.geotools/modules/20-SNAPSHOT/modules-20-SNAPSHOT.pom
[JENKINS] Archiving /home/hudson/genie.jts/.jenkins/jobs/GeoTools-1.15.0/workspace/modules/extension/graph/pom.xml to org.geotools/gt-graph/20-SNAPSHOT/gt-graph-20-SNAPSHOT.pom
[JENKINS] Archiving /home/hudson/genie.jts/.jenkins/jobs/GeoTools-1.15.0/workspace/modules/extension/graph/target/gt-graph-20-SNAPSHOT.jar to org.geotools/gt-graph/20-SNAPSHOT/gt-graph-20-SNAPSHOT.jar
[JENKINS] Archiving /home/hudson/genie.jts/.jenkins/jobs/GeoTools-1.15.0/workspace/modules/extension/graph/target/gt-graph-20-SNAPSHOT-sources.jar to org.geotools/gt-graph/20-SNAPSHOT/gt-graph-20-SNAPSHOT-sources.jar
[JENKINS] Archiving /home/hudson/genie.jts/.jenkins/jobs/GeoTools-1.15.0/workspace/modules/unsupported/process-raster/pom.xml to org.geotools/gt-process-raster/20-SNAPSHOT/gt-process-raster-20-SNAPSHOT.pom
[JENKINS] Archiving /home/hudson/genie.jts/.jenkins/jobs/GeoTools-1.15.0/workspace/modules/extension/wms/pom.xml to org.geotools/gt-wms/20-SNAPSHOT/gt-wms-20-SNAPSHOT.pom
[JENKINS] Archiving /home/hudson/genie.jts/.jenkins/jobs/GeoTools-1.15.0/workspace/modules/plugin/arcsde/sde-dummy/pom.xml to org.geotools/gt-sde-dummy/20-SNAPSHOT/gt-sde-dummy-20-SNAPSHOT.pom
[JENKINS] Archiving /home/hudson/genie.jts/.jenkins/jobs/GeoTools-1.15.0/workspace/modules/extension/pom.xml to org.geotools/extension/20-SNAPSHOT/extension-20-SNAPSHOT.pom
[JENKINS] Archiving /home/hudson/genie.jts/.jenkins/jobs/GeoTools-1.15.0/workspace/modules/plugin/grassraster/pom.xml to org.geotools/gt-grassraster/20-SNAPSHOT/gt-grassraster-20-SNAPSHOT.pom
[JENKINS] Archiving /home/hudson/genie.jts/.jenkins/jobs/GeoTools-1.15.0/workspace/modules/library/render/pom.xml to org.geotools/gt-render/20-SNAPSHOT/gt-render-20-SNAPSHOT.pom
[JENKINS] Archiving /home/hudson/genie.jts/.jenkins/jobs/GeoTools-1.15.0/workspace/modules/ogc/net.opengis.wps/pom.xml to org.geotools.ogc/net.opengis.wps/20-SNAPSHOT/net.opengis.wps-20-SNAPSHOT.pom
[JENKINS] Archiving /home/hudson/genie.jts/.jenkins/jobs/GeoTools-1.15.0/workspace/modules/unsupported/swt/pom.xml to org.geotools/gt-swt/20-SNAPSHOT/gt-swt-20-SNAPSHOT.pom
[JENKINS] Archiving /home/hudson/genie.jts/.jenkins/jobs/GeoTools-1.15.0/workspace/modules/unsupported/app-schema/pom.xml to org.geotools/app-schema-unsupported/20-SNAPSHOT/app-schema-unsupported-20-SNAPSHOT.pom
[JENKINS] Archiving /home/hudson/genie.jts/.jenkins/jobs/GeoTools-1.15.0/workspace/modules/plugin/feature-pregeneralized/pom.xml to org.geotools/gt-feature-pregeneralized/20-SNAPSHOT/gt-feature-pregeneralized-20-SNAPSHOT.pom
[JENKINS] Archiving /home/hudson/genie.jts/.jenkins/jobs/GeoTools-1.15.0/workspace/modules/plugin/gtopo30/pom.xml to org.geotools/gt-gtopo30/20-SNAPSHOT/gt-gtopo30-20-SNAPSHOT.pom
[JENKINS] Archiving /home/hudson/genie.jts/.jenkins/jobs/GeoTools-1.15.0/workspace/modules/plugin/property/pom.xml to org.geotools/gt-property/20-SNAPSHOT/gt-property-20-SNAPSHOT.pom
[JENKINS] Archiving /home/hudson/genie.jts/.jenkins/jobs/GeoTools-1.15.0/workspace/modules/plugin/property/target/gt-property-20-SNAPSHOT.jar to org.geotools/gt-property/20-SNAPSHOT/gt-property-20-SNAPSHOT.jar
[JENKINS] Archiving /home/hudson/genie.jts/.jenkins/jobs/GeoTools-1.15.0/workspace/modules/plugin/property/target/gt-property-20-SNAPSHOT-sources.jar to org.geotools/gt-property/20-SNAPSHOT/gt-property-20-SNAPSHOT-sources.jar
[JENKINS] Archiving /home/hudson/genie.jts/.jenkins/jobs/GeoTools-1.15.0/workspace/modules/extension/xsd/xsd-ows/pom.xml to org.geotools.xsd/gt-xsd-ows/20-SNAPSHOT/gt-xsd-ows-20-SNAPSHOT.pom
[JENKINS] Archiving /home/hudson/genie.jts/.jenkins/jobs/GeoTools-1.15.0/workspace/modules/unsupported/geojsonstore/pom.xml to org.geotools/gt-geojsondatastore/20-SNAPSHOT/gt-geojsondatastore-20-SNAPSHOT.pom
[JENKINS] Archiving /home/hudson/genie.jts/.jenkins/jobs/GeoTools-1.15.0/workspace/modules/library/main/pom.xml to org.geotools/gt-main/20-SNAPSHOT/gt-main-20-SNAPSHOT.pom
[JENKINS] Archiving /home/hudson/genie.jts/.jenkins/jobs/GeoTools-1.15.0/workspace/modules/library/main/target/gt-main-20-SNAPSHOT.jar to org.geotools/gt-main/20-SNAPSHOT/gt-main-20-SNAPSHOT.jar
[JENKINS] Archiving /home/hudson/genie.jts/.jenkins/jobs/GeoTools-1.15.0/workspace/modules/library/main/target/gt-main-20-SNAPSHOT-tests.jar to org.geotools/gt-main/20-SNAPSHOT/gt-main-20-SNAPSHOT-tests.jar
[JENKINS] Archiving /home/hudson/genie.jts/.jenkins/jobs/GeoTools-1.15.0/workspace/modules/library/main/target/gt-main-20-SNAPSHOT-sources.jar to org.geotools/gt-main/20-SNAPSHOT/gt-main-20-SNAPSHOT-sources.jar
[JENKINS] Archiving /home/hudson/genie.jts/.jenkins/jobs/GeoTools-1.15.0/workspace/modules/extension/xsd/xsd-wfs/pom.xml to org.geotools.xsd/gt-xsd-wfs/20-SNAPSHOT/gt-xsd-wfs-20-SNAPSHOT.pom
[JENKINS] Archiving /home/hudson/genie.jts/.jenkins/jobs/GeoTools-1.15.0/workspace/modules/unsupported/sfs/pom.xml to org.geotools/gt-sfs/20-SNAPSHOT/gt-sfs-20-SNAPSHOT.pom
channel stopped
Started calculate disk usage of build
Finished Calculation of disk usage of build in 0 seconds
Started calculate disk usage of workspace
Finished Calculation of disk usage of workspace in 0 seconds
Finished: FAILURE