SuccessConsole Output

Started calculate disk usage of build
Finished Calculation of disk usage of build in 0 seconds
Started calculate disk usage of workspace
Finished Calculation of disk usage of workspace in 0 seconds
[INFO] 
[INFO] ------------------------< org.geoserver:gs-ows >------------------------
[INFO] Building Open Web Service Module 2.14-SNAPSHOT                    [3/36]
[INFO] --------------------------------[ jar ]---------------------------------
[INFO] Downloading from boundless: https://repo.boundlessgeo.com/main/commons-fileupload/commons-fileupload/1.3.3/commons-fileupload-1.3.3.pom
[INFO] Downloading from osgeo: http://download.osgeo.org/webdav/geotools/commons-fileupload/commons-fileupload/1.3.3/commons-fileupload-1.3.3.pom
[INFO] Downloading from geosolutions: http://maven.geo-solutions.it/commons-fileupload/commons-fileupload/1.3.3/commons-fileupload-1.3.3.pom
[INFO] Downloading from eclipse.maven.central.mirror: https://repo.eclipse.org/content/repositories/maven_central/commons-fileupload/commons-fileupload/1.3.3/commons-fileupload-1.3.3.pom
[INFO] Downloaded from eclipse.maven.central.mirror: https://repo.eclipse.org/content/repositories/maven_central/commons-fileupload/commons-fileupload/1.3.3/commons-fileupload-1.3.3.pom (11 kB at 137 kB/s)
[INFO] Downloading from boundless: https://repo.boundlessgeo.com/main/xpp3/xpp3/1.1.3.4.O/xpp3-1.1.3.4.O.pom
[INFO] Downloading from osgeo: http://download.osgeo.org/webdav/geotools/xpp3/xpp3/1.1.3.4.O/xpp3-1.1.3.4.O.pom
[INFO] Downloading from geosolutions: http://maven.geo-solutions.it/xpp3/xpp3/1.1.3.4.O/xpp3-1.1.3.4.O.pom
[INFO] Downloading from eclipse.maven.central.mirror: https://repo.eclipse.org/content/repositories/maven_central/xpp3/xpp3/1.1.3.4.O/xpp3-1.1.3.4.O.pom
[INFO] Downloaded from eclipse.maven.central.mirror: https://repo.eclipse.org/content/repositories/maven_central/xpp3/xpp3/1.1.3.4.O/xpp3-1.1.3.4.O.pom (634 B at 5.8 kB/s)
[INFO] Downloading from boundless: https://repo.boundlessgeo.com/main/xalan/xalan/2.7.0/xalan-2.7.0.pom
[INFO] Downloading from osgeo: http://download.osgeo.org/webdav/geotools/xalan/xalan/2.7.0/xalan-2.7.0.pom
[INFO] Downloading from geosolutions: http://maven.geo-solutions.it/xalan/xalan/2.7.0/xalan-2.7.0.pom
[INFO] Downloading from eclipse.maven.central.mirror: https://repo.eclipse.org/content/repositories/maven_central/xalan/xalan/2.7.0/xalan-2.7.0.pom
[INFO] Downloaded from eclipse.maven.central.mirror: https://repo.eclipse.org/content/repositories/maven_central/xalan/xalan/2.7.0/xalan-2.7.0.pom (491 B at 5.5 kB/s)
[INFO] Downloading from boundless: https://repo.boundlessgeo.com/main/xml-apis/xml-apis/1.4.01/xml-apis-1.4.01.pom
[INFO] Downloading from osgeo: http://download.osgeo.org/webdav/geotools/xml-apis/xml-apis/1.4.01/xml-apis-1.4.01.pom
[INFO] Downloading from geosolutions: http://maven.geo-solutions.it/xml-apis/xml-apis/1.4.01/xml-apis-1.4.01.pom
[INFO] Downloading from eclipse.maven.central.mirror: https://repo.eclipse.org/content/repositories/maven_central/xml-apis/xml-apis/1.4.01/xml-apis-1.4.01.pom
[INFO] Downloaded from eclipse.maven.central.mirror: https://repo.eclipse.org/content/repositories/maven_central/xml-apis/xml-apis/1.4.01/xml-apis-1.4.01.pom (2.7 kB at 68 kB/s)
[INFO] Downloading from boundless: https://repo.boundlessgeo.com/main/javax/mail/mail/1.4/mail-1.4.pom
[INFO] Downloading from osgeo: http://download.osgeo.org/webdav/geotools/javax/mail/mail/1.4/mail-1.4.pom
[INFO] Downloading from geosolutions: http://maven.geo-solutions.it/javax/mail/mail/1.4/mail-1.4.pom
[INFO] Downloading from eclipse.maven.central.mirror: https://repo.eclipse.org/content/repositories/maven_central/javax/mail/mail/1.4/mail-1.4.pom
[INFO] Downloaded from eclipse.maven.central.mirror: https://repo.eclipse.org/content/repositories/maven_central/javax/mail/mail/1.4/mail-1.4.pom (993 B at 14 kB/s)
[INFO] Downloading from boundless: https://repo.boundlessgeo.com/main/javax/activation/activation/1.1/activation-1.1.pom
[INFO] Downloading from osgeo: http://download.osgeo.org/webdav/geotools/javax/activation/activation/1.1/activation-1.1.pom
[INFO] Downloading from geosolutions: http://maven.geo-solutions.it/javax/activation/activation/1.1/activation-1.1.pom
[INFO] Downloading from eclipse.maven.central.mirror: https://repo.eclipse.org/content/repositories/maven_central/javax/activation/activation/1.1/activation-1.1.pom
[INFO] Downloaded from eclipse.maven.central.mirror: https://repo.eclipse.org/content/repositories/maven_central/javax/activation/activation/1.1/activation-1.1.pom (0 B at 0 B/s)
[INFO] Downloading from boundless: https://repo.boundlessgeo.com/main/commons-fileupload/commons-fileupload/1.3.3/commons-fileupload-1.3.3.jar
[INFO] Downloading from boundless: https://repo.boundlessgeo.com/main/xpp3/xpp3/1.1.3.4.O/xpp3-1.1.3.4.O.jar
[INFO] Downloading from boundless: https://repo.boundlessgeo.com/main/xalan/xalan/2.7.0/xalan-2.7.0.jar
[INFO] Downloading from boundless: https://repo.boundlessgeo.com/main/xml-apis/xml-apis/1.4.01/xml-apis-1.4.01.jar
[INFO] Downloading from boundless: https://repo.boundlessgeo.com/main/javax/mail/mail/1.4/mail-1.4.jar
[INFO] Downloading from boundless: https://repo.boundlessgeo.com/main/javax/activation/activation/1.1/activation-1.1.jar
[INFO] Downloading from osgeo: http://download.osgeo.org/webdav/geotools/commons-fileupload/commons-fileupload/1.3.3/commons-fileupload-1.3.3.jar
[INFO] Downloading from osgeo: http://download.osgeo.org/webdav/geotools/xpp3/xpp3/1.1.3.4.O/xpp3-1.1.3.4.O.jar
[INFO] Downloading from osgeo: http://download.osgeo.org/webdav/geotools/xalan/xalan/2.7.0/xalan-2.7.0.jar
[INFO] Downloading from osgeo: http://download.osgeo.org/webdav/geotools/xml-apis/xml-apis/1.4.01/xml-apis-1.4.01.jar
[INFO] Downloading from osgeo: http://download.osgeo.org/webdav/geotools/javax/mail/mail/1.4/mail-1.4.jar
[INFO] Downloading from osgeo: http://download.osgeo.org/webdav/geotools/javax/activation/activation/1.1/activation-1.1.jar
[INFO] Downloading from geosolutions: http://maven.geo-solutions.it/commons-fileupload/commons-fileupload/1.3.3/commons-fileupload-1.3.3.jar
[INFO] Downloading from geosolutions: http://maven.geo-solutions.it/xpp3/xpp3/1.1.3.4.O/xpp3-1.1.3.4.O.jar
[INFO] Downloading from geosolutions: http://maven.geo-solutions.it/xalan/xalan/2.7.0/xalan-2.7.0.jar
[INFO] Downloading from geosolutions: http://maven.geo-solutions.it/xml-apis/xml-apis/1.4.01/xml-apis-1.4.01.jar
[INFO] Downloading from geosolutions: http://maven.geo-solutions.it/javax/mail/mail/1.4/mail-1.4.jar
[INFO] Downloading from geosolutions: http://maven.geo-solutions.it/javax/activation/activation/1.1/activation-1.1.jar
[INFO] Downloading from eclipse.maven.central.mirror: https://repo.eclipse.org/content/repositories/maven_central/commons-fileupload/commons-fileupload/1.3.3/commons-fileupload-1.3.3.jar
[INFO] Downloading from eclipse.maven.central.mirror: https://repo.eclipse.org/content/repositories/maven_central/xpp3/xpp3/1.1.3.4.O/xpp3-1.1.3.4.O.jar
[INFO] Downloading from eclipse.maven.central.mirror: https://repo.eclipse.org/content/repositories/maven_central/xalan/xalan/2.7.0/xalan-2.7.0.jar
[INFO] Downloading from eclipse.maven.central.mirror: https://repo.eclipse.org/content/repositories/maven_central/xml-apis/xml-apis/1.4.01/xml-apis-1.4.01.jar
[INFO] Downloading from eclipse.maven.central.mirror: https://repo.eclipse.org/content/repositories/maven_central/javax/mail/mail/1.4/mail-1.4.jar
[INFO] Downloaded from eclipse.maven.central.mirror: https://repo.eclipse.org/content/repositories/maven_central/xml-apis/xml-apis/1.4.01/xml-apis-1.4.01.jar (221 kB at 2.7 MB/s)
[INFO] Downloading from eclipse.maven.central.mirror: https://repo.eclipse.org/content/repositories/maven_central/javax/activation/activation/1.1/activation-1.1.jar
[INFO] Downloaded from eclipse.maven.central.mirror: https://repo.eclipse.org/content/repositories/maven_central/javax/activation/activation/1.1/activation-1.1.jar (0 B at 0 B/s)
[INFO] Downloaded from eclipse.maven.central.mirror: https://repo.eclipse.org/content/repositories/maven_central/commons-fileupload/commons-fileupload/1.3.3/commons-fileupload-1.3.3.jar (71 kB at 433 kB/s)
[INFO] Downloaded from eclipse.maven.central.mirror: https://repo.eclipse.org/content/repositories/maven_central/javax/mail/mail/1.4/mail-1.4.jar (389 kB at 2.4 MB/s)
[INFO] Downloaded from eclipse.maven.central.mirror: https://repo.eclipse.org/content/repositories/maven_central/xpp3/xpp3/1.1.3.4.O/xpp3-1.1.3.4.O.jar (120 kB at 641 kB/s)
[INFO] Downloaded from eclipse.maven.central.mirror: https://repo.eclipse.org/content/repositories/maven_central/xalan/xalan/2.7.0/xalan-2.7.0.jar (2.7 MB at 10 MB/s)
[INFO] 
[INFO] --- maven-clean-plugin:2.5:clean (default-clean) @ gs-ows ---
[INFO] 
[INFO] --- git-commit-id-plugin:2.1.15:revision (default) @ gs-ows ---
[INFO] 
[INFO] --- fmt-maven-plugin:2.4.0:format (default) @ gs-ows ---
[debug] Using AOSP style
[INFO] Processed 100 files (0 reformatted).
[INFO] Processed 120 files (0 reformatted).
[INFO] 
[INFO] --- maven-resources-plugin:2.6:resources (default-resources) @ gs-ows ---
[INFO] Using 'UTF-8' encoding to copy filtered resources.
[INFO] Copying 9 resources
[INFO] skip non existing resourceDirectory /home/hudson/genie.jts/.jenkins/jobs/GeoServer-1.15.0/workspace/src/ows/src/main/resources
[INFO] 
[INFO] --- maven-compiler-plugin:2.3.2:compile (default-compile) @ gs-ows ---
[INFO] Compiling 92 source files to /home/hudson/genie.jts/.jenkins/jobs/GeoServer-1.15.0/workspace/src/ows/target/classes
[INFO] 
[INFO] --- maven-resources-plugin:2.6:testResources (default-testResources) @ gs-ows ---
[INFO] Using 'UTF-8' encoding to copy filtered resources.
[INFO] Copying 7 resources
[INFO] skip non existing resourceDirectory /home/hudson/genie.jts/.jenkins/jobs/GeoServer-1.15.0/workspace/src/ows/src/test/resources
[INFO] 
[INFO] --- maven-compiler-plugin:2.3.2:testCompile (default-testCompile) @ gs-ows ---
[INFO] Compiling 28 source files to /home/hudson/genie.jts/.jenkins/jobs/GeoServer-1.15.0/workspace/src/ows/target/test-classes
[INFO] 
[INFO] --- maven-surefire-plugin:2.12.3:test (default-test) @ gs-ows ---
[INFO] Surefire report directory: /home/hudson/genie.jts/.jenkins/jobs/GeoServer-1.15.0/workspace/src/ows/target/surefire-reports

-------------------------------------------------------
 T E S T S
-------------------------------------------------------
Picked up JAVA_TOOL_OPTIONS: -Xmx2G -Djava.io.tmpdir=/tmp/genie.jts
Running org.geoserver.ows.DefaultServiceExceptionHandlerTest
Jun 28, 2018 8:23:26 PM org.geoserver.platform.GeoServerExtensions checkContext
WARNING: Extension lookup 'URLMangler', but ApplicationContext is unset.
Jun 28, 2018 8:23:26 PM org.geoserver.platform.GeoServerExtensions checkContext
WARNING: Extension lookup 'ExtensionFilter', but ApplicationContext is unset.
Jun 28, 2018 8:23:26 PM org.geoserver.platform.GeoServerExtensions checkContext
WARNING: Extension lookup 'ExtensionProvider', but ApplicationContext is unset.
Jun 28, 2018 8:23:26 PM org.geoserver.platform.GeoServerExtensions checkContext
WARNING: Extension lookup 'ExtensionFilter', but ApplicationContext is unset.
Jun 28, 2018 8:23:26 PM org.geoserver.platform.GeoServerExtensions checkContext
WARNING: Extension lookup 'URLMangler', but ApplicationContext is unset.
Jun 28, 2018 8:23:26 PM org.geoserver.platform.GeoServerExtensions checkContext
WARNING: Extension lookup 'ExtensionFilter', but ApplicationContext is unset.
Jun 28, 2018 8:23:26 PM org.geoserver.platform.GeoServerExtensions checkContext
WARNING: Extension lookup 'ExtensionProvider', but ApplicationContext is unset.
Jun 28, 2018 8:23:26 PM org.geoserver.platform.GeoServerExtensions checkContext
WARNING: Extension lookup 'ExtensionFilter', but ApplicationContext is unset.
Jun 28, 2018 8:23:26 PM org.geoserver.platform.GeoServerExtensions checkContext
WARNING: Extension lookup 'URLMangler', but ApplicationContext is unset.
Jun 28, 2018 8:23:26 PM org.geoserver.platform.GeoServerExtensions checkContext
WARNING: Extension lookup 'ExtensionFilter', but ApplicationContext is unset.
Jun 28, 2018 8:23:26 PM org.geoserver.platform.GeoServerExtensions checkContext
WARNING: Extension lookup 'ExtensionProvider', but ApplicationContext is unset.
Jun 28, 2018 8:23:26 PM org.geoserver.platform.GeoServerExtensions checkContext
WARNING: Extension lookup 'ExtensionFilter', but ApplicationContext is unset.
Jun 28, 2018 8:23:26 PM org.geoserver.platform.GeoServerExtensions checkContext
WARNING: Extension lookup 'URLMangler', but ApplicationContext is unset.
Jun 28, 2018 8:23:26 PM org.geoserver.platform.GeoServerExtensions checkContext
WARNING: Extension lookup 'ExtensionFilter', but ApplicationContext is unset.
Jun 28, 2018 8:23:26 PM org.geoserver.platform.GeoServerExtensions checkContext
WARNING: Extension lookup 'ExtensionProvider', but ApplicationContext is unset.
Jun 28, 2018 8:23:26 PM org.geoserver.platform.GeoServerExtensions checkContext
WARNING: Extension lookup 'ExtensionFilter', but ApplicationContext is unset.
Jun 28, 2018 8:23:26 PM org.geoserver.platform.GeoServerExtensions checkContext
WARNING: Extension lookup 'URLMangler', but ApplicationContext is unset.
Jun 28, 2018 8:23:26 PM org.geoserver.platform.GeoServerExtensions checkContext
WARNING: Extension lookup 'ExtensionFilter', but ApplicationContext is unset.
Jun 28, 2018 8:23:26 PM org.geoserver.platform.GeoServerExtensions checkContext
WARNING: Extension lookup 'ExtensionProvider', but ApplicationContext is unset.
Jun 28, 2018 8:23:26 PM org.geoserver.platform.GeoServerExtensions checkContext
WARNING: Extension lookup 'ExtensionFilter', but ApplicationContext is unset.
Tests run: 5, Failures: 0, Errors: 0, Skipped: 0, Time elapsed: 1.282 sec
Running org.geoserver.ows.DispatcherTest
Jun 28, 2018 8:23:26 PM org.springframework.context.support.AbstractApplicationContext prepareRefresh
INFO: Refreshing org.springframework.context.support.FileSystemXmlApplicationContext@5db4c359: startup date [Thu Jun 28 20:23:26 EDT 2018]; root of context hierarchy
Jun 28, 2018 8:23:26 PM org.springframework.beans.factory.xml.XmlBeanDefinitionReader loadBeanDefinitions
INFO: Loading XML bean definitions from URL [file:/home/hudson/genie.jts/.jenkins/jobs/GeoServer-1.15.0/workspace/src/ows/target/test-classes/org/geoserver/ows/applicationContext.xml]
Jun 28, 2018 8:23:26 PM org.geoserver.ows.Dispatcher exception
SEVERE: 
java.lang.RuntimeException: TestDispatcherCallbackFailResponseDispatched
	at org.geoserver.ows.DispatcherTest$13.responseDispatched(DispatcherTest.java:728)
	at org.geoserver.ows.Dispatcher.fireResponseDispatchedCallback(Dispatcher.java:1122)
	at org.geoserver.ows.Dispatcher.response(Dispatcher.java:980)
	at org.geoserver.ows.Dispatcher.handleRequestInternal(Dispatcher.java:263)
	at org.springframework.web.servlet.mvc.AbstractController.handleRequest(AbstractController.java:174)
	at org.geoserver.ows.DispatcherTest.testDispatcherCallbackFailResponseDispatched(DispatcherTest.java:739)
	at sun.reflect.NativeMethodAccessorImpl.invoke0(Native Method)
	at sun.reflect.NativeMethodAccessorImpl.invoke(NativeMethodAccessorImpl.java:62)
	at sun.reflect.DelegatingMethodAccessorImpl.invoke(DelegatingMethodAccessorImpl.java:43)
	at java.lang.reflect.Method.invoke(Method.java:498)
	at junit.framework.TestCase.runTest(TestCase.java:176)
	at junit.framework.TestCase.runBare(TestCase.java:141)
	at junit.framework.TestResult$1.protect(TestResult.java:122)
	at junit.framework.TestResult.runProtected(TestResult.java:142)
	at junit.framework.TestResult.run(TestResult.java:125)
	at junit.framework.TestCase.run(TestCase.java:129)
	at junit.framework.TestSuite.runTest(TestSuite.java:255)
	at junit.framework.TestSuite.run(TestSuite.java:250)
	at org.junit.internal.runners.JUnit38ClassRunner.run(JUnit38ClassRunner.java:84)
	at org.apache.maven.surefire.junit4.JUnit4Provider.execute(JUnit4Provider.java:252)
	at org.apache.maven.surefire.junit4.JUnit4Provider.executeTestSet(JUnit4Provider.java:141)
	at org.apache.maven.surefire.junit4.JUnit4Provider.invoke(JUnit4Provider.java:112)
	at sun.reflect.NativeMethodAccessorImpl.invoke0(Native Method)
	at sun.reflect.NativeMethodAccessorImpl.invoke(NativeMethodAccessorImpl.java:62)
	at sun.reflect.DelegatingMethodAccessorImpl.invoke(DelegatingMethodAccessorImpl.java:43)
	at java.lang.reflect.Method.invoke(Method.java:498)
	at org.apache.maven.surefire.util.ReflectionUtils.invokeMethodWithArray(ReflectionUtils.java:189)
	at org.apache.maven.surefire.booter.ProviderFactory$ProviderProxy.invoke(ProviderFactory.java:165)
	at org.apache.maven.surefire.booter.ProviderFactory.invokeProvider(ProviderFactory.java:85)
	at org.apache.maven.surefire.booter.ForkedBooter.runSuitesInProcess(ForkedBooter.java:115)
	at org.apache.maven.surefire.booter.ForkedBooter.main(ForkedBooter.java:75)

Jun 28, 2018 8:23:26 PM org.geoserver.ows.Dispatcher exception
SEVERE: 
java.lang.RuntimeException: foo
	at org.geoserver.ows.DispatcherTest.testErrorSavedOnRequestOnGenericException(DispatcherTest.java:802)
	at sun.reflect.NativeMethodAccessorImpl.invoke0(Native Method)
	at sun.reflect.NativeMethodAccessorImpl.invoke(NativeMethodAccessorImpl.java:62)
	at sun.reflect.DelegatingMethodAccessorImpl.invoke(DelegatingMethodAccessorImpl.java:43)
	at java.lang.reflect.Method.invoke(Method.java:498)
	at junit.framework.TestCase.runTest(TestCase.java:176)
	at junit.framework.TestCase.runBare(TestCase.java:141)
	at junit.framework.TestResult$1.protect(TestResult.java:122)
	at junit.framework.TestResult.runProtected(TestResult.java:142)
	at junit.framework.TestResult.run(TestResult.java:125)
	at junit.framework.TestCase.run(TestCase.java:129)
	at junit.framework.TestSuite.runTest(TestSuite.java:255)
	at junit.framework.TestSuite.run(TestSuite.java:250)
	at org.junit.internal.runners.JUnit38ClassRunner.run(JUnit38ClassRunner.java:84)
	at org.apache.maven.surefire.junit4.JUnit4Provider.execute(JUnit4Provider.java:252)
	at org.apache.maven.surefire.junit4.JUnit4Provider.executeTestSet(JUnit4Provider.java:141)
	at org.apache.maven.surefire.junit4.JUnit4Provider.invoke(JUnit4Provider.java:112)
	at sun.reflect.NativeMethodAccessorImpl.invoke0(Native Method)
	at sun.reflect.NativeMethodAccessorImpl.invoke(NativeMethodAccessorImpl.java:62)
	at sun.reflect.DelegatingMethodAccessorImpl.invoke(DelegatingMethodAccessorImpl.java:43)
	at java.lang.reflect.Method.invoke(Method.java:498)
	at org.apache.maven.surefire.util.ReflectionUtils.invokeMethodWithArray(ReflectionUtils.java:189)
	at org.apache.maven.surefire.booter.ProviderFactory$ProviderProxy.invoke(ProviderFactory.java:165)
	at org.apache.maven.surefire.booter.ProviderFactory.invokeProvider(ProviderFactory.java:85)
	at org.apache.maven.surefire.booter.ForkedBooter.runSuitesInProcess(ForkedBooter.java:115)
	at org.apache.maven.surefire.booter.ForkedBooter.main(ForkedBooter.java:75)

Jun 28, 2018 8:23:26 PM org.springframework.context.support.AbstractApplicationContext prepareRefresh
INFO: Refreshing org.springframework.context.support.FileSystemXmlApplicationContext@28b576a9: startup date [Thu Jun 28 20:23:26 EDT 2018]; root of context hierarchy
Jun 28, 2018 8:23:26 PM org.springframework.beans.factory.xml.XmlBeanDefinitionReader loadBeanDefinitions
INFO: Loading XML bean definitions from URL [file:/home/hudson/genie.jts/.jenkins/jobs/GeoServer-1.15.0/workspace/src/ows/target/test-classes/org/geoserver/ows/applicationContext-errorResponse.xml]
Jun 28, 2018 8:23:26 PM org.geoserver.ows.Dispatcher exception
SEVERE: 
org.geoserver.platform.ServiceException: Whoops, something gone wrong!
	at org.geoserver.ows.ErrorThrowingResponse.write(ErrorThrowingResponse.java:25)
	at org.geoserver.ows.Dispatcher.response(Dispatcher.java:1021)
	at org.geoserver.ows.Dispatcher.handleRequestInternal(Dispatcher.java:263)
	at org.springframework.web.servlet.mvc.AbstractController.handleRequest(AbstractController.java:174)
	at org.geoserver.ows.DispatcherTest.testErrorThrowingResponse(DispatcherTest.java:1019)
	at sun.reflect.NativeMethodAccessorImpl.invoke0(Native Method)
	at sun.reflect.NativeMethodAccessorImpl.invoke(NativeMethodAccessorImpl.java:62)
	at sun.reflect.DelegatingMethodAccessorImpl.invoke(DelegatingMethodAccessorImpl.java:43)
	at java.lang.reflect.Method.invoke(Method.java:498)
	at junit.framework.TestCase.runTest(TestCase.java:176)
	at junit.framework.TestCase.runBare(TestCase.java:141)
	at junit.framework.TestResult$1.protect(TestResult.java:122)
	at junit.framework.TestResult.runProtected(TestResult.java:142)
	at junit.framework.TestResult.run(TestResult.java:125)
	at junit.framework.TestCase.run(TestCase.java:129)
	at junit.framework.TestSuite.runTest(TestSuite.java:255)
	at junit.framework.TestSuite.run(TestSuite.java:250)
	at org.junit.internal.runners.JUnit38ClassRunner.run(JUnit38ClassRunner.java:84)
	at org.apache.maven.surefire.junit4.JUnit4Provider.execute(JUnit4Provider.java:252)
	at org.apache.maven.surefire.junit4.JUnit4Provider.executeTestSet(JUnit4Provider.java:141)
	at org.apache.maven.surefire.junit4.JUnit4Provider.invoke(JUnit4Provider.java:112)
	at sun.reflect.NativeMethodAccessorImpl.invoke0(Native Method)
	at sun.reflect.NativeMethodAccessorImpl.invoke(NativeMethodAccessorImpl.java:62)
	at sun.reflect.DelegatingMethodAccessorImpl.invoke(DelegatingMethodAccessorImpl.java:43)
	at java.lang.reflect.Method.invoke(Method.java:498)
	at org.apache.maven.surefire.util.ReflectionUtils.invokeMethodWithArray(ReflectionUtils.java:189)
	at org.apache.maven.surefire.booter.ProviderFactory$ProviderProxy.invoke(ProviderFactory.java:165)
	at org.apache.maven.surefire.booter.ProviderFactory.invokeProvider(ProviderFactory.java:85)
	at org.apache.maven.surefire.booter.ForkedBooter.runSuitesInProcess(ForkedBooter.java:115)
	at org.apache.maven.surefire.booter.ForkedBooter.main(ForkedBooter.java:75)

Jun 28, 2018 8:23:26 PM org.springframework.context.support.AbstractApplicationContext doClose
INFO: Closing org.springframework.context.support.FileSystemXmlApplicationContext@28b576a9: startup date [Thu Jun 28 20:23:26 EDT 2018]; root of context hierarchy
Jun 28, 2018 8:23:26 PM org.springframework.context.support.AbstractApplicationContext prepareRefresh
INFO: Refreshing org.springframework.context.support.FileSystemXmlApplicationContext@70d8de: startup date [Thu Jun 28 20:23:26 EDT 2018]; root of context hierarchy
Jun 28, 2018 8:23:26 PM org.springframework.beans.factory.xml.XmlBeanDefinitionReader loadBeanDefinitions
INFO: Loading XML bean definitions from URL [file:/home/hudson/genie.jts/.jenkins/jobs/GeoServer-1.15.0/workspace/src/ows/target/test-classes/org/geoserver/ows/applicationContext.xml]
Jun 28, 2018 8:23:26 PM org.springframework.context.support.AbstractApplicationContext prepareRefresh
INFO: Refreshing org.springframework.context.support.FileSystemXmlApplicationContext@76304b46: startup date [Thu Jun 28 20:23:26 EDT 2018]; root of context hierarchy
Jun 28, 2018 8:23:26 PM org.springframework.beans.factory.xml.XmlBeanDefinitionReader loadBeanDefinitions
INFO: Loading XML bean definitions from URL [file:/home/hudson/genie.jts/.jenkins/jobs/GeoServer-1.15.0/workspace/src/ows/target/test-classes/org/geoserver/ows/applicationContext.xml]
Jun 28, 2018 8:23:26 PM org.springframework.context.support.AbstractApplicationContext prepareRefresh
INFO: Refreshing org.springframework.context.support.FileSystemXmlApplicationContext@138a7441: startup date [Thu Jun 28 20:23:26 EDT 2018]; root of context hierarchy
Jun 28, 2018 8:23:26 PM org.springframework.beans.factory.xml.XmlBeanDefinitionReader loadBeanDefinitions
INFO: Loading XML bean definitions from URL [file:/home/hudson/genie.jts/.jenkins/jobs/GeoServer-1.15.0/workspace/src/ows/target/test-classes/org/geoserver/ows/applicationContext.xml]
Jun 28, 2018 8:23:26 PM org.springframework.context.support.AbstractApplicationContext prepareRefresh
INFO: Refreshing org.springframework.context.support.FileSystemXmlApplicationContext@1b812421: startup date [Thu Jun 28 20:23:26 EDT 2018]; root of context hierarchy
Jun 28, 2018 8:23:26 PM org.springframework.beans.factory.xml.XmlBeanDefinitionReader loadBeanDefinitions
INFO: Loading XML bean definitions from URL [file:/home/hudson/genie.jts/.jenkins/jobs/GeoServer-1.15.0/workspace/src/ows/target/test-classes/org/geoserver/ows/applicationContext.xml]
Jun 28, 2018 8:23:26 PM org.geoserver.ows.Dispatcher exception
SEVERE: 
java.lang.RuntimeException: TestDispatcherCallbackFailOperationDispatched
	at org.geoserver.ows.DispatcherTest$11.operationDispatched(DispatcherTest.java:659)
	at org.geoserver.ows.Dispatcher.fireOperationDispatchedCallback(Dispatcher.java:819)
	at org.geoserver.ows.Dispatcher.dispatch(Dispatcher.java:803)
	at org.geoserver.ows.Dispatcher.handleRequestInternal(Dispatcher.java:249)
	at org.springframework.web.servlet.mvc.AbstractController.handleRequest(AbstractController.java:174)
	at org.geoserver.ows.DispatcherTest.testDispatcherCallbackFailOperationDispatched(DispatcherTest.java:670)
	at sun.reflect.NativeMethodAccessorImpl.invoke0(Native Method)
	at sun.reflect.NativeMethodAccessorImpl.invoke(NativeMethodAccessorImpl.java:62)
	at sun.reflect.DelegatingMethodAccessorImpl.invoke(DelegatingMethodAccessorImpl.java:43)
	at java.lang.reflect.Method.invoke(Method.java:498)
	at junit.framework.TestCase.runTest(TestCase.java:176)
	at junit.framework.TestCase.runBare(TestCase.java:141)
	at junit.framework.TestResult$1.protect(TestResult.java:122)
	at junit.framework.TestResult.runProtected(TestResult.java:142)
	at junit.framework.TestResult.run(TestResult.java:125)
	at junit.framework.TestCase.run(TestCase.java:129)
	at junit.framework.TestSuite.runTest(TestSuite.java:255)
	at junit.framework.TestSuite.run(TestSuite.java:250)
	at org.junit.internal.runners.JUnit38ClassRunner.run(JUnit38ClassRunner.java:84)
	at org.apache.maven.surefire.junit4.JUnit4Provider.execute(JUnit4Provider.java:252)
	at org.apache.maven.surefire.junit4.JUnit4Provider.executeTestSet(JUnit4Provider.java:141)
	at org.apache.maven.surefire.junit4.JUnit4Provider.invoke(JUnit4Provider.java:112)
	at sun.reflect.NativeMethodAccessorImpl.invoke0(Native Method)
	at sun.reflect.NativeMethodAccessorImpl.invoke(NativeMethodAccessorImpl.java:62)
	at sun.reflect.DelegatingMethodAccessorImpl.invoke(DelegatingMethodAccessorImpl.java:43)
	at java.lang.reflect.Method.invoke(Method.java:498)
	at org.apache.maven.surefire.util.ReflectionUtils.invokeMethodWithArray(ReflectionUtils.java:189)
	at org.apache.maven.surefire.booter.ProviderFactory$ProviderProxy.invoke(ProviderFactory.java:165)
	at org.apache.maven.surefire.booter.ProviderFactory.invokeProvider(ProviderFactory.java:85)
	at org.apache.maven.surefire.booter.ForkedBooter.runSuitesInProcess(ForkedBooter.java:115)
	at org.apache.maven.surefire.booter.ForkedBooter.main(ForkedBooter.java:75)

Jun 28, 2018 8:23:26 PM org.springframework.context.support.AbstractApplicationContext prepareRefresh
INFO: Refreshing org.springframework.context.support.FileSystemXmlApplicationContext@5767b2af: startup date [Thu Jun 28 20:23:26 EDT 2018]; root of context hierarchy
Jun 28, 2018 8:23:26 PM org.springframework.beans.factory.xml.XmlBeanDefinitionReader loadBeanDefinitions
INFO: Loading XML bean definitions from URL [file:/home/hudson/genie.jts/.jenkins/jobs/GeoServer-1.15.0/workspace/src/ows/target/test-classes/org/geoserver/ows/applicationContext.xml]
Jun 28, 2018 8:23:26 PM org.springframework.context.support.AbstractApplicationContext prepareRefresh
INFO: Refreshing org.springframework.context.support.FileSystemXmlApplicationContext@602c4656: startup date [Thu Jun 28 20:23:26 EDT 2018]; root of context hierarchy
Jun 28, 2018 8:23:26 PM org.springframework.beans.factory.xml.XmlBeanDefinitionReader loadBeanDefinitions
INFO: Loading XML bean definitions from URL [file:/home/hudson/genie.jts/.jenkins/jobs/GeoServer-1.15.0/workspace/src/ows/target/test-classes/org/geoserver/ows/applicationContext.xml]
Jun 28, 2018 8:23:26 PM org.springframework.context.support.AbstractApplicationContext prepareRefresh
INFO: Refreshing org.springframework.context.support.FileSystemXmlApplicationContext@4cfbaf4: startup date [Thu Jun 28 20:23:26 EDT 2018]; root of context hierarchy
Jun 28, 2018 8:23:26 PM org.springframework.beans.factory.xml.XmlBeanDefinitionReader loadBeanDefinitions
INFO: Loading XML bean definitions from URL [file:/home/hudson/genie.jts/.jenkins/jobs/GeoServer-1.15.0/workspace/src/ows/target/test-classes/org/geoserver/ows/applicationContext.xml]
Jun 28, 2018 8:23:26 PM org.geoserver.ows.Dispatcher exception
SEVERE: 
java.lang.RuntimeException: TestDispatcherCallbackFailOperationExecuted
	at org.geoserver.ows.DispatcherTest$12.operationExecuted(DispatcherTest.java:692)
	at org.geoserver.ows.Dispatcher.fireOperationExecutedCallback(Dispatcher.java:880)
	at org.geoserver.ows.Dispatcher.execute(Dispatcher.java:875)
	at org.geoserver.ows.Dispatcher.handleRequestInternal(Dispatcher.java:259)
	at org.springframework.web.servlet.mvc.AbstractController.handleRequest(AbstractController.java:174)
	at org.geoserver.ows.DispatcherTest.testDispatcherCallbackFailOperationExecuted(DispatcherTest.java:703)
	at sun.reflect.NativeMethodAccessorImpl.invoke0(Native Method)
	at sun.reflect.NativeMethodAccessorImpl.invoke(NativeMethodAccessorImpl.java:62)
	at sun.reflect.DelegatingMethodAccessorImpl.invoke(DelegatingMethodAccessorImpl.java:43)
	at java.lang.reflect.Method.invoke(Method.java:498)
	at junit.framework.TestCase.runTest(TestCase.java:176)
	at junit.framework.TestCase.runBare(TestCase.java:141)
	at junit.framework.TestResult$1.protect(TestResult.java:122)
	at junit.framework.TestResult.runProtected(TestResult.java:142)
	at junit.framework.TestResult.run(TestResult.java:125)
	at junit.framework.TestCase.run(TestCase.java:129)
	at junit.framework.TestSuite.runTest(TestSuite.java:255)
	at junit.framework.TestSuite.run(TestSuite.java:250)
	at org.junit.internal.runners.JUnit38ClassRunner.run(JUnit38ClassRunner.java:84)
	at org.apache.maven.surefire.junit4.JUnit4Provider.execute(JUnit4Provider.java:252)
	at org.apache.maven.surefire.junit4.JUnit4Provider.executeTestSet(JUnit4Provider.java:141)
	at org.apache.maven.surefire.junit4.JUnit4Provider.invoke(JUnit4Provider.java:112)
	at sun.reflect.NativeMethodAccessorImpl.invoke0(Native Method)
	at sun.reflect.NativeMethodAccessorImpl.invoke(NativeMethodAccessorImpl.java:62)
	at sun.reflect.DelegatingMethodAccessorImpl.invoke(DelegatingMethodAccessorImpl.java:43)
	at java.lang.reflect.Method.invoke(Method.java:498)
	at org.apache.maven.surefire.util.ReflectionUtils.invokeMethodWithArray(ReflectionUtils.java:189)
	at org.apache.maven.surefire.booter.ProviderFactory$ProviderProxy.invoke(ProviderFactory.java:165)
	at org.apache.maven.surefire.booter.ProviderFactory.invokeProvider(ProviderFactory.java:85)
	at org.apache.maven.surefire.booter.ForkedBooter.runSuitesInProcess(ForkedBooter.java:115)
	at org.apache.maven.surefire.booter.ForkedBooter.main(ForkedBooter.java:75)

Jun 28, 2018 8:23:26 PM org.springframework.context.support.AbstractApplicationContext prepareRefresh
INFO: Refreshing org.springframework.context.support.FileSystemXmlApplicationContext@73aff8f1: startup date [Thu Jun 28 20:23:26 EDT 2018]; root of context hierarchy
Jun 28, 2018 8:23:26 PM org.springframework.beans.factory.xml.XmlBeanDefinitionReader loadBeanDefinitions
INFO: Loading XML bean definitions from URL [file:/home/hudson/genie.jts/.jenkins/jobs/GeoServer-1.15.0/workspace/src/ows/target/test-classes/org/geoserver/ows/applicationContext.xml]
Jun 28, 2018 8:23:26 PM org.springframework.context.support.AbstractApplicationContext prepareRefresh
INFO: Refreshing org.springframework.context.support.FileSystemXmlApplicationContext@7d151a: startup date [Thu Jun 28 20:23:26 EDT 2018]; root of context hierarchy
Jun 28, 2018 8:23:26 PM org.springframework.beans.factory.xml.XmlBeanDefinitionReader loadBeanDefinitions
INFO: Loading XML bean definitions from URL [file:/home/hudson/genie.jts/.jenkins/jobs/GeoServer-1.15.0/workspace/src/ows/target/test-classes/org/geoserver/ows/applicationContext4.xml]
Jun 28, 2018 8:23:26 PM org.geoserver.ows.Dispatcher exception
SEVERE: 
org.geoserver.platform.ServiceException: Could not parse the KVP for: org.geoserver.ows.Message
	at org.geoserver.ows.Dispatcher.dispatch(Dispatcher.java:710)
	at org.geoserver.ows.Dispatcher.handleRequestInternal(Dispatcher.java:249)
	at org.geoserver.ows.DispatcherTest.testDispatchKVPException(DispatcherTest.java:939)
	at sun.reflect.NativeMethodAccessorImpl.invoke0(Native Method)
	at sun.reflect.NativeMethodAccessorImpl.invoke(NativeMethodAccessorImpl.java:62)
	at sun.reflect.DelegatingMethodAccessorImpl.invoke(DelegatingMethodAccessorImpl.java:43)
	at java.lang.reflect.Method.invoke(Method.java:498)
	at junit.framework.TestCase.runTest(TestCase.java:176)
	at junit.framework.TestCase.runBare(TestCase.java:141)
	at junit.framework.TestResult$1.protect(TestResult.java:122)
	at junit.framework.TestResult.runProtected(TestResult.java:142)
	at junit.framework.TestResult.run(TestResult.java:125)
	at junit.framework.TestCase.run(TestCase.java:129)
	at junit.framework.TestSuite.runTest(TestSuite.java:255)
	at junit.framework.TestSuite.run(TestSuite.java:250)
	at org.junit.internal.runners.JUnit38ClassRunner.run(JUnit38ClassRunner.java:84)
	at org.apache.maven.surefire.junit4.JUnit4Provider.execute(JUnit4Provider.java:252)
	at org.apache.maven.surefire.junit4.JUnit4Provider.executeTestSet(JUnit4Provider.java:141)
	at org.apache.maven.surefire.junit4.JUnit4Provider.invoke(JUnit4Provider.java:112)
	at sun.reflect.NativeMethodAccessorImpl.invoke0(Native Method)
	at sun.reflect.NativeMethodAccessorImpl.invoke(NativeMethodAccessorImpl.java:62)
	at sun.reflect.DelegatingMethodAccessorImpl.invoke(DelegatingMethodAccessorImpl.java:43)
	at java.lang.reflect.Method.invoke(Method.java:498)
	at org.apache.maven.surefire.util.ReflectionUtils.invokeMethodWithArray(ReflectionUtils.java:189)
	at org.apache.maven.surefire.booter.ProviderFactory$ProviderProxy.invoke(ProviderFactory.java:165)
	at org.apache.maven.surefire.booter.ProviderFactory.invokeProvider(ProviderFactory.java:85)
	at org.apache.maven.surefire.booter.ForkedBooter.runSuitesInProcess(ForkedBooter.java:115)
	at org.apache.maven.surefire.booter.ForkedBooter.main(ForkedBooter.java:75)

Jun 28, 2018 8:23:26 PM org.springframework.context.support.AbstractApplicationContext prepareRefresh
INFO: Refreshing org.springframework.context.support.FileSystemXmlApplicationContext@7af1cd63: startup date [Thu Jun 28 20:23:26 EDT 2018]; root of context hierarchy
Jun 28, 2018 8:23:26 PM org.springframework.beans.factory.xml.XmlBeanDefinitionReader loadBeanDefinitions
INFO: Loading XML bean definitions from URL [file:/home/hudson/genie.jts/.jenkins/jobs/GeoServer-1.15.0/workspace/src/ows/target/test-classes/org/geoserver/ows/applicationContext.xml]
Jun 28, 2018 8:23:26 PM org.springframework.context.support.AbstractApplicationContext prepareRefresh
INFO: Refreshing org.springframework.context.support.FileSystemXmlApplicationContext@6f8d7714: startup date [Thu Jun 28 20:23:26 EDT 2018]; root of context hierarchy
Jun 28, 2018 8:23:26 PM org.springframework.beans.factory.xml.XmlBeanDefinitionReader loadBeanDefinitions
INFO: Loading XML bean definitions from URL [file:/home/hudson/genie.jts/.jenkins/jobs/GeoServer-1.15.0/workspace/src/ows/target/test-classes/org/geoserver/ows/applicationContext.xml]
Jun 28, 2018 8:23:26 PM org.geoserver.ows.Dispatcher exception
SEVERE: 
java.lang.RuntimeException: TestDispatcherCallbackFailServiceDispatched
	at org.geoserver.ows.DispatcherTest$10.serviceDispatched(DispatcherTest.java:627)
	at org.geoserver.ows.Dispatcher.fireServiceDispatchedCallback(Dispatcher.java:572)
	at org.geoserver.ows.Dispatcher.service(Dispatcher.java:567)
	at org.geoserver.ows.Dispatcher.handleRequestInternal(Dispatcher.java:236)
	at org.springframework.web.servlet.mvc.AbstractController.handleRequest(AbstractController.java:174)
	at org.geoserver.ows.DispatcherTest.testDispatcherCallbackFailServiceDispatched(DispatcherTest.java:638)
	at sun.reflect.NativeMethodAccessorImpl.invoke0(Native Method)
	at sun.reflect.NativeMethodAccessorImpl.invoke(NativeMethodAccessorImpl.java:62)
	at sun.reflect.DelegatingMethodAccessorImpl.invoke(DelegatingMethodAccessorImpl.java:43)
	at java.lang.reflect.Method.invoke(Method.java:498)
	at junit.framework.TestCase.runTest(TestCase.java:176)
	at junit.framework.TestCase.runBare(TestCase.java:141)
	at junit.framework.TestResult$1.protect(TestResult.java:122)
	at junit.framework.TestResult.runProtected(TestResult.java:142)
	at junit.framework.TestResult.run(TestResult.java:125)
	at junit.framework.TestCase.run(TestCase.java:129)
	at junit.framework.TestSuite.runTest(TestSuite.java:255)
	at junit.framework.TestSuite.run(TestSuite.java:250)
	at org.junit.internal.runners.JUnit38ClassRunner.run(JUnit38ClassRunner.java:84)
	at org.apache.maven.surefire.junit4.JUnit4Provider.execute(JUnit4Provider.java:252)
	at org.apache.maven.surefire.junit4.JUnit4Provider.executeTestSet(JUnit4Provider.java:141)
	at org.apache.maven.surefire.junit4.JUnit4Provider.invoke(JUnit4Provider.java:112)
	at sun.reflect.NativeMethodAccessorImpl.invoke0(Native Method)
	at sun.reflect.NativeMethodAccessorImpl.invoke(NativeMethodAccessorImpl.java:62)
	at sun.reflect.DelegatingMethodAccessorImpl.invoke(DelegatingMethodAccessorImpl.java:43)
	at java.lang.reflect.Method.invoke(Method.java:498)
	at org.apache.maven.surefire.util.ReflectionUtils.invokeMethodWithArray(ReflectionUtils.java:189)
	at org.apache.maven.surefire.booter.ProviderFactory$ProviderProxy.invoke(ProviderFactory.java:165)
	at org.apache.maven.surefire.booter.ProviderFactory.invokeProvider(ProviderFactory.java:85)
	at org.apache.maven.surefire.booter.ForkedBooter.runSuitesInProcess(ForkedBooter.java:115)
	at org.apache.maven.surefire.booter.ForkedBooter.main(ForkedBooter.java:75)

Jun 28, 2018 8:23:26 PM org.springframework.context.support.AbstractApplicationContext prepareRefresh
INFO: Refreshing org.springframework.context.support.FileSystemXmlApplicationContext@2375b321: startup date [Thu Jun 28 20:23:26 EDT 2018]; root of context hierarchy
Jun 28, 2018 8:23:26 PM org.springframework.beans.factory.xml.XmlBeanDefinitionReader loadBeanDefinitions
INFO: Loading XML bean definitions from URL [file:/home/hudson/genie.jts/.jenkins/jobs/GeoServer-1.15.0/workspace/src/ows/target/test-classes/org/geoserver/ows/applicationContextNamespace.xml]
Jun 28, 2018 8:23:26 PM org.springframework.beans.factory.xml.XmlBeanDefinitionReader loadBeanDefinitions
INFO: Loading XML bean definitions from URL [file:/home/hudson/genie.jts/.jenkins/jobs/GeoServer-1.15.0/workspace/src/ows/target/test-classes/org/geoserver/ows/applicationContext.xml]
Jun 28, 2018 8:23:26 PM org.springframework.beans.factory.support.DefaultListableBeanFactory registerBeanDefinition
INFO: Overriding bean definition for bean 'helloWorldService' with a different definition: replacing [Generic bean: class [org.geoserver.platform.Service]; scope=; abstract=false; lazyInit=false; autowireMode=0; dependencyCheck=0; autowireCandidate=true; primary=false; factoryBeanName=null; factoryMethodName=null; initMethodName=null; destroyMethodName=null; defined in URL [file:/home/hudson/genie.jts/.jenkins/jobs/GeoServer-1.15.0/workspace/src/ows/target/test-classes/org/geoserver/ows/applicationContext.xml]] with [Generic bean: class [org.geoserver.platform.Service]; scope=; abstract=false; lazyInit=false; autowireMode=0; dependencyCheck=0; autowireCandidate=true; primary=false; factoryBeanName=null; factoryMethodName=null; initMethodName=null; destroyMethodName=null; defined in URL [file:/home/hudson/genie.jts/.jenkins/jobs/GeoServer-1.15.0/workspace/src/ows/target/test-classes/org/geoserver/ows/applicationContextNamespace.xml]]
Jun 28, 2018 8:23:26 PM org.geoserver.ows.Dispatcher findXmlReader
INFO: No xml reader: (http:/hello.org,Hello)
Jun 28, 2018 8:23:26 PM org.geoserver.ows.Dispatcher exception
SEVERE: 
org.geoserver.platform.ServiceException: Could not parse the XML for: org.geoserver.ows.Message
	at org.geoserver.ows.Dispatcher.dispatch(Dispatcher.java:713)
	at org.geoserver.ows.Dispatcher.handleRequestInternal(Dispatcher.java:249)
	at org.geoserver.ows.DispatcherTest.testDispatchXMLException(DispatcherTest.java:889)
	at sun.reflect.NativeMethodAccessorImpl.invoke0(Native Method)
	at sun.reflect.NativeMethodAccessorImpl.invoke(NativeMethodAccessorImpl.java:62)
	at sun.reflect.DelegatingMethodAccessorImpl.invoke(DelegatingMethodAccessorImpl.java:43)
	at java.lang.reflect.Method.invoke(Method.java:498)
	at junit.framework.TestCase.runTest(TestCase.java:176)
	at junit.framework.TestCase.runBare(TestCase.java:141)
	at junit.framework.TestResult$1.protect(TestResult.java:122)
	at junit.framework.TestResult.runProtected(TestResult.java:142)
	at junit.framework.TestResult.run(TestResult.java:125)
	at junit.framework.TestCase.run(TestCase.java:129)
	at junit.framework.TestSuite.runTest(TestSuite.java:255)
	at junit.framework.TestSuite.run(TestSuite.java:250)
	at org.junit.internal.runners.JUnit38ClassRunner.run(JUnit38ClassRunner.java:84)
	at org.apache.maven.surefire.junit4.JUnit4Provider.execute(JUnit4Provider.java:252)
	at org.apache.maven.surefire.junit4.JUnit4Provider.executeTestSet(JUnit4Provider.java:141)
	at org.apache.maven.surefire.junit4.JUnit4Provider.invoke(JUnit4Provider.java:112)
	at sun.reflect.NativeMethodAccessorImpl.invoke0(Native Method)
	at sun.reflect.NativeMethodAccessorImpl.invoke(NativeMethodAccessorImpl.java:62)
	at sun.reflect.DelegatingMethodAccessorImpl.invoke(DelegatingMethodAccessorImpl.java:43)
	at java.lang.reflect.Method.invoke(Method.java:498)
	at org.apache.maven.surefire.util.ReflectionUtils.invokeMethodWithArray(ReflectionUtils.java:189)
	at org.apache.maven.surefire.booter.ProviderFactory$ProviderProxy.invoke(ProviderFactory.java:165)
	at org.apache.maven.surefire.booter.ProviderFactory.invokeProvider(ProviderFactory.java:85)
	at org.apache.maven.surefire.booter.ForkedBooter.runSuitesInProcess(ForkedBooter.java:115)
	at org.apache.maven.surefire.booter.ForkedBooter.main(ForkedBooter.java:75)

Jun 28, 2018 8:23:26 PM org.springframework.context.support.AbstractApplicationContext prepareRefresh
INFO: Refreshing org.springframework.context.support.FileSystemXmlApplicationContext@29f0802c: startup date [Thu Jun 28 20:23:26 EDT 2018]; root of context hierarchy
Jun 28, 2018 8:23:26 PM org.springframework.beans.factory.xml.XmlBeanDefinitionReader loadBeanDefinitions
INFO: Loading XML bean definitions from URL [file:/home/hudson/genie.jts/.jenkins/jobs/GeoServer-1.15.0/workspace/src/ows/target/test-classes/org/geoserver/ows/applicationContextOnlyXml.xml]
Jun 28, 2018 8:23:26 PM org.springframework.context.support.AbstractApplicationContext prepareRefresh
INFO: Refreshing org.springframework.context.support.FileSystemXmlApplicationContext@5ec77191: startup date [Thu Jun 28 20:23:26 EDT 2018]; root of context hierarchy
Jun 28, 2018 8:23:26 PM org.springframework.beans.factory.xml.XmlBeanDefinitionReader loadBeanDefinitions
INFO: Loading XML bean definitions from URL [file:/home/hudson/genie.jts/.jenkins/jobs/GeoServer-1.15.0/workspace/src/ows/target/test-classes/org/geoserver/ows/applicationContext.xml]
Jun 28, 2018 8:23:27 PM org.springframework.context.support.AbstractApplicationContext prepareRefresh
INFO: Refreshing org.springframework.context.support.FileSystemXmlApplicationContext@2bc12da: startup date [Thu Jun 28 20:23:27 EDT 2018]; root of context hierarchy
Jun 28, 2018 8:23:27 PM org.springframework.beans.factory.xml.XmlBeanDefinitionReader loadBeanDefinitions
INFO: Loading XML bean definitions from URL [file:/home/hudson/genie.jts/.jenkins/jobs/GeoServer-1.15.0/workspace/src/ows/target/test-classes/org/geoserver/ows/applicationContextNamespace.xml]
Jun 28, 2018 8:23:27 PM org.springframework.beans.factory.xml.XmlBeanDefinitionReader loadBeanDefinitions
INFO: Loading XML bean definitions from URL [file:/home/hudson/genie.jts/.jenkins/jobs/GeoServer-1.15.0/workspace/src/ows/target/test-classes/org/geoserver/ows/applicationContext.xml]
Jun 28, 2018 8:23:27 PM org.springframework.beans.factory.support.DefaultListableBeanFactory registerBeanDefinition
INFO: Overriding bean definition for bean 'helloWorldService' with a different definition: replacing [Generic bean: class [org.geoserver.platform.Service]; scope=; abstract=false; lazyInit=false; autowireMode=0; dependencyCheck=0; autowireCandidate=true; primary=false; factoryBeanName=null; factoryMethodName=null; initMethodName=null; destroyMethodName=null; defined in URL [file:/home/hudson/genie.jts/.jenkins/jobs/GeoServer-1.15.0/workspace/src/ows/target/test-classes/org/geoserver/ows/applicationContext.xml]] with [Generic bean: class [org.geoserver.platform.Service]; scope=; abstract=false; lazyInit=false; autowireMode=0; dependencyCheck=0; autowireCandidate=true; primary=false; factoryBeanName=null; factoryMethodName=null; initMethodName=null; destroyMethodName=null; defined in URL [file:/home/hudson/genie.jts/.jenkins/jobs/GeoServer-1.15.0/workspace/src/ows/target/test-classes/org/geoserver/ows/applicationContextNamespace.xml]]
Jun 28, 2018 8:23:27 PM org.springframework.context.support.AbstractApplicationContext prepareRefresh
INFO: Refreshing org.springframework.context.support.FileSystemXmlApplicationContext@6331250e: startup date [Thu Jun 28 20:23:27 EDT 2018]; root of context hierarchy
Jun 28, 2018 8:23:27 PM org.springframework.beans.factory.xml.XmlBeanDefinitionReader loadBeanDefinitions
INFO: Loading XML bean definitions from URL [file:/home/hudson/genie.jts/.jenkins/jobs/GeoServer-1.15.0/workspace/src/ows/target/test-classes/org/geoserver/ows/applicationContext.xml]
Jun 28, 2018 8:23:27 PM org.geoserver.ows.Dispatcher fireFinishedCallback
WARNING: Error firing finished callback for class org.geoserver.ows.DispatcherTest$15
java.lang.Error: TestDispatcherCallbackFailFinished
	at org.geoserver.ows.DispatcherTest$15.finished(DispatcherTest.java:768)
	at org.geoserver.ows.Dispatcher.fireFinishedCallback(Dispatcher.java:295)
	at org.geoserver.ows.Dispatcher.handleRequestInternal(Dispatcher.java:271)
	at org.springframework.web.servlet.mvc.AbstractController.handleRequest(AbstractController.java:174)
	at org.geoserver.ows.DispatcherTest.testDispatcherCallbackFailFinished(DispatcherTest.java:779)
	at sun.reflect.NativeMethodAccessorImpl.invoke0(Native Method)
	at sun.reflect.NativeMethodAccessorImpl.invoke(NativeMethodAccessorImpl.java:62)
	at sun.reflect.DelegatingMethodAccessorImpl.invoke(DelegatingMethodAccessorImpl.java:43)
	at java.lang.reflect.Method.invoke(Method.java:498)
	at junit.framework.TestCase.runTest(TestCase.java:176)
	at junit.framework.TestCase.runBare(TestCase.java:141)
	at junit.framework.TestResult$1.protect(TestResult.java:122)
	at junit.framework.TestResult.runProtected(TestResult.java:142)
	at junit.framework.TestResult.run(TestResult.java:125)
	at junit.framework.TestCase.run(TestCase.java:129)
	at junit.framework.TestSuite.runTest(TestSuite.java:255)
	at junit.framework.TestSuite.run(TestSuite.java:250)
	at org.junit.internal.runners.JUnit38ClassRunner.run(JUnit38ClassRunner.java:84)
	at org.apache.maven.surefire.junit4.JUnit4Provider.execute(JUnit4Provider.java:252)
	at org.apache.maven.surefire.junit4.JUnit4Provider.executeTestSet(JUnit4Provider.java:141)
	at org.apache.maven.surefire.junit4.JUnit4Provider.invoke(JUnit4Provider.java:112)
	at sun.reflect.NativeMethodAccessorImpl.invoke0(Native Method)
	at sun.reflect.NativeMethodAccessorImpl.invoke(NativeMethodAccessorImpl.java:62)
	at sun.reflect.DelegatingMethodAccessorImpl.invoke(DelegatingMethodAccessorImpl.java:43)
	at java.lang.reflect.Method.invoke(Method.java:498)
	at org.apache.maven.surefire.util.ReflectionUtils.invokeMethodWithArray(ReflectionUtils.java:189)
	at org.apache.maven.surefire.booter.ProviderFactory$ProviderProxy.invoke(ProviderFactory.java:165)
	at org.apache.maven.surefire.booter.ProviderFactory.invokeProvider(ProviderFactory.java:85)
	at org.apache.maven.surefire.booter.ForkedBooter.runSuitesInProcess(ForkedBooter.java:115)
	at org.apache.maven.surefire.booter.ForkedBooter.main(ForkedBooter.java:75)

Jun 28, 2018 8:23:27 PM org.springframework.context.support.AbstractApplicationContext doClose
INFO: Closing org.springframework.context.support.FileSystemXmlApplicationContext@6331250e: startup date [Thu Jun 28 20:23:27 EDT 2018]; root of context hierarchy
Jun 28, 2018 8:23:27 PM org.springframework.context.support.AbstractApplicationContext prepareRefresh
INFO: Refreshing org.springframework.context.support.FileSystemXmlApplicationContext@69ce2f62: startup date [Thu Jun 28 20:23:27 EDT 2018]; root of context hierarchy
Jun 28, 2018 8:23:27 PM org.springframework.beans.factory.xml.XmlBeanDefinitionReader loadBeanDefinitions
INFO: Loading XML bean definitions from URL [file:/home/hudson/genie.jts/.jenkins/jobs/GeoServer-1.15.0/workspace/src/ows/target/test-classes/org/geoserver/ows/applicationContext.xml]
Jun 28, 2018 8:23:27 PM org.geoserver.ows.Dispatcher exception
SEVERE: 
java.lang.RuntimeException: TestDispatcherCallbackFailInit
	at org.geoserver.ows.DispatcherTest$9.init(DispatcherTest.java:595)
	at org.geoserver.ows.Dispatcher.fireInitCallback(Dispatcher.java:419)
	at org.geoserver.ows.Dispatcher.init(Dispatcher.java:406)
	at org.geoserver.ows.Dispatcher.handleRequestInternal(Dispatcher.java:229)
	at org.springframework.web.servlet.mvc.AbstractController.handleRequest(AbstractController.java:174)
	at org.geoserver.ows.DispatcherTest.testDispatcherCallbackFailInit(DispatcherTest.java:606)
	at sun.reflect.NativeMethodAccessorImpl.invoke0(Native Method)
	at sun.reflect.NativeMethodAccessorImpl.invoke(NativeMethodAccessorImpl.java:62)
	at sun.reflect.DelegatingMethodAccessorImpl.invoke(DelegatingMethodAccessorImpl.java:43)
	at java.lang.reflect.Method.invoke(Method.java:498)
	at junit.framework.TestCase.runTest(TestCase.java:176)
	at junit.framework.TestCase.runBare(TestCase.java:141)
	at junit.framework.TestResult$1.protect(TestResult.java:122)
	at junit.framework.TestResult.runProtected(TestResult.java:142)
	at junit.framework.TestResult.run(TestResult.java:125)
	at junit.framework.TestCase.run(TestCase.java:129)
	at junit.framework.TestSuite.runTest(TestSuite.java:255)
	at junit.framework.TestSuite.run(TestSuite.java:250)
	at org.junit.internal.runners.JUnit38ClassRunner.run(JUnit38ClassRunner.java:84)
	at org.apache.maven.surefire.junit4.JUnit4Provider.execute(JUnit4Provider.java:252)
	at org.apache.maven.surefire.junit4.JUnit4Provider.executeTestSet(JUnit4Provider.java:141)
	at org.apache.maven.surefire.junit4.JUnit4Provider.invoke(JUnit4Provider.java:112)
	at sun.reflect.NativeMethodAccessorImpl.invoke0(Native Method)
	at sun.reflect.NativeMethodAccessorImpl.invoke(NativeMethodAccessorImpl.java:62)
	at sun.reflect.DelegatingMethodAccessorImpl.invoke(DelegatingMethodAccessorImpl.java:43)
	at java.lang.reflect.Method.invoke(Method.java:498)
	at org.apache.maven.surefire.util.ReflectionUtils.invokeMethodWithArray(ReflectionUtils.java:189)
	at org.apache.maven.surefire.booter.ProviderFactory$ProviderProxy.invoke(ProviderFactory.java:165)
	at org.apache.maven.surefire.booter.ProviderFactory.invokeProvider(ProviderFactory.java:85)
	at org.apache.maven.surefire.booter.ForkedBooter.runSuitesInProcess(ForkedBooter.java:115)
	at org.apache.maven.surefire.booter.ForkedBooter.main(ForkedBooter.java:75)

Jun 28, 2018 8:23:27 PM org.springframework.context.support.AbstractApplicationContext prepareRefresh
INFO: Refreshing org.springframework.context.support.FileSystemXmlApplicationContext@7b60c3e: startup date [Thu Jun 28 20:23:27 EDT 2018]; root of context hierarchy
Jun 28, 2018 8:23:27 PM org.springframework.beans.factory.xml.XmlBeanDefinitionReader loadBeanDefinitions
INFO: Loading XML bean definitions from URL [file:/home/hudson/genie.jts/.jenkins/jobs/GeoServer-1.15.0/workspace/src/ows/target/test-classes/org/geoserver/ows/applicationContext.xml]
Jun 28, 2018 8:23:27 PM org.springframework.context.support.AbstractApplicationContext prepareRefresh
INFO: Refreshing org.springframework.context.support.FileSystemXmlApplicationContext@35c09b94: startup date [Thu Jun 28 20:23:27 EDT 2018]; root of context hierarchy
Jun 28, 2018 8:23:27 PM org.springframework.beans.factory.xml.XmlBeanDefinitionReader loadBeanDefinitions
INFO: Loading XML bean definitions from URL [file:/home/hudson/genie.jts/.jenkins/jobs/GeoServer-1.15.0/workspace/src/ows/target/test-classes/org/geoserver/ows/applicationContext.xml]
Jun 28, 2018 8:23:27 PM org.springframework.context.support.AbstractApplicationContext prepareRefresh
INFO: Refreshing org.springframework.context.support.FileSystemXmlApplicationContext@1c12f3ee: startup date [Thu Jun 28 20:23:27 EDT 2018]; root of context hierarchy
Jun 28, 2018 8:23:27 PM org.springframework.beans.factory.xml.XmlBeanDefinitionReader loadBeanDefinitions
INFO: Loading XML bean definitions from URL [file:/home/hudson/genie.jts/.jenkins/jobs/GeoServer-1.15.0/workspace/src/ows/target/test-classes/org/geoserver/ows/applicationContext.xml]
Jun 28, 2018 8:23:27 PM org.springframework.context.support.AbstractApplicationContext prepareRefresh
INFO: Refreshing org.springframework.context.support.FileSystemXmlApplicationContext@16fe9c29: startup date [Thu Jun 28 20:23:27 EDT 2018]; root of context hierarchy
Jun 28, 2018 8:23:27 PM org.springframework.beans.factory.xml.XmlBeanDefinitionReader loadBeanDefinitions
INFO: Loading XML bean definitions from URL [file:/home/hudson/genie.jts/.jenkins/jobs/GeoServer-1.15.0/workspace/src/ows/target/test-classes/org/geoserver/ows/applicationContext.xml]
Tests run: 29, Failures: 0, Errors: 0, Skipped: 0, Time elapsed: 0.695 sec
Running org.geoserver.ows.FilePublisherTest
Tests run: 2, Failures: 0, Errors: 0, Skipped: 0, Time elapsed: 0.055 sec
Running org.geoserver.ows.XmlObjectEncodingResponseTest
Tests run: 3, Failures: 0, Errors: 0, Skipped: 0, Time elapsed: 0.013 sec
Running org.geoserver.ows.kvp.CharsetKvpParserTest
Tests run: 2, Failures: 0, Errors: 0, Skipped: 0, Time elapsed: 0.006 sec
Running org.geoserver.ows.kvp.ElevationKvpParserTest
Tests run: 3, Failures: 0, Errors: 0, Skipped: 0, Time elapsed: 0.011 sec
Running org.geoserver.ows.kvp.FormatOptionsKvpParserTest
Jun 28, 2018 8:23:27 PM org.geoserver.platform.GeoServerExtensions checkContext
WARNING: Extension lookup 'KvpParser', but ApplicationContext is unset.
Jun 28, 2018 8:23:27 PM org.geoserver.platform.GeoServerExtensions checkContext
WARNING: Extension lookup 'ExtensionFilter', but ApplicationContext is unset.
Jun 28, 2018 8:23:27 PM org.geoserver.platform.GeoServerExtensions checkContext
WARNING: Extension lookup 'ExtensionProvider', but ApplicationContext is unset.
Jun 28, 2018 8:23:27 PM org.geoserver.platform.GeoServerExtensions checkContext
WARNING: Extension lookup 'ExtensionFilter', but ApplicationContext is unset.
Jun 28, 2018 8:23:27 PM org.geoserver.platform.GeoServerExtensions checkContext
WARNING: Extension lookup 'KvpParser', but ApplicationContext is unset.
Jun 28, 2018 8:23:27 PM org.geoserver.platform.GeoServerExtensions checkContext
WARNING: Extension lookup 'ExtensionFilter', but ApplicationContext is unset.
Jun 28, 2018 8:23:27 PM org.geoserver.platform.GeoServerExtensions checkContext
WARNING: Extension lookup 'ExtensionProvider', but ApplicationContext is unset.
Jun 28, 2018 8:23:27 PM org.geoserver.platform.GeoServerExtensions checkContext
WARNING: Extension lookup 'ExtensionFilter', but ApplicationContext is unset.
Jun 28, 2018 8:23:27 PM org.geoserver.platform.GeoServerExtensions checkContext
WARNING: Extension lookup 'KvpParser', but ApplicationContext is unset.
Jun 28, 2018 8:23:27 PM org.geoserver.platform.GeoServerExtensions checkContext
WARNING: Extension lookup 'ExtensionFilter', but ApplicationContext is unset.
Jun 28, 2018 8:23:27 PM org.geoserver.platform.GeoServerExtensions checkContext
WARNING: Extension lookup 'ExtensionProvider', but ApplicationContext is unset.
Jun 28, 2018 8:23:27 PM org.geoserver.platform.GeoServerExtensions checkContext
WARNING: Extension lookup 'ExtensionFilter', but ApplicationContext is unset.
Jun 28, 2018 8:23:27 PM org.geoserver.platform.GeoServerExtensions checkContext
WARNING: Extension lookup 'KvpParser', but ApplicationContext is unset.
Jun 28, 2018 8:23:27 PM org.geoserver.platform.GeoServerExtensions checkContext
WARNING: Extension lookup 'ExtensionFilter', but ApplicationContext is unset.
Jun 28, 2018 8:23:27 PM org.geoserver.platform.GeoServerExtensions checkContext
WARNING: Extension lookup 'ExtensionProvider', but ApplicationContext is unset.
Jun 28, 2018 8:23:27 PM org.geoserver.platform.GeoServerExtensions checkContext
WARNING: Extension lookup 'ExtensionFilter', but ApplicationContext is unset.
Tests run: 4, Failures: 0, Errors: 0, Skipped: 0, Time elapsed: 0.006 sec
Running org.geoserver.ows.kvp.KvpUtilsTest
Tests run: 10, Failures: 0, Errors: 0, Skipped: 0, Time elapsed: 0.002 sec
Running org.geoserver.ows.kvp.TimeKvpParserTest
Tests run: 13, Failures: 0, Errors: 0, Skipped: 0, Time elapsed: 0.043 sec
Running org.geoserver.ows.util.CaseInsensitiveMapTest
Tests run: 1, Failures: 0, Errors: 0, Skipped: 0, Time elapsed: 0 sec
Running org.geoserver.ows.util.KvpMapTest
Tests run: 1, Failures: 0, Errors: 0, Skipped: 0, Time elapsed: 0 sec
Running org.geoserver.ows.util.OwsUtilsTest
Tests run: 3, Failures: 0, Errors: 0, Skipped: 0, Time elapsed: 0.001 sec
Running org.geoserver.ows.util.RequestUtilsTest
Tests run: 3, Failures: 0, Errors: 0, Skipped: 0, Time elapsed: 0 sec
Running org.geoserver.ows.xml.v1_0.ExceptionReportBindingTest
Tests run: 1, Failures: 0, Errors: 0, Skipped: 0, Time elapsed: 0.019 sec

Results :

Tests run: 80, Failures: 0, Errors: 0, Skipped: 0

[JENKINS] Recording test results
[INFO] 
[INFO] --- maven-jar-plugin:2.4:jar (default-jar) @ gs-ows ---
[INFO] Building jar: /home/hudson/genie.jts/.jenkins/jobs/GeoServer-1.15.0/workspace/src/ows/target/gs-ows-2.14-SNAPSHOT.jar
[INFO] 
[INFO] --- maven-jar-plugin:2.4:test-jar (default) @ gs-ows ---
[INFO] Building jar: /home/hudson/genie.jts/.jenkins/jobs/GeoServer-1.15.0/workspace/src/ows/target/gs-ows-2.14-SNAPSHOT-tests.jar
[INFO] 
[INFO] --- maven-source-plugin:2.2.1:jar-no-fork (attach-sources) @ gs-ows ---
[INFO] Building jar: /home/hudson/genie.jts/.jenkins/jobs/GeoServer-1.15.0/workspace/src/ows/target/gs-ows-2.14-SNAPSHOT-sources.jar
[INFO] 
[INFO] --- maven-source-plugin:2.2.1:test-jar-no-fork (attach-sources) @ gs-ows ---
[INFO] Building jar: /home/hudson/genie.jts/.jenkins/jobs/GeoServer-1.15.0/workspace/src/ows/target/gs-ows-2.14-SNAPSHOT-test-sources.jar
[INFO] 
[INFO] --- maven-install-plugin:2.4:install (default-install) @ gs-ows ---
[INFO] Installing /home/hudson/genie.jts/.jenkins/jobs/GeoServer-1.15.0/workspace/src/ows/target/gs-ows-2.14-SNAPSHOT.jar to /opt/public/hipp/homes/genie.jts/.m2/repository/org/geoserver/gs-ows/2.14-SNAPSHOT/gs-ows-2.14-SNAPSHOT.jar
[INFO] Installing /home/hudson/genie.jts/.jenkins/jobs/GeoServer-1.15.0/workspace/src/ows/pom.xml to /opt/public/hipp/homes/genie.jts/.m2/repository/org/geoserver/gs-ows/2.14-SNAPSHOT/gs-ows-2.14-SNAPSHOT.pom
[INFO] Installing /home/hudson/genie.jts/.jenkins/jobs/GeoServer-1.15.0/workspace/src/ows/target/gs-ows-2.14-SNAPSHOT-tests.jar to /opt/public/hipp/homes/genie.jts/.m2/repository/org/geoserver/gs-ows/2.14-SNAPSHOT/gs-ows-2.14-SNAPSHOT-tests.jar
[INFO] Installing /home/hudson/genie.jts/.jenkins/jobs/GeoServer-1.15.0/workspace/src/ows/target/gs-ows-2.14-SNAPSHOT-sources.jar to /opt/public/hipp/homes/genie.jts/.m2/repository/org/geoserver/gs-ows/2.14-SNAPSHOT/gs-ows-2.14-SNAPSHOT-sources.jar
[INFO] Installing /home/hudson/genie.jts/.jenkins/jobs/GeoServer-1.15.0/workspace/src/ows/target/gs-ows-2.14-SNAPSHOT-test-sources.jar to /opt/public/hipp/homes/genie.jts/.m2/repository/org/geoserver/gs-ows/2.14-SNAPSHOT/gs-ows-2.14-SNAPSHOT-test-sources.jar