FailedConsole Output

Skipping 6 KB.. Full Log
[WARNING] 
[WARNING] It is highly recommended to fix these problems because they threaten the stability of your build.
[WARNING] 
[WARNING] For this reason, future Maven versions might no longer support building such malformed projects.
[WARNING] 
[INFO] ------------------------------------------------------------------------
[INFO] Reactor Build Order:
[INFO] 
[INFO] GeoServer                                                          [pom]
[INFO] Core Platform Module                                               [jar]
[INFO] Open Web Service Module                                            [jar]
[INFO] Main Module                                                        [jar]
[INFO] GeoServer Security Modules                                         [pom]
[INFO] GeoServer Security Tests Module                                    [jar]
[INFO] GeoServer JDBC Security Module                                     [jar]
[INFO] GeoServer LDAP Security Module                                     [jar]
[INFO] Web Coverage Service Module                                        [jar]
[INFO] Web Coverage Service 1.0 Module                                    [jar]
[INFO] Web Coverage Service 1.1 Module                                    [jar]
[INFO] Web Coverage Service 2.0 Module                                    [jar]
[INFO] Web Feature Service Module                                         [jar]
[INFO] Web Map Service Module                                             [jar]
[INFO] KML support for GeoServer                                          [jar]
[INFO] gs-rest                                                            [jar]
[INFO] GeoWebCache (GWC) Module                                           [jar]
[INFO] gs-restconfig                                                      [jar]
[INFO] gs-restconfig-wcs                                                  [jar]
[INFO] gs-restconfig-wfs                                                  [jar]
[INFO] gs-restconfig-wms                                                  [jar]
[INFO] GeoServer Web Modules                                              [pom]
[INFO] Core UI Module                                                     [jar]
[INFO] WMS UI Module                                                      [jar]
[INFO] GWC UI Module                                                      [jar]
[INFO] WFS UI Module                                                      [jar]
[INFO] Demos Module                                                       [jar]
[INFO] WCS UI Module                                                      [jar]
[INFO] Security UI Modules                                                [pom]
[INFO] Security UI Core Module                                            [jar]
[INFO] Security UI JDBC Module                                            [jar]
[INFO] Security UI LDAP Module                                            [jar]
[INFO] REST UI Module                                                     [jar]
[INFO] GeoServer Web Application                                          [jar]
[INFO] Community Space                                                    [pom]
[INFO] GeoServer Extensions                                               [pom]
[INFO] 
[INFO] ----------------------< org.geoserver:geoserver >-----------------------
[INFO] Building GeoServer 2.14-SNAPSHOT                                  [1/36]
[INFO] --------------------------------[ pom ]---------------------------------
[INFO] 
[INFO] --- maven-clean-plugin:2.5:clean (default-clean) @ geoserver ---
[INFO] Deleting /home/hudson/genie.jts/.jenkins/jobs/GeoServer-1.15.0/workspace/src/target
[INFO] 
[INFO] --- git-commit-id-plugin:2.1.15:revision (default) @ geoserver ---
[INFO] 
[INFO] --- fmt-maven-plugin:2.4.0:format (default) @ geoserver ---
[warn] Source directory '/home/hudson/genie.jts/.jenkins/jobs/GeoServer-1.15.0/workspace/src/src/main/java' does not exist, ignoring.
[warn] Test source directory '/home/hudson/genie.jts/.jenkins/jobs/GeoServer-1.15.0/workspace/src/src/test/java' does not exist, ignoring.
[debug] Using AOSP style
[INFO] Processed 0 files (0 reformatted).
[INFO] 
[INFO] --- maven-jar-plugin:2.4:test-jar (default) @ geoserver ---
[WARNING] JAR will be empty - no content was marked for inclusion!
[INFO] Building jar: /home/hudson/genie.jts/.jenkins/jobs/GeoServer-1.15.0/workspace/src/target/geoserver-2.14-SNAPSHOT-tests.jar
[INFO] 
[INFO] --- maven-source-plugin:2.2.1:jar-no-fork (attach-sources) @ geoserver ---
[INFO] 
[INFO] --- maven-source-plugin:2.2.1:test-jar-no-fork (attach-sources) @ geoserver ---
[INFO] 
[INFO] --- maven-install-plugin:2.4:install (default-install) @ geoserver ---
[INFO] Installing /home/hudson/genie.jts/.jenkins/jobs/GeoServer-1.15.0/workspace/src/pom.xml to /opt/public/hipp/homes/genie.jts/.m2/repository/org/geoserver/geoserver/2.14-SNAPSHOT/geoserver-2.14-SNAPSHOT.pom
[INFO] Installing /home/hudson/genie.jts/.jenkins/jobs/GeoServer-1.15.0/workspace/src/target/geoserver-2.14-SNAPSHOT-tests.jar to /opt/public/hipp/homes/genie.jts/.m2/repository/org/geoserver/geoserver/2.14-SNAPSHOT/geoserver-2.14-SNAPSHOT-tests.jar
Started calculate disk usage of build
Finished Calculation of disk usage of build in 0 seconds
Started calculate disk usage of workspace
Finished Calculation of disk usage of workspace in 0 seconds
[INFO] 
[INFO] ---------------------< org.geoserver:gs-platform >----------------------
[INFO] Building Core Platform Module 2.14-SNAPSHOT                       [2/36]
[INFO] --------------------------------[ jar ]---------------------------------
[INFO] Downloading from boundless: https://repo.boundlessgeo.com/main/org/springframework/spring-test/4.3.16.RELEASE/spring-test-4.3.16.RELEASE.pom
[INFO] Downloading from osgeo: http://download.osgeo.org/webdav/geotools/org/springframework/spring-test/4.3.16.RELEASE/spring-test-4.3.16.RELEASE.pom
[INFO] Downloading from geosolutions: http://maven.geo-solutions.it/org/springframework/spring-test/4.3.16.RELEASE/spring-test-4.3.16.RELEASE.pom
[INFO] Downloading from eclipse.maven.central.mirror: https://repo.eclipse.org/content/repositories/maven_central/org/springframework/spring-test/4.3.16.RELEASE/spring-test-4.3.16.RELEASE.pom
[INFO] Downloaded from eclipse.maven.central.mirror: https://repo.eclipse.org/content/repositories/maven_central/org/springframework/spring-test/4.3.16.RELEASE/spring-test-4.3.16.RELEASE.pom (8.2 kB at 23 kB/s)
[INFO] Downloading from boundless: https://repo.boundlessgeo.com/main/commons-codec/commons-codec/1.9/commons-codec-1.9.jar
[INFO] Downloading from boundless: https://repo.boundlessgeo.com/main/javax/servlet/javax.servlet-api/3.0.1/javax.servlet-api-3.0.1.jar
[INFO] Downloading from boundless: https://repo.boundlessgeo.com/main/xmlunit/xmlunit/1.3/xmlunit-1.3.jar
[INFO] Downloading from boundless: https://repo.boundlessgeo.com/main/org/easymock/easymockclassextension/2.5.2/easymockclassextension-2.5.2.jar
[INFO] Downloading from boundless: https://repo.boundlessgeo.com/main/cglib/cglib-nodep/2.2/cglib-nodep-2.2.jar
[INFO] Downloading from boundless: https://repo.boundlessgeo.com/main/org/objenesis/objenesis/1.2/objenesis-1.2.jar
[INFO] Downloading from boundless: https://repo.boundlessgeo.com/main/org/easymock/easymock/3.1/easymock-3.1.jar
[INFO] Downloading from boundless: https://repo.boundlessgeo.com/main/org/springframework/spring-test/4.3.16.RELEASE/spring-test-4.3.16.RELEASE.jar
[INFO] Downloading from osgeo: http://download.osgeo.org/webdav/geotools/commons-codec/commons-codec/1.9/commons-codec-1.9.jar
[INFO] Downloading from osgeo: http://download.osgeo.org/webdav/geotools/xmlunit/xmlunit/1.3/xmlunit-1.3.jar
[INFO] Downloading from osgeo: http://download.osgeo.org/webdav/geotools/javax/servlet/javax.servlet-api/3.0.1/javax.servlet-api-3.0.1.jar
[INFO] Downloading from osgeo: http://download.osgeo.org/webdav/geotools/org/easymock/easymockclassextension/2.5.2/easymockclassextension-2.5.2.jar
[INFO] Downloading from osgeo: http://download.osgeo.org/webdav/geotools/cglib/cglib-nodep/2.2/cglib-nodep-2.2.jar
[INFO] Downloading from osgeo: http://download.osgeo.org/webdav/geotools/org/objenesis/objenesis/1.2/objenesis-1.2.jar
[INFO] Downloading from osgeo: http://download.osgeo.org/webdav/geotools/org/easymock/easymock/3.1/easymock-3.1.jar
[INFO] Downloading from osgeo: http://download.osgeo.org/webdav/geotools/org/springframework/spring-test/4.3.16.RELEASE/spring-test-4.3.16.RELEASE.jar
[INFO] Downloading from geosolutions: http://maven.geo-solutions.it/commons-codec/commons-codec/1.9/commons-codec-1.9.jar
[INFO] Downloading from geosolutions: http://maven.geo-solutions.it/javax/servlet/javax.servlet-api/3.0.1/javax.servlet-api-3.0.1.jar
[INFO] Downloading from geosolutions: http://maven.geo-solutions.it/xmlunit/xmlunit/1.3/xmlunit-1.3.jar
[INFO] Downloading from geosolutions: http://maven.geo-solutions.it/org/easymock/easymockclassextension/2.5.2/easymockclassextension-2.5.2.jar
[INFO] Downloading from geosolutions: http://maven.geo-solutions.it/cglib/cglib-nodep/2.2/cglib-nodep-2.2.jar
[INFO] Downloading from geosolutions: http://maven.geo-solutions.it/org/objenesis/objenesis/1.2/objenesis-1.2.jar
[INFO] Downloading from geosolutions: http://maven.geo-solutions.it/org/easymock/easymock/3.1/easymock-3.1.jar
[INFO] Downloading from geosolutions: http://maven.geo-solutions.it/org/springframework/spring-test/4.3.16.RELEASE/spring-test-4.3.16.RELEASE.jar
[INFO] Downloading from eclipse.maven.central.mirror: https://repo.eclipse.org/content/repositories/maven_central/commons-codec/commons-codec/1.9/commons-codec-1.9.jar
[INFO] Downloading from eclipse.maven.central.mirror: https://repo.eclipse.org/content/repositories/maven_central/javax/servlet/javax.servlet-api/3.0.1/javax.servlet-api-3.0.1.jar
[INFO] Downloading from eclipse.maven.central.mirror: https://repo.eclipse.org/content/repositories/maven_central/xmlunit/xmlunit/1.3/xmlunit-1.3.jar
[INFO] Downloading from eclipse.maven.central.mirror: https://repo.eclipse.org/content/repositories/maven_central/org/easymock/easymockclassextension/2.5.2/easymockclassextension-2.5.2.jar
[INFO] Downloading from eclipse.maven.central.mirror: https://repo.eclipse.org/content/repositories/maven_central/cglib/cglib-nodep/2.2/cglib-nodep-2.2.jar
[INFO] Downloaded from eclipse.maven.central.mirror: https://repo.eclipse.org/content/repositories/maven_central/commons-codec/commons-codec/1.9/commons-codec-1.9.jar (0 B at 0 B/s)
[INFO] Downloading from eclipse.maven.central.mirror: https://repo.eclipse.org/content/repositories/maven_central/org/objenesis/objenesis/1.2/objenesis-1.2.jar
[INFO] Downloaded from eclipse.maven.central.mirror: https://repo.eclipse.org/content/repositories/maven_central/xmlunit/xmlunit/1.3/xmlunit-1.3.jar (0 B at 0 B/s)
[INFO] Downloading from eclipse.maven.central.mirror: https://repo.eclipse.org/content/repositories/maven_central/org/easymock/easymock/3.1/easymock-3.1.jar
[INFO] Downloaded from eclipse.maven.central.mirror: https://repo.eclipse.org/content/repositories/maven_central/javax/servlet/javax.servlet-api/3.0.1/javax.servlet-api-3.0.1.jar (85 kB at 623 kB/s)
[INFO] Downloading from eclipse.maven.central.mirror: https://repo.eclipse.org/content/repositories/maven_central/org/springframework/spring-test/4.3.16.RELEASE/spring-test-4.3.16.RELEASE.jar
[INFO] Downloaded from eclipse.maven.central.mirror: https://repo.eclipse.org/content/repositories/maven_central/org/objenesis/objenesis/1.2/objenesis-1.2.jar (36 kB at 242 kB/s)
[INFO] Downloaded from eclipse.maven.central.mirror: https://repo.eclipse.org/content/repositories/maven_central/org/easymock/easymock/3.1/easymock-3.1.jar (112 kB at 722 kB/s)
[INFO] Downloaded from eclipse.maven.central.mirror: https://repo.eclipse.org/content/repositories/maven_central/cglib/cglib-nodep/2.2/cglib-nodep-2.2.jar (322 kB at 2.1 MB/s)
[INFO] Downloaded from eclipse.maven.central.mirror: https://repo.eclipse.org/content/repositories/maven_central/org/easymock/easymockclassextension/2.5.2/easymockclassextension-2.5.2.jar (37 kB at 196 kB/s)
[INFO] Downloaded from eclipse.maven.central.mirror: https://repo.eclipse.org/content/repositories/maven_central/org/springframework/spring-test/4.3.16.RELEASE/spring-test-4.3.16.RELEASE.jar (604 kB at 1.1 MB/s)
[INFO] 
[INFO] --- maven-clean-plugin:2.5:clean (default-clean) @ gs-platform ---
[INFO] 
[INFO] --- git-commit-id-plugin:2.1.15:revision (default) @ gs-platform ---
[INFO] 
[INFO] --- fmt-maven-plugin:2.4.0:format (default) @ gs-platform ---
[debug] Using AOSP style
[INFO] Processed 84 files (0 reformatted).
[INFO] 
[INFO] --- maven-resources-plugin:2.6:resources (default-resources) @ gs-platform ---
[INFO] Using 'UTF-8' encoding to copy filtered resources.
[INFO] Copying 0 resource
[INFO] skip non existing resourceDirectory /home/hudson/genie.jts/.jenkins/jobs/GeoServer-1.15.0/workspace/src/platform/src/main/resources
[INFO] 
[INFO] --- maven-compiler-plugin:2.3.2:compile (default-compile) @ gs-platform ---
[INFO] Compiling 52 source files to /home/hudson/genie.jts/.jenkins/jobs/GeoServer-1.15.0/workspace/src/platform/target/classes
[WARNING]  -Xmx2G -Djava.io.tmpdir=/tmp/genie.jts
/home/hudson/genie.jts/.jenkins/jobs/GeoServer-1.15.0/workspace/src/platform/src/main/java/org/geoserver/platform/RenderingEngineStatus.java:[8,22] RenderingEngine is internal proprietary API and may be removed in a future release
[WARNING] /home/hudson/genie.jts/.jenkins/jobs/GeoServer-1.15.0/workspace/src/platform/src/main/java/org/geoserver/platform/RenderingEngineStatus.java:[21,14] RenderingEngine is internal proprietary API and may be removed in a future release
[WARNING] /home/hudson/genie.jts/.jenkins/jobs/GeoServer-1.15.0/workspace/src/platform/src/main/java/org/geoserver/platform/RenderingEngineStatus.java:[24,27] RenderingEngine is internal proprietary API and may be removed in a future release
[WARNING] /home/hudson/genie.jts/.jenkins/jobs/GeoServer-1.15.0/workspace/src/platform/src/main/java/org/geoserver/platform/RenderingEngineStatus.java:[25,43] RenderingEngine is internal proprietary API and may be removed in a future release
[INFO] 
[INFO] --- maven-resources-plugin:2.6:testResources (default-testResources) @ gs-platform ---
[INFO] Using 'UTF-8' encoding to copy filtered resources.
[INFO] Copying 3 resources
[INFO] Copying 1 resource
[INFO] 
[INFO] --- maven-compiler-plugin:2.3.2:testCompile (default-testCompile) @ gs-platform ---
[INFO] Compiling 32 source files to /home/hudson/genie.jts/.jenkins/jobs/GeoServer-1.15.0/workspace/src/platform/target/test-classes
[WARNING]  -Xmx2G -Djava.io.tmpdir=/tmp/genie.jts
/home/hudson/genie.jts/.jenkins/jobs/GeoServer-1.15.0/workspace/src/platform/src/test/java/org/geoserver/platform/RenderingEngineStatusTest.java:[14,22] RenderingEngine is internal proprietary API and may be removed in a future release
[WARNING] /home/hudson/genie.jts/.jenkins/jobs/GeoServer-1.15.0/workspace/src/platform/src/test/java/org/geoserver/platform/RenderingEngineStatusTest.java:[29,14] RenderingEngine is internal proprietary API and may be removed in a future release
[WARNING] /home/hudson/genie.jts/.jenkins/jobs/GeoServer-1.15.0/workspace/src/platform/src/test/java/org/geoserver/platform/RenderingEngineStatusTest.java:[32,27] RenderingEngine is internal proprietary API and may be removed in a future release
[WARNING] /home/hudson/genie.jts/.jenkins/jobs/GeoServer-1.15.0/workspace/src/platform/src/test/java/org/geoserver/platform/RenderingEngineStatusTest.java:[33,43] RenderingEngine is internal proprietary API and may be removed in a future release
[INFO] 
[INFO] --- maven-surefire-plugin:2.12.3:test (default-test) @ gs-platform ---
[INFO] Downloading from eclipse.maven.central.mirror: https://repo.eclipse.org/content/repositories/maven_central/org/apache/maven/surefire/surefire-booter/2.12.3/surefire-booter-2.12.3.pom
[INFO] Downloaded from eclipse.maven.central.mirror: https://repo.eclipse.org/content/repositories/maven_central/org/apache/maven/surefire/surefire-booter/2.12.3/surefire-booter-2.12.3.pom (3.0 kB at 25 kB/s)
[INFO] Downloading from eclipse.maven.central.mirror: https://repo.eclipse.org/content/repositories/maven_central/org/apache/maven/surefire/surefire-api/2.12.3/surefire-api-2.12.3.pom
[INFO] Downloaded from eclipse.maven.central.mirror: https://repo.eclipse.org/content/repositories/maven_central/org/apache/maven/surefire/surefire-api/2.12.3/surefire-api-2.12.3.pom (2.5 kB at 23 kB/s)
[INFO] Downloading from eclipse.maven.central.mirror: https://repo.eclipse.org/content/repositories/maven_central/org/apache/maven/surefire/maven-surefire-common/2.12.3/maven-surefire-common-2.12.3.pom
[INFO] Downloaded from eclipse.maven.central.mirror: https://repo.eclipse.org/content/repositories/maven_central/org/apache/maven/surefire/maven-surefire-common/2.12.3/maven-surefire-common-2.12.3.pom (5.5 kB at 52 kB/s)
[INFO] Downloading from eclipse.maven.central.mirror: https://repo.eclipse.org/content/repositories/maven_central/org/apache/maven/surefire/surefire-booter/2.12.3/surefire-booter-2.12.3.jar
[INFO] Downloading from eclipse.maven.central.mirror: https://repo.eclipse.org/content/repositories/maven_central/org/apache/maven/surefire/surefire-api/2.12.3/surefire-api-2.12.3.jar
[INFO] Downloading from eclipse.maven.central.mirror: https://repo.eclipse.org/content/repositories/maven_central/org/apache/maven/surefire/maven-surefire-common/2.12.3/maven-surefire-common-2.12.3.jar
[INFO] Downloaded from eclipse.maven.central.mirror: https://repo.eclipse.org/content/repositories/maven_central/org/apache/maven/surefire/surefire-booter/2.12.3/surefire-booter-2.12.3.jar (35 kB at 265 kB/s)
[INFO] Downloaded from eclipse.maven.central.mirror: https://repo.eclipse.org/content/repositories/maven_central/org/apache/maven/surefire/surefire-api/2.12.3/surefire-api-2.12.3.jar (116 kB at 540 kB/s)
[INFO] Downloaded from eclipse.maven.central.mirror: https://repo.eclipse.org/content/repositories/maven_central/org/apache/maven/surefire/maven-surefire-common/2.12.3/maven-surefire-common-2.12.3.jar (261 kB at 771 kB/s)
[INFO] Surefire report directory: /home/hudson/genie.jts/.jenkins/jobs/GeoServer-1.15.0/workspace/src/platform/target/surefire-reports
[INFO] Downloading from eclipse.maven.central.mirror: https://repo.eclipse.org/content/repositories/maven_central/org/apache/maven/surefire/surefire-junit4/2.12.3/surefire-junit4-2.12.3.pom
[INFO] Downloaded from eclipse.maven.central.mirror: https://repo.eclipse.org/content/repositories/maven_central/org/apache/maven/surefire/surefire-junit4/2.12.3/surefire-junit4-2.12.3.pom (2.4 kB at 23 kB/s)
[INFO] Downloading from eclipse.maven.central.mirror: https://repo.eclipse.org/content/repositories/maven_central/org/apache/maven/surefire/surefire-providers/2.12.3/surefire-providers-2.12.3.pom
[INFO] Downloaded from eclipse.maven.central.mirror: https://repo.eclipse.org/content/repositories/maven_central/org/apache/maven/surefire/surefire-providers/2.12.3/surefire-providers-2.12.3.pom (2.3 kB at 22 kB/s)
[INFO] Downloading from eclipse.maven.central.mirror: https://repo.eclipse.org/content/repositories/maven_central/org/apache/maven/surefire/surefire-junit4/2.12.3/surefire-junit4-2.12.3.jar
[INFO] Downloaded from eclipse.maven.central.mirror: https://repo.eclipse.org/content/repositories/maven_central/org/apache/maven/surefire/surefire-junit4/2.12.3/surefire-junit4-2.12.3.jar (37 kB at 279 kB/s)

-------------------------------------------------------
 T E S T S
-------------------------------------------------------
Picked up JAVA_TOOL_OPTIONS: -Xmx2G -Djava.io.tmpdir=/tmp/genie.jts
Running org.geoserver.platform.AdvancedDispatchFilterTest
Tests run: 2, Failures: 0, Errors: 0, Skipped: 0, Time elapsed: 0.076 sec
Running org.geoserver.platform.GeoServerEnvironmentTest
Jun 28, 2018 8:22:54 PM org.geoserver.platform.GeoServerResourceLoader lookupGeoServerDataDirectory
INFO: Falling back to embedded data directory: data
Jun 28, 2018 8:22:54 PM org.geoserver.platform.GeoServerEnvironmentTest testSystemProperty
INFO: GeoServerEnvironment = false
Tests run: 1, Failures: 0, Errors: 0, Skipped: 0, Time elapsed: 0.375 sec
Running org.geoserver.platform.GeoServerExtensionsTest
Tests run: 9, Failures: 0, Errors: 0, Skipped: 0, Time elapsed: 0.011 sec
Running org.geoserver.platform.GeoServerResourceLoaderTest
Jun 28, 2018 8:22:58 PM org.geoserver.platform.GeoServerResourceLoader lookupGeoServerDataDirectory
INFO: Falling back to embedded data directory: data
Tests run: 8, Failures: 0, Errors: 0, Skipped: 0, Time elapsed: 0.034 sec
Running org.geoserver.platform.ModuleStatusTest
test
default
Tests run: 2, Failures: 0, Errors: 0, Skipped: 0, Time elapsed: 0.005 sec
Running org.geoserver.platform.RenderingEngineStatusTest
Tests run: 1, Failures: 0, Errors: 0, Skipped: 0, Time elapsed: 0.004 sec
Running org.geoserver.platform.SystemEnvironmentTest
Jun 28, 2018 8:22:58 PM org.geoserver.platform.SystemEnvironmentTest testGeoServerEnvironmentDefaultValue
INFO: ALLOW_ENV_PARAMETRIZATION = null
Jun 28, 2018 8:22:58 PM org.geoserver.platform.SystemEnvironmentTest testGeoServerEnvironmentDefaultValue
INFO: GeoServerEnvironment = false
Tests run: 2, Failures: 0, Errors: 0, Skipped: 0, Time elapsed: 0.006 sec
Running org.geoserver.platform.SystemPropertiesStatusTest
Tests run: 1, Failures: 0, Errors: 0, Skipped: 0, Time elapsed: 0 sec
Running org.geoserver.platform.exception.ExceptionLocalizeTest
Tests run: 6, Failures: 0, Errors: 0, Skipped: 0, Time elapsed: 0.008 sec
Running org.geoserver.platform.exception.GeoServerExceptionsTest
Tests run: 5, Failures: 0, Errors: 0, Skipped: 0, Time elapsed: 0.002 sec
Running org.geoserver.platform.resource.FileSystemResourceStoreTest
Tests run: 6, Failures: 0, Errors: 0, Skipped: 0, Time elapsed: 0.022 sec
Running org.geoserver.platform.resource.FileSystemResourceTheoryTest
Tests run: 37, Failures: 0, Errors: 0, Skipped: 0, Time elapsed: 6.366 sec
Running org.geoserver.platform.resource.FileWrapperResourceTheoryTest
Tests run: 33, Failures: 0, Errors: 0, Skipped: 0, Time elapsed: 0.751 sec
Running org.geoserver.platform.resource.PathsTest
Tests run: 6, Failures: 0, Errors: 0, Skipped: 0, Time elapsed: 0.002 sec
Running org.geoserver.platform.resource.ResourcesTest
Tests run: 34, Failures: 0, Errors: 0, Skipped: 0, Time elapsed: 1.067 sec
Running org.geoserver.platform.resource.SimpleResourceNotificationDispatcherTest
Tests run: 7, Failures: 0, Errors: 0, Skipped: 0, Time elapsed: 0.014 sec
Running org.geoserver.platform.util.GeoServerPropertyFactoryBeanTest
Jun 28, 2018 8:23:06 PM org.geoserver.platform.util.GeoServerPropertyFactoryBean createInstance
WARNING: FOO had unexpected value "UNKNOWN", using default "Default" instead
Jun 28, 2018 8:23:06 PM org.geoserver.platform.util.GeoServerPropertyFactoryBean createInstance
INFO: FOO was empty or undefined, using default "null" instead
Jun 28, 2018 8:23:06 PM org.geoserver.platform.util.GeoServerPropertyFactoryBean createInstance
INFO: FOO was empty or undefined, using default "UNKNOWN" instead
Jun 28, 2018 8:23:06 PM org.geoserver.platform.util.GeoServerPropertyFactoryBean createInstance
INFO: FOO was empty or undefined, using default "Default" instead
Tests run: 5, Failures: 0, Errors: 0, Skipped: 0, Time elapsed: 0.014 sec
Running org.geoserver.util.IOUtilsTest
Tests run: 3, Failures: 0, Errors: 0, Skipped: 0, Time elapsed: 0.022 sec
Running org.geoserver.util.LoggerRuleTest
Tests run: 7, Failures: 0, Errors: 0, Skipped: 0, Time elapsed: 0.078 sec

Results :

Tests run: 175, Failures: 0, Errors: 0, Skipped: 0

[JENKINS] Recording test results
[INFO] 
[INFO] --- maven-jar-plugin:2.4:jar (default-jar) @ gs-platform ---
[INFO] Building jar: /home/hudson/genie.jts/.jenkins/jobs/GeoServer-1.15.0/workspace/src/platform/target/gs-platform-2.14-SNAPSHOT.jar
[INFO] 
[INFO] --- maven-jar-plugin:2.4:test-jar (default) @ gs-platform ---
[INFO] Building jar: /home/hudson/genie.jts/.jenkins/jobs/GeoServer-1.15.0/workspace/src/platform/target/gs-platform-2.14-SNAPSHOT-tests.jar
[INFO] 
[INFO] --- maven-source-plugin:2.2.1:jar-no-fork (attach-sources) @ gs-platform ---
[INFO] Building jar: /home/hudson/genie.jts/.jenkins/jobs/GeoServer-1.15.0/workspace/src/platform/target/gs-platform-2.14-SNAPSHOT-sources.jar
[INFO] 
[INFO] --- maven-source-plugin:2.2.1:test-jar-no-fork (attach-sources) @ gs-platform ---
[INFO] Building jar: /home/hudson/genie.jts/.jenkins/jobs/GeoServer-1.15.0/workspace/src/platform/target/gs-platform-2.14-SNAPSHOT-test-sources.jar
[INFO] 
[INFO] --- maven-install-plugin:2.4:install (default-install) @ gs-platform ---
[INFO] Installing /home/hudson/genie.jts/.jenkins/jobs/GeoServer-1.15.0/workspace/src/platform/target/gs-platform-2.14-SNAPSHOT.jar to /opt/public/hipp/homes/genie.jts/.m2/repository/org/geoserver/gs-platform/2.14-SNAPSHOT/gs-platform-2.14-SNAPSHOT.jar
[INFO] Installing /home/hudson/genie.jts/.jenkins/jobs/GeoServer-1.15.0/workspace/src/platform/pom.xml to /opt/public/hipp/homes/genie.jts/.m2/repository/org/geoserver/gs-platform/2.14-SNAPSHOT/gs-platform-2.14-SNAPSHOT.pom
[INFO] Installing /home/hudson/genie.jts/.jenkins/jobs/GeoServer-1.15.0/workspace/src/platform/target/gs-platform-2.14-SNAPSHOT-tests.jar to /opt/public/hipp/homes/genie.jts/.m2/repository/org/geoserver/gs-platform/2.14-SNAPSHOT/gs-platform-2.14-SNAPSHOT-tests.jar
[INFO] Installing /home/hudson/genie.jts/.jenkins/jobs/GeoServer-1.15.0/workspace/src/platform/target/gs-platform-2.14-SNAPSHOT-sources.jar to /opt/public/hipp/homes/genie.jts/.m2/repository/org/geoserver/gs-platform/2.14-SNAPSHOT/gs-platform-2.14-SNAPSHOT-sources.jar
[INFO] Installing /home/hudson/genie.jts/.jenkins/jobs/GeoServer-1.15.0/workspace/src/platform/target/gs-platform-2.14-SNAPSHOT-test-sources.jar to /opt/public/hipp/homes/genie.jts/.m2/repository/org/geoserver/gs-platform/2.14-SNAPSHOT/gs-platform-2.14-SNAPSHOT-test-sources.jar
Started calculate disk usage of build
Finished Calculation of disk usage of build in 0 seconds
Started calculate disk usage of workspace
Finished Calculation of disk usage of workspace in 0 seconds
[INFO] 
[INFO] ------------------------< org.geoserver:gs-ows >------------------------
[INFO] Building Open Web Service Module 2.14-SNAPSHOT                    [3/36]
[INFO] --------------------------------[ jar ]---------------------------------
[INFO] Downloading from boundless: https://repo.boundlessgeo.com/main/commons-fileupload/commons-fileupload/1.3.3/commons-fileupload-1.3.3.pom
[INFO] Downloading from osgeo: http://download.osgeo.org/webdav/geotools/commons-fileupload/commons-fileupload/1.3.3/commons-fileupload-1.3.3.pom
[INFO] Downloading from geosolutions: http://maven.geo-solutions.it/commons-fileupload/commons-fileupload/1.3.3/commons-fileupload-1.3.3.pom
[INFO] Downloading from eclipse.maven.central.mirror: https://repo.eclipse.org/content/repositories/maven_central/commons-fileupload/commons-fileupload/1.3.3/commons-fileupload-1.3.3.pom
[INFO] Downloaded from eclipse.maven.central.mirror: https://repo.eclipse.org/content/repositories/maven_central/commons-fileupload/commons-fileupload/1.3.3/commons-fileupload-1.3.3.pom (11 kB at 137 kB/s)
[INFO] Downloading from boundless: https://repo.boundlessgeo.com/main/xpp3/xpp3/1.1.3.4.O/xpp3-1.1.3.4.O.pom
[INFO] Downloading from osgeo: http://download.osgeo.org/webdav/geotools/xpp3/xpp3/1.1.3.4.O/xpp3-1.1.3.4.O.pom
[INFO] Downloading from geosolutions: http://maven.geo-solutions.it/xpp3/xpp3/1.1.3.4.O/xpp3-1.1.3.4.O.pom
[INFO] Downloading from eclipse.maven.central.mirror: https://repo.eclipse.org/content/repositories/maven_central/xpp3/xpp3/1.1.3.4.O/xpp3-1.1.3.4.O.pom
[INFO] Downloaded from eclipse.maven.central.mirror: https://repo.eclipse.org/content/repositories/maven_central/xpp3/xpp3/1.1.3.4.O/xpp3-1.1.3.4.O.pom (634 B at 5.8 kB/s)
[INFO] Downloading from boundless: https://repo.boundlessgeo.com/main/xalan/xalan/2.7.0/xalan-2.7.0.pom
[INFO] Downloading from osgeo: http://download.osgeo.org/webdav/geotools/xalan/xalan/2.7.0/xalan-2.7.0.pom
[INFO] Downloading from geosolutions: http://maven.geo-solutions.it/xalan/xalan/2.7.0/xalan-2.7.0.pom
[INFO] Downloading from eclipse.maven.central.mirror: https://repo.eclipse.org/content/repositories/maven_central/xalan/xalan/2.7.0/xalan-2.7.0.pom
[INFO] Downloaded from eclipse.maven.central.mirror: https://repo.eclipse.org/content/repositories/maven_central/xalan/xalan/2.7.0/xalan-2.7.0.pom (491 B at 5.5 kB/s)
[INFO] Downloading from boundless: https://repo.boundlessgeo.com/main/xml-apis/xml-apis/1.4.01/xml-apis-1.4.01.pom
[INFO] Downloading from osgeo: http://download.osgeo.org/webdav/geotools/xml-apis/xml-apis/1.4.01/xml-apis-1.4.01.pom
[INFO] Downloading from geosolutions: http://maven.geo-solutions.it/xml-apis/xml-apis/1.4.01/xml-apis-1.4.01.pom
[INFO] Downloading from eclipse.maven.central.mirror: https://repo.eclipse.org/content/repositories/maven_central/xml-apis/xml-apis/1.4.01/xml-apis-1.4.01.pom
[INFO] Downloaded from eclipse.maven.central.mirror: https://repo.eclipse.org/content/repositories/maven_central/xml-apis/xml-apis/1.4.01/xml-apis-1.4.01.pom (2.7 kB at 68 kB/s)
[INFO] Downloading from boundless: https://repo.boundlessgeo.com/main/javax/mail/mail/1.4/mail-1.4.pom
[INFO] Downloading from osgeo: http://download.osgeo.org/webdav/geotools/javax/mail/mail/1.4/mail-1.4.pom
[INFO] Downloading from geosolutions: http://maven.geo-solutions.it/javax/mail/mail/1.4/mail-1.4.pom
[INFO] Downloading from eclipse.maven.central.mirror: https://repo.eclipse.org/content/repositories/maven_central/javax/mail/mail/1.4/mail-1.4.pom
[INFO] Downloaded from eclipse.maven.central.mirror: https://repo.eclipse.org/content/repositories/maven_central/javax/mail/mail/1.4/mail-1.4.pom (993 B at 14 kB/s)
[INFO] Downloading from boundless: https://repo.boundlessgeo.com/main/javax/activation/activation/1.1/activation-1.1.pom
[INFO] Downloading from osgeo: http://download.osgeo.org/webdav/geotools/javax/activation/activation/1.1/activation-1.1.pom
[INFO] Downloading from geosolutions: http://maven.geo-solutions.it/javax/activation/activation/1.1/activation-1.1.pom
[INFO] Downloading from eclipse.maven.central.mirror: https://repo.eclipse.org/content/repositories/maven_central/javax/activation/activation/1.1/activation-1.1.pom
[INFO] Downloaded from eclipse.maven.central.mirror: https://repo.eclipse.org/content/repositories/maven_central/javax/activation/activation/1.1/activation-1.1.pom (0 B at 0 B/s)
[INFO] Downloading from boundless: https://repo.boundlessgeo.com/main/commons-fileupload/commons-fileupload/1.3.3/commons-fileupload-1.3.3.jar
[INFO] Downloading from boundless: https://repo.boundlessgeo.com/main/xpp3/xpp3/1.1.3.4.O/xpp3-1.1.3.4.O.jar
[INFO] Downloading from boundless: https://repo.boundlessgeo.com/main/xalan/xalan/2.7.0/xalan-2.7.0.jar
[INFO] Downloading from boundless: https://repo.boundlessgeo.com/main/xml-apis/xml-apis/1.4.01/xml-apis-1.4.01.jar
[INFO] Downloading from boundless: https://repo.boundlessgeo.com/main/javax/mail/mail/1.4/mail-1.4.jar
[INFO] Downloading from boundless: https://repo.boundlessgeo.com/main/javax/activation/activation/1.1/activation-1.1.jar
[INFO] Downloading from osgeo: http://download.osgeo.org/webdav/geotools/commons-fileupload/commons-fileupload/1.3.3/commons-fileupload-1.3.3.jar
[INFO] Downloading from osgeo: http://download.osgeo.org/webdav/geotools/xpp3/xpp3/1.1.3.4.O/xpp3-1.1.3.4.O.jar
[INFO] Downloading from osgeo: http://download.osgeo.org/webdav/geotools/xalan/xalan/2.7.0/xalan-2.7.0.jar
[INFO] Downloading from osgeo: http://download.osgeo.org/webdav/geotools/xml-apis/xml-apis/1.4.01/xml-apis-1.4.01.jar
[INFO] Downloading from osgeo: http://download.osgeo.org/webdav/geotools/javax/mail/mail/1.4/mail-1.4.jar
[INFO] Downloading from osgeo: http://download.osgeo.org/webdav/geotools/javax/activation/activation/1.1/activation-1.1.jar
[INFO] Downloading from geosolutions: http://maven.geo-solutions.it/commons-fileupload/commons-fileupload/1.3.3/commons-fileupload-1.3.3.jar
[INFO] Downloading from geosolutions: http://maven.geo-solutions.it/xpp3/xpp3/1.1.3.4.O/xpp3-1.1.3.4.O.jar
[INFO] Downloading from geosolutions: http://maven.geo-solutions.it/xalan/xalan/2.7.0/xalan-2.7.0.jar
[INFO] Downloading from geosolutions: http://maven.geo-solutions.it/xml-apis/xml-apis/1.4.01/xml-apis-1.4.01.jar
[INFO] Downloading from geosolutions: http://maven.geo-solutions.it/javax/mail/mail/1.4/mail-1.4.jar
[INFO] Downloading from geosolutions: http://maven.geo-solutions.it/javax/activation/activation/1.1/activation-1.1.jar
[INFO] Downloading from eclipse.maven.central.mirror: https://repo.eclipse.org/content/repositories/maven_central/commons-fileupload/commons-fileupload/1.3.3/commons-fileupload-1.3.3.jar
[INFO] Downloading from eclipse.maven.central.mirror: https://repo.eclipse.org/content/repositories/maven_central/xpp3/xpp3/1.1.3.4.O/xpp3-1.1.3.4.O.jar
[INFO] Downloading from eclipse.maven.central.mirror: https://repo.eclipse.org/content/repositories/maven_central/xalan/xalan/2.7.0/xalan-2.7.0.jar
[INFO] Downloading from eclipse.maven.central.mirror: https://repo.eclipse.org/content/repositories/maven_central/xml-apis/xml-apis/1.4.01/xml-apis-1.4.01.jar
[INFO] Downloading from eclipse.maven.central.mirror: https://repo.eclipse.org/content/repositories/maven_central/javax/mail/mail/1.4/mail-1.4.jar
[INFO] Downloaded from eclipse.maven.central.mirror: https://repo.eclipse.org/content/repositories/maven_central/xml-apis/xml-apis/1.4.01/xml-apis-1.4.01.jar (221 kB at 2.7 MB/s)
[INFO] Downloading from eclipse.maven.central.mirror: https://repo.eclipse.org/content/repositories/maven_central/javax/activation/activation/1.1/activation-1.1.jar
[INFO] Downloaded from eclipse.maven.central.mirror: https://repo.eclipse.org/content/repositories/maven_central/javax/activation/activation/1.1/activation-1.1.jar (0 B at 0 B/s)
[INFO] Downloaded from eclipse.maven.central.mirror: https://repo.eclipse.org/content/repositories/maven_central/commons-fileupload/commons-fileupload/1.3.3/commons-fileupload-1.3.3.jar (71 kB at 433 kB/s)
[INFO] Downloaded from eclipse.maven.central.mirror: https://repo.eclipse.org/content/repositories/maven_central/javax/mail/mail/1.4/mail-1.4.jar (389 kB at 2.4 MB/s)
[INFO] Downloaded from eclipse.maven.central.mirror: https://repo.eclipse.org/content/repositories/maven_central/xpp3/xpp3/1.1.3.4.O/xpp3-1.1.3.4.O.jar (120 kB at 641 kB/s)
[INFO] Downloaded from eclipse.maven.central.mirror: https://repo.eclipse.org/content/repositories/maven_central/xalan/xalan/2.7.0/xalan-2.7.0.jar (2.7 MB at 10 MB/s)
[INFO] 
[INFO] --- maven-clean-plugin:2.5:clean (default-clean) @ gs-ows ---
[INFO] 
[INFO] --- git-commit-id-plugin:2.1.15:revision (default) @ gs-ows ---
[INFO] 
[INFO] --- fmt-maven-plugin:2.4.0:format (default) @ gs-ows ---
[debug] Using AOSP style
[INFO] Processed 100 files (0 reformatted).
[INFO] Processed 120 files (0 reformatted).
[INFO] 
[INFO] --- maven-resources-plugin:2.6:resources (default-resources) @ gs-ows ---
[INFO] Using 'UTF-8' encoding to copy filtered resources.
[INFO] Copying 9 resources
[INFO] skip non existing resourceDirectory /home/hudson/genie.jts/.jenkins/jobs/GeoServer-1.15.0/workspace/src/ows/src/main/resources
[INFO] 
[INFO] --- maven-compiler-plugin:2.3.2:compile (default-compile) @ gs-ows ---
[INFO] Compiling 92 source files to /home/hudson/genie.jts/.jenkins/jobs/GeoServer-1.15.0/workspace/src/ows/target/classes
[INFO] 
[INFO] --- maven-resources-plugin:2.6:testResources (default-testResources) @ gs-ows ---
[INFO] Using 'UTF-8' encoding to copy filtered resources.
[INFO] Copying 7 resources
[INFO] skip non existing resourceDirectory /home/hudson/genie.jts/.jenkins/jobs/GeoServer-1.15.0/workspace/src/ows/src/test/resources
[INFO] 
[INFO] --- maven-compiler-plugin:2.3.2:testCompile (default-testCompile) @ gs-ows ---
[INFO] Compiling 28 source files to /home/hudson/genie.jts/.jenkins/jobs/GeoServer-1.15.0/workspace/src/ows/target/test-classes
[INFO] 
[INFO] --- maven-surefire-plugin:2.12.3:test (default-test) @ gs-ows ---
[INFO] Surefire report directory: /home/hudson/genie.jts/.jenkins/jobs/GeoServer-1.15.0/workspace/src/ows/target/surefire-reports

-------------------------------------------------------
 T E S T S
-------------------------------------------------------
Picked up JAVA_TOOL_OPTIONS: -Xmx2G -Djava.io.tmpdir=/tmp/genie.jts
Running org.geoserver.ows.DefaultServiceExceptionHandlerTest
Jun 28, 2018 8:23:26 PM org.geoserver.platform.GeoServerExtensions checkContext
WARNING: Extension lookup 'URLMangler', but ApplicationContext is unset.
Jun 28, 2018 8:23:26 PM org.geoserver.platform.GeoServerExtensions checkContext
WARNING: Extension lookup 'ExtensionFilter', but ApplicationContext is unset.
Jun 28, 2018 8:23:26 PM org.geoserver.platform.GeoServerExtensions checkContext
WARNING: Extension lookup 'ExtensionProvider', but ApplicationContext is unset.
Jun 28, 2018 8:23:26 PM org.geoserver.platform.GeoServerExtensions checkContext
WARNING: Extension lookup 'ExtensionFilter', but ApplicationContext is unset.
Jun 28, 2018 8:23:26 PM org.geoserver.platform.GeoServerExtensions checkContext
WARNING: Extension lookup 'URLMangler', but ApplicationContext is unset.
Jun 28, 2018 8:23:26 PM org.geoserver.platform.GeoServerExtensions checkContext
WARNING: Extension lookup 'ExtensionFilter', but ApplicationContext is unset.
Jun 28, 2018 8:23:26 PM org.geoserver.platform.GeoServerExtensions checkContext
WARNING: Extension lookup 'ExtensionProvider', but ApplicationContext is unset.
Jun 28, 2018 8:23:26 PM org.geoserver.platform.GeoServerExtensions checkContext
WARNING: Extension lookup 'ExtensionFilter', but ApplicationContext is unset.
Jun 28, 2018 8:23:26 PM org.geoserver.platform.GeoServerExtensions checkContext
WARNING: Extension lookup 'URLMangler', but ApplicationContext is unset.
Jun 28, 2018 8:23:26 PM org.geoserver.platform.GeoServerExtensions checkContext
WARNING: Extension lookup 'ExtensionFilter', but ApplicationContext is unset.
Jun 28, 2018 8:23:26 PM org.geoserver.platform.GeoServerExtensions checkContext
WARNING: Extension lookup 'ExtensionProvider', but ApplicationContext is unset.
Jun 28, 2018 8:23:26 PM org.geoserver.platform.GeoServerExtensions checkContext
WARNING: Extension lookup 'ExtensionFilter', but ApplicationContext is unset.
Jun 28, 2018 8:23:26 PM org.geoserver.platform.GeoServerExtensions checkContext
WARNING: Extension lookup 'URLMangler', but ApplicationContext is unset.
Jun 28, 2018 8:23:26 PM org.geoserver.platform.GeoServerExtensions checkContext
WARNING: Extension lookup 'ExtensionFilter', but ApplicationContext is unset.
Jun 28, 2018 8:23:26 PM org.geoserver.platform.GeoServerExtensions checkContext
WARNING: Extension lookup 'ExtensionProvider', but ApplicationContext is unset.
Jun 28, 2018 8:23:26 PM org.geoserver.platform.GeoServerExtensions checkContext
WARNING: Extension lookup 'ExtensionFilter', but ApplicationContext is unset.
Jun 28, 2018 8:23:26 PM org.geoserver.platform.GeoServerExtensions checkContext
WARNING: Extension lookup 'URLMangler', but ApplicationContext is unset.
Jun 28, 2018 8:23:26 PM org.geoserver.platform.GeoServerExtensions checkContext
WARNING: Extension lookup 'ExtensionFilter', but ApplicationContext is unset.
Jun 28, 2018 8:23:26 PM org.geoserver.platform.GeoServerExtensions checkContext
WARNING: Extension lookup 'ExtensionProvider', but ApplicationContext is unset.
Jun 28, 2018 8:23:26 PM org.geoserver.platform.GeoServerExtensions checkContext
WARNING: Extension lookup 'ExtensionFilter', but ApplicationContext is unset.
Tests run: 5, Failures: 0, Errors: 0, Skipped: 0, Time elapsed: 1.282 sec
Running org.geoserver.ows.DispatcherTest
Jun 28, 2018 8:23:26 PM org.springframework.context.support.AbstractApplicationContext prepareRefresh
INFO: Refreshing org.springframework.context.support.FileSystemXmlApplicationContext@5db4c359: startup date [Thu Jun 28 20:23:26 EDT 2018]; root of context hierarchy
Jun 28, 2018 8:23:26 PM org.springframework.beans.factory.xml.XmlBeanDefinitionReader loadBeanDefinitions
INFO: Loading XML bean definitions from URL [file:/home/hudson/genie.jts/.jenkins/jobs/GeoServer-1.15.0/workspace/src/ows/target/test-classes/org/geoserver/ows/applicationContext.xml]
Jun 28, 2018 8:23:26 PM org.geoserver.ows.Dispatcher exception
SEVERE: 
java.lang.RuntimeException: TestDispatcherCallbackFailResponseDispatched
	at org.geoserver.ows.DispatcherTest$13.responseDispatched(DispatcherTest.java:728)
	at org.geoserver.ows.Dispatcher.fireResponseDispatchedCallback(Dispatcher.java:1122)
	at org.geoserver.ows.Dispatcher.response(Dispatcher.java:980)
	at org.geoserver.ows.Dispatcher.handleRequestInternal(Dispatcher.java:263)
	at org.springframework.web.servlet.mvc.AbstractController.handleRequest(AbstractController.java:174)
	at org.geoserver.ows.DispatcherTest.testDispatcherCallbackFailResponseDispatched(DispatcherTest.java:739)
	at sun.reflect.NativeMethodAccessorImpl.invoke0(Native Method)
	at sun.reflect.NativeMethodAccessorImpl.invoke(NativeMethodAccessorImpl.java:62)
	at sun.reflect.DelegatingMethodAccessorImpl.invoke(DelegatingMethodAccessorImpl.java:43)
	at java.lang.reflect.Method.invoke(Method.java:498)
	at junit.framework.TestCase.runTest(TestCase.java:176)
	at junit.framework.TestCase.runBare(TestCase.java:141)
	at junit.framework.TestResult$1.protect(TestResult.java:122)
	at junit.framework.TestResult.runProtected(TestResult.java:142)
	at junit.framework.TestResult.run(TestResult.java:125)
	at junit.framework.TestCase.run(TestCase.java:129)
	at junit.framework.TestSuite.runTest(TestSuite.java:255)
	at junit.framework.TestSuite.run(TestSuite.java:250)
	at org.junit.internal.runners.JUnit38ClassRunner.run(JUnit38ClassRunner.java:84)
	at org.apache.maven.surefire.junit4.JUnit4Provider.execute(JUnit4Provider.java:252)
	at org.apache.maven.surefire.junit4.JUnit4Provider.executeTestSet(JUnit4Provider.java:141)
	at org.apache.maven.surefire.junit4.JUnit4Provider.invoke(JUnit4Provider.java:112)
	at sun.reflect.NativeMethodAccessorImpl.invoke0(Native Method)
	at sun.reflect.NativeMethodAccessorImpl.invoke(NativeMethodAccessorImpl.java:62)
	at sun.reflect.DelegatingMethodAccessorImpl.invoke(DelegatingMethodAccessorImpl.java:43)
	at java.lang.reflect.Method.invoke(Method.java:498)
	at org.apache.maven.surefire.util.ReflectionUtils.invokeMethodWithArray(ReflectionUtils.java:189)
	at org.apache.maven.surefire.booter.ProviderFactory$ProviderProxy.invoke(ProviderFactory.java:165)
	at org.apache.maven.surefire.booter.ProviderFactory.invokeProvider(ProviderFactory.java:85)
	at org.apache.maven.surefire.booter.ForkedBooter.runSuitesInProcess(ForkedBooter.java:115)
	at org.apache.maven.surefire.booter.ForkedBooter.main(ForkedBooter.java:75)

Jun 28, 2018 8:23:26 PM org.geoserver.ows.Dispatcher exception
SEVERE: 
java.lang.RuntimeException: foo
	at org.geoserver.ows.DispatcherTest.testErrorSavedOnRequestOnGenericException(DispatcherTest.java:802)
	at sun.reflect.NativeMethodAccessorImpl.invoke0(Native Method)
	at sun.reflect.NativeMethodAccessorImpl.invoke(NativeMethodAccessorImpl.java:62)
	at sun.reflect.DelegatingMethodAccessorImpl.invoke(DelegatingMethodAccessorImpl.java:43)
	at java.lang.reflect.Method.invoke(Method.java:498)
	at junit.framework.TestCase.runTest(TestCase.java:176)
	at junit.framework.TestCase.runBare(TestCase.java:141)
	at junit.framework.TestResult$1.protect(TestResult.java:122)
	at junit.framework.TestResult.runProtected(TestResult.java:142)
	at junit.framework.TestResult.run(TestResult.java:125)
	at junit.framework.TestCase.run(TestCase.java:129)
	at junit.framework.TestSuite.runTest(TestSuite.java:255)
	at junit.framework.TestSuite.run(TestSuite.java:250)
	at org.junit.internal.runners.JUnit38ClassRunner.run(JUnit38ClassRunner.java:84)
	at org.apache.maven.surefire.junit4.JUnit4Provider.execute(JUnit4Provider.java:252)
	at org.apache.maven.surefire.junit4.JUnit4Provider.executeTestSet(JUnit4Provider.java:141)
	at org.apache.maven.surefire.junit4.JUnit4Provider.invoke(JUnit4Provider.java:112)
	at sun.reflect.NativeMethodAccessorImpl.invoke0(Native Method)
	at sun.reflect.NativeMethodAccessorImpl.invoke(NativeMethodAccessorImpl.java:62)
	at sun.reflect.DelegatingMethodAccessorImpl.invoke(DelegatingMethodAccessorImpl.java:43)
	at java.lang.reflect.Method.invoke(Method.java:498)
	at org.apache.maven.surefire.util.ReflectionUtils.invokeMethodWithArray(ReflectionUtils.java:189)
	at org.apache.maven.surefire.booter.ProviderFactory$ProviderProxy.invoke(ProviderFactory.java:165)
	at org.apache.maven.surefire.booter.ProviderFactory.invokeProvider(ProviderFactory.java:85)
	at org.apache.maven.surefire.booter.ForkedBooter.runSuitesInProcess(ForkedBooter.java:115)
	at org.apache.maven.surefire.booter.ForkedBooter.main(ForkedBooter.java:75)

Jun 28, 2018 8:23:26 PM org.springframework.context.support.AbstractApplicationContext prepareRefresh
INFO: Refreshing org.springframework.context.support.FileSystemXmlApplicationContext@28b576a9: startup date [Thu Jun 28 20:23:26 EDT 2018]; root of context hierarchy
Jun 28, 2018 8:23:26 PM org.springframework.beans.factory.xml.XmlBeanDefinitionReader loadBeanDefinitions
INFO: Loading XML bean definitions from URL [file:/home/hudson/genie.jts/.jenkins/jobs/GeoServer-1.15.0/workspace/src/ows/target/test-classes/org/geoserver/ows/applicationContext-errorResponse.xml]
Jun 28, 2018 8:23:26 PM org.geoserver.ows.Dispatcher exception
SEVERE: 
org.geoserver.platform.ServiceException: Whoops, something gone wrong!
	at org.geoserver.ows.ErrorThrowingResponse.write(ErrorThrowingResponse.java:25)
	at org.geoserver.ows.Dispatcher.response(Dispatcher.java:1021)
	at org.geoserver.ows.Dispatcher.handleRequestInternal(Dispatcher.java:263)
	at org.springframework.web.servlet.mvc.AbstractController.handleRequest(AbstractController.java:174)
	at org.geoserver.ows.DispatcherTest.testErrorThrowingResponse(DispatcherTest.java:1019)
	at sun.reflect.NativeMethodAccessorImpl.invoke0(Native Method)
	at sun.reflect.NativeMethodAccessorImpl.invoke(NativeMethodAccessorImpl.java:62)
	at sun.reflect.DelegatingMethodAccessorImpl.invoke(DelegatingMethodAccessorImpl.java:43)
	at java.lang.reflect.Method.invoke(Method.java:498)
	at junit.framework.TestCase.runTest(TestCase.java:176)
	at junit.framework.TestCase.runBare(TestCase.java:141)
	at junit.framework.TestResult$1.protect(TestResult.java:122)
	at junit.framework.TestResult.runProtected(TestResult.java:142)
	at junit.framework.TestResult.run(TestResult.java:125)
	at junit.framework.TestCase.run(TestCase.java:129)
	at junit.framework.TestSuite.runTest(TestSuite.java:255)
	at junit.framework.TestSuite.run(TestSuite.java:250)
	at org.junit.internal.runners.JUnit38ClassRunner.run(JUnit38ClassRunner.java:84)
	at org.apache.maven.surefire.junit4.JUnit4Provider.execute(JUnit4Provider.java:252)
	at org.apache.maven.surefire.junit4.JUnit4Provider.executeTestSet(JUnit4Provider.java:141)
	at org.apache.maven.surefire.junit4.JUnit4Provider.invoke(JUnit4Provider.java:112)
	at sun.reflect.NativeMethodAccessorImpl.invoke0(Native Method)
	at sun.reflect.NativeMethodAccessorImpl.invoke(NativeMethodAccessorImpl.java:62)
	at sun.reflect.DelegatingMethodAccessorImpl.invoke(DelegatingMethodAccessorImpl.java:43)
	at java.lang.reflect.Method.invoke(Method.java:498)
	at org.apache.maven.surefire.util.ReflectionUtils.invokeMethodWithArray(ReflectionUtils.java:189)
	at org.apache.maven.surefire.booter.ProviderFactory$ProviderProxy.invoke(ProviderFactory.java:165)
	at org.apache.maven.surefire.booter.ProviderFactory.invokeProvider(ProviderFactory.java:85)
	at org.apache.maven.surefire.booter.ForkedBooter.runSuitesInProcess(ForkedBooter.java:115)
	at org.apache.maven.surefire.booter.ForkedBooter.main(ForkedBooter.java:75)

Jun 28, 2018 8:23:26 PM org.springframework.context.support.AbstractApplicationContext doClose
INFO: Closing org.springframework.context.support.FileSystemXmlApplicationContext@28b576a9: startup date [Thu Jun 28 20:23:26 EDT 2018]; root of context hierarchy
Jun 28, 2018 8:23:26 PM org.springframework.context.support.AbstractApplicationContext prepareRefresh
INFO: Refreshing org.springframework.context.support.FileSystemXmlApplicationContext@70d8de: startup date [Thu Jun 28 20:23:26 EDT 2018]; root of context hierarchy
Jun 28, 2018 8:23:26 PM org.springframework.beans.factory.xml.XmlBeanDefinitionReader loadBeanDefinitions
INFO: Loading XML bean definitions from URL [file:/home/hudson/genie.jts/.jenkins/jobs/GeoServer-1.15.0/workspace/src/ows/target/test-classes/org/geoserver/ows/applicationContext.xml]
Jun 28, 2018 8:23:26 PM org.springframework.context.support.AbstractApplicationContext prepareRefresh
INFO: Refreshing org.springframework.context.support.FileSystemXmlApplicationContext@76304b46: startup date [Thu Jun 28 20:23:26 EDT 2018]; root of context hierarchy
Jun 28, 2018 8:23:26 PM org.springframework.beans.factory.xml.XmlBeanDefinitionReader loadBeanDefinitions
INFO: Loading XML bean definitions from URL [file:/home/hudson/genie.jts/.jenkins/jobs/GeoServer-1.15.0/workspace/src/ows/target/test-classes/org/geoserver/ows/applicationContext.xml]
Jun 28, 2018 8:23:26 PM org.springframework.context.support.AbstractApplicationContext prepareRefresh
INFO: Refreshing org.springframework.context.support.FileSystemXmlApplicationContext@138a7441: startup date [Thu Jun 28 20:23:26 EDT 2018]; root of context hierarchy
Jun 28, 2018 8:23:26 PM org.springframework.beans.factory.xml.XmlBeanDefinitionReader loadBeanDefinitions
INFO: Loading XML bean definitions from URL [file:/home/hudson/genie.jts/.jenkins/jobs/GeoServer-1.15.0/workspace/src/ows/target/test-classes/org/geoserver/ows/applicationContext.xml]
Jun 28, 2018 8:23:26 PM org.springframework.context.support.AbstractApplicationContext prepareRefresh
INFO: Refreshing org.springframework.context.support.FileSystemXmlApplicationContext@1b812421: startup date [Thu Jun 28 20:23:26 EDT 2018]; root of context hierarchy
Jun 28, 2018 8:23:26 PM org.springframework.beans.factory.xml.XmlBeanDefinitionReader loadBeanDefinitions
INFO: Loading XML bean definitions from URL [file:/home/hudson/genie.jts/.jenkins/jobs/GeoServer-1.15.0/workspace/src/ows/target/test-classes/org/geoserver/ows/applicationContext.xml]
Jun 28, 2018 8:23:26 PM org.geoserver.ows.Dispatcher exception
SEVERE: 
java.lang.RuntimeException: TestDispatcherCallbackFailOperationDispatched
	at org.geoserver.ows.DispatcherTest$11.operationDispatched(DispatcherTest.java:659)
	at org.geoserver.ows.Dispatcher.fireOperationDispatchedCallback(Dispatcher.java:819)
	at org.geoserver.ows.Dispatcher.dispatch(Dispatcher.java:803)
	at org.geoserver.ows.Dispatcher.handleRequestInternal(Dispatcher.java:249)
	at org.springframework.web.servlet.mvc.AbstractController.handleRequest(AbstractController.java:174)
	at org.geoserver.ows.DispatcherTest.testDispatcherCallbackFailOperationDispatched(DispatcherTest.java:670)
	at sun.reflect.NativeMethodAccessorImpl.invoke0(Native Method)
	at sun.reflect.NativeMethodAccessorImpl.invoke(NativeMethodAccessorImpl.java:62)
	at sun.reflect.DelegatingMethodAccessorImpl.invoke(DelegatingMethodAccessorImpl.java:43)
	at java.lang.reflect.Method.invoke(Method.java:498)
	at junit.framework.TestCase.runTest(TestCase.java:176)
	at junit.framework.TestCase.runBare(TestCase.java:141)
	at junit.framework.TestResult$1.protect(TestResult.java:122)
	at junit.framework.TestResult.runProtected(TestResult.java:142)
	at junit.framework.TestResult.run(TestResult.java:125)
	at junit.framework.TestCase.run(TestCase.java:129)
	at junit.framework.TestSuite.runTest(TestSuite.java:255)
	at junit.framework.TestSuite.run(TestSuite.java:250)
	at org.junit.internal.runners.JUnit38ClassRunner.run(JUnit38ClassRunner.java:84)
	at org.apache.maven.surefire.junit4.JUnit4Provider.execute(JUnit4Provider.java:252)
	at org.apache.maven.surefire.junit4.JUnit4Provider.executeTestSet(JUnit4Provider.java:141)
	at org.apache.maven.surefire.junit4.JUnit4Provider.invoke(JUnit4Provider.java:112)
	at sun.reflect.NativeMethodAccessorImpl.invoke0(Native Method)
	at sun.reflect.NativeMethodAccessorImpl.invoke(NativeMethodAccessorImpl.java:62)
	at sun.reflect.DelegatingMethodAccessorImpl.invoke(DelegatingMethodAccessorImpl.java:43)
	at java.lang.reflect.Method.invoke(Method.java:498)
	at org.apache.maven.surefire.util.ReflectionUtils.invokeMethodWithArray(ReflectionUtils.java:189)
	at org.apache.maven.surefire.booter.ProviderFactory$ProviderProxy.invoke(ProviderFactory.java:165)
	at org.apache.maven.surefire.booter.ProviderFactory.invokeProvider(ProviderFactory.java:85)
	at org.apache.maven.surefire.booter.ForkedBooter.runSuitesInProcess(ForkedBooter.java:115)
	at org.apache.maven.surefire.booter.ForkedBooter.main(ForkedBooter.java:75)

Jun 28, 2018 8:23:26 PM org.springframework.context.support.AbstractApplicationContext prepareRefresh
INFO: Refreshing org.springframework.context.support.FileSystemXmlApplicationContext@5767b2af: startup date [Thu Jun 28 20:23:26 EDT 2018]; root of context hierarchy
Jun 28, 2018 8:23:26 PM org.springframework.beans.factory.xml.XmlBeanDefinitionReader loadBeanDefinitions
INFO: Loading XML bean definitions from URL [file:/home/hudson/genie.jts/.jenkins/jobs/GeoServer-1.15.0/workspace/src/ows/target/test-classes/org/geoserver/ows/applicationContext.xml]
Jun 28, 2018 8:23:26 PM org.springframework.context.support.AbstractApplicationContext prepareRefresh
INFO: Refreshing org.springframework.context.support.FileSystemXmlApplicationContext@602c4656: startup date [Thu Jun 28 20:23:26 EDT 2018]; root of context hierarchy
Jun 28, 2018 8:23:26 PM org.springframework.beans.factory.xml.XmlBeanDefinitionReader loadBeanDefinitions
INFO: Loading XML bean definitions from URL [file:/home/hudson/genie.jts/.jenkins/jobs/GeoServer-1.15.0/workspace/src/ows/target/test-classes/org/geoserver/ows/applicationContext.xml]
Jun 28, 2018 8:23:26 PM org.springframework.context.support.AbstractApplicationContext prepareRefresh
INFO: Refreshing org.springframework.context.support.FileSystemXmlApplicationContext@4cfbaf4: startup date [Thu Jun 28 20:23:26 EDT 2018]; root of context hierarchy
Jun 28, 2018 8:23:26 PM org.springframework.beans.factory.xml.XmlBeanDefinitionReader loadBeanDefinitions
INFO: Loading XML bean definitions from URL [file:/home/hudson/genie.jts/.jenkins/jobs/GeoServer-1.15.0/workspace/src/ows/target/test-classes/org/geoserver/ows/applicationContext.xml]
Jun 28, 2018 8:23:26 PM org.geoserver.ows.Dispatcher exception
SEVERE: 
java.lang.RuntimeException: TestDispatcherCallbackFailOperationExecuted
	at org.geoserver.ows.DispatcherTest$12.operationExecuted(DispatcherTest.java:692)
	at org.geoserver.ows.Dispatcher.fireOperationExecutedCallback(Dispatcher.java:880)
	at org.geoserver.ows.Dispatcher.execute(Dispatcher.java:875)
	at org.geoserver.ows.Dispatcher.handleRequestInternal(Dispatcher.java:259)
	at org.springframework.web.servlet.mvc.AbstractController.handleRequest(AbstractController.java:174)
	at org.geoserver.ows.DispatcherTest.testDispatcherCallbackFailOperationExecuted(DispatcherTest.java:703)
	at sun.reflect.NativeMethodAccessorImpl.invoke0(Native Method)
	at sun.reflect.NativeMethodAccessorImpl.invoke(NativeMethodAccessorImpl.java:62)
	at sun.reflect.DelegatingMethodAccessorImpl.invoke(DelegatingMethodAccessorImpl.java:43)
	at java.lang.reflect.Method.invoke(Method.java:498)
	at junit.framework.TestCase.runTest(TestCase.java:176)
	at junit.framework.TestCase.runBare(TestCase.java:141)
	at junit.framework.TestResult$1.protect(TestResult.java:122)
	at junit.framework.TestResult.runProtected(TestResult.java:142)
	at junit.framework.TestResult.run(TestResult.java:125)
	at junit.framework.TestCase.run(TestCase.java:129)
	at junit.framework.TestSuite.runTest(TestSuite.java:255)
	at junit.framework.TestSuite.run(TestSuite.java:250)
	at org.junit.internal.runners.JUnit38ClassRunner.run(JUnit38ClassRunner.java:84)
	at org.apache.maven.surefire.junit4.JUnit4Provider.execute(JUnit4Provider.java:252)
	at org.apache.maven.surefire.junit4.JUnit4Provider.executeTestSet(JUnit4Provider.java:141)
	at org.apache.maven.surefire.junit4.JUnit4Provider.invoke(JUnit4Provider.java:112)
	at sun.reflect.NativeMethodAccessorImpl.invoke0(Native Method)
	at sun.reflect.NativeMethodAccessorImpl.invoke(NativeMethodAccessorImpl.java:62)
	at sun.reflect.DelegatingMethodAccessorImpl.invoke(DelegatingMethodAccessorImpl.java:43)
	at java.lang.reflect.Method.invoke(Method.java:498)
	at org.apache.maven.surefire.util.ReflectionUtils.invokeMethodWithArray(ReflectionUtils.java:189)
	at org.apache.maven.surefire.booter.ProviderFactory$ProviderProxy.invoke(ProviderFactory.java:165)
	at org.apache.maven.surefire.booter.ProviderFactory.invokeProvider(ProviderFactory.java:85)
	at org.apache.maven.surefire.booter.ForkedBooter.runSuitesInProcess(ForkedBooter.java:115)
	at org.apache.maven.surefire.booter.ForkedBooter.main(ForkedBooter.java:75)

Jun 28, 2018 8:23:26 PM org.springframework.context.support.AbstractApplicationContext prepareRefresh
INFO: Refreshing org.springframework.context.support.FileSystemXmlApplicationContext@73aff8f1: startup date [Thu Jun 28 20:23:26 EDT 2018]; root of context hierarchy
Jun 28, 2018 8:23:26 PM org.springframework.beans.factory.xml.XmlBeanDefinitionReader loadBeanDefinitions
INFO: Loading XML bean definitions from URL [file:/home/hudson/genie.jts/.jenkins/jobs/GeoServer-1.15.0/workspace/src/ows/target/test-classes/org/geoserver/ows/applicationContext.xml]
Jun 28, 2018 8:23:26 PM org.springframework.context.support.AbstractApplicationContext prepareRefresh
INFO: Refreshing org.springframework.context.support.FileSystemXmlApplicationContext@7d151a: startup date [Thu Jun 28 20:23:26 EDT 2018]; root of context hierarchy
Jun 28, 2018 8:23:26 PM org.springframework.beans.factory.xml.XmlBeanDefinitionReader loadBeanDefinitions
INFO: Loading XML bean definitions from URL [file:/home/hudson/genie.jts/.jenkins/jobs/GeoServer-1.15.0/workspace/src/ows/target/test-classes/org/geoserver/ows/applicationContext4.xml]
Jun 28, 2018 8:23:26 PM org.geoserver.ows.Dispatcher exception
SEVERE: 
org.geoserver.platform.ServiceException: Could not parse the KVP for: org.geoserver.ows.Message
	at org.geoserver.ows.Dispatcher.dispatch(Dispatcher.java:710)
	at org.geoserver.ows.Dispatcher.handleRequestInternal(Dispatcher.java:249)
	at org.geoserver.ows.DispatcherTest.testDispatchKVPException(DispatcherTest.java:939)
	at sun.reflect.NativeMethodAccessorImpl.invoke0(Native Method)
	at sun.reflect.NativeMethodAccessorImpl.invoke(NativeMethodAccessorImpl.java:62)
	at sun.reflect.DelegatingMethodAccessorImpl.invoke(DelegatingMethodAccessorImpl.java:43)
	at java.lang.reflect.Method.invoke(Method.java:498)
	at junit.framework.TestCase.runTest(TestCase.java:176)
	at junit.framework.TestCase.runBare(TestCase.java:141)
	at junit.framework.TestResult$1.protect(TestResult.java:122)
	at junit.framework.TestResult.runProtected(TestResult.java:142)
	at junit.framework.TestResult.run(TestResult.java:125)
	at junit.framework.TestCase.run(TestCase.java:129)
	at junit.framework.TestSuite.runTest(TestSuite.java:255)
	at junit.framework.TestSuite.run(TestSuite.java:250)
	at org.junit.internal.runners.JUnit38ClassRunner.run(JUnit38ClassRunner.java:84)
	at org.apache.maven.surefire.junit4.JUnit4Provider.execute(JUnit4Provider.java:252)
	at org.apache.maven.surefire.junit4.JUnit4Provider.executeTestSet(JUnit4Provider.java:141)
	at org.apache.maven.surefire.junit4.JUnit4Provider.invoke(JUnit4Provider.java:112)
	at sun.reflect.NativeMethodAccessorImpl.invoke0(Native Method)
	at sun.reflect.NativeMethodAccessorImpl.invoke(NativeMethodAccessorImpl.java:62)
	at sun.reflect.DelegatingMethodAccessorImpl.invoke(DelegatingMethodAccessorImpl.java:43)
	at java.lang.reflect.Method.invoke(Method.java:498)
	at org.apache.maven.surefire.util.ReflectionUtils.invokeMethodWithArray(ReflectionUtils.java:189)
	at org.apache.maven.surefire.booter.ProviderFactory$ProviderProxy.invoke(ProviderFactory.java:165)
	at org.apache.maven.surefire.booter.ProviderFactory.invokeProvider(ProviderFactory.java:85)
	at org.apache.maven.surefire.booter.ForkedBooter.runSuitesInProcess(ForkedBooter.java:115)
	at org.apache.maven.surefire.booter.ForkedBooter.main(ForkedBooter.java:75)

Jun 28, 2018 8:23:26 PM org.springframework.context.support.AbstractApplicationContext prepareRefresh
INFO: Refreshing org.springframework.context.support.FileSystemXmlApplicationContext@7af1cd63: startup date [Thu Jun 28 20:23:26 EDT 2018]; root of context hierarchy
Jun 28, 2018 8:23:26 PM org.springframework.beans.factory.xml.XmlBeanDefinitionReader loadBeanDefinitions
INFO: Loading XML bean definitions from URL [file:/home/hudson/genie.jts/.jenkins/jobs/GeoServer-1.15.0/workspace/src/ows/target/test-classes/org/geoserver/ows/applicationContext.xml]
Jun 28, 2018 8:23:26 PM org.springframework.context.support.AbstractApplicationContext prepareRefresh
INFO: Refreshing org.springframework.context.support.FileSystemXmlApplicationContext@6f8d7714: startup date [Thu Jun 28 20:23:26 EDT 2018]; root of context hierarchy
Jun 28, 2018 8:23:26 PM org.springframework.beans.factory.xml.XmlBeanDefinitionReader loadBeanDefinitions
INFO: Loading XML bean definitions from URL [file:/home/hudson/genie.jts/.jenkins/jobs/GeoServer-1.15.0/workspace/src/ows/target/test-classes/org/geoserver/ows/applicationContext.xml]
Jun 28, 2018 8:23:26 PM org.geoserver.ows.Dispatcher exception
SEVERE: 
java.lang.RuntimeException: TestDispatcherCallbackFailServiceDispatched
	at org.geoserver.ows.DispatcherTest$10.serviceDispatched(DispatcherTest.java:627)
	at org.geoserver.ows.Dispatcher.fireServiceDispatchedCallback(Dispatcher.java:572)
	at org.geoserver.ows.Dispatcher.service(Dispatcher.java:567)
	at org.geoserver.ows.Dispatcher.handleRequestInternal(Dispatcher.java:236)
	at org.springframework.web.servlet.mvc.AbstractController.handleRequest(AbstractController.java:174)
	at org.geoserver.ows.DispatcherTest.testDispatcherCallbackFailServiceDispatched(DispatcherTest.java:638)
	at sun.reflect.NativeMethodAccessorImpl.invoke0(Native Method)
	at sun.reflect.NativeMethodAccessorImpl.invoke(NativeMethodAccessorImpl.java:62)
	at sun.reflect.DelegatingMethodAccessorImpl.invoke(DelegatingMethodAccessorImpl.java:43)
	at java.lang.reflect.Method.invoke(Method.java:498)
	at junit.framework.TestCase.runTest(TestCase.java:176)
	at junit.framework.TestCase.runBare(TestCase.java:141)
	at junit.framework.TestResult$1.protect(TestResult.java:122)
	at junit.framework.TestResult.runProtected(TestResult.java:142)
	at junit.framework.TestResult.run(TestResult.java:125)
	at junit.framework.TestCase.run(TestCase.java:129)
	at junit.framework.TestSuite.runTest(TestSuite.java:255)
	at junit.framework.TestSuite.run(TestSuite.java:250)
	at org.junit.internal.runners.JUnit38ClassRunner.run(JUnit38ClassRunner.java:84)
	at org.apache.maven.surefire.junit4.JUnit4Provider.execute(JUnit4Provider.java:252)
	at org.apache.maven.surefire.junit4.JUnit4Provider.executeTestSet(JUnit4Provider.java:141)
	at org.apache.maven.surefire.junit4.JUnit4Provider.invoke(JUnit4Provider.java:112)
	at sun.reflect.NativeMethodAccessorImpl.invoke0(Native Method)
	at sun.reflect.NativeMethodAccessorImpl.invoke(NativeMethodAccessorImpl.java:62)
	at sun.reflect.DelegatingMethodAccessorImpl.invoke(DelegatingMethodAccessorImpl.java:43)
	at java.lang.reflect.Method.invoke(Method.java:498)
	at org.apache.maven.surefire.util.ReflectionUtils.invokeMethodWithArray(ReflectionUtils.java:189)
	at org.apache.maven.surefire.booter.ProviderFactory$ProviderProxy.invoke(ProviderFactory.java:165)
	at org.apache.maven.surefire.booter.ProviderFactory.invokeProvider(ProviderFactory.java:85)
	at org.apache.maven.surefire.booter.ForkedBooter.runSuitesInProcess(ForkedBooter.java:115)
	at org.apache.maven.surefire.booter.ForkedBooter.main(ForkedBooter.java:75)

Jun 28, 2018 8:23:26 PM org.springframework.context.support.AbstractApplicationContext prepareRefresh
INFO: Refreshing org.springframework.context.support.FileSystemXmlApplicationContext@2375b321: startup date [Thu Jun 28 20:23:26 EDT 2018]; root of context hierarchy
Jun 28, 2018 8:23:26 PM org.springframework.beans.factory.xml.XmlBeanDefinitionReader loadBeanDefinitions
INFO: Loading XML bean definitions from URL [file:/home/hudson/genie.jts/.jenkins/jobs/GeoServer-1.15.0/workspace/src/ows/target/test-classes/org/geoserver/ows/applicationContextNamespace.xml]
Jun 28, 2018 8:23:26 PM org.springframework.beans.factory.xml.XmlBeanDefinitionReader loadBeanDefinitions
INFO: Loading XML bean definitions from URL [file:/home/hudson/genie.jts/.jenkins/jobs/GeoServer-1.15.0/workspace/src/ows/target/test-classes/org/geoserver/ows/applicationContext.xml]
Jun 28, 2018 8:23:26 PM org.springframework.beans.factory.support.DefaultListableBeanFactory registerBeanDefinition
INFO: Overriding bean definition for bean 'helloWorldService' with a different definition: replacing [Generic bean: class [org.geoserver.platform.Service]; scope=; abstract=false; lazyInit=false; autowireMode=0; dependencyCheck=0; autowireCandidate=true; primary=false; factoryBeanName=null; factoryMethodName=null; initMethodName=null; destroyMethodName=null; defined in URL [file:/home/hudson/genie.jts/.jenkins/jobs/GeoServer-1.15.0/workspace/src/ows/target/test-classes/org/geoserver/ows/applicationContext.xml]] with [Generic bean: class [org.geoserver.platform.Service]; scope=; abstract=false; lazyInit=false; autowireMode=0; dependencyCheck=0; autowireCandidate=true; primary=false; factoryBeanName=null; factoryMethodName=null; initMethodName=null; destroyMethodName=null; defined in URL [file:/home/hudson/genie.jts/.jenkins/jobs/GeoServer-1.15.0/workspace/src/ows/target/test-classes/org/geoserver/ows/applicationContextNamespace.xml]]
Jun 28, 2018 8:23:26 PM org.geoserver.ows.Dispatcher findXmlReader
INFO: No xml reader: (http:/hello.org,Hello)
Jun 28, 2018 8:23:26 PM org.geoserver.ows.Dispatcher exception
SEVERE: 
org.geoserver.platform.ServiceException: Could not parse the XML for: org.geoserver.ows.Message
	at org.geoserver.ows.Dispatcher.dispatch(Dispatcher.java:713)
	at org.geoserver.ows.Dispatcher.handleRequestInternal(Dispatcher.java:249)
	at org.geoserver.ows.DispatcherTest.testDispatchXMLException(DispatcherTest.java:889)
	at sun.reflect.NativeMethodAccessorImpl.invoke0(Native Method)
	at sun.reflect.NativeMethodAccessorImpl.invoke(NativeMethodAccessorImpl.java:62)
	at sun.reflect.DelegatingMethodAccessorImpl.invoke(DelegatingMethodAccessorImpl.java:43)
	at java.lang.reflect.Method.invoke(Method.java:498)
	at junit.framework.TestCase.runTest(TestCase.java:176)
	at junit.framework.TestCase.runBare(TestCase.java:141)
	at junit.framework.TestResult$1.protect(TestResult.java:122)
	at junit.framework.TestResult.runProtected(TestResult.java:142)
	at junit.framework.TestResult.run(TestResult.java:125)
	at junit.framework.TestCase.run(TestCase.java:129)
	at junit.framework.TestSuite.runTest(TestSuite.java:255)
	at junit.framework.TestSuite.run(TestSuite.java:250)
	at org.junit.internal.runners.JUnit38ClassRunner.run(JUnit38ClassRunner.java:84)
	at org.apache.maven.surefire.junit4.JUnit4Provider.execute(JUnit4Provider.java:252)
	at org.apache.maven.surefire.junit4.JUnit4Provider.executeTestSet(JUnit4Provider.java:141)
	at org.apache.maven.surefire.junit4.JUnit4Provider.invoke(JUnit4Provider.java:112)
	at sun.reflect.NativeMethodAccessorImpl.invoke0(Native Method)
	at sun.reflect.NativeMethodAccessorImpl.invoke(NativeMethodAccessorImpl.java:62)
	at sun.reflect.DelegatingMethodAccessorImpl.invoke(DelegatingMethodAccessorImpl.java:43)
	at java.lang.reflect.Method.invoke(Method.java:498)
	at org.apache.maven.surefire.util.ReflectionUtils.invokeMethodWithArray(ReflectionUtils.java:189)
	at org.apache.maven.surefire.booter.ProviderFactory$ProviderProxy.invoke(ProviderFactory.java:165)
	at org.apache.maven.surefire.booter.ProviderFactory.invokeProvider(ProviderFactory.java:85)
	at org.apache.maven.surefire.booter.ForkedBooter.runSuitesInProcess(ForkedBooter.java:115)
	at org.apache.maven.surefire.booter.ForkedBooter.main(ForkedBooter.java:75)

Jun 28, 2018 8:23:26 PM org.springframework.context.support.AbstractApplicationContext prepareRefresh
INFO: Refreshing org.springframework.context.support.FileSystemXmlApplicationContext@29f0802c: startup date [Thu Jun 28 20:23:26 EDT 2018]; root of context hierarchy
Jun 28, 2018 8:23:26 PM org.springframework.beans.factory.xml.XmlBeanDefinitionReader loadBeanDefinitions
INFO: Loading XML bean definitions from URL [file:/home/hudson/genie.jts/.jenkins/jobs/GeoServer-1.15.0/workspace/src/ows/target/test-classes/org/geoserver/ows/applicationContextOnlyXml.xml]
Jun 28, 2018 8:23:26 PM org.springframework.context.support.AbstractApplicationContext prepareRefresh
INFO: Refreshing org.springframework.context.support.FileSystemXmlApplicationContext@5ec77191: startup date [Thu Jun 28 20:23:26 EDT 2018]; root of context hierarchy
Jun 28, 2018 8:23:26 PM org.springframework.beans.factory.xml.XmlBeanDefinitionReader loadBeanDefinitions
INFO: Loading XML bean definitions from URL [file:/home/hudson/genie.jts/.jenkins/jobs/GeoServer-1.15.0/workspace/src/ows/target/test-classes/org/geoserver/ows/applicationContext.xml]
Jun 28, 2018 8:23:27 PM org.springframework.context.support.AbstractApplicationContext prepareRefresh
INFO: Refreshing org.springframework.context.support.FileSystemXmlApplicationContext@2bc12da: startup date [Thu Jun 28 20:23:27 EDT 2018]; root of context hierarchy
Jun 28, 2018 8:23:27 PM org.springframework.beans.factory.xml.XmlBeanDefinitionReader loadBeanDefinitions
INFO: Loading XML bean definitions from URL [file:/home/hudson/genie.jts/.jenkins/jobs/GeoServer-1.15.0/workspace/src/ows/target/test-classes/org/geoserver/ows/applicationContextNamespace.xml]
Jun 28, 2018 8:23:27 PM org.springframework.beans.factory.xml.XmlBeanDefinitionReader loadBeanDefinitions
INFO: Loading XML bean definitions from URL [file:/home/hudson/genie.jts/.jenkins/jobs/GeoServer-1.15.0/workspace/src/ows/target/test-classes/org/geoserver/ows/applicationContext.xml]
Jun 28, 2018 8:23:27 PM org.springframework.beans.factory.support.DefaultListableBeanFactory registerBeanDefinition
INFO: Overriding bean definition for bean 'helloWorldService' with a different definition: replacing [Generic bean: class [org.geoserver.platform.Service]; scope=; abstract=false; lazyInit=false; autowireMode=0; dependencyCheck=0; autowireCandidate=true; primary=false; factoryBeanName=null; factoryMethodName=null; initMethodName=null; destroyMethodName=null; defined in URL [file:/home/hudson/genie.jts/.jenkins/jobs/GeoServer-1.15.0/workspace/src/ows/target/test-classes/org/geoserver/ows/applicationContext.xml]] with [Generic bean: class [org.geoserver.platform.Service]; scope=; abstract=false; lazyInit=false; autowireMode=0; dependencyCheck=0; autowireCandidate=true; primary=false; factoryBeanName=null; factoryMethodName=null; initMethodName=null; destroyMethodName=null; defined in URL [file:/home/hudson/genie.jts/.jenkins/jobs/GeoServer-1.15.0/workspace/src/ows/target/test-classes/org/geoserver/ows/applicationContextNamespace.xml]]
Jun 28, 2018 8:23:27 PM org.springframework.context.support.AbstractApplicationContext prepareRefresh
INFO: Refreshing org.springframework.context.support.FileSystemXmlApplicationContext@6331250e: startup date [Thu Jun 28 20:23:27 EDT 2018]; root of context hierarchy
Jun 28, 2018 8:23:27 PM org.springframework.beans.factory.xml.XmlBeanDefinitionReader loadBeanDefinitions
INFO: Loading XML bean definitions from URL [file:/home/hudson/genie.jts/.jenkins/jobs/GeoServer-1.15.0/workspace/src/ows/target/test-classes/org/geoserver/ows/applicationContext.xml]
Jun 28, 2018 8:23:27 PM org.geoserver.ows.Dispatcher fireFinishedCallback
WARNING: Error firing finished callback for class org.geoserver.ows.DispatcherTest$15
java.lang.Error: TestDispatcherCallbackFailFinished
	at org.geoserver.ows.DispatcherTest$15.finished(DispatcherTest.java:768)
	at org.geoserver.ows.Dispatcher.fireFinishedCallback(Dispatcher.java:295)
	at org.geoserver.ows.Dispatcher.handleRequestInternal(Dispatcher.java:271)
	at org.springframework.web.servlet.mvc.AbstractController.handleRequest(AbstractController.java:174)
	at org.geoserver.ows.DispatcherTest.testDispatcherCallbackFailFinished(DispatcherTest.java:779)
	at sun.reflect.NativeMethodAccessorImpl.invoke0(Native Method)
	at sun.reflect.NativeMethodAccessorImpl.invoke(NativeMethodAccessorImpl.java:62)
	at sun.reflect.DelegatingMethodAccessorImpl.invoke(DelegatingMethodAccessorImpl.java:43)
	at java.lang.reflect.Method.invoke(Method.java:498)
	at junit.framework.TestCase.runTest(TestCase.java:176)
	at junit.framework.TestCase.runBare(TestCase.java:141)
	at junit.framework.TestResult$1.protect(TestResult.java:122)
	at junit.framework.TestResult.runProtected(TestResult.java:142)
	at junit.framework.TestResult.run(TestResult.java:125)
	at junit.framework.TestCase.run(TestCase.java:129)
	at junit.framework.TestSuite.runTest(TestSuite.java:255)
	at junit.framework.TestSuite.run(TestSuite.java:250)
	at org.junit.internal.runners.JUnit38ClassRunner.run(JUnit38ClassRunner.java:84)
	at org.apache.maven.surefire.junit4.JUnit4Provider.execute(JUnit4Provider.java:252)
	at org.apache.maven.surefire.junit4.JUnit4Provider.executeTestSet(JUnit4Provider.java:141)
	at org.apache.maven.surefire.junit4.JUnit4Provider.invoke(JUnit4Provider.java:112)
	at sun.reflect.NativeMethodAccessorImpl.invoke0(Native Method)
	at sun.reflect.NativeMethodAccessorImpl.invoke(NativeMethodAccessorImpl.java:62)
	at sun.reflect.DelegatingMethodAccessorImpl.invoke(DelegatingMethodAccessorImpl.java:43)
	at java.lang.reflect.Method.invoke(Method.java:498)
	at org.apache.maven.surefire.util.ReflectionUtils.invokeMethodWithArray(ReflectionUtils.java:189)
	at org.apache.maven.surefire.booter.ProviderFactory$ProviderProxy.invoke(ProviderFactory.java:165)
	at org.apache.maven.surefire.booter.ProviderFactory.invokeProvider(ProviderFactory.java:85)
	at org.apache.maven.surefire.booter.ForkedBooter.runSuitesInProcess(ForkedBooter.java:115)
	at org.apache.maven.surefire.booter.ForkedBooter.main(ForkedBooter.java:75)

Jun 28, 2018 8:23:27 PM org.springframework.context.support.AbstractApplicationContext doClose
INFO: Closing org.springframework.context.support.FileSystemXmlApplicationContext@6331250e: startup date [Thu Jun 28 20:23:27 EDT 2018]; root of context hierarchy
Jun 28, 2018 8:23:27 PM org.springframework.context.support.AbstractApplicationContext prepareRefresh
INFO: Refreshing org.springframework.context.support.FileSystemXmlApplicationContext@69ce2f62: startup date [Thu Jun 28 20:23:27 EDT 2018]; root of context hierarchy
Jun 28, 2018 8:23:27 PM org.springframework.beans.factory.xml.XmlBeanDefinitionReader loadBeanDefinitions
INFO: Loading XML bean definitions from URL [file:/home/hudson/genie.jts/.jenkins/jobs/GeoServer-1.15.0/workspace/src/ows/target/test-classes/org/geoserver/ows/applicationContext.xml]
Jun 28, 2018 8:23:27 PM org.geoserver.ows.Dispatcher exception
SEVERE: 
java.lang.RuntimeException: TestDispatcherCallbackFailInit
	at org.geoserver.ows.DispatcherTest$9.init(DispatcherTest.java:595)
	at org.geoserver.ows.Dispatcher.fireInitCallback(Dispatcher.java:419)
	at org.geoserver.ows.Dispatcher.init(Dispatcher.java:406)
	at org.geoserver.ows.Dispatcher.handleRequestInternal(Dispatcher.java:229)
	at org.springframework.web.servlet.mvc.AbstractController.handleRequest(AbstractController.java:174)
	at org.geoserver.ows.DispatcherTest.testDispatcherCallbackFailInit(DispatcherTest.java:606)
	at sun.reflect.NativeMethodAccessorImpl.invoke0(Native Method)
	at sun.reflect.NativeMethodAccessorImpl.invoke(NativeMethodAccessorImpl.java:62)
	at sun.reflect.DelegatingMethodAccessorImpl.invoke(DelegatingMethodAccessorImpl.java:43)
	at java.lang.reflect.Method.invoke(Method.java:498)
	at junit.framework.TestCase.runTest(TestCase.java:176)
	at junit.framework.TestCase.runBare(TestCase.java:141)
	at junit.framework.TestResult$1.protect(TestResult.java:122)
	at junit.framework.TestResult.runProtected(TestResult.java:142)
	at junit.framework.TestResult.run(TestResult.java:125)
	at junit.framework.TestCase.run(TestCase.java:129)
	at junit.framework.TestSuite.runTest(TestSuite.java:255)
	at junit.framework.TestSuite.run(TestSuite.java:250)
	at org.junit.internal.runners.JUnit38ClassRunner.run(JUnit38ClassRunner.java:84)
	at org.apache.maven.surefire.junit4.JUnit4Provider.execute(JUnit4Provider.java:252)
	at org.apache.maven.surefire.junit4.JUnit4Provider.executeTestSet(JUnit4Provider.java:141)
	at org.apache.maven.surefire.junit4.JUnit4Provider.invoke(JUnit4Provider.java:112)
	at sun.reflect.NativeMethodAccessorImpl.invoke0(Native Method)
	at sun.reflect.NativeMethodAccessorImpl.invoke(NativeMethodAccessorImpl.java:62)
	at sun.reflect.DelegatingMethodAccessorImpl.invoke(DelegatingMethodAccessorImpl.java:43)
	at java.lang.reflect.Method.invoke(Method.java:498)
	at org.apache.maven.surefire.util.ReflectionUtils.invokeMethodWithArray(ReflectionUtils.java:189)
	at org.apache.maven.surefire.booter.ProviderFactory$ProviderProxy.invoke(ProviderFactory.java:165)
	at org.apache.maven.surefire.booter.ProviderFactory.invokeProvider(ProviderFactory.java:85)
	at org.apache.maven.surefire.booter.ForkedBooter.runSuitesInProcess(ForkedBooter.java:115)
	at org.apache.maven.surefire.booter.ForkedBooter.main(ForkedBooter.java:75)

Jun 28, 2018 8:23:27 PM org.springframework.context.support.AbstractApplicationContext prepareRefresh
INFO: Refreshing org.springframework.context.support.FileSystemXmlApplicationContext@7b60c3e: startup date [Thu Jun 28 20:23:27 EDT 2018]; root of context hierarchy
Jun 28, 2018 8:23:27 PM org.springframework.beans.factory.xml.XmlBeanDefinitionReader loadBeanDefinitions
INFO: Loading XML bean definitions from URL [file:/home/hudson/genie.jts/.jenkins/jobs/GeoServer-1.15.0/workspace/src/ows/target/test-classes/org/geoserver/ows/applicationContext.xml]
Jun 28, 2018 8:23:27 PM org.springframework.context.support.AbstractApplicationContext prepareRefresh
INFO: Refreshing org.springframework.context.support.FileSystemXmlApplicationContext@35c09b94: startup date [Thu Jun 28 20:23:27 EDT 2018]; root of context hierarchy
Jun 28, 2018 8:23:27 PM org.springframework.beans.factory.xml.XmlBeanDefinitionReader loadBeanDefinitions
INFO: Loading XML bean definitions from URL [file:/home/hudson/genie.jts/.jenkins/jobs/GeoServer-1.15.0/workspace/src/ows/target/test-classes/org/geoserver/ows/applicationContext.xml]
Jun 28, 2018 8:23:27 PM org.springframework.context.support.AbstractApplicationContext prepareRefresh
INFO: Refreshing org.springframework.context.support.FileSystemXmlApplicationContext@1c12f3ee: startup date [Thu Jun 28 20:23:27 EDT 2018]; root of context hierarchy
Jun 28, 2018 8:23:27 PM org.springframework.beans.factory.xml.XmlBeanDefinitionReader loadBeanDefinitions
INFO: Loading XML bean definitions from URL [file:/home/hudson/genie.jts/.jenkins/jobs/GeoServer-1.15.0/workspace/src/ows/target/test-classes/org/geoserver/ows/applicationContext.xml]
Jun 28, 2018 8:23:27 PM org.springframework.context.support.AbstractApplicationContext prepareRefresh
INFO: Refreshing org.springframework.context.support.FileSystemXmlApplicationContext@16fe9c29: startup date [Thu Jun 28 20:23:27 EDT 2018]; root of context hierarchy
Jun 28, 2018 8:23:27 PM org.springframework.beans.factory.xml.XmlBeanDefinitionReader loadBeanDefinitions
INFO: Loading XML bean definitions from URL [file:/home/hudson/genie.jts/.jenkins/jobs/GeoServer-1.15.0/workspace/src/ows/target/test-classes/org/geoserver/ows/applicationContext.xml]
Tests run: 29, Failures: 0, Errors: 0, Skipped: 0, Time elapsed: 0.695 sec
Running org.geoserver.ows.FilePublisherTest
Tests run: 2, Failures: 0, Errors: 0, Skipped: 0, Time elapsed: 0.055 sec
Running org.geoserver.ows.XmlObjectEncodingResponseTest
Tests run: 3, Failures: 0, Errors: 0, Skipped: 0, Time elapsed: 0.013 sec
Running org.geoserver.ows.kvp.CharsetKvpParserTest
Tests run: 2, Failures: 0, Errors: 0, Skipped: 0, Time elapsed: 0.006 sec
Running org.geoserver.ows.kvp.ElevationKvpParserTest
Tests run: 3, Failures: 0, Errors: 0, Skipped: 0, Time elapsed: 0.011 sec
Running org.geoserver.ows.kvp.FormatOptionsKvpParserTest
Jun 28, 2018 8:23:27 PM org.geoserver.platform.GeoServerExtensions checkContext
WARNING: Extension lookup 'KvpParser', but ApplicationContext is unset.
Jun 28, 2018 8:23:27 PM org.geoserver.platform.GeoServerExtensions checkContext
WARNING: Extension lookup 'ExtensionFilter', but ApplicationContext is unset.
Jun 28, 2018 8:23:27 PM org.geoserver.platform.GeoServerExtensions checkContext
WARNING: Extension lookup 'ExtensionProvider', but ApplicationContext is unset.
Jun 28, 2018 8:23:27 PM org.geoserver.platform.GeoServerExtensions checkContext
WARNING: Extension lookup 'ExtensionFilter', but ApplicationContext is unset.
Jun 28, 2018 8:23:27 PM org.geoserver.platform.GeoServerExtensions checkContext
WARNING: Extension lookup 'KvpParser', but ApplicationContext is unset.
Jun 28, 2018 8:23:27 PM org.geoserver.platform.GeoServerExtensions checkContext
WARNING: Extension lookup 'ExtensionFilter', but ApplicationContext is unset.
Jun 28, 2018 8:23:27 PM org.geoserver.platform.GeoServerExtensions checkContext
WARNING: Extension lookup 'ExtensionProvider', but ApplicationContext is unset.
Jun 28, 2018 8:23:27 PM org.geoserver.platform.GeoServerExtensions checkContext
WARNING: Extension lookup 'ExtensionFilter', but ApplicationContext is unset.
Jun 28, 2018 8:23:27 PM org.geoserver.platform.GeoServerExtensions checkContext
WARNING: Extension lookup 'KvpParser', but ApplicationContext is unset.
Jun 28, 2018 8:23:27 PM org.geoserver.platform.GeoServerExtensions checkContext
WARNING: Extension lookup 'ExtensionFilter', but ApplicationContext is unset.
Jun 28, 2018 8:23:27 PM org.geoserver.platform.GeoServerExtensions checkContext
WARNING: Extension lookup 'ExtensionProvider', but ApplicationContext is unset.
Jun 28, 2018 8:23:27 PM org.geoserver.platform.GeoServerExtensions checkContext
WARNING: Extension lookup 'ExtensionFilter', but ApplicationContext is unset.
Jun 28, 2018 8:23:27 PM org.geoserver.platform.GeoServerExtensions checkContext
WARNING: Extension lookup 'KvpParser', but ApplicationContext is unset.
Jun 28, 2018 8:23:27 PM org.geoserver.platform.GeoServerExtensions checkContext
WARNING: Extension lookup 'ExtensionFilter', but ApplicationContext is unset.
Jun 28, 2018 8:23:27 PM org.geoserver.platform.GeoServerExtensions checkContext
WARNING: Extension lookup 'ExtensionProvider', but ApplicationContext is unset.
Jun 28, 2018 8:23:27 PM org.geoserver.platform.GeoServerExtensions checkContext
WARNING: Extension lookup 'ExtensionFilter', but ApplicationContext is unset.
Tests run: 4, Failures: 0, Errors: 0, Skipped: 0, Time elapsed: 0.006 sec
Running org.geoserver.ows.kvp.KvpUtilsTest
Tests run: 10, Failures: 0, Errors: 0, Skipped: 0, Time elapsed: 0.002 sec
Running org.geoserver.ows.kvp.TimeKvpParserTest
Tests run: 13, Failures: 0, Errors: 0, Skipped: 0, Time elapsed: 0.043 sec
Running org.geoserver.ows.util.CaseInsensitiveMapTest
Tests run: 1, Failures: 0, Errors: 0, Skipped: 0, Time elapsed: 0 sec
Running org.geoserver.ows.util.KvpMapTest
Tests run: 1, Failures: 0, Errors: 0, Skipped: 0, Time elapsed: 0 sec
Running org.geoserver.ows.util.OwsUtilsTest
Tests run: 3, Failures: 0, Errors: 0, Skipped: 0, Time elapsed: 0.001 sec
Running org.geoserver.ows.util.RequestUtilsTest
Tests run: 3, Failures: 0, Errors: 0, Skipped: 0, Time elapsed: 0 sec
Running org.geoserver.ows.xml.v1_0.ExceptionReportBindingTest
Tests run: 1, Failures: 0, Errors: 0, Skipped: 0, Time elapsed: 0.019 sec

Results :

Tests run: 80, Failures: 0, Errors: 0, Skipped: 0

[JENKINS] Recording test results
[INFO] 
[INFO] --- maven-jar-plugin:2.4:jar (default-jar) @ gs-ows ---
[INFO] Building jar: /home/hudson/genie.jts/.jenkins/jobs/GeoServer-1.15.0/workspace/src/ows/target/gs-ows-2.14-SNAPSHOT.jar
[INFO] 
[INFO] --- maven-jar-plugin:2.4:test-jar (default) @ gs-ows ---
[INFO] Building jar: /home/hudson/genie.jts/.jenkins/jobs/GeoServer-1.15.0/workspace/src/ows/target/gs-ows-2.14-SNAPSHOT-tests.jar
[INFO] 
[INFO] --- maven-source-plugin:2.2.1:jar-no-fork (attach-sources) @ gs-ows ---
[INFO] Building jar: /home/hudson/genie.jts/.jenkins/jobs/GeoServer-1.15.0/workspace/src/ows/target/gs-ows-2.14-SNAPSHOT-sources.jar
[INFO] 
[INFO] --- maven-source-plugin:2.2.1:test-jar-no-fork (attach-sources) @ gs-ows ---
[INFO] Building jar: /home/hudson/genie.jts/.jenkins/jobs/GeoServer-1.15.0/workspace/src/ows/target/gs-ows-2.14-SNAPSHOT-test-sources.jar
[INFO] 
[INFO] --- maven-install-plugin:2.4:install (default-install) @ gs-ows ---
[INFO] Installing /home/hudson/genie.jts/.jenkins/jobs/GeoServer-1.15.0/workspace/src/ows/target/gs-ows-2.14-SNAPSHOT.jar to /opt/public/hipp/homes/genie.jts/.m2/repository/org/geoserver/gs-ows/2.14-SNAPSHOT/gs-ows-2.14-SNAPSHOT.jar
[INFO] Installing /home/hudson/genie.jts/.jenkins/jobs/GeoServer-1.15.0/workspace/src/ows/pom.xml to /opt/public/hipp/homes/genie.jts/.m2/repository/org/geoserver/gs-ows/2.14-SNAPSHOT/gs-ows-2.14-SNAPSHOT.pom
[INFO] Installing /home/hudson/genie.jts/.jenkins/jobs/GeoServer-1.15.0/workspace/src/ows/target/gs-ows-2.14-SNAPSHOT-tests.jar to /opt/public/hipp/homes/genie.jts/.m2/repository/org/geoserver/gs-ows/2.14-SNAPSHOT/gs-ows-2.14-SNAPSHOT-tests.jar
[INFO] Installing /home/hudson/genie.jts/.jenkins/jobs/GeoServer-1.15.0/workspace/src/ows/target/gs-ows-2.14-SNAPSHOT-sources.jar to /opt/public/hipp/homes/genie.jts/.m2/repository/org/geoserver/gs-ows/2.14-SNAPSHOT/gs-ows-2.14-SNAPSHOT-sources.jar
[INFO] Installing /home/hudson/genie.jts/.jenkins/jobs/GeoServer-1.15.0/workspace/src/ows/target/gs-ows-2.14-SNAPSHOT-test-sources.jar to /opt/public/hipp/homes/genie.jts/.m2/repository/org/geoserver/gs-ows/2.14-SNAPSHOT/gs-ows-2.14-SNAPSHOT-test-sources.jar
Started calculate disk usage of build
Finished Calculation of disk usage of build in 0 seconds
Started calculate disk usage of workspace
Finished Calculation of disk usage of workspace in 0 seconds
[INFO] 
[INFO] -----------------------< org.geoserver:gs-main >------------------------
[INFO] Building Main Module 2.14-SNAPSHOT                                [4/36]
[INFO] --------------------------------[ jar ]---------------------------------
[INFO] Downloading from boundless: https://repo.boundlessgeo.com/main/net/sf/json-lib/json-lib/2.2.3/json-lib-2.2.3.pom
[INFO] Downloading from osgeo: http://download.osgeo.org/webdav/geotools/net/sf/json-lib/json-lib/2.2.3/json-lib-2.2.3.pom
[INFO] Downloading from geosolutions: http://maven.geo-solutions.it/net/sf/json-lib/json-lib/2.2.3/json-lib-2.2.3.pom
[INFO] Downloading from eclipse.maven.central.mirror: https://repo.eclipse.org/content/repositories/maven_central/net/sf/json-lib/json-lib/2.2.3/json-lib-2.2.3.pom
[INFO] Downloaded from eclipse.maven.central.mirror: https://repo.eclipse.org/content/repositories/maven_central/net/sf/json-lib/json-lib/2.2.3/json-lib-2.2.3.pom (13 kB at 97 kB/s)
[INFO] Downloading from boundless: https://repo.boundlessgeo.com/main/commons-beanutils/commons-beanutils/1.9.2/commons-beanutils-1.9.2.pom
[INFO] Downloading from osgeo: http://download.osgeo.org/webdav/geotools/commons-beanutils/commons-beanutils/1.9.2/commons-beanutils-1.9.2.pom
[INFO] Downloading from geosolutions: http://maven.geo-solutions.it/commons-beanutils/commons-beanutils/1.9.2/commons-beanutils-1.9.2.pom
[INFO] Downloading from eclipse.maven.central.mirror: https://repo.eclipse.org/content/repositories/maven_central/commons-beanutils/commons-beanutils/1.9.2/commons-beanutils-1.9.2.pom
[INFO] Downloaded from eclipse.maven.central.mirror: https://repo.eclipse.org/content/repositories/maven_central/commons-beanutils/commons-beanutils/1.9.2/commons-beanutils-1.9.2.pom (0 B at 0 B/s)
[INFO] Downloading from boundless: https://repo.boundlessgeo.com/main/org/apache/commons/commons-parent/33/commons-parent-33.pom
[INFO] Downloading from osgeo: http://download.osgeo.org/webdav/geotools/org/apache/commons/commons-parent/33/commons-parent-33.pom
[INFO] Downloading from geosolutions: http://maven.geo-solutions.it/org/apache/commons/commons-parent/33/commons-parent-33.pom
[INFO] Downloading from eclipse.maven.central.mirror: https://repo.eclipse.org/content/repositories/maven_central/org/apache/commons/commons-parent/33/commons-parent-33.pom
[INFO] Downloaded from eclipse.maven.central.mirror: https://repo.eclipse.org/content/repositories/maven_central/org/apache/commons/commons-parent/33/commons-parent-33.pom (0 B at 0 B/s)
[INFO] Downloading from boundless: https://repo.boundlessgeo.com/main/net/sf/ezmorph/ezmorph/1.0.6/ezmorph-1.0.6.pom
[INFO] Downloading from osgeo: http://download.osgeo.org/webdav/geotools/net/sf/ezmorph/ezmorph/1.0.6/ezmorph-1.0.6.pom
[INFO] Downloading from geosolutions: http://maven.geo-solutions.it/net/sf/ezmorph/ezmorph/1.0.6/ezmorph-1.0.6.pom
[INFO] Downloading from eclipse.maven.central.mirror: https://repo.eclipse.org/content/repositories/maven_central/net/sf/ezmorph/ezmorph/1.0.6/ezmorph-1.0.6.pom
[INFO] Downloaded from eclipse.maven.central.mirror: https://repo.eclipse.org/content/repositories/maven_central/net/sf/ezmorph/ezmorph/1.0.6/ezmorph-1.0.6.pom (6.8 kB at 75 kB/s)
[INFO] Downloading from boundless: https://repo.boundlessgeo.com/main/log4j/log4j/1.2.17/log4j-1.2.17.pom
[INFO] Downloading from osgeo: http://download.osgeo.org/webdav/geotools/log4j/log4j/1.2.17/log4j-1.2.17.pom
[INFO] Downloading from geosolutions: http://maven.geo-solutions.it/log4j/log4j/1.2.17/log4j-1.2.17.pom
[INFO] Downloading from eclipse.maven.central.mirror: https://repo.eclipse.org/content/repositories/maven_central/log4j/log4j/1.2.17/log4j-1.2.17.pom
[INFO] Downloaded from eclipse.maven.central.mirror: https://repo.eclipse.org/content/repositories/maven_central/log4j/log4j/1.2.17/log4j-1.2.17.pom (22 kB at 572 kB/s)
[INFO] Downloading from boundless: https://repo.boundlessgeo.com/main/org/springframework/spring-jdbc/4.3.16.RELEASE/spring-jdbc-4.3.16.RELEASE.pom
[INFO] Downloading from osgeo: http://download.osgeo.org/webdav/geotools/org/springframework/spring-jdbc/4.3.16.RELEASE/spring-jdbc-4.3.16.RELEASE.pom
[INFO] Downloading from geosolutions: http://maven.geo-solutions.it/org/springframework/spring-jdbc/4.3.16.RELEASE/spring-jdbc-4.3.16.RELEASE.pom
[INFO] Downloading from eclipse.maven.central.mirror: https://repo.eclipse.org/content/repositories/maven_central/org/springframework/spring-jdbc/4.3.16.RELEASE/spring-jdbc-4.3.16.RELEASE.pom
[INFO] Downloaded from eclipse.maven.central.mirror: https://repo.eclipse.org/content/repositories/maven_central/org/springframework/spring-jdbc/4.3.16.RELEASE/spring-jdbc-4.3.16.RELEASE.pom (3.5 kB at 28 kB/s)
[INFO] Downloading from boundless: https://repo.boundlessgeo.com/main/org/springframework/spring-tx/4.3.16.RELEASE/spring-tx-4.3.16.RELEASE.pom
[INFO] Downloading from osgeo: http://download.osgeo.org/webdav/geotools/org/springframework/spring-tx/4.3.16.RELEASE/spring-tx-4.3.16.RELEASE.pom
[INFO] Downloading from geosolutions: http://maven.geo-solutions.it/org/springframework/spring-tx/4.3.16.RELEASE/spring-tx-4.3.16.RELEASE.pom
[INFO] Downloading from eclipse.maven.central.mirror: https://repo.eclipse.org/content/repositories/maven_central/org/springframework/spring-tx/4.3.16.RELEASE/spring-tx-4.3.16.RELEASE.pom
[INFO] Downloaded from eclipse.maven.central.mirror: https://repo.eclipse.org/content/repositories/maven_central/org/springframework/spring-tx/4.3.16.RELEASE/spring-tx-4.3.16.RELEASE.pom (3.2 kB at 23 kB/s)
[INFO] Downloading from boundless: https://repo.boundlessgeo.com/main/com/google/code/findbugs/jsr305/2.0.3/jsr305-2.0.3.pom
[INFO] Downloading from osgeo: http://download.osgeo.org/webdav/geotools/com/google/code/findbugs/jsr305/2.0.3/jsr305-2.0.3.pom
[INFO] Downloading from geosolutions: http://maven.geo-solutions.it/com/google/code/findbugs/jsr305/2.0.3/jsr305-2.0.3.pom
[INFO] Downloading from eclipse.maven.central.mirror: https://repo.eclipse.org/content/repositories/maven_central/com/google/code/findbugs/jsr305/2.0.3/jsr305-2.0.3.pom
[INFO] Downloaded from eclipse.maven.central.mirror: https://repo.eclipse.org/content/repositories/maven_central/com/google/code/findbugs/jsr305/2.0.3/jsr305-2.0.3.pom (1.4 kB at 38 kB/s)
[INFO] Downloading from boundless: https://repo.boundlessgeo.com/main/org/jasypt/jasypt/1.8/jasypt-1.8.pom
[INFO] Downloading from osgeo: http://download.osgeo.org/webdav/geotools/org/jasypt/jasypt/1.8/jasypt-1.8.pom
[INFO] Downloading from geosolutions: http://maven.geo-solutions.it/org/jasypt/jasypt/1.8/jasypt-1.8.pom
[INFO] Downloading from eclipse.maven.central.mirror: https://repo.eclipse.org/content/repositories/maven_central/org/jasypt/jasypt/1.8/jasypt-1.8.pom
[INFO] Downloaded from eclipse.maven.central.mirror: https://repo.eclipse.org/content/repositories/maven_central/org/jasypt/jasypt/1.8/jasypt-1.8.pom (19 kB at 159 kB/s)
[INFO] Downloading from boundless: https://repo.boundlessgeo.com/main/org/bouncycastle/bcprov-jdk15on/1.54/bcprov-jdk15on-1.54.pom
[INFO] Downloading from osgeo: http://download.osgeo.org/webdav/geotools/org/bouncycastle/bcprov-jdk15on/1.54/bcprov-jdk15on-1.54.pom
[INFO] Downloading from geosolutions: http://maven.geo-solutions.it/org/bouncycastle/bcprov-jdk15on/1.54/bcprov-jdk15on-1.54.pom
[INFO] Downloading from eclipse.maven.central.mirror: https://repo.eclipse.org/content/repositories/maven_central/org/bouncycastle/bcprov-jdk15on/1.54/bcprov-jdk15on-1.54.pom
[INFO] Downloaded from eclipse.maven.central.mirror: https://repo.eclipse.org/content/repositories/maven_central/org/bouncycastle/bcprov-jdk15on/1.54/bcprov-jdk15on-1.54.pom (1.2 kB at 27 kB/s)
[INFO] Downloading from boundless: https://repo.boundlessgeo.com/main/net/sf/json-lib/json-lib/2.2.3/json-lib-2.2.3-jdk15.jar
[INFO] Downloading from boundless: https://repo.boundlessgeo.com/main/commons-beanutils/commons-beanutils/1.9.2/commons-beanutils-1.9.2.jar
[INFO] Downloading from boundless: https://repo.boundlessgeo.com/main/net/sf/ezmorph/ezmorph/1.0.6/ezmorph-1.0.6.jar
[INFO] Downloading from boundless: https://repo.boundlessgeo.com/main/log4j/log4j/1.2.17/log4j-1.2.17.jar
[INFO] Downloading from boundless: https://repo.boundlessgeo.com/main/org/springframework/spring-jdbc/4.3.16.RELEASE/spring-jdbc-4.3.16.RELEASE.jar
[INFO] Downloading from boundless: https://repo.boundlessgeo.com/main/org/springframework/spring-tx/4.3.16.RELEASE/spring-tx-4.3.16.RELEASE.jar
[INFO] Downloading from boundless: https://repo.boundlessgeo.com/main/com/google/code/findbugs/jsr305/2.0.3/jsr305-2.0.3.jar
[INFO] Downloading from boundless: https://repo.boundlessgeo.com/main/org/slf4j/slf4j-api/1.6.4/slf4j-api-1.6.4.jar
[INFO] Downloading from boundless: https://repo.boundlessgeo.com/main/org/jasypt/jasypt/1.8/jasypt-1.8.jar
[INFO] Downloading from boundless: https://repo.boundlessgeo.com/main/org/bouncycastle/bcprov-jdk15on/1.54/bcprov-jdk15on-1.54.jar
[INFO] Downloading from osgeo: http://download.osgeo.org/webdav/geotools/net/sf/json-lib/json-lib/2.2.3/json-lib-2.2.3-jdk15.jar
[INFO] Downloading from osgeo: http://download.osgeo.org/webdav/geotools/commons-beanutils/commons-beanutils/1.9.2/commons-beanutils-1.9.2.jar
[INFO] Downloading from osgeo: http://download.osgeo.org/webdav/geotools/net/sf/ezmorph/ezmorph/1.0.6/ezmorph-1.0.6.jar
[INFO] Downloading from osgeo: http://download.osgeo.org/webdav/geotools/log4j/log4j/1.2.17/log4j-1.2.17.jar
[INFO] Downloading from osgeo: http://download.osgeo.org/webdav/geotools/org/springframework/spring-jdbc/4.3.16.RELEASE/spring-jdbc-4.3.16.RELEASE.jar
[INFO] Downloading from osgeo: http://download.osgeo.org/webdav/geotools/org/slf4j/slf4j-api/1.6.4/slf4j-api-1.6.4.jar
[INFO] Downloading from osgeo: http://download.osgeo.org/webdav/geotools/org/springframework/spring-tx/4.3.16.RELEASE/spring-tx-4.3.16.RELEASE.jar
[INFO] Downloading from osgeo: http://download.osgeo.org/webdav/geotools/com/google/code/findbugs/jsr305/2.0.3/jsr305-2.0.3.jar
[INFO] Downloading from osgeo: http://download.osgeo.org/webdav/geotools/org/jasypt/jasypt/1.8/jasypt-1.8.jar
[INFO] Downloading from osgeo: http://download.osgeo.org/webdav/geotools/org/bouncycastle/bcprov-jdk15on/1.54/bcprov-jdk15on-1.54.jar
[INFO] Downloading from geosolutions: http://maven.geo-solutions.it/net/sf/json-lib/json-lib/2.2.3/json-lib-2.2.3-jdk15.jar
[INFO] Downloading from geosolutions: http://maven.geo-solutions.it/commons-beanutils/commons-beanutils/1.9.2/commons-beanutils-1.9.2.jar
[INFO] Downloading from geosolutions: http://maven.geo-solutions.it/net/sf/ezmorph/ezmorph/1.0.6/ezmorph-1.0.6.jar
[INFO] Downloading from geosolutions: http://maven.geo-solutions.it/log4j/log4j/1.2.17/log4j-1.2.17.jar
[INFO] Downloading from geosolutions: http://maven.geo-solutions.it/org/springframework/spring-jdbc/4.3.16.RELEASE/spring-jdbc-4.3.16.RELEASE.jar
[INFO] Downloading from geosolutions: http://maven.geo-solutions.it/org/springframework/spring-tx/4.3.16.RELEASE/spring-tx-4.3.16.RELEASE.jar
[INFO] Downloading from geosolutions: http://maven.geo-solutions.it/com/google/code/findbugs/jsr305/2.0.3/jsr305-2.0.3.jar
[INFO] Downloading from geosolutions: http://maven.geo-solutions.it/org/slf4j/slf4j-api/1.6.4/slf4j-api-1.6.4.jar
[INFO] Downloading from geosolutions: http://maven.geo-solutions.it/org/jasypt/jasypt/1.8/jasypt-1.8.jar
[INFO] Downloading from geosolutions: http://maven.geo-solutions.it/org/bouncycastle/bcprov-jdk15on/1.54/bcprov-jdk15on-1.54.jar
[INFO] Downloading from eclipse.maven.central.mirror: https://repo.eclipse.org/content/repositories/maven_central/net/sf/json-lib/json-lib/2.2.3/json-lib-2.2.3-jdk15.jar
[INFO] Downloading from eclipse.maven.central.mirror: https://repo.eclipse.org/content/repositories/maven_central/commons-beanutils/commons-beanutils/1.9.2/commons-beanutils-1.9.2.jar
[INFO] Downloading from eclipse.maven.central.mirror: https://repo.eclipse.org/content/repositories/maven_central/net/sf/ezmorph/ezmorph/1.0.6/ezmorph-1.0.6.jar
[INFO] Downloading from eclipse.maven.central.mirror: https://repo.eclipse.org/content/repositories/maven_central/log4j/log4j/1.2.17/log4j-1.2.17.jar
[INFO] Downloading from eclipse.maven.central.mirror: https://repo.eclipse.org/content/repositories/maven_central/org/springframework/spring-jdbc/4.3.16.RELEASE/spring-jdbc-4.3.16.RELEASE.jar
[INFO] Downloaded from eclipse.maven.central.mirror: https://repo.eclipse.org/content/repositories/maven_central/commons-beanutils/commons-beanutils/1.9.2/commons-beanutils-1.9.2.jar (234 kB at 3.2 MB/s)
[INFO] Downloading from eclipse.maven.central.mirror: https://repo.eclipse.org/content/repositories/maven_central/org/springframework/spring-tx/4.3.16.RELEASE/spring-tx-4.3.16.RELEASE.jar
[INFO] Downloaded from eclipse.maven.central.mirror: https://repo.eclipse.org/content/repositories/maven_central/log4j/log4j/1.2.17/log4j-1.2.17.jar (490 kB at 4.8 MB/s)
[INFO] Downloading from eclipse.maven.central.mirror: https://repo.eclipse.org/content/repositories/maven_central/com/google/code/findbugs/jsr305/2.0.3/jsr305-2.0.3.jar
[INFO] Downloaded from eclipse.maven.central.mirror: https://repo.eclipse.org/content/repositories/maven_central/net/sf/ezmorph/ezmorph/1.0.6/ezmorph-1.0.6.jar (86 kB at 824 kB/s)
[INFO] Downloading from eclipse.maven.central.mirror: https://repo.eclipse.org/content/repositories/maven_central/org/slf4j/slf4j-api/1.6.4/slf4j-api-1.6.4.jar
[INFO] Downloaded from eclipse.maven.central.mirror: https://repo.eclipse.org/content/repositories/maven_central/org/slf4j/slf4j-api/1.6.4/slf4j-api-1.6.4.jar (26 kB at 201 kB/s)
[INFO] Downloading from eclipse.maven.central.mirror: https://repo.eclipse.org/content/repositories/maven_central/org/jasypt/jasypt/1.8/jasypt-1.8.jar
[INFO] Downloaded from eclipse.maven.central.mirror: https://repo.eclipse.org/content/repositories/maven_central/com/google/code/findbugs/jsr305/2.0.3/jsr305-2.0.3.jar (33 kB at 246 kB/s)
[INFO] Downloading from eclipse.maven.central.mirror: https://repo.eclipse.org/content/repositories/maven_central/org/bouncycastle/bcprov-jdk15on/1.54/bcprov-jdk15on-1.54.jar
[INFO] Downloaded from eclipse.maven.central.mirror: https://repo.eclipse.org/content/repositories/maven_central/org/springframework/spring-tx/4.3.16.RELEASE/spring-tx-4.3.16.RELEASE.jar (268 kB at 911 kB/s)
[INFO] Downloaded from eclipse.maven.central.mirror: https://repo.eclipse.org/content/repositories/maven_central/net/sf/json-lib/json-lib/2.2.3/json-lib-2.2.3-jdk15.jar (148 kB at 488 kB/s)
[INFO] Downloaded from eclipse.maven.central.mirror: https://repo.eclipse.org/content/repositories/maven_central/org/bouncycastle/bcprov-jdk15on/1.54/bcprov-jdk15on-1.54.jar (3.3 MB at 5.0 MB/s)
[INFO] Downloaded from eclipse.maven.central.mirror: https://repo.eclipse.org/content/repositories/maven_central/org/jasypt/jasypt/1.8/jasypt-1.8.jar (179 kB at 267 kB/s)
[INFO] Downloaded from eclipse.maven.central.mirror: https://repo.eclipse.org/content/repositories/maven_central/org/springframework/spring-jdbc/4.3.16.RELEASE/spring-jdbc-4.3.16.RELEASE.jar (431 kB at 626 kB/s)
[INFO] 
[INFO] --- maven-clean-plugin:2.5:clean (default-clean) @ gs-main ---
[INFO] 
[INFO] --- git-commit-id-plugin:2.1.15:revision (default) @ gs-main ---
[INFO] 
[INFO] --- fmt-maven-plugin:2.4.0:format (default) @ gs-main ---
[debug] Using AOSP style
[INFO] Processed 101 files (0 reformatted).
[INFO] Processed 200 files (0 reformatted).
[INFO] Processed 300 files (0 reformatted).
[INFO] Processed 400 files (0 reformatted).
[INFO] Processed 500 files (0 reformatted).
[INFO] Processed 600 files (0 reformatted).
[INFO] Processed 700 files (0 reformatted).
[INFO] Processed 800 files (0 reformatted).
[INFO] Processed 823 files (0 reformatted).
[INFO] 
[INFO] --- maven-resources-plugin:2.6:resources (default-resources) @ gs-main ---
[INFO] Using 'UTF-8' encoding to copy filtered resources.
[INFO] Copying 35 resources
[INFO] Copying 138 resources
[INFO] 
[INFO] --- maven-compiler-plugin:2.3.2:compile (default-compile) @ gs-main ---
[INFO] Compiling 656 source files to /home/hudson/genie.jts/.jenkins/jobs/GeoServer-1.15.0/workspace/src/main/target/classes
[INFO] 
[INFO] --- maven-resources-plugin:2.6:testResources (default-testResources) @ gs-main ---
[INFO] Using 'UTF-8' encoding to copy filtered resources.
[INFO] Copying 113 resources
[INFO] Copying 44 resources
[INFO] 
[INFO] --- maven-compiler-plugin:2.3.2:testCompile (default-testCompile) @ gs-main ---
[INFO] Compiling 168 source files to /home/hudson/genie.jts/.jenkins/jobs/GeoServer-1.15.0/workspace/src/main/target/test-classes
[INFO] 
[INFO] --- maven-surefire-plugin:2.12.3:test (default-test) @ gs-main ---
[INFO] Surefire report directory: /home/hudson/genie.jts/.jenkins/jobs/GeoServer-1.15.0/workspace/src/main/target/surefire-reports

-------------------------------------------------------
 T E S T S
-------------------------------------------------------
Picked up JAVA_TOOL_OPTIONS: -Xmx2G -Djava.io.tmpdir=/tmp/genie.jts
Running org.geoserver.GeoServerInitStartupListenerTest
Tests run: 2, Failures: 0, Errors: 0, Skipped: 0, Time elapsed: 0.647 sec
Running org.geoserver.GeoServerNodeDataTest
Tests run: 1, Failures: 0, Errors: 0, Skipped: 0, Time elapsed: 0.002 sec
Running org.geoserver.ManifestLoaderTest
Tests run: 6, Failures: 0, Errors: 0, Skipped: 0, Time elapsed: 3.945 sec
Running org.geoserver.ManifestLoaderTest$ManifestPropertiesTest
Tests run: 2, Failures: 0, Errors: 0, Skipped: 0, Time elapsed: 3.508 sec
Running org.geoserver.ModuleStatusTest
Tests run: 1, Failures: 0, Errors: 0, Skipped: 0, Time elapsed: 0.396 sec
Running org.geoserver.catalog.AcceptableRangeTest
Tests run: 3, Failures: 0, Errors: 0, Skipped: 0, Time elapsed: 0.002 sec
Running org.geoserver.catalog.CatalogIntegrationTest
Tests run: 10, Failures: 0, Errors: 0, Skipped: 0, Time elapsed: 5.931 sec
Running org.geoserver.catalog.CatalogIsolatedWorkspacesTest
Tests run: 5, Failures: 0, Errors: 0, Skipped: 0, Time elapsed: 0.333 sec
Running org.geoserver.catalog.CatalogRepositoryTest
Tests run: 4, Failures: 0, Errors: 0, Skipped: 0, Time elapsed: 0.27 sec
Running org.geoserver.catalog.CoverageDimensionCustomizerReaderTest
Tests run: 5, Failures: 0, Errors: 0, Skipped: 0, Time elapsed: 0.292 sec
Running org.geoserver.catalog.CoverageViewTest
Tests run: 15, Failures: 0, Errors: 0, Skipped: 0, Time elapsed: 13.375 sec
Running org.geoserver.catalog.LayerGroupHelperTest
Tests run: 10, Failures: 0, Errors: 0, Skipped: 0, Time elapsed: 2.64 sec
Running org.geoserver.catalog.PredicatesTest
Tests run: 7, Failures: 0, Errors: 0, Skipped: 0, Time elapsed: 0.005 sec
Running org.geoserver.catalog.ResourcePoolTest
Tests run: 21, Failures: 0, Errors: 0, Skipped: 0, Time elapsed: 7.417 sec
Running org.geoserver.catalog.SLDNamedLayerRenameHelperTest
Tests run: 2, Failures: 0, Errors: 0, Skipped: 0, Time elapsed: 0.561 sec
Running org.geoserver.catalog.SchemaMappingTest
Tests run: 3, Failures: 0, Errors: 0, Skipped: 0, Time elapsed: 0.514 sec
Running org.geoserver.catalog.StyleGeneratorTest
Tests run: 3, Failures: 0, Errors: 0, Skipped: 0, Time elapsed: 0.058 sec
Running org.geoserver.catalog.StylesTest
Tests run: 5, Failures: 0, Errors: 0, Skipped: 0, Time elapsed: 0.494 sec
Running org.geoserver.catalog.impl.CascadeDeleteVisitorTest
Tests run: 6, Failures: 0, Errors: 0, Skipped: 0, Time elapsed: 1.552 sec
Running org.geoserver.catalog.impl.CascadeRemovalReporterTest
Tests run: 4, Failures: 0, Errors: 0, Skipped: 0, Time elapsed: 1.31 sec
Running org.geoserver.catalog.impl.CatalogBuilderIntTest
/home/hudson/genie.jts/.jenkins/jobs/GeoServer-1.15.0/workspace/src/main/./target/smallMosaic
/home/hudson/genie.jts/.jenkins/jobs/GeoServer-1.15.0/workspace/src/main/./target/largeMosaic
Tests run: 2, Failures: 0, Errors: 0, Skipped: 0, Time elapsed: 7.078 sec
Running org.geoserver.catalog.impl.CatalogBuilderTest
Tests run: 23, Failures: 0, Errors: 0, Skipped: 0, Time elapsed: 7.865 sec
Running org.geoserver.catalog.impl.CatalogImplTest
Tests run: 103, Failures: 0, Errors: 0, Skipped: 1, Time elapsed: 0.112 sec
Running org.geoserver.catalog.impl.CatalogProxiesTest
Tests run: 2, Failures: 0, Errors: 0, Skipped: 0, Time elapsed: 1.978 sec
Running org.geoserver.catalog.impl.DataLinkInfoImplTest
Tests run: 10, Failures: 0, Errors: 0, Skipped: 0, Time elapsed: 0.014 sec
Running org.geoserver.catalog.impl.FeatureTypeInfoImplTest
Tests run: 1, Failures: 0, Errors: 0, Skipped: 0, Time elapsed: 0 sec
Running org.geoserver.catalog.impl.InfoObjectProxyTest
Tests run: 1, Failures: 0, Errors: 0, Skipped: 0, Time elapsed: 0.002 sec
Running org.geoserver.catalog.impl.LocalWorkspaceCatalogTest
Tests run: 9, Failures: 0, Errors: 0, Skipped: 0, Time elapsed: 0.013 sec
Running org.geoserver.catalog.impl.LocalWorkspaceLayersTest
Tests run: 7, Failures: 0, Errors: 0, Skipped: 0, Time elapsed: 0.43 sec
Running org.geoserver.catalog.impl.MetadataLinkInfoImplTest
Tests run: 10, Failures: 0, Errors: 0, Skipped: 0, Time elapsed: 0.001 sec
Running org.geoserver.catalog.impl.ModificationProxyClonerTest
Tests run: 6, Failures: 0, Errors: 0, Skipped: 0, Time elapsed: 0.006 sec
Running org.geoserver.catalog.impl.ModificationProxyTest
Tests run: 7, Failures: 0, Errors: 0, Skipped: 0, Time elapsed: 0.001 sec
Running org.geoserver.catalog.impl.ReaderDimensionAccessorTest
Tests run: 5, Failures: 0, Errors: 0, Skipped: 0, Time elapsed: 0.001 sec
Running org.geoserver.catalog.impl.WorkspaceNamespaceConstencyTest
Tests run: 5, Failures: 0, Errors: 0, Skipped: 0, Time elapsed: 0.003 sec
Running org.geoserver.catalog.impl.util.LegacyCatalogImporterTest
Tests run: 3, Failures: 0, Errors: 0, Skipped: 0, Time elapsed: 4.949 sec
Running org.geoserver.config.DefaultGeoServerLoaderTest
Tests run: 3, Failures: 0, Errors: 0, Skipped: 0, Time elapsed: 0.096 sec
Running org.geoserver.config.GeoServerDataDirectoryTest
Tests run: 4, Failures: 0, Errors: 0, Skipped: 0, Time elapsed: 0.034 sec
Running org.geoserver.config.GeoServerImplTest
Tests run: 9, Failures: 0, Errors: 0, Skipped: 0, Time elapsed: 0.008 sec
Running org.geoserver.config.GeoServerPersistersTest
Tests run: 55, Failures: 0, Errors: 0, Skipped: 0, Time elapsed: 1.596 sec
Running org.geoserver.config.GeoServerPropertyConfigurerTest
Tests run: 2, Failures: 0, Errors: 0, Skipped: 0, Time elapsed: 0.093 sec
Running org.geoserver.config.GeoServerPropertyOverrideConfigurerTest
Tests run: 1, Failures: 0, Errors: 0, Skipped: 0, Time elapsed: 0.047 sec
Running org.geoserver.config.GeoServerTolerantStartupTest
Tests run: 1, Failures: 0, Errors: 0, Skipped: 0, Time elapsed: 0.82 sec
Running org.geoserver.config.LegacyConfigurationImporterTest
Tests run: 1, Failures: 0, Errors: 0, Skipped: 0, Time elapsed: 0.002 sec
Running org.geoserver.config.ServicePersisterTest
Tests run: 4, Failures: 0, Errors: 0, Skipped: 0, Time elapsed: 1.032 sec
Running org.geoserver.config.UpdateSequenceListenerTest
Tests run: 2, Failures: 0, Errors: 0, Skipped: 0, Time elapsed: 0.422 sec
Running org.geoserver.config.util.AuthorityURLInfoInfoListConverterTest
Tests run: 6, Failures: 0, Errors: 0, Skipped: 0, Time elapsed: 0.078 sec
Running org.geoserver.config.util.LayerIdentifierInfoListConverterTest
[{"authority":"auth1","identifier":"IDENTIFIER_1"},{"authority":"auth2","identifier":"IDENTIFIER_2"}]
Tests run: 6, Failures: 0, Errors: 0, Skipped: 0, Time elapsed: 0.002 sec
Running org.geoserver.config.util.SecureXStreamTest
Jun 28, 2018 8:25:07 PM org.geoserver.config.util.SecureXStream$DetailedSecurityExceptionWrapper realClass
SEVERE: Class org.easymock.Capture is not whitelisted for XML parsing. 
This is done to prevent Remote Code Execution attacks, but it might be 
you need this class to be authorized for GeoServer to actually work
If you are a user, you can set a variable named GEOSERVER_XSTREAM_WHITELIST
  with a semicolon separated list of fully qualified names, or patterns
  to match several classes.The variable can be set as a system variable,
  an environment variable, or a servlet context variable, just like
  GEOSERVER_DATA_DIR.
  For example, in order to authorize the org.geoserver.Foo class,
  plus any class in the org.geoserver.custom package, one could set
  a system variable: 
  -DGEOSERVER_XSTREAM_WHITELIST=org.geoserver.Foo;org.geoserver.custom.**
If instead you are a developer, you can call allowTypes/allowTypeHierarchy against
  the XStream used for serialization by rolling a custom
  XStreamPersisterInitializer or customizing your XStreamServiceLoader.
Jun 28, 2018 8:25:07 PM org.geoserver.config.util.SecureXStream$DetailedSecurityExceptionWrapper realClass
SEVERE: Class org.hamcrest.core.AllOf is not whitelisted for XML parsing. 
This is done to prevent Remote Code Execution attacks, but it might be 
you need this class to be authorized for GeoServer to actually work
If you are a user, you can set a variable named GEOSERVER_XSTREAM_WHITELIST
  with a semicolon separated list of fully qualified names, or patterns
  to match several classes.The variable can be set as a system variable,
  an environment variable, or a servlet context variable, just like
  GEOSERVER_DATA_DIR.
  For example, in order to authorize the org.geoserver.Foo class,
  plus any class in the org.geoserver.custom package, one could set
  a system variable: 
  -DGEOSERVER_XSTREAM_WHITELIST=org.geoserver.Foo;org.geoserver.custom.**
If instead you are a developer, you can call allowTypes/allowTypeHierarchy against
  the XStream used for serialization by rolling a custom
  XStreamPersisterInitializer or customizing your XStreamServiceLoader.
Jun 28, 2018 8:25:07 PM org.geoserver.config.util.SecureXStream$DetailedSecurityExceptionWrapper realClass
SEVERE: Class org.hamcrest.core.AllOf is not whitelisted for XML parsing. 
This is done to prevent Remote Code Execution attacks, but it might be 
you need this class to be authorized for GeoServer to actually work
If you are a user, you can set a variable named GEOSERVER_XSTREAM_WHITELIST
  with a semicolon separated list of fully qualified names, or patterns
  to match several classes.The variable can be set as a system variable,
  an environment variable, or a servlet context variable, just like
  GEOSERVER_DATA_DIR.
  For example, in order to authorize the org.geoserver.Foo class,
  plus any class in the org.geoserver.custom package, one could set
  a system variable: 
  -DGEOSERVER_XSTREAM_WHITELIST=org.geoserver.Foo;org.geoserver.custom.**
If instead you are a developer, you can call allowTypes/allowTypeHierarchy against
  the XStream used for serialization by rolling a custom
  XStreamPersisterInitializer or customizing your XStreamServiceLoader.
Tests run: 3, Failures: 0, Errors: 0, Skipped: 0, Time elapsed: 0.022 sec
Running org.geoserver.config.util.XStreamPersisterIntegrationTest
Tests run: 2, Failures: 0, Errors: 0, Skipped: 0, Time elapsed: 2.061 sec
Running org.geoserver.config.util.XStreamPersisterTest
Tests run: 37, Failures: 0, Errors: 0, Skipped: 1, Time elapsed: 0.283 sec
Running org.geoserver.data.jdbc.GenericUnWrapperTest
Tests run: 2, Failures: 0, Errors: 0, Skipped: 0, Time elapsed: 0.03 sec
Running org.geoserver.data.test.PropertyDataStoreRelativeUrlTest
Tests run: 1, Failures: 1, Errors: 0, Skipped: 0, Time elapsed: 0.419 sec <<< FAILURE!
testPropertyDataStoreRelativeUrl(org.geoserver.data.test.PropertyDataStoreRelativeUrlTest)  Time elapsed: 401 sec  <<< FAILURE!
org.junit.ComparisonFailure: expected:<file:/[jobs/genie.jt]s/geoserver-1.15.0/w...> but was:<file:/[home/hudson/genie.jts/.jenkins/job]s/geoserver-1.15.0/w...>
	at org.junit.Assert.assertEquals(Assert.java:115)
	at org.junit.Assert.assertEquals(Assert.java:144)
	at org.geoserver.data.test.PropertyDataStoreRelativeUrlTest.testPropertyDataStoreRelativeUrl(PropertyDataStoreRelativeUrlTest.java:49)
	at sun.reflect.NativeMethodAccessorImpl.invoke0(Native Method)
	at sun.reflect.NativeMethodAccessorImpl.invoke(NativeMethodAccessorImpl.java:62)
	at sun.reflect.DelegatingMethodAccessorImpl.invoke(DelegatingMethodAccessorImpl.java:43)
	at java.lang.reflect.Method.invoke(Method.java:498)
	at org.junit.runners.model.FrameworkMethod$1.runReflectiveCall(FrameworkMethod.java:47)
	at org.junit.internal.runners.model.ReflectiveCallable.run(ReflectiveCallable.java:12)
	at org.junit.runners.model.FrameworkMethod.invokeExplosively(FrameworkMethod.java:44)
	at org.junit.internal.runners.statements.InvokeMethod.evaluate(InvokeMethod.java:17)
	at org.junit.internal.runners.statements.RunBefores.evaluate(RunBefores.java:26)
	at org.junit.internal.runners.statements.RunAfters.evaluate(RunAfters.java:27)
	at org.junit.rules.RunRules.evaluate(RunRules.java:20)
	at org.junit.runners.ParentRunner.runLeaf(ParentRunner.java:271)
	at org.junit.runners.BlockJUnit4ClassRunner.runChild(BlockJUnit4ClassRunner.java:70)
	at org.junit.runners.BlockJUnit4ClassRunner.runChild(BlockJUnit4ClassRunner.java:50)
	at org.junit.runners.ParentRunner$3.run(ParentRunner.java:238)
	at org.junit.runners.ParentRunner$1.schedule(ParentRunner.java:63)
	at org.junit.runners.ParentRunner.runChildren(ParentRunner.java:236)
	at org.junit.runners.ParentRunner.access$000(ParentRunner.java:53)
	at org.junit.runners.ParentRunner$2.evaluate(ParentRunner.java:229)
	at org.junit.internal.runners.statements.RunBefores.evaluate(RunBefores.java:26)
	at org.junit.internal.runners.statements.RunAfters.evaluate(RunAfters.java:27)
	at org.junit.runners.ParentRunner.run(ParentRunner.java:309)
	at org.apache.maven.surefire.junit4.JUnit4Provider.execute(JUnit4Provider.java:252)
	at org.apache.maven.surefire.junit4.JUnit4Provider.executeTestSet(JUnit4Provider.java:141)
	at org.apache.maven.surefire.junit4.JUnit4Provider.invoke(JUnit4Provider.java:112)
	at sun.reflect.NativeMethodAccessorImpl.invoke0(Native Method)
	at sun.reflect.NativeMethodAccessorImpl.invoke(NativeMethodAccessorImpl.java:62)
	at sun.reflect.DelegatingMethodAccessorImpl.invoke(DelegatingMethodAccessorImpl.java:43)
	at java.lang.reflect.Method.invoke(Method.java:498)
	at org.apache.maven.surefire.util.ReflectionUtils.invokeMethodWithArray(ReflectionUtils.java:189)
	at org.apache.maven.surefire.booter.ProviderFactory$ProviderProxy.invoke(ProviderFactory.java:165)
	at org.apache.maven.surefire.booter.ProviderFactory.invokeProvider(ProviderFactory.java:85)
	at org.apache.maven.surefire.booter.ForkedBooter.runSuitesInProcess(ForkedBooter.java:115)
	at org.apache.maven.surefire.booter.ForkedBooter.main(ForkedBooter.java:75)

Running org.geoserver.data.util.CoverageUtilsTest
Tests run: 2, Failures: 0, Errors: 0, Skipped: 0, Time elapsed: 0 sec
Running org.geoserver.feature.CompositeFeatureCollectionTest
Tests run: 3, Failures: 0, Errors: 0, Skipped: 0, Time elapsed: 0.004 sec
Running org.geoserver.feature.ReprojectingFeatureCollectionTest
Tests run: 1, Failures: 0, Errors: 0, Skipped: 0, Time elapsed: 0.068 sec
Running org.geoserver.feature.RetypingFeatureCollectionTest
Tests run: 3, Failures: 0, Errors: 0, Skipped: 0, Time elapsed: 0.001 sec
Running org.geoserver.feature.retype.FullyRetypingDataStoreTest
Tests run: 10, Failures: 0, Errors: 0, Skipped: 0, Time elapsed: 0.09 sec
Running org.geoserver.feature.retype.RetypingDataStoreTest
Tests run: 11, Failures: 0, Errors: 0, Skipped: 0, Time elapsed: 0.037 sec
Running org.geoserver.feature.retype.RetypingFeatureSourceMockTest
Tests run: 1, Failures: 0, Errors: 0, Skipped: 0, Time elapsed: 0.005 sec
Running org.geoserver.feature.retype.RetypingFeatureSourceTest
Tests run: 2, Failures: 0, Errors: 0, Skipped: 0, Time elapsed: 0.005 sec
Running org.geoserver.filters.BufferedRequestStreamTest
Tests run: 1, Failures: 0, Errors: 0, Skipped: 0, Time elapsed: 0 sec
Running org.geoserver.filters.BufferedRequestWrapperTest
Tests run: 5, Failures: 0, Errors: 0, Skipped: 0, Time elapsed: 0.015 sec
Running org.geoserver.filters.FlushSafeFilterTest
Tests run: 2, Failures: 0, Errors: 0, Skipped: 0, Time elapsed: 0.012 sec
Running org.geoserver.filters.GZipFilterTest
Tests run: 4, Failures: 0, Errors: 0, Skipped: 0, Time elapsed: 0.007 sec
Running org.geoserver.filters.XFrameOptionsFilterTest
Tests run: 3, Failures: 0, Errors: 0, Skipped: 0, Time elapsed: 0 sec
Running org.geoserver.function.InstanceOfTest
Tests run: 5, Failures: 0, Errors: 0, Skipped: 0, Time elapsed: 0.001 sec
Running org.geoserver.logging.LegacyLoggingImporterTest
Tests run: 1, Failures: 0, Errors: 0, Skipped: 0, Time elapsed: 0.002 sec
Running org.geoserver.logging.LoggingStartupContextListenerTest
log4j:WARN No appenders could be found for logger (org.geoserver.logging).
log4j:WARN Please initialize the log4j system properly.
log4j:WARN See http://logging.apache.org/log4j/1.2/faq.html#noconfig for more info.
log4j:WARN File option not set for appender [geoserverlogfile].
log4j:WARN Are you using FileAppender instead of ConsoleAppender?
log4j:WARN File option not set for appender [geoserverlogfile].
log4j:WARN Are you using FileAppender instead of ConsoleAppender?
log4j:WARN File option not set for appender [geoserverlogfile].
log4j:WARN Are you using FileAppender instead of ConsoleAppender?
log4j:WARN File option not set for appender [geoserverlogfile].
log4j:WARN Are you using FileAppender instead of ConsoleAppender?
Tests run: 2, Failures: 1, Errors: 0, Skipped: 0, Time elapsed: 0.033 sec <<< FAILURE!
testLogLocationFromServletContext(org.geoserver.logging.LoggingStartupContextListenerTest)  Time elapsed: 26 sec  <<< FAILURE!
org.junit.ComparisonFailure: expected:</[jobs/genie.jt]s/geoserver-1.15.0/w...> but was:</[home/hudson/genie.jts/.jenkins/job]s/geoserver-1.15.0/w...>
	at org.junit.Assert.assertEquals(Assert.java:115)
	at org.junit.Assert.assertEquals(Assert.java:144)
	at org.geoserver.logging.LoggingStartupContextListenerTest.testLogLocationFromServletContext(LoggingStartupContextListenerTest.java:70)
	at sun.reflect.NativeMethodAccessorImpl.invoke0(Native Method)
	at sun.reflect.NativeMethodAccessorImpl.invoke(NativeMethodAccessorImpl.java:62)
	at sun.reflect.DelegatingMethodAccessorImpl.invoke(DelegatingMethodAccessorImpl.java:43)
	at java.lang.reflect.Method.invoke(Method.java:498)
	at org.junit.runners.model.FrameworkMethod$1.runReflectiveCall(FrameworkMethod.java:47)
	at org.junit.internal.runners.model.ReflectiveCallable.run(ReflectiveCallable.java:12)
	at org.junit.runners.model.FrameworkMethod.invokeExplosively(FrameworkMethod.java:44)
	at org.junit.internal.runners.statements.InvokeMethod.evaluate(InvokeMethod.java:17)
	at org.junit.internal.runners.statements.RunBefores.evaluate(RunBefores.java:26)
	at org.junit.runners.ParentRunner.runLeaf(ParentRunner.java:271)
	at org.junit.runners.BlockJUnit4ClassRunner.runChild(BlockJUnit4ClassRunner.java:70)
	at org.junit.runners.BlockJUnit4ClassRunner.runChild(BlockJUnit4ClassRunner.java:50)
	at org.junit.runners.ParentRunner$3.run(ParentRunner.java:238)
	at org.junit.runners.ParentRunner$1.schedule(ParentRunner.java:63)
	at org.junit.runners.ParentRunner.runChildren(ParentRunner.java:236)
	at org.junit.runners.ParentRunner.access$000(ParentRunner.java:53)
	at org.junit.runners.ParentRunner$2.evaluate(ParentRunner.java:229)
	at org.junit.runners.ParentRunner.run(ParentRunner.java:309)
	at org.apache.maven.surefire.junit4.JUnit4Provider.execute(JUnit4Provider.java:252)
	at org.apache.maven.surefire.junit4.JUnit4Provider.executeTestSet(JUnit4Provider.java:141)
	at org.apache.maven.surefire.junit4.JUnit4Provider.invoke(JUnit4Provider.java:112)
	at sun.reflect.NativeMethodAccessorImpl.invoke0(Native Method)
	at sun.reflect.NativeMethodAccessorImpl.invoke(NativeMethodAccessorImpl.java:62)
	at sun.reflect.DelegatingMethodAccessorImpl.invoke(DelegatingMethodAccessorImpl.java:43)
	at java.lang.reflect.Method.invoke(Method.java:498)
	at org.apache.maven.surefire.util.ReflectionUtils.invokeMethodWithArray(ReflectionUtils.java:189)
	at org.apache.maven.surefire.booter.ProviderFactory$ProviderProxy.invoke(ProviderFactory.java:165)
	at org.apache.maven.surefire.booter.ProviderFactory.invokeProvider(ProviderFactory.java:85)
	at org.apache.maven.surefire.booter.ForkedBooter.runSuitesInProcess(ForkedBooter.java:115)
	at org.apache.maven.surefire.booter.ForkedBooter.main(ForkedBooter.java:75)

Running org.geoserver.ows.CustomManglerTest
Tests run: 2, Failures: 0, Errors: 0, Skipped: 0, Time elapsed: 0.531 sec
Running org.geoserver.ows.LocalWorkspaceCallbackTest
Tests run: 11, Failures: 0, Errors: 0, Skipped: 0, Time elapsed: 0.423 sec
Running org.geoserver.ows.OWSHandlerMappingTest
Tests run: 11, Failures: 0, Errors: 0, Skipped: 0, Time elapsed: 0.408 sec
Running org.geoserver.ows.StylePublisherTest
Tests run: 3, Failures: 0, Errors: 0, Skipped: 0, Time elapsed: 1.41 sec
Running org.geoserver.ows.URLManglersTest
Tests run: 3, Failures: 0, Errors: 0, Skipped: 0, Time elapsed: 0.939 sec
Running org.geoserver.ows.kvp.NamespaceKvpParserTest
Tests run: 6, Failures: 0, Errors: 0, Skipped: 0, Time elapsed: 0.005 sec
Running org.geoserver.platform.GeoServerExtensionsHelperTest
Tests run: 4, Failures: 0, Errors: 0, Skipped: 0, Time elapsed: 0.002 sec
Running org.geoserver.security.decorators.SecuredCoverageInfoTest
Tests run: 3, Failures: 0, Errors: 0, Skipped: 0, Time elapsed: 0.514 sec
Running org.geoserver.security.decorators.SecuredFeatureTypeInfoTest
Tests run: 3, Failures: 0, Errors: 0, Skipped: 0, Time elapsed: 0.491 sec
Running org.geoserver.security.decorators.SecuredWMSLayerInfoTest
Tests run: 3, Failures: 0, Errors: 0, Skipped: 0, Time elapsed: 0.433 sec
Running org.geoserver.security.decorators.SecuredWMTSLayerInfoTest
Tests run: 3, Failures: 0, Errors: 0, Skipped: 0, Time elapsed: 0.496 sec
Running org.geoserver.security.impl.LayerGroupContainmentCacheTest
Tests run: 13, Failures: 0, Errors: 0, Skipped: 0, Time elapsed: 0.117 sec
Running org.geoserver.template.DirectFeatureWrapperTest
Tests run: 4, Failures: 0, Errors: 0, Skipped: 0, Time elapsed: 0.159 sec
Running org.geoserver.template.FeatureWrapperTest
Tests run: 4, Failures: 0, Errors: 0, Skipped: 0, Time elapsed: 0.011 sec
Running org.geoserver.template.GeoServerTemplateLoader2Test
Tests run: 5, Failures: 0, Errors: 0, Skipped: 0, Time elapsed: 0.017 sec
Running org.geoserver.threadlocals.AdminRequestThreadLocalTransferTest
Tests run: 1, Failures: 0, Errors: 0, Skipped: 0, Time elapsed: 0.038 sec
Running org.geoserver.threadlocals.AuthenticationThreadLocalTransferTest
Tests run: 1, Failures: 0, Errors: 0, Skipped: 0, Time elapsed: 0.003 sec
Running org.geoserver.threadlocals.LocalLayerThreadLocalTransferTest
Tests run: 1, Failures: 0, Errors: 0, Skipped: 0, Time elapsed: 0.001 sec
Running org.geoserver.threadlocals.LocalWorkspaceThreadLocalTransferTest
Tests run: 1, Failures: 0, Errors: 0, Skipped: 0, Time elapsed: 0.001 sec
Running org.geoserver.threadlocals.PublicThreadLocalTransferTest
Tests run: 1, Failures: 0, Errors: 0, Skipped: 0, Time elapsed: 0.001 sec
Running org.geoserver.threadlocals.ThreadLocalsTransferTest
Tests run: 1, Failures: 0, Errors: 0, Skipped: 0, Time elapsed: 0.258 sec
Running org.geoserver.util.DefaultCacheProviderTest
28 Jun 20:25:16 WARN [geoserver.util] - Multiple Cache Providers in context: testCacheProvider1, testCacheProvider2
	Using testCacheProvider1.  Override by setting system property GEOSERVER_DEFAULT_CACHE_PROVIDER
Tests run: 5, Failures: 0, Errors: 0, Skipped: 1, Time elapsed: 0.016 sec
Running org.geoserver.util.PartialBufferOutputStream2Test
Tests run: 1, Failures: 0, Errors: 0, Skipped: 0, Time elapsed: 0 sec
Running org.geoserver.util.XCQLTest
Tests run: 2, Failures: 0, Errors: 0, Skipped: 0, Time elapsed: 0.016 sec
Running org.geoserver.vfny.global.TolerantStartupTest
Tests run: 1, Failures: 0, Errors: 0, Skipped: 0, Time elapsed: 0.489 sec
Running org.geoserver.wfsng.WfsCompatibilityTest
Tests run: 1, Failures: 0, Errors: 0, Skipped: 1, Time elapsed: 0.544 sec
Running org.vfny.geoserver.ProjectionPolicyTest
Tests run: 5, Failures: 0, Errors: 0, Skipped: 0, Time elapsed: 0.66 sec
Running org.vfny.geoserver.crs.OverrideCRSTest
Tests run: 1, Failures: 0, Errors: 0, Skipped: 0, Time elapsed: 0.367 sec
Running org.vfny.geoserver.crs.OvverideTransformationsTest
Tests run: 4, Failures: 0, Errors: 0, Skipped: 0, Time elapsed: 0.725 sec
Running org.vfny.geoserver.global.GeoserverDataDirectoryTest
Tests run: 4, Failures: 0, Errors: 0, Skipped: 0, Time elapsed: 0.483 sec
Running org.vfny.geoserver.global.xml.WriterHelperTest
Tests run: 3, Failures: 0, Errors: 0, Skipped: 0, Time elapsed: 0 sec
Running org.vfny.geoserver.util.ResponseUtilsTest
Tests run: 6, Failures: 0, Errors: 0, Skipped: 0, Time elapsed: 0.009 sec
Running org.vfny.geoserver.util.SLDValidatorTest
Tests run: 2, Failures: 0, Errors: 0, Skipped: 0, Time elapsed: 0.013 sec

Results :

Failed tests:   testPropertyDataStoreRelativeUrl(org.geoserver.data.test.PropertyDataStoreRelativeUrlTest): expected:<file:/[jobs/genie.jt]s/geoserver-1.15.0/w...> but was:<file:/[home/hudson/genie.jts/.jenkins/job]s/geoserver-1.15.0/w...>
  testLogLocationFromServletContext(org.geoserver.logging.LoggingStartupContextListenerTest): expected:</[jobs/genie.jt]s/geoserver-1.15.0/w...> but was:</[home/hudson/genie.jts/.jenkins/job]s/geoserver-1.15.0/w...>

Tests run: 623, Failures: 2, Errors: 0, Skipped: 4

[JENKINS] Recording test results
Started calculate disk usage of build
Finished Calculation of disk usage of build in 0 seconds
Started calculate disk usage of workspace
Finished Calculation of disk usage of workspace in 0 seconds
[INFO] ------------------------------------------------------------------------
[INFO] Reactor Summary:
[INFO] 
[INFO] GeoServer 2.14-SNAPSHOT ............................ SUCCESS [  4.681 s]
[INFO] Core Platform Module ............................... SUCCESS [ 28.385 s]
[INFO] Open Web Service Module ............................ SUCCESS [ 16.318 s]
[INFO] Main Module ........................................ FAILURE [01:51 min]
[INFO] GeoServer Security Modules ......................... SKIPPED
[INFO] GeoServer Security Tests Module .................... SKIPPED
[INFO] GeoServer JDBC Security Module ..................... SKIPPED
[INFO] GeoServer LDAP Security Module ..................... SKIPPED
[INFO] Web Coverage Service Module ........................ SKIPPED
[INFO] Web Coverage Service 1.0 Module .................... SKIPPED
[INFO] Web Coverage Service 1.1 Module .................... SKIPPED
[INFO] Web Coverage Service 2.0 Module .................... SKIPPED
[INFO] Web Feature Service Module ......................... SKIPPED
[INFO] Web Map Service Module ............................. SKIPPED
[INFO] KML support for GeoServer .......................... SKIPPED
[INFO] gs-rest ............................................ SKIPPED
[INFO] GeoWebCache (GWC) Module ........................... SKIPPED
[INFO] gs-restconfig ...................................... SKIPPED
[INFO] gs-restconfig-wcs .................................. SKIPPED
[INFO] gs-restconfig-wfs .................................. SKIPPED
[INFO] gs-restconfig-wms .................................. SKIPPED
[INFO] GeoServer Web Modules .............................. SKIPPED
[INFO] Core UI Module ..................................... SKIPPED
[INFO] WMS UI Module ...................................... SKIPPED
[INFO] GWC UI Module ...................................... SKIPPED
[INFO] WFS UI Module ...................................... SKIPPED
[INFO] Demos Module ....................................... SKIPPED
[INFO] WCS UI Module ...................................... SKIPPED
[INFO] Security UI Modules ................................ SKIPPED
[INFO] Security UI Core Module ............................ SKIPPED
[INFO] Security UI JDBC Module ............................ SKIPPED
[INFO] Security UI LDAP Module ............................ SKIPPED
[INFO] REST UI Module ..................................... SKIPPED
[INFO] GeoServer Web Application .......................... SKIPPED
[INFO] Community Space .................................... SKIPPED
[INFO] GeoServer Extensions 2.14-SNAPSHOT ................. SKIPPED
[INFO] ------------------------------------------------------------------------
[INFO] BUILD FAILURE
[INFO] ------------------------------------------------------------------------
[INFO] Total time: 02:46 min
[INFO] Finished at: 2018-06-28T20:25:23-04:00
[INFO] ------------------------------------------------------------------------
Waiting for Jenkins to finish collecting data
[ERROR] Failed to execute goal org.apache.maven.plugins:maven-surefire-plugin:2.12.3:test (default-test) on project gs-main: There are test failures.
[ERROR] 
[ERROR] Please refer to /home/hudson/genie.jts/.jenkins/jobs/GeoServer-1.15.0/workspace/src/main/target/surefire-reports for the individual test results.
[ERROR] -> [Help 1]
[ERROR] 
[ERROR] To see the full stack trace of the errors, re-run Maven with the -e switch.
[ERROR] Re-run Maven using the -X switch to enable full debug logging.
[ERROR] 
[ERROR] For more information about the errors and possible solutions, please read the following articles:
[ERROR] [Help 1] http://cwiki.apache.org/confluence/display/MAVEN/MojoFailureException
[ERROR] 
[ERROR] After correcting the problems, you can resume the build with the command
[JENKINS] Archiving /home/hudson/genie.jts/.jenkins/jobs/GeoServer-1.15.0/workspace/src/web/security/ldap/pom.xml to org.geoserver.web/gs-web-sec-ldap/2.14-SNAPSHOT/gs-web-sec-ldap-2.14-SNAPSHOT.pom
[ERROR]   mvn <goals> -rf :gs-main
[JENKINS] Archiving /home/hudson/genie.jts/.jenkins/jobs/GeoServer-1.15.0/workspace/src/web/pom.xml to org.geoserver/web/2.14-SNAPSHOT/web-2.14-SNAPSHOT.pom
[JENKINS] Archiving /home/hudson/genie.jts/.jenkins/jobs/GeoServer-1.15.0/workspace/src/wms/pom.xml to org.geoserver/gs-wms/2.14-SNAPSHOT/gs-wms-2.14-SNAPSHOT.pom
[JENKINS] Archiving /home/hudson/genie.jts/.jenkins/jobs/GeoServer-1.15.0/workspace/src/restconfig-wms/pom.xml to org.geoserver/gs-restconfig-wms/2.14-SNAPSHOT/gs-restconfig-wms-2.14-SNAPSHOT.pom
[JENKINS] Archiving /home/hudson/genie.jts/.jenkins/jobs/GeoServer-1.15.0/workspace/src/wcs/pom.xml to org.geoserver/gs-wcs/2.14-SNAPSHOT/gs-wcs-2.14-SNAPSHOT.pom
[JENKINS] Archiving /home/hudson/genie.jts/.jenkins/jobs/GeoServer-1.15.0/workspace/src/web/security/core/pom.xml to org.geoserver.web/gs-web-sec-core/2.14-SNAPSHOT/gs-web-sec-core-2.14-SNAPSHOT.pom
[JENKINS] Archiving /home/hudson/genie.jts/.jenkins/jobs/GeoServer-1.15.0/workspace/src/web/security/pom.xml to org.geoserver.web/gs-web-sec/2.14-SNAPSHOT/gs-web-sec-2.14-SNAPSHOT.pom
[JENKINS] Archiving /home/hudson/genie.jts/.jenkins/jobs/GeoServer-1.15.0/workspace/src/community/pom.xml to org.geoserver/community/2.14-SNAPSHOT/community-2.14-SNAPSHOT.pom
[JENKINS] Archiving /home/hudson/genie.jts/.jenkins/jobs/GeoServer-1.15.0/workspace/src/security/pom.xml to org.geoserver/gs-security/2.14-SNAPSHOT/gs-security-2.14-SNAPSHOT.pom
[JENKINS] Archiving /home/hudson/genie.jts/.jenkins/jobs/GeoServer-1.15.0/workspace/src/ows/pom.xml to org.geoserver/gs-ows/2.14-SNAPSHOT/gs-ows-2.14-SNAPSHOT.pom
[JENKINS] Archiving /home/hudson/genie.jts/.jenkins/jobs/GeoServer-1.15.0/workspace/src/ows/target/gs-ows-2.14-SNAPSHOT.jar to org.geoserver/gs-ows/2.14-SNAPSHOT/gs-ows-2.14-SNAPSHOT.jar
[JENKINS] Archiving /home/hudson/genie.jts/.jenkins/jobs/GeoServer-1.15.0/workspace/src/ows/target/gs-ows-2.14-SNAPSHOT-tests.jar to org.geoserver/gs-ows/2.14-SNAPSHOT/gs-ows-2.14-SNAPSHOT-tests.jar
[JENKINS] Archiving /home/hudson/genie.jts/.jenkins/jobs/GeoServer-1.15.0/workspace/src/ows/target/gs-ows-2.14-SNAPSHOT-sources.jar to org.geoserver/gs-ows/2.14-SNAPSHOT/gs-ows-2.14-SNAPSHOT-sources.jar
[JENKINS] Archiving /home/hudson/genie.jts/.jenkins/jobs/GeoServer-1.15.0/workspace/src/ows/target/gs-ows-2.14-SNAPSHOT-test-sources.jar to org.geoserver/gs-ows/2.14-SNAPSHOT/gs-ows-2.14-SNAPSHOT-test-sources.jar
[JENKINS] Archiving /home/hudson/genie.jts/.jenkins/jobs/GeoServer-1.15.0/workspace/src/web/wcs/pom.xml to org.geoserver.web/gs-web-wcs/2.14-SNAPSHOT/gs-web-wcs-2.14-SNAPSHOT.pom
[JENKINS] Archiving /home/hudson/genie.jts/.jenkins/jobs/GeoServer-1.15.0/workspace/src/web/wms/pom.xml to org.geoserver.web/gs-web-wms/2.14-SNAPSHOT/gs-web-wms-2.14-SNAPSHOT.pom
[JENKINS] Archiving /home/hudson/genie.jts/.jenkins/jobs/GeoServer-1.15.0/workspace/src/rest/pom.xml to org.geoserver/gs-rest/2.14-SNAPSHOT/gs-rest-2.14-SNAPSHOT.pom
[JENKINS] Archiving /home/hudson/genie.jts/.jenkins/jobs/GeoServer-1.15.0/workspace/src/restconfig-wfs/pom.xml to org.geoserver/gs-restconfig-wfs/2.14-SNAPSHOT/gs-restconfig-wfs-2.14-SNAPSHOT.pom
[JENKINS] Archiving /home/hudson/genie.jts/.jenkins/jobs/GeoServer-1.15.0/workspace/src/web/app/pom.xml to org.geoserver.web/gs-web-app/2.14-SNAPSHOT/gs-web-app-2.14-SNAPSHOT.pom
[JENKINS] Archiving /home/hudson/genie.jts/.jenkins/jobs/GeoServer-1.15.0/workspace/src/restconfig/pom.xml to org.geoserver/gs-restconfig/2.14-SNAPSHOT/gs-restconfig-2.14-SNAPSHOT.pom
[JENKINS] Archiving /home/hudson/genie.jts/.jenkins/jobs/GeoServer-1.15.0/workspace/src/web/gwc/pom.xml to org.geoserver.web/gs-web-gwc/2.14-SNAPSHOT/gs-web-gwc-2.14-SNAPSHOT.pom
[JENKINS] Archiving /home/hudson/genie.jts/.jenkins/jobs/GeoServer-1.15.0/workspace/src/main/pom.xml to org.geoserver/gs-main/2.14-SNAPSHOT/gs-main-2.14-SNAPSHOT.pom
[JENKINS] Archiving /home/hudson/genie.jts/.jenkins/jobs/GeoServer-1.15.0/workspace/src/platform/pom.xml to org.geoserver/gs-platform/2.14-SNAPSHOT/gs-platform-2.14-SNAPSHOT.pom
[JENKINS] Archiving /home/hudson/genie.jts/.jenkins/jobs/GeoServer-1.15.0/workspace/src/platform/target/gs-platform-2.14-SNAPSHOT.jar to org.geoserver/gs-platform/2.14-SNAPSHOT/gs-platform-2.14-SNAPSHOT.jar
[JENKINS] Archiving /home/hudson/genie.jts/.jenkins/jobs/GeoServer-1.15.0/workspace/src/platform/target/gs-platform-2.14-SNAPSHOT-tests.jar to org.geoserver/gs-platform/2.14-SNAPSHOT/gs-platform-2.14-SNAPSHOT-tests.jar
[JENKINS] Archiving /home/hudson/genie.jts/.jenkins/jobs/GeoServer-1.15.0/workspace/src/platform/target/gs-platform-2.14-SNAPSHOT-sources.jar to org.geoserver/gs-platform/2.14-SNAPSHOT/gs-platform-2.14-SNAPSHOT-sources.jar
[JENKINS] Archiving /home/hudson/genie.jts/.jenkins/jobs/GeoServer-1.15.0/workspace/src/platform/target/gs-platform-2.14-SNAPSHOT-test-sources.jar to org.geoserver/gs-platform/2.14-SNAPSHOT/gs-platform-2.14-SNAPSHOT-test-sources.jar
[JENKINS] Archiving /home/hudson/genie.jts/.jenkins/jobs/GeoServer-1.15.0/workspace/src/kml/pom.xml to org.geoserver/gs-kml/2.14-SNAPSHOT/gs-kml-2.14-SNAPSHOT.pom
[JENKINS] Archiving /home/hudson/genie.jts/.jenkins/jobs/GeoServer-1.15.0/workspace/src/wfs/pom.xml to org.geoserver/gs-wfs/2.14-SNAPSHOT/gs-wfs-2.14-SNAPSHOT.pom
[JENKINS] Archiving /home/hudson/genie.jts/.jenkins/jobs/GeoServer-1.15.0/workspace/src/web/security/jdbc/pom.xml to org.geoserver.web/gs-web-sec-jdbc/2.14-SNAPSHOT/gs-web-sec-jdbc-2.14-SNAPSHOT.pom
[JENKINS] Archiving /home/hudson/genie.jts/.jenkins/jobs/GeoServer-1.15.0/workspace/src/security/ldap/pom.xml to org.geoserver.security/gs-sec-ldap/2.14-SNAPSHOT/gs-sec-ldap-2.14-SNAPSHOT.pom
[JENKINS] Archiving /home/hudson/genie.jts/.jenkins/jobs/GeoServer-1.15.0/workspace/src/web/demo/pom.xml to org.geoserver.web/gs-web-demo/2.14-SNAPSHOT/gs-web-demo-2.14-SNAPSHOT.pom
[JENKINS] Archiving /home/hudson/genie.jts/.jenkins/jobs/GeoServer-1.15.0/workspace/src/extension/pom.xml to org.geoserver/extension/2.14-SNAPSHOT/extension-2.14-SNAPSHOT.pom
[JENKINS] Archiving /home/hudson/genie.jts/.jenkins/jobs/GeoServer-1.15.0/workspace/src/web/wfs/pom.xml to org.geoserver.web/gs-web-wfs/2.14-SNAPSHOT/gs-web-wfs-2.14-SNAPSHOT.pom
[JENKINS] Archiving /home/hudson/genie.jts/.jenkins/jobs/GeoServer-1.15.0/workspace/src/web/core/pom.xml to org.geoserver.web/gs-web-core/2.14-SNAPSHOT/gs-web-core-2.14-SNAPSHOT.pom
[JENKINS] Archiving /home/hudson/genie.jts/.jenkins/jobs/GeoServer-1.15.0/workspace/src/pom.xml to org.geoserver/geoserver/2.14-SNAPSHOT/geoserver-2.14-SNAPSHOT.pom
[JENKINS] Archiving /home/hudson/genie.jts/.jenkins/jobs/GeoServer-1.15.0/workspace/src/target/geoserver-2.14-SNAPSHOT-tests.jar to org.geoserver/geoserver/2.14-SNAPSHOT/geoserver-2.14-SNAPSHOT-tests.jar
[JENKINS] Archiving /home/hudson/genie.jts/.jenkins/jobs/GeoServer-1.15.0/workspace/src/security/security-tests/pom.xml to org.geoserver.security/gs-security-tests/2.14-SNAPSHOT/gs-security-tests-2.14-SNAPSHOT.pom
[JENKINS] Archiving /home/hudson/genie.jts/.jenkins/jobs/GeoServer-1.15.0/workspace/src/wcs1_0/pom.xml to org.geoserver/gs-wcs1_0/2.14-SNAPSHOT/gs-wcs1_0-2.14-SNAPSHOT.pom
[JENKINS] Archiving /home/hudson/genie.jts/.jenkins/jobs/GeoServer-1.15.0/workspace/src/web/rest/pom.xml to org.geoserver.web/gs-web-rest/2.14-SNAPSHOT/gs-web-rest-2.14-SNAPSHOT.pom
[JENKINS] Archiving /home/hudson/genie.jts/.jenkins/jobs/GeoServer-1.15.0/workspace/src/security/jdbc/pom.xml to org.geoserver.security/gs-sec-jdbc/2.14-SNAPSHOT/gs-sec-jdbc-2.14-SNAPSHOT.pom
[JENKINS] Archiving /home/hudson/genie.jts/.jenkins/jobs/GeoServer-1.15.0/workspace/src/wcs1_1/pom.xml to org.geoserver/gs-wcs1_1/2.14-SNAPSHOT/gs-wcs1_1-2.14-SNAPSHOT.pom
[JENKINS] Archiving /home/hudson/genie.jts/.jenkins/jobs/GeoServer-1.15.0/workspace/src/wcs2_0/pom.xml to org.geoserver/gs-wcs2_0/2.14-SNAPSHOT/gs-wcs2_0-2.14-SNAPSHOT.pom
[JENKINS] Archiving /home/hudson/genie.jts/.jenkins/jobs/GeoServer-1.15.0/workspace/src/gwc/pom.xml to org.geoserver/gs-gwc/2.14-SNAPSHOT/gs-gwc-2.14-SNAPSHOT.pom
[JENKINS] Archiving /home/hudson/genie.jts/.jenkins/jobs/GeoServer-1.15.0/workspace/src/restconfig-wcs/pom.xml to org.geoserver/gs-restconfig-wcs/2.14-SNAPSHOT/gs-restconfig-wcs-2.14-SNAPSHOT.pom
channel stopped
Started calculate disk usage of build
Finished Calculation of disk usage of build in 0 seconds
Started calculate disk usage of workspace
Finished Calculation of disk usage of workspace in 0 seconds
Finished: FAILURE