AbortedConsole Output

Skipping 494 KB.. Full Log
rness - sClassPathFromExecProps = 
[javatest.batch] command: com.sun.ts.lib.harness.ExecTSTestCmd CLASSPATH=:/home/jenkins/workspace/TCK_JSONP_run/jsonp-tck/bin/xml/../../lib/tsharness.jar:/home/jenkins/workspace/TCK_JSONP_run/jsonp-tck/bin/xml/../../lib/sigtest.jar:/home/jenkins/workspace/TCK_JSONP_run/jsonp-tck/bin/xml/../../lib/jsonptck.jar:/home/jenkins/workspace/TCK_JSONP_run/jsonp-tck/bin/xml/../../classes:/home/jenkins/workspace/TCK_JSONP_run/jsonp-tck/bin/xml/../../bin:jsonp.alt.provider.classes:/home/jenkins/workspace/TCK_JSONP_run/jsonp-tck/bin/xml/../../src/com/sun/ts/tests/jsonp/resources:/home/jenkins/workspace/TCK_JSONP_run/jsonp-tck/bin/xml/../../../glassfish5/glassfish/modules/cdi-api.jar:/home/jenkins/workspace/TCK_JSONP_run/jsonp-tck/bin/xml/../../../glassfish5/glassfish/modules/jakarta.ejb-api.jar:/home/jenkins/workspace/TCK_JSONP_run/jsonp-tck/bin/xml/../../../glassfish5/glassfish/modules/jakarta.inject.jar:/home/jenkins/workspace/TCK_JSONP_run/jsonp-tck/bin/xml/../../../glassfish5/glassfish/modules/jakarta.json.jar:/home/jenkins/workspace/TCK_JSONP_run/jsonp-tck/bin/xml/../../../glassfish5/glassfish/modules/jakarta.json-api.jar:/home/jenkins/workspace/TCK_JSONP_run/jsonp-tck/bin/xml/../../../glassfish5/glassfish/modules/jakarta.persistence.jar:/home/jenkins/workspace/TCK_JSONP_run/jsonp-tck/bin/xml/../../../glassfish5/glassfish/modules/jakarta.servlet-api.jar:/home/jenkins/workspace/TCK_JSONP_run/jsonp-tck/bin/xml/../../../glassfish5/glassfish/modules/jakarta.transaction-api.jar DISPLAY=:0.0 HOME=/home/jenkins windir= SYSTEMROOT= /opt/tools/java/oracle/jdk-8/1.8.0_202/jre/bin/java -Djava.security.policy=/home/jenkins/workspace/TCK_JSONP_run/jsonp-tck/bin/xml/../../bin/harness.policy -Djava.security.manager -Ddeliverable.class=com.sun.ts.lib.deliverable.jsonp.JSONPDeliverable com.sun.ts.tests.common.vehicle.VehicleClient -p /home/jenkins/workspace/TCK_JSONP_run/jsonp-tck/bin/xml/../../tmp/tstest.jte -t jsonValuesTest -vehicle standalone
[javatest.batch] ************************************************************
[javatest.batch] * props file set to "/tmp/default-cts-props.txt"
[javatest.batch] ************************************************************
[javatest.batch] 07-30-2019 12:33:08:  TRACE: #######  Value of harness.socket.retry.count is "10"
[javatest.batch] 07-30-2019 12:33:08:  TRACE: #######  Value of harness.log.port is "2000"
[javatest.batch] 07-30-2019 12:33:08:  TRACE: #######  Actual bind value of harness.log.port is "2000"
[javatest.batch] 07-30-2019 12:33:08:  TRACE: in ServiceEETest.run() method
[javatest.batch] 07-30-2019 12:33:08:  TRACE: Vehicle to be used for this test is:  standalone
[javatest.batch] 07-30-2019 12:33:08:  TRACE: in custom vehicle so call on EETest.
[javatest.batch] 07-30-2019 12:33:08:  TRACE: *** in EETest.run(argv,p)
[javatest.batch] 07-30-2019 12:33:08:  TRACE: TESTCLASS=com.sun.ts.tests.jsonp.api.jsonparsereventtests.Client
[javatest.batch] 07-30-2019 12:33:08:  TRACE: ** IN getRunMethod: testClass=com.sun.ts.tests.jsonp.api.jsonparsereventtests.Client
[javatest.batch] 07-30-2019 12:33:08:  TRACE: ** IN getRunMethod: testname=jsonValuesTest
[javatest.batch] 07-30-2019 12:33:08:  TRACE: ** GOT RUN METHOD!
[javatest.batch] 07-30-2019 12:33:08:  TRACE: **runmethod=jsonValuesTest
[javatest.batch] 07-30-2019 12:33:08:  TRACE: ABOUT TO GET SETUP METHOD!
[javatest.batch] 07-30-2019 12:33:08:  TRACE: No setupMethod annotation present
[javatest.batch] 07-30-2019 12:33:08:  TRACE: getSetupMethod - checking for testcase specific setup method:  jsonValuesTest_setup
[javatest.batch] 07-30-2019 12:33:08:  TRACE: getSetupMethod - checking for default class specific setup method
[javatest.batch] 07-30-2019 12:33:08:  TRACE: GOT SETUP METHOD!
[javatest.batch] 07-30-2019 12:33:08:  TRACE: No cleanupMethod annotation present
[javatest.batch] 07-30-2019 12:33:08:  TRACE: getCleanupMethod - checking for testcase specific cleanup method:  jsonValuesTest_cleanup
[javatest.batch] 07-30-2019 12:33:08:  TRACE: getCleanupMethod - checking for default class specific cleanup method
[javatest.batch] 07-30-2019 12:33:08:  TRACE: GOT CLEANUP METHOD!
[javatest.batch] 07-30-2019 12:33:08:  TRACE: ABOUT TO INVOKE SETUP METHOD!
[javatest.batch] 07-30-2019 12:33:08:  setup ok
[javatest.batch] 07-30-2019 12:33:08:  TRACE: INVOKED SETUP METHOD!
[javatest.batch] 07-30-2019 12:33:08:  TRACE: ABOUT TO INVOKE EETEST RUN METHOD!
[javatest.batch] 07-30-2019 12:33:08:  Testing API method JsonParser.Event.values() to return array of enums.
[javatest.batch] 07-30-2019 12:33:08:  Got START_ARRAY for enum START_ARRAY
[javatest.batch] 07-30-2019 12:33:08:  Got START_OBJECT for enum START_OBJECT
[javatest.batch] 07-30-2019 12:33:08:  Got KEY_NAME for enum KEY_NAME
[javatest.batch] 07-30-2019 12:33:08:  Got VALUE_STRING for enum VALUE_STRING
[javatest.batch] 07-30-2019 12:33:08:  Got VALUE_NUMBER for enum VALUE_NUMBER
[javatest.batch] 07-30-2019 12:33:08:  Got VALUE_TRUE for enum VALUE_TRUE
[javatest.batch] 07-30-2019 12:33:08:  Got VALUE_FALSE for enum VALUE_FALSE
[javatest.batch] 07-30-2019 12:33:08:  Got VALUE_NULL for enum VALUE_NULL
[javatest.batch] 07-30-2019 12:33:08:  Got END_OBJECT for enum END_OBJECT
[javatest.batch] 07-30-2019 12:33:08:  Got END_ARRAY for enum END_ARRAY
[javatest.batch] 07-30-2019 12:33:08:  cleanup ok
[javatest.batch] 07-30-2019 12:33:09:  TRACE: SLEPT FOR:  1000
[javatest.batch] STATUS:Passed.
[javatest.batch] Passed.
[javatest.batch] ********************************************************************************
[javatest.batch] Finished Test:  PASSED........com/sun/ts/tests/jsonp/api/jsonparsereventtests/Client.java#jsonValuesTest_from_standalone
[javatest.batch] ********************************************************************************
[javatest.batch] Number of tests completed:  58 (58 passed, 0 failed, 0 with errors)
[javatest.batch] Number of tests remaining:  111
[javatest.batch] ********************************************************************************
[javatest.batch] Beginning Test:  com/sun/ts/tests/jsonp/api/jsonparserfactorytests/Client.java#jsonParserFactoryExceptionTest_from_standalone
[javatest.batch] ********************************************************************************
[javatest.batch] 
[javatest.batch] 07-30-2019 12:33:10:  Harness - harness.executeMode is set to "2"
[javatest.batch] 07-30-2019 12:33:10:  Harness - keywords (to be passed to tests) set to:  all
[javatest.batch] 07-30-2019 12:33:10:  Harness - sClassPathFromExecProps = 
[javatest.batch] command: com.sun.ts.lib.harness.ExecTSTestCmd CLASSPATH=:/home/jenkins/workspace/TCK_JSONP_run/jsonp-tck/bin/xml/../../lib/tsharness.jar:/home/jenkins/workspace/TCK_JSONP_run/jsonp-tck/bin/xml/../../lib/sigtest.jar:/home/jenkins/workspace/TCK_JSONP_run/jsonp-tck/bin/xml/../../lib/jsonptck.jar:/home/jenkins/workspace/TCK_JSONP_run/jsonp-tck/bin/xml/../../classes:/home/jenkins/workspace/TCK_JSONP_run/jsonp-tck/bin/xml/../../bin:jsonp.alt.provider.classes:/home/jenkins/workspace/TCK_JSONP_run/jsonp-tck/bin/xml/../../src/com/sun/ts/tests/jsonp/resources:/home/jenkins/workspace/TCK_JSONP_run/jsonp-tck/bin/xml/../../../glassfish5/glassfish/modules/cdi-api.jar:/home/jenkins/workspace/TCK_JSONP_run/jsonp-tck/bin/xml/../../../glassfish5/glassfish/modules/jakarta.ejb-api.jar:/home/jenkins/workspace/TCK_JSONP_run/jsonp-tck/bin/xml/../../../glassfish5/glassfish/modules/jakarta.inject.jar:/home/jenkins/workspace/TCK_JSONP_run/jsonp-tck/bin/xml/../../../glassfish5/glassfish/modules/jakarta.json.jar:/home/jenkins/workspace/TCK_JSONP_run/jsonp-tck/bin/xml/../../../glassfish5/glassfish/modules/jakarta.json-api.jar:/home/jenkins/workspace/TCK_JSONP_run/jsonp-tck/bin/xml/../../../glassfish5/glassfish/modules/jakarta.persistence.jar:/home/jenkins/workspace/TCK_JSONP_run/jsonp-tck/bin/xml/../../../glassfish5/glassfish/modules/jakarta.servlet-api.jar:/home/jenkins/workspace/TCK_JSONP_run/jsonp-tck/bin/xml/../../../glassfish5/glassfish/modules/jakarta.transaction-api.jar DISPLAY=:0.0 HOME=/home/jenkins windir= SYSTEMROOT= /opt/tools/java/oracle/jdk-8/1.8.0_202/jre/bin/java -Djava.security.policy=/home/jenkins/workspace/TCK_JSONP_run/jsonp-tck/bin/xml/../../bin/harness.policy -Djava.security.manager -Ddeliverable.class=com.sun.ts.lib.deliverable.jsonp.JSONPDeliverable com.sun.ts.tests.common.vehicle.VehicleClient -p /home/jenkins/workspace/TCK_JSONP_run/jsonp-tck/bin/xml/../../tmp/tstest.jte -t jsonParserFactoryExceptionTest -vehicle standalone
[javatest.batch] ************************************************************
[javatest.batch] * props file set to "/tmp/default-cts-props.txt"
[javatest.batch] ************************************************************
[javatest.batch] 07-30-2019 12:33:10:  TRACE: #######  Value of harness.socket.retry.count is "10"
[javatest.batch] 07-30-2019 12:33:10:  TRACE: #######  Value of harness.log.port is "2000"
[javatest.batch] 07-30-2019 12:33:11:  TRACE: #######  Actual bind value of harness.log.port is "2000"
[javatest.batch] 07-30-2019 12:33:11:  TRACE: in ServiceEETest.run() method
[javatest.batch] 07-30-2019 12:33:11:  TRACE: Vehicle to be used for this test is:  standalone
[javatest.batch] 07-30-2019 12:33:11:  TRACE: in custom vehicle so call on EETest.
[javatest.batch] 07-30-2019 12:33:11:  TRACE: *** in EETest.run(argv,p)
[javatest.batch] 07-30-2019 12:33:11:  TRACE: TESTCLASS=com.sun.ts.tests.jsonp.api.jsonparserfactorytests.Client
[javatest.batch] 07-30-2019 12:33:11:  TRACE: ** IN getRunMethod: testClass=com.sun.ts.tests.jsonp.api.jsonparserfactorytests.Client
[javatest.batch] 07-30-2019 12:33:11:  TRACE: ** IN getRunMethod: testname=jsonParserFactoryExceptionTest
[javatest.batch] 07-30-2019 12:33:11:  TRACE: ** GOT RUN METHOD!
[javatest.batch] 07-30-2019 12:33:11:  TRACE: **runmethod=jsonParserFactoryExceptionTest
[javatest.batch] 07-30-2019 12:33:11:  TRACE: ABOUT TO GET SETUP METHOD!
[javatest.batch] 07-30-2019 12:33:11:  TRACE: No setupMethod annotation present
[javatest.batch] 07-30-2019 12:33:11:  TRACE: getSetupMethod - checking for testcase specific setup method:  jsonParserFactoryExceptionTest_setup
[javatest.batch] 07-30-2019 12:33:11:  TRACE: getSetupMethod - checking for default class specific setup method
[javatest.batch] 07-30-2019 12:33:11:  TRACE: GOT SETUP METHOD!
[javatest.batch] 07-30-2019 12:33:11:  TRACE: No cleanupMethod annotation present
[javatest.batch] 07-30-2019 12:33:11:  TRACE: getCleanupMethod - checking for testcase specific cleanup method:  jsonParserFactoryExceptionTest_cleanup
[javatest.batch] 07-30-2019 12:33:11:  TRACE: getCleanupMethod - checking for default class specific cleanup method
[javatest.batch] 07-30-2019 12:33:11:  TRACE: GOT CLEANUP METHOD!
[javatest.batch] 07-30-2019 12:33:11:  TRACE: ABOUT TO INVOKE SETUP METHOD!
[javatest.batch] 07-30-2019 12:33:11:  setup ok
[javatest.batch] 07-30-2019 12:33:11:  TRACE: INVOKED SETUP METHOD!
[javatest.batch] 07-30-2019 12:33:11:  TRACE: ABOUT TO INVOKE EETEST RUN METHOD!
[javatest.batch] 07-30-2019 12:33:11:  Tests JsonParserFactory.createParser(InputStream) for JsonException if i/o error.
[javatest.batch] 07-30-2019 12:33:11:  getEmptyConfig
[javatest.batch] 07-30-2019 12:33:11:  MyBufferedInputStream->checkToTripIOException: *** tripping an IOException ***
[javatest.batch] 07-30-2019 12:33:11:  Caught expected JsonException
[javatest.batch] 07-30-2019 12:33:11:  Tests JsonParserFactory.createParser(InputStream) for JsonException if unknown encoding.
[javatest.batch] 07-30-2019 12:33:11:  getEmptyConfig
[javatest.batch] 07-30-2019 12:33:11:  Caught expected JsonException
[javatest.batch] 07-30-2019 12:33:11:  cleanup ok
[javatest.batch] 07-30-2019 12:33:12:  TRACE: SLEPT FOR:  1000
[javatest.batch] STATUS:Passed.
[javatest.batch] Passed.
[javatest.batch] ********************************************************************************
[javatest.batch] Finished Test:  PASSED........com/sun/ts/tests/jsonp/api/jsonparserfactorytests/Client.java#jsonParserFactoryExceptionTest_from_standalone
[javatest.batch] ********************************************************************************
[javatest.batch] Number of tests completed:  59 (59 passed, 0 failed, 0 with errors)
[javatest.batch] Number of tests remaining:  110
[javatest.batch] ********************************************************************************
[javatest.batch] Beginning Test:  com/sun/ts/tests/jsonp/api/jsonparserfactorytests/Client.java#jsonParserFactoryTest1_from_standalone
[javatest.batch] ********************************************************************************
[javatest.batch] 
[javatest.batch] 07-30-2019 12:33:12:  Harness - harness.executeMode is set to "2"
[javatest.batch] 07-30-2019 12:33:12:  Harness - keywords (to be passed to tests) set to:  all
[javatest.batch] 07-30-2019 12:33:12:  Harness - sClassPathFromExecProps = 
[javatest.batch] command: com.sun.ts.lib.harness.ExecTSTestCmd CLASSPATH=:/home/jenkins/workspace/TCK_JSONP_run/jsonp-tck/bin/xml/../../lib/tsharness.jar:/home/jenkins/workspace/TCK_JSONP_run/jsonp-tck/bin/xml/../../lib/sigtest.jar:/home/jenkins/workspace/TCK_JSONP_run/jsonp-tck/bin/xml/../../lib/jsonptck.jar:/home/jenkins/workspace/TCK_JSONP_run/jsonp-tck/bin/xml/../../classes:/home/jenkins/workspace/TCK_JSONP_run/jsonp-tck/bin/xml/../../bin:jsonp.alt.provider.classes:/home/jenkins/workspace/TCK_JSONP_run/jsonp-tck/bin/xml/../../src/com/sun/ts/tests/jsonp/resources:/home/jenkins/workspace/TCK_JSONP_run/jsonp-tck/bin/xml/../../../glassfish5/glassfish/modules/cdi-api.jar:/home/jenkins/workspace/TCK_JSONP_run/jsonp-tck/bin/xml/../../../glassfish5/glassfish/modules/jakarta.ejb-api.jar:/home/jenkins/workspace/TCK_JSONP_run/jsonp-tck/bin/xml/../../../glassfish5/glassfish/modules/jakarta.inject.jar:/home/jenkins/workspace/TCK_JSONP_run/jsonp-tck/bin/xml/../../../glassfish5/glassfish/modules/jakarta.json.jar:/home/jenkins/workspace/TCK_JSONP_run/jsonp-tck/bin/xml/../../../glassfish5/glassfish/modules/jakarta.json-api.jar:/home/jenkins/workspace/TCK_JSONP_run/jsonp-tck/bin/xml/../../../glassfish5/glassfish/modules/jakarta.persistence.jar:/home/jenkins/workspace/TCK_JSONP_run/jsonp-tck/bin/xml/../../../glassfish5/glassfish/modules/jakarta.servlet-api.jar:/home/jenkins/workspace/TCK_JSONP_run/jsonp-tck/bin/xml/../../../glassfish5/glassfish/modules/jakarta.transaction-api.jar DISPLAY=:0.0 HOME=/home/jenkins windir= SYSTEMROOT= /opt/tools/java/oracle/jdk-8/1.8.0_202/jre/bin/java -Djava.security.policy=/home/jenkins/workspace/TCK_JSONP_run/jsonp-tck/bin/xml/../../bin/harness.policy -Djava.security.manager -Ddeliverable.class=com.sun.ts.lib.deliverable.jsonp.JSONPDeliverable com.sun.ts.tests.common.vehicle.VehicleClient -p /home/jenkins/workspace/TCK_JSONP_run/jsonp-tck/bin/xml/../../tmp/tstest.jte -t jsonParserFactoryTest1 -vehicle standalone
[javatest.batch] ************************************************************
[javatest.batch] * props file set to "/tmp/default-cts-props.txt"
[javatest.batch] ************************************************************
[javatest.batch] 07-30-2019 12:33:12:  TRACE: #######  Value of harness.socket.retry.count is "10"
[javatest.batch] 07-30-2019 12:33:12:  TRACE: #######  Value of harness.log.port is "2000"
[javatest.batch] 07-30-2019 12:33:12:  TRACE: #######  Actual bind value of harness.log.port is "2000"
[javatest.batch] 07-30-2019 12:33:12:  TRACE: in ServiceEETest.run() method
[javatest.batch] 07-30-2019 12:33:12:  TRACE: Vehicle to be used for this test is:  standalone
[javatest.batch] 07-30-2019 12:33:12:  TRACE: in custom vehicle so call on EETest.
[javatest.batch] 07-30-2019 12:33:12:  TRACE: *** in EETest.run(argv,p)
[javatest.batch] 07-30-2019 12:33:12:  TRACE: TESTCLASS=com.sun.ts.tests.jsonp.api.jsonparserfactorytests.Client
[javatest.batch] 07-30-2019 12:33:12:  TRACE: ** IN getRunMethod: testClass=com.sun.ts.tests.jsonp.api.jsonparserfactorytests.Client
[javatest.batch] 07-30-2019 12:33:12:  TRACE: ** IN getRunMethod: testname=jsonParserFactoryTest1
[javatest.batch] 07-30-2019 12:33:12:  TRACE: ** GOT RUN METHOD!
[javatest.batch] 07-30-2019 12:33:12:  TRACE: **runmethod=jsonParserFactoryTest1
[javatest.batch] 07-30-2019 12:33:12:  TRACE: ABOUT TO GET SETUP METHOD!
[javatest.batch] 07-30-2019 12:33:12:  TRACE: No setupMethod annotation present
[javatest.batch] 07-30-2019 12:33:12:  TRACE: getSetupMethod - checking for testcase specific setup method:  jsonParserFactoryTest1_setup
[javatest.batch] 07-30-2019 12:33:12:  TRACE: getSetupMethod - checking for default class specific setup method
[javatest.batch] 07-30-2019 12:33:12:  TRACE: GOT SETUP METHOD!
[javatest.batch] 07-30-2019 12:33:12:  TRACE: No cleanupMethod annotation present
[javatest.batch] 07-30-2019 12:33:12:  TRACE: getCleanupMethod - checking for testcase specific cleanup method:  jsonParserFactoryTest1_cleanup
[javatest.batch] 07-30-2019 12:33:12:  TRACE: getCleanupMethod - checking for default class specific cleanup method
[javatest.batch] 07-30-2019 12:33:12:  TRACE: GOT CLEANUP METHOD!
[javatest.batch] 07-30-2019 12:33:12:  TRACE: ABOUT TO INVOKE SETUP METHOD!
[javatest.batch] 07-30-2019 12:33:12:  setup ok
[javatest.batch] 07-30-2019 12:33:12:  TRACE: INVOKED SETUP METHOD!
[javatest.batch] 07-30-2019 12:33:12:  TRACE: ABOUT TO INVOKE EETEST RUN METHOD!
[javatest.batch] 07-30-2019 12:33:12:  Create JsonParserFactory with a configuration
[javatest.batch] 07-30-2019 12:33:12:  getEmptyConfig
[javatest.batch] 07-30-2019 12:33:12:  Checking factory configuration properties
[javatest.batch] 07-30-2019 12:33:12:  *** Beg: Dumping Config Map contents ***
[javatest.batch] 07-30-2019 12:33:12:  *** End: Dumping Config Map contents ***
[javatest.batch] 07-30-2019 12:33:12:  Checking factory configuration property size
[javatest.batch] 07-30-2019 12:33:12:  Expecting no of properties=0, got=0
[javatest.batch] 07-30-2019 12:33:12:  --------------------------------------------------
[javatest.batch] 07-30-2019 12:33:12:  TEST CASE [JsonParserFactory.createParser(Reader)]
[javatest.batch] 07-30-2019 12:33:12:  --------------------------------------------------
[javatest.batch] 07-30-2019 12:33:12:  Create 1st JsonParser from the Reader using JsonParserFactory
[javatest.batch] 07-30-2019 12:33:12:  Parsing {"foo":"bar"}
[javatest.batch] 07-30-2019 12:33:12:  Verify that JSON Parser Events/Data matches
[javatest.batch] 07-30-2019 12:33:12:  Got expected event: START_OBJECT
[javatest.batch] 07-30-2019 12:33:12:  Got expected event: KEY_NAME
[javatest.batch] 07-30-2019 12:33:12:  Got expected keyname: foo
[javatest.batch] 07-30-2019 12:33:12:  Got expected keyvalue: bar
[javatest.batch] 07-30-2019 12:33:12:  Got expected event: END_OBJECT
[javatest.batch] 07-30-2019 12:33:12:  Create 2nd JsonParser from the Reader using JsonParserFactory
[javatest.batch] 07-30-2019 12:33:12:  Parsing {"foo":"bar"}
[javatest.batch] 07-30-2019 12:33:12:  Verify that JSON Parser Events/Data matches
[javatest.batch] 07-30-2019 12:33:12:  Got expected event: START_OBJECT
[javatest.batch] 07-30-2019 12:33:12:  Got expected event: KEY_NAME
[javatest.batch] 07-30-2019 12:33:12:  Got expected keyname: foo
[javatest.batch] 07-30-2019 12:33:12:  Got expected keyvalue: bar
[javatest.batch] 07-30-2019 12:33:12:  Got expected event: END_OBJECT
[javatest.batch] 07-30-2019 12:33:12:  cleanup ok
[javatest.batch] 07-30-2019 12:33:13:  TRACE: SLEPT FOR:  1000
[javatest.batch] STATUS:Passed.
[javatest.batch] Passed.
[javatest.batch] ********************************************************************************
[javatest.batch] Finished Test:  PASSED........com/sun/ts/tests/jsonp/api/jsonparserfactorytests/Client.java#jsonParserFactoryTest1_from_standalone
[javatest.batch] ********************************************************************************
[javatest.batch] Number of tests completed:  60 (60 passed, 0 failed, 0 with errors)
[javatest.batch] Number of tests remaining:  109
[javatest.batch] ********************************************************************************
[javatest.batch] Beginning Test:  com/sun/ts/tests/jsonp/api/jsonparserfactorytests/Client.java#jsonParserFactoryTest2_from_standalone
[javatest.batch] ********************************************************************************
[javatest.batch] 
[javatest.batch] 07-30-2019 12:33:13:  Harness - harness.executeMode is set to "2"
[javatest.batch] 07-30-2019 12:33:13:  Harness - keywords (to be passed to tests) set to:  all
[javatest.batch] 07-30-2019 12:33:13:  Harness - sClassPathFromExecProps = 
[javatest.batch] command: com.sun.ts.lib.harness.ExecTSTestCmd CLASSPATH=:/home/jenkins/workspace/TCK_JSONP_run/jsonp-tck/bin/xml/../../lib/tsharness.jar:/home/jenkins/workspace/TCK_JSONP_run/jsonp-tck/bin/xml/../../lib/sigtest.jar:/home/jenkins/workspace/TCK_JSONP_run/jsonp-tck/bin/xml/../../lib/jsonptck.jar:/home/jenkins/workspace/TCK_JSONP_run/jsonp-tck/bin/xml/../../classes:/home/jenkins/workspace/TCK_JSONP_run/jsonp-tck/bin/xml/../../bin:jsonp.alt.provider.classes:/home/jenkins/workspace/TCK_JSONP_run/jsonp-tck/bin/xml/../../src/com/sun/ts/tests/jsonp/resources:/home/jenkins/workspace/TCK_JSONP_run/jsonp-tck/bin/xml/../../../glassfish5/glassfish/modules/cdi-api.jar:/home/jenkins/workspace/TCK_JSONP_run/jsonp-tck/bin/xml/../../../glassfish5/glassfish/modules/jakarta.ejb-api.jar:/home/jenkins/workspace/TCK_JSONP_run/jsonp-tck/bin/xml/../../../glassfish5/glassfish/modules/jakarta.inject.jar:/home/jenkins/workspace/TCK_JSONP_run/jsonp-tck/bin/xml/../../../glassfish5/glassfish/modules/jakarta.json.jar:/home/jenkins/workspace/TCK_JSONP_run/jsonp-tck/bin/xml/../../../glassfish5/glassfish/modules/jakarta.json-api.jar:/home/jenkins/workspace/TCK_JSONP_run/jsonp-tck/bin/xml/../../../glassfish5/glassfish/modules/jakarta.persistence.jar:/home/jenkins/workspace/TCK_JSONP_run/jsonp-tck/bin/xml/../../../glassfish5/glassfish/modules/jakarta.servlet-api.jar:/home/jenkins/workspace/TCK_JSONP_run/jsonp-tck/bin/xml/../../../glassfish5/glassfish/modules/jakarta.transaction-api.jar DISPLAY=:0.0 HOME=/home/jenkins windir= SYSTEMROOT= /opt/tools/java/oracle/jdk-8/1.8.0_202/jre/bin/java -Djava.security.policy=/home/jenkins/workspace/TCK_JSONP_run/jsonp-tck/bin/xml/../../bin/harness.policy -Djava.security.manager -Ddeliverable.class=com.sun.ts.lib.deliverable.jsonp.JSONPDeliverable com.sun.ts.tests.common.vehicle.VehicleClient -p /home/jenkins/workspace/TCK_JSONP_run/jsonp-tck/bin/xml/../../tmp/tstest.jte -t jsonParserFactoryTest2 -vehicle standalone
[javatest.batch] ************************************************************
[javatest.batch] * props file set to "/tmp/default-cts-props.txt"
[javatest.batch] ************************************************************
[javatest.batch] 07-30-2019 12:33:14:  TRACE: #######  Value of harness.socket.retry.count is "10"
[javatest.batch] 07-30-2019 12:33:14:  TRACE: #######  Value of harness.log.port is "2000"
[javatest.batch] 07-30-2019 12:33:14:  TRACE: #######  Actual bind value of harness.log.port is "2000"
[javatest.batch] 07-30-2019 12:33:14:  TRACE: in ServiceEETest.run() method
[javatest.batch] 07-30-2019 12:33:14:  TRACE: Vehicle to be used for this test is:  standalone
[javatest.batch] 07-30-2019 12:33:14:  TRACE: in custom vehicle so call on EETest.
[javatest.batch] 07-30-2019 12:33:14:  TRACE: *** in EETest.run(argv,p)
[javatest.batch] 07-30-2019 12:33:14:  TRACE: TESTCLASS=com.sun.ts.tests.jsonp.api.jsonparserfactorytests.Client
[javatest.batch] 07-30-2019 12:33:14:  TRACE: ** IN getRunMethod: testClass=com.sun.ts.tests.jsonp.api.jsonparserfactorytests.Client
[javatest.batch] 07-30-2019 12:33:14:  TRACE: ** IN getRunMethod: testname=jsonParserFactoryTest2
[javatest.batch] 07-30-2019 12:33:14:  TRACE: ** GOT RUN METHOD!
[javatest.batch] 07-30-2019 12:33:14:  TRACE: **runmethod=jsonParserFactoryTest2
[javatest.batch] 07-30-2019 12:33:14:  TRACE: ABOUT TO GET SETUP METHOD!
[javatest.batch] 07-30-2019 12:33:14:  TRACE: No setupMethod annotation present
[javatest.batch] 07-30-2019 12:33:14:  TRACE: getSetupMethod - checking for testcase specific setup method:  jsonParserFactoryTest2_setup
[javatest.batch] 07-30-2019 12:33:14:  TRACE: getSetupMethod - checking for default class specific setup method
[javatest.batch] 07-30-2019 12:33:14:  TRACE: GOT SETUP METHOD!
[javatest.batch] 07-30-2019 12:33:14:  TRACE: No cleanupMethod annotation present
[javatest.batch] 07-30-2019 12:33:14:  TRACE: getCleanupMethod - checking for testcase specific cleanup method:  jsonParserFactoryTest2_cleanup
[javatest.batch] 07-30-2019 12:33:14:  TRACE: getCleanupMethod - checking for default class specific cleanup method
[javatest.batch] 07-30-2019 12:33:14:  TRACE: GOT CLEANUP METHOD!
[javatest.batch] 07-30-2019 12:33:14:  TRACE: ABOUT TO INVOKE SETUP METHOD!
[javatest.batch] 07-30-2019 12:33:14:  setup ok
[javatest.batch] 07-30-2019 12:33:14:  TRACE: INVOKED SETUP METHOD!
[javatest.batch] 07-30-2019 12:33:14:  TRACE: ABOUT TO INVOKE EETEST RUN METHOD!
[javatest.batch] 07-30-2019 12:33:14:  Create JsonParserFactory with a configuration
[javatest.batch] 07-30-2019 12:33:14:  getEmptyConfig
[javatest.batch] 07-30-2019 12:33:14:  Checking factory configuration properties
[javatest.batch] 07-30-2019 12:33:14:  *** Beg: Dumping Config Map contents ***
[javatest.batch] 07-30-2019 12:33:14:  *** End: Dumping Config Map contents ***
[javatest.batch] 07-30-2019 12:33:14:  Checking factory configuration property size
[javatest.batch] 07-30-2019 12:33:14:  Expecting no of properties=0, got=0
[javatest.batch] 07-30-2019 12:33:14:  ------------------------------------------------------
[javatest.batch] 07-30-2019 12:33:14:  TEST CASE [JsonParserFactory.createParser(JsonObject)]
[javatest.batch] 07-30-2019 12:33:14:  ------------------------------------------------------
[javatest.batch] 07-30-2019 12:33:14:  Create 1st JsonParser from the JsonObject using JsonParserFactory
[javatest.batch] 07-30-2019 12:33:14:  Parsing {"foo":"bar"}
[javatest.batch] 07-30-2019 12:33:14:  Verify that JSON Parser Events/Data matches
[javatest.batch] 07-30-2019 12:33:14:  Got expected event: START_OBJECT
[javatest.batch] 07-30-2019 12:33:14:  Got expected event: KEY_NAME
[javatest.batch] 07-30-2019 12:33:14:  Got expected keyname: foo
[javatest.batch] 07-30-2019 12:33:14:  Got expected keyvalue: bar
[javatest.batch] 07-30-2019 12:33:14:  Got expected event: END_OBJECT
[javatest.batch] 07-30-2019 12:33:14:  Create 2nd JsonParser from the JsonObject using JsonParserFactory
[javatest.batch] 07-30-2019 12:33:14:  Parsing {"foo":"bar"}
[javatest.batch] 07-30-2019 12:33:14:  Verify that JSON Parser Events/Data matches
[javatest.batch] 07-30-2019 12:33:14:  Got expected event: START_OBJECT
[javatest.batch] 07-30-2019 12:33:14:  Got expected event: KEY_NAME
[javatest.batch] 07-30-2019 12:33:14:  Got expected keyname: foo
[javatest.batch] 07-30-2019 12:33:14:  Got expected keyvalue: bar
[javatest.batch] 07-30-2019 12:33:14:  Got expected event: END_OBJECT
[javatest.batch] 07-30-2019 12:33:14:  cleanup ok
[javatest.batch] 07-30-2019 12:33:15:  TRACE: SLEPT FOR:  1000
[javatest.batch] STATUS:Passed.
[javatest.batch] Passed.
[javatest.batch] ********************************************************************************
[javatest.batch] Finished Test:  PASSED........com/sun/ts/tests/jsonp/api/jsonparserfactorytests/Client.java#jsonParserFactoryTest2_from_standalone
[javatest.batch] ********************************************************************************
[javatest.batch] Number of tests completed:  61 (61 passed, 0 failed, 0 with errors)
[javatest.batch] Number of tests remaining:  108
[javatest.batch] ********************************************************************************
[javatest.batch] Beginning Test:  com/sun/ts/tests/jsonp/api/jsonparserfactorytests/Client.java#jsonParserFactoryTest3_from_standalone
[javatest.batch] ********************************************************************************
[javatest.batch] 
[javatest.batch] 07-30-2019 12:33:15:  Harness - harness.executeMode is set to "2"
[javatest.batch] 07-30-2019 12:33:15:  Harness - keywords (to be passed to tests) set to:  all
[javatest.batch] 07-30-2019 12:33:15:  Harness - sClassPathFromExecProps = 
[javatest.batch] command: com.sun.ts.lib.harness.ExecTSTestCmd CLASSPATH=:/home/jenkins/workspace/TCK_JSONP_run/jsonp-tck/bin/xml/../../lib/tsharness.jar:/home/jenkins/workspace/TCK_JSONP_run/jsonp-tck/bin/xml/../../lib/sigtest.jar:/home/jenkins/workspace/TCK_JSONP_run/jsonp-tck/bin/xml/../../lib/jsonptck.jar:/home/jenkins/workspace/TCK_JSONP_run/jsonp-tck/bin/xml/../../classes:/home/jenkins/workspace/TCK_JSONP_run/jsonp-tck/bin/xml/../../bin:jsonp.alt.provider.classes:/home/jenkins/workspace/TCK_JSONP_run/jsonp-tck/bin/xml/../../src/com/sun/ts/tests/jsonp/resources:/home/jenkins/workspace/TCK_JSONP_run/jsonp-tck/bin/xml/../../../glassfish5/glassfish/modules/cdi-api.jar:/home/jenkins/workspace/TCK_JSONP_run/jsonp-tck/bin/xml/../../../glassfish5/glassfish/modules/jakarta.ejb-api.jar:/home/jenkins/workspace/TCK_JSONP_run/jsonp-tck/bin/xml/../../../glassfish5/glassfish/modules/jakarta.inject.jar:/home/jenkins/workspace/TCK_JSONP_run/jsonp-tck/bin/xml/../../../glassfish5/glassfish/modules/jakarta.json.jar:/home/jenkins/workspace/TCK_JSONP_run/jsonp-tck/bin/xml/../../../glassfish5/glassfish/modules/jakarta.json-api.jar:/home/jenkins/workspace/TCK_JSONP_run/jsonp-tck/bin/xml/../../../glassfish5/glassfish/modules/jakarta.persistence.jar:/home/jenkins/workspace/TCK_JSONP_run/jsonp-tck/bin/xml/../../../glassfish5/glassfish/modules/jakarta.servlet-api.jar:/home/jenkins/workspace/TCK_JSONP_run/jsonp-tck/bin/xml/../../../glassfish5/glassfish/modules/jakarta.transaction-api.jar DISPLAY=:0.0 HOME=/home/jenkins windir= SYSTEMROOT= /opt/tools/java/oracle/jdk-8/1.8.0_202/jre/bin/java -Djava.security.policy=/home/jenkins/workspace/TCK_JSONP_run/jsonp-tck/bin/xml/../../bin/harness.policy -Djava.security.manager -Ddeliverable.class=com.sun.ts.lib.deliverable.jsonp.JSONPDeliverable com.sun.ts.tests.common.vehicle.VehicleClient -p /home/jenkins/workspace/TCK_JSONP_run/jsonp-tck/bin/xml/../../tmp/tstest.jte -t jsonParserFactoryTest3 -vehicle standalone
[javatest.batch] ************************************************************
[javatest.batch] * props file set to "/tmp/default-cts-props.txt"
[javatest.batch] ************************************************************
[javatest.batch] 07-30-2019 12:33:15:  TRACE: #######  Value of harness.socket.retry.count is "10"
[javatest.batch] 07-30-2019 12:33:15:  TRACE: #######  Value of harness.log.port is "2000"
[javatest.batch] 07-30-2019 12:33:15:  TRACE: #######  Actual bind value of harness.log.port is "2000"
[javatest.batch] 07-30-2019 12:33:15:  TRACE: in ServiceEETest.run() method
[javatest.batch] 07-30-2019 12:33:15:  TRACE: Vehicle to be used for this test is:  standalone
[javatest.batch] 07-30-2019 12:33:15:  TRACE: in custom vehicle so call on EETest.
[javatest.batch] 07-30-2019 12:33:15:  TRACE: *** in EETest.run(argv,p)
[javatest.batch] 07-30-2019 12:33:15:  TRACE: TESTCLASS=com.sun.ts.tests.jsonp.api.jsonparserfactorytests.Client
[javatest.batch] 07-30-2019 12:33:15:  TRACE: ** IN getRunMethod: testClass=com.sun.ts.tests.jsonp.api.jsonparserfactorytests.Client
[javatest.batch] 07-30-2019 12:33:15:  TRACE: ** IN getRunMethod: testname=jsonParserFactoryTest3
[javatest.batch] 07-30-2019 12:33:15:  TRACE: ** GOT RUN METHOD!
[javatest.batch] 07-30-2019 12:33:15:  TRACE: **runmethod=jsonParserFactoryTest3
[javatest.batch] 07-30-2019 12:33:15:  TRACE: ABOUT TO GET SETUP METHOD!
[javatest.batch] 07-30-2019 12:33:15:  TRACE: No setupMethod annotation present
[javatest.batch] 07-30-2019 12:33:15:  TRACE: getSetupMethod - checking for testcase specific setup method:  jsonParserFactoryTest3_setup
[javatest.batch] 07-30-2019 12:33:15:  TRACE: getSetupMethod - checking for default class specific setup method
[javatest.batch] 07-30-2019 12:33:15:  TRACE: GOT SETUP METHOD!
[javatest.batch] 07-30-2019 12:33:15:  TRACE: No cleanupMethod annotation present
[javatest.batch] 07-30-2019 12:33:15:  TRACE: getCleanupMethod - checking for testcase specific cleanup method:  jsonParserFactoryTest3_cleanup
[javatest.batch] 07-30-2019 12:33:15:  TRACE: getCleanupMethod - checking for default class specific cleanup method
[javatest.batch] 07-30-2019 12:33:15:  TRACE: GOT CLEANUP METHOD!
[javatest.batch] 07-30-2019 12:33:15:  TRACE: ABOUT TO INVOKE SETUP METHOD!
[javatest.batch] 07-30-2019 12:33:15:  setup ok
[javatest.batch] 07-30-2019 12:33:15:  TRACE: INVOKED SETUP METHOD!
[javatest.batch] 07-30-2019 12:33:15:  TRACE: ABOUT TO INVOKE EETEST RUN METHOD!
[javatest.batch] 07-30-2019 12:33:15:  Create JsonParserFactory with a configuration
[javatest.batch] 07-30-2019 12:33:15:  getEmptyConfig
[javatest.batch] 07-30-2019 12:33:15:  Checking factory configuration properties
[javatest.batch] 07-30-2019 12:33:15:  *** Beg: Dumping Config Map contents ***
[javatest.batch] 07-30-2019 12:33:15:  *** End: Dumping Config Map contents ***
[javatest.batch] 07-30-2019 12:33:15:  Checking factory configuration property size
[javatest.batch] 07-30-2019 12:33:15:  Expecting no of properties=0, got=0
[javatest.batch] 07-30-2019 12:33:15:  -----------------------------------------------------
[javatest.batch] 07-30-2019 12:33:15:  TEST CASE [JsonParserFactory.createParser(JsonArray)]
[javatest.batch] 07-30-2019 12:33:15:  -----------------------------------------------------
[javatest.batch] 07-30-2019 12:33:15:  Create 1st JsonParser from the JsonArray using JsonParserFactory
[javatest.batch] 07-30-2019 12:33:15:  Parsing ["foo","bar"]
[javatest.batch] 07-30-2019 12:33:15:  Verify that JSON Parser Events/Data matches
[javatest.batch] 07-30-2019 12:33:15:  Got expected event: START_ARRAY
[javatest.batch] 07-30-2019 12:33:15:  Got expected event: VALUE_STRING
[javatest.batch] 07-30-2019 12:33:15:  Got expected keyvalue: foo
[javatest.batch] 07-30-2019 12:33:15:  Got expected event: VALUE_STRING
[javatest.batch] 07-30-2019 12:33:15:  Got expected keyvalue: bar
[javatest.batch] 07-30-2019 12:33:15:  Got expected event: END_ARRAY
[javatest.batch] 07-30-2019 12:33:15:  Create 2nd JsonParser from the JsonArray using JsonParserFactory
[javatest.batch] 07-30-2019 12:33:15:  Parsing ["foo","bar"]
[javatest.batch] 07-30-2019 12:33:15:  Verify that JSON Parser Events/Data matches
[javatest.batch] 07-30-2019 12:33:15:  Got expected event: START_ARRAY
[javatest.batch] 07-30-2019 12:33:15:  Got expected event: VALUE_STRING
[javatest.batch] 07-30-2019 12:33:15:  Got expected keyvalue: foo
[javatest.batch] 07-30-2019 12:33:15:  Got expected event: VALUE_STRING
[javatest.batch] 07-30-2019 12:33:15:  Got expected keyvalue: bar
[javatest.batch] 07-30-2019 12:33:15:  Got expected event: END_ARRAY
[javatest.batch] 07-30-2019 12:33:15:  cleanup ok
[javatest.batch] 07-30-2019 12:33:16:  TRACE: SLEPT FOR:  1000
[javatest.batch] STATUS:Passed.
[javatest.batch] Passed.
[javatest.batch] ********************************************************************************
[javatest.batch] Finished Test:  PASSED........com/sun/ts/tests/jsonp/api/jsonparserfactorytests/Client.java#jsonParserFactoryTest3_from_standalone
[javatest.batch] ********************************************************************************
[javatest.batch] Number of tests completed:  62 (62 passed, 0 failed, 0 with errors)
[javatest.batch] Number of tests remaining:  107
[javatest.batch] ********************************************************************************
[javatest.batch] Beginning Test:  com/sun/ts/tests/jsonp/api/jsonparserfactorytests/Client.java#jsonParserFactoryTest4_from_standalone
[javatest.batch] ********************************************************************************
[javatest.batch] 
[javatest.batch] 07-30-2019 12:33:17:  Harness - harness.executeMode is set to "2"
[javatest.batch] 07-30-2019 12:33:17:  Harness - keywords (to be passed to tests) set to:  all
[javatest.batch] 07-30-2019 12:33:17:  Harness - sClassPathFromExecProps = 
[javatest.batch] command: com.sun.ts.lib.harness.ExecTSTestCmd CLASSPATH=:/home/jenkins/workspace/TCK_JSONP_run/jsonp-tck/bin/xml/../../lib/tsharness.jar:/home/jenkins/workspace/TCK_JSONP_run/jsonp-tck/bin/xml/../../lib/sigtest.jar:/home/jenkins/workspace/TCK_JSONP_run/jsonp-tck/bin/xml/../../lib/jsonptck.jar:/home/jenkins/workspace/TCK_JSONP_run/jsonp-tck/bin/xml/../../classes:/home/jenkins/workspace/TCK_JSONP_run/jsonp-tck/bin/xml/../../bin:jsonp.alt.provider.classes:/home/jenkins/workspace/TCK_JSONP_run/jsonp-tck/bin/xml/../../src/com/sun/ts/tests/jsonp/resources:/home/jenkins/workspace/TCK_JSONP_run/jsonp-tck/bin/xml/../../../glassfish5/glassfish/modules/cdi-api.jar:/home/jenkins/workspace/TCK_JSONP_run/jsonp-tck/bin/xml/../../../glassfish5/glassfish/modules/jakarta.ejb-api.jar:/home/jenkins/workspace/TCK_JSONP_run/jsonp-tck/bin/xml/../../../glassfish5/glassfish/modules/jakarta.inject.jar:/home/jenkins/workspace/TCK_JSONP_run/jsonp-tck/bin/xml/../../../glassfish5/glassfish/modules/jakarta.json.jar:/home/jenkins/workspace/TCK_JSONP_run/jsonp-tck/bin/xml/../../../glassfish5/glassfish/modules/jakarta.json-api.jar:/home/jenkins/workspace/TCK_JSONP_run/jsonp-tck/bin/xml/../../../glassfish5/glassfish/modules/jakarta.persistence.jar:/home/jenkins/workspace/TCK_JSONP_run/jsonp-tck/bin/xml/../../../glassfish5/glassfish/modules/jakarta.servlet-api.jar:/home/jenkins/workspace/TCK_JSONP_run/jsonp-tck/bin/xml/../../../glassfish5/glassfish/modules/jakarta.transaction-api.jar DISPLAY=:0.0 HOME=/home/jenkins windir= SYSTEMROOT= /opt/tools/java/oracle/jdk-8/1.8.0_202/jre/bin/java -Djava.security.policy=/home/jenkins/workspace/TCK_JSONP_run/jsonp-tck/bin/xml/../../bin/harness.policy -Djava.security.manager -Ddeliverable.class=com.sun.ts.lib.deliverable.jsonp.JSONPDeliverable com.sun.ts.tests.common.vehicle.VehicleClient -p /home/jenkins/workspace/TCK_JSONP_run/jsonp-tck/bin/xml/../../tmp/tstest.jte -t jsonParserFactoryTest4 -vehicle standalone
[javatest.batch] ************************************************************
[javatest.batch] * props file set to "/tmp/default-cts-props.txt"
[javatest.batch] ************************************************************
[javatest.batch] 07-30-2019 12:33:17:  TRACE: #######  Value of harness.socket.retry.count is "10"
[javatest.batch] 07-30-2019 12:33:17:  TRACE: #######  Value of harness.log.port is "2000"
[javatest.batch] 07-30-2019 12:33:17:  TRACE: #######  Actual bind value of harness.log.port is "2000"
[javatest.batch] 07-30-2019 12:33:17:  TRACE: in ServiceEETest.run() method
[javatest.batch] 07-30-2019 12:33:17:  TRACE: Vehicle to be used for this test is:  standalone
[javatest.batch] 07-30-2019 12:33:17:  TRACE: in custom vehicle so call on EETest.
[javatest.batch] 07-30-2019 12:33:17:  TRACE: *** in EETest.run(argv,p)
[javatest.batch] 07-30-2019 12:33:17:  TRACE: TESTCLASS=com.sun.ts.tests.jsonp.api.jsonparserfactorytests.Client
[javatest.batch] 07-30-2019 12:33:17:  TRACE: ** IN getRunMethod: testClass=com.sun.ts.tests.jsonp.api.jsonparserfactorytests.Client
[javatest.batch] 07-30-2019 12:33:17:  TRACE: ** IN getRunMethod: testname=jsonParserFactoryTest4
[javatest.batch] 07-30-2019 12:33:17:  TRACE: ** GOT RUN METHOD!
[javatest.batch] 07-30-2019 12:33:17:  TRACE: **runmethod=jsonParserFactoryTest4
[javatest.batch] 07-30-2019 12:33:17:  TRACE: ABOUT TO GET SETUP METHOD!
[javatest.batch] 07-30-2019 12:33:17:  TRACE: No setupMethod annotation present
[javatest.batch] 07-30-2019 12:33:17:  TRACE: getSetupMethod - checking for testcase specific setup method:  jsonParserFactoryTest4_setup
[javatest.batch] 07-30-2019 12:33:17:  TRACE: getSetupMethod - checking for default class specific setup method
[javatest.batch] 07-30-2019 12:33:17:  TRACE: GOT SETUP METHOD!
[javatest.batch] 07-30-2019 12:33:17:  TRACE: No cleanupMethod annotation present
[javatest.batch] 07-30-2019 12:33:17:  TRACE: getCleanupMethod - checking for testcase specific cleanup method:  jsonParserFactoryTest4_cleanup
[javatest.batch] 07-30-2019 12:33:17:  TRACE: getCleanupMethod - checking for default class specific cleanup method
[javatest.batch] 07-30-2019 12:33:17:  TRACE: GOT CLEANUP METHOD!
[javatest.batch] 07-30-2019 12:33:17:  TRACE: ABOUT TO INVOKE SETUP METHOD!
[javatest.batch] 07-30-2019 12:33:17:  setup ok
[javatest.batch] 07-30-2019 12:33:17:  TRACE: INVOKED SETUP METHOD!
[javatest.batch] 07-30-2019 12:33:17:  TRACE: ABOUT TO INVOKE EETEST RUN METHOD!
[javatest.batch] 07-30-2019 12:33:17:  Create JsonParserFactory with a configuration
[javatest.batch] 07-30-2019 12:33:17:  getEmptyConfig
[javatest.batch] 07-30-2019 12:33:17:  Checking factory configuration properties
[javatest.batch] 07-30-2019 12:33:17:  *** Beg: Dumping Config Map contents ***
[javatest.batch] 07-30-2019 12:33:17:  *** End: Dumping Config Map contents ***
[javatest.batch] 07-30-2019 12:33:17:  Checking factory configuration property size
[javatest.batch] 07-30-2019 12:33:17:  Expecting no of properties=0, got=0
[javatest.batch] 07-30-2019 12:33:17:  -------------------------------------------------------
[javatest.batch] 07-30-2019 12:33:17:  TEST CASE [JsonParserFactory.createParser(InputStream)]
[javatest.batch] 07-30-2019 12:33:17:  -------------------------------------------------------
[javatest.batch] 07-30-2019 12:33:17:  Create 1st JsonParser from the InputStream using JsonParserFactory
[javatest.batch] 07-30-2019 12:33:17:  Parsing {"foo":"bar"}
[javatest.batch] 07-30-2019 12:33:17:  Verify that JSON Parser Events/Data matches
[javatest.batch] 07-30-2019 12:33:17:  Got expected event: START_OBJECT
[javatest.batch] 07-30-2019 12:33:17:  Got expected event: KEY_NAME
[javatest.batch] 07-30-2019 12:33:17:  Got expected keyname: foo
[javatest.batch] 07-30-2019 12:33:17:  Got expected keyvalue: bar
[javatest.batch] 07-30-2019 12:33:17:  Got expected event: END_OBJECT
[javatest.batch] 07-30-2019 12:33:17:  Create 2nd JsonParser from the InputStream using JsonParserFactory
[javatest.batch] 07-30-2019 12:33:17:  Parsing {"foo":"bar"}
[javatest.batch] 07-30-2019 12:33:17:  Verify that JSON Parser Events/Data matches
[javatest.batch] 07-30-2019 12:33:17:  Got expected event: START_OBJECT
[javatest.batch] 07-30-2019 12:33:17:  Got expected event: KEY_NAME
[javatest.batch] 07-30-2019 12:33:17:  Got expected keyname: foo
[javatest.batch] 07-30-2019 12:33:17:  Got expected keyvalue: bar
[javatest.batch] 07-30-2019 12:33:17:  Got expected event: END_OBJECT
[javatest.batch] 07-30-2019 12:33:17:  cleanup ok
[javatest.batch] 07-30-2019 12:33:18:  TRACE: SLEPT FOR:  1000
[javatest.batch] STATUS:Passed.
[javatest.batch] Passed.
[javatest.batch] ********************************************************************************
[javatest.batch] Finished Test:  PASSED........com/sun/ts/tests/jsonp/api/jsonparserfactorytests/Client.java#jsonParserFactoryTest4_from_standalone
[javatest.batch] ********************************************************************************
[javatest.batch] Number of tests completed:  63 (63 passed, 0 failed, 0 with errors)
[javatest.batch] Number of tests remaining:  106
[javatest.batch] ********************************************************************************
[javatest.batch] Beginning Test:  com/sun/ts/tests/jsonp/api/jsonparserfactorytests/Client.java#jsonParserFactoryTest5_from_standalone
[javatest.batch] ********************************************************************************
[javatest.batch] 
[javatest.batch] 07-30-2019 12:33:18:  Harness - harness.executeMode is set to "2"
[javatest.batch] 07-30-2019 12:33:18:  Harness - keywords (to be passed to tests) set to:  all
[javatest.batch] 07-30-2019 12:33:18:  Harness - sClassPathFromExecProps = 
[javatest.batch] command: com.sun.ts.lib.harness.ExecTSTestCmd CLASSPATH=:/home/jenkins/workspace/TCK_JSONP_run/jsonp-tck/bin/xml/../../lib/tsharness.jar:/home/jenkins/workspace/TCK_JSONP_run/jsonp-tck/bin/xml/../../lib/sigtest.jar:/home/jenkins/workspace/TCK_JSONP_run/jsonp-tck/bin/xml/../../lib/jsonptck.jar:/home/jenkins/workspace/TCK_JSONP_run/jsonp-tck/bin/xml/../../classes:/home/jenkins/workspace/TCK_JSONP_run/jsonp-tck/bin/xml/../../bin:jsonp.alt.provider.classes:/home/jenkins/workspace/TCK_JSONP_run/jsonp-tck/bin/xml/../../src/com/sun/ts/tests/jsonp/resources:/home/jenkins/workspace/TCK_JSONP_run/jsonp-tck/bin/xml/../../../glassfish5/glassfish/modules/cdi-api.jar:/home/jenkins/workspace/TCK_JSONP_run/jsonp-tck/bin/xml/../../../glassfish5/glassfish/modules/jakarta.ejb-api.jar:/home/jenkins/workspace/TCK_JSONP_run/jsonp-tck/bin/xml/../../../glassfish5/glassfish/modules/jakarta.inject.jar:/home/jenkins/workspace/TCK_JSONP_run/jsonp-tck/bin/xml/../../../glassfish5/glassfish/modules/jakarta.json.jar:/home/jenkins/workspace/TCK_JSONP_run/jsonp-tck/bin/xml/../../../glassfish5/glassfish/modules/jakarta.json-api.jar:/home/jenkins/workspace/TCK_JSONP_run/jsonp-tck/bin/xml/../../../glassfish5/glassfish/modules/jakarta.persistence.jar:/home/jenkins/workspace/TCK_JSONP_run/jsonp-tck/bin/xml/../../../glassfish5/glassfish/modules/jakarta.servlet-api.jar:/home/jenkins/workspace/TCK_JSONP_run/jsonp-tck/bin/xml/../../../glassfish5/glassfish/modules/jakarta.transaction-api.jar DISPLAY=:0.0 HOME=/home/jenkins windir= SYSTEMROOT= /opt/tools/java/oracle/jdk-8/1.8.0_202/jre/bin/java -Djava.security.policy=/home/jenkins/workspace/TCK_JSONP_run/jsonp-tck/bin/xml/../../bin/harness.policy -Djava.security.manager -Ddeliverable.class=com.sun.ts.lib.deliverable.jsonp.JSONPDeliverable com.sun.ts.tests.common.vehicle.VehicleClient -p /home/jenkins/workspace/TCK_JSONP_run/jsonp-tck/bin/xml/../../tmp/tstest.jte -t jsonParserFactoryTest5 -vehicle standalone
[javatest.batch] ************************************************************
[javatest.batch] * props file set to "/tmp/default-cts-props.txt"
[javatest.batch] ************************************************************
[javatest.batch] 07-30-2019 12:33:18:  TRACE: #######  Value of harness.socket.retry.count is "10"
[javatest.batch] 07-30-2019 12:33:18:  TRACE: #######  Value of harness.log.port is "2000"
[javatest.batch] 07-30-2019 12:33:18:  TRACE: #######  Actual bind value of harness.log.port is "2000"
[javatest.batch] 07-30-2019 12:33:18:  TRACE: in ServiceEETest.run() method
[javatest.batch] 07-30-2019 12:33:18:  TRACE: Vehicle to be used for this test is:  standalone
[javatest.batch] 07-30-2019 12:33:18:  TRACE: in custom vehicle so call on EETest.
[javatest.batch] 07-30-2019 12:33:18:  TRACE: *** in EETest.run(argv,p)
[javatest.batch] 07-30-2019 12:33:18:  TRACE: TESTCLASS=com.sun.ts.tests.jsonp.api.jsonparserfactorytests.Client
[javatest.batch] 07-30-2019 12:33:18:  TRACE: ** IN getRunMethod: testClass=com.sun.ts.tests.jsonp.api.jsonparserfactorytests.Client
[javatest.batch] 07-30-2019 12:33:18:  TRACE: ** IN getRunMethod: testname=jsonParserFactoryTest5
[javatest.batch] 07-30-2019 12:33:18:  TRACE: ** GOT RUN METHOD!
[javatest.batch] 07-30-2019 12:33:18:  TRACE: **runmethod=jsonParserFactoryTest5
[javatest.batch] 07-30-2019 12:33:18:  TRACE: ABOUT TO GET SETUP METHOD!
[javatest.batch] 07-30-2019 12:33:18:  TRACE: No setupMethod annotation present
[javatest.batch] 07-30-2019 12:33:18:  TRACE: getSetupMethod - checking for testcase specific setup method:  jsonParserFactoryTest5_setup
[javatest.batch] 07-30-2019 12:33:18:  TRACE: getSetupMethod - checking for default class specific setup method
[javatest.batch] 07-30-2019 12:33:18:  TRACE: GOT SETUP METHOD!
[javatest.batch] 07-30-2019 12:33:18:  TRACE: No cleanupMethod annotation present
[javatest.batch] 07-30-2019 12:33:18:  TRACE: getCleanupMethod - checking for testcase specific cleanup method:  jsonParserFactoryTest5_cleanup
[javatest.batch] 07-30-2019 12:33:18:  TRACE: getCleanupMethod - checking for default class specific cleanup method
[javatest.batch] 07-30-2019 12:33:18:  TRACE: GOT CLEANUP METHOD!
[javatest.batch] 07-30-2019 12:33:18:  TRACE: ABOUT TO INVOKE SETUP METHOD!
[javatest.batch] 07-30-2019 12:33:18:  setup ok
[javatest.batch] 07-30-2019 12:33:18:  TRACE: INVOKED SETUP METHOD!
[javatest.batch] 07-30-2019 12:33:18:  TRACE: ABOUT TO INVOKE EETEST RUN METHOD!
[javatest.batch] 07-30-2019 12:33:18:  Create JsonParserFactory with a configuration
[javatest.batch] 07-30-2019 12:33:18:  getEmptyConfig
[javatest.batch] 07-30-2019 12:33:18:  Checking factory configuration properties
[javatest.batch] 07-30-2019 12:33:18:  *** Beg: Dumping Config Map contents ***
[javatest.batch] 07-30-2019 12:33:18:  *** End: Dumping Config Map contents ***
[javatest.batch] 07-30-2019 12:33:18:  Checking factory configuration property size
[javatest.batch] 07-30-2019 12:33:18:  Expecting no of properties=0, got=0
[javatest.batch] 07-30-2019 12:33:18:  ----------------------------------------------------------------
[javatest.batch] 07-30-2019 12:33:18:  TEST CASE [JsonParserFactory.createParser(InputStream, Charset)]
[javatest.batch] 07-30-2019 12:33:18:  ----------------------------------------------------------------
[javatest.batch] 07-30-2019 12:33:18:  Create 1st JsonParser from the InputStream using JsonParserFactory
[javatest.batch] 07-30-2019 12:33:18:  Parsing {"foo":"bar"}
[javatest.batch] 07-30-2019 12:33:18:  Verify that JSON Parser Events/Data matches
[javatest.batch] 07-30-2019 12:33:18:  Got expected event: START_OBJECT
[javatest.batch] 07-30-2019 12:33:18:  Got expected event: KEY_NAME
[javatest.batch] 07-30-2019 12:33:18:  Got expected keyname: foo
[javatest.batch] 07-30-2019 12:33:18:  Got expected keyvalue: bar
[javatest.batch] 07-30-2019 12:33:18:  Got expected event: END_OBJECT
[javatest.batch] 07-30-2019 12:33:18:  Create 2nd JsonParser from the InputStream using JsonParserFactory
[javatest.batch] 07-30-2019 12:33:18:  Parsing {"foo":"bar"}
[javatest.batch] 07-30-2019 12:33:18:  Verify that JSON Parser Events/Data matches
[javatest.batch] 07-30-2019 12:33:18:  Got expected event: START_OBJECT
[javatest.batch] 07-30-2019 12:33:18:  Got expected event: KEY_NAME
[javatest.batch] 07-30-2019 12:33:18:  Got expected keyname: foo
[javatest.batch] 07-30-2019 12:33:18:  Got expected keyvalue: bar
[javatest.batch] 07-30-2019 12:33:18:  Got expected event: END_OBJECT
[javatest.batch] 07-30-2019 12:33:18:  cleanup ok
[javatest.batch] 07-30-2019 12:33:19:  TRACE: SLEPT FOR:  1000
[javatest.batch] STATUS:Passed.
[javatest.batch] Passed.
[javatest.batch] ********************************************************************************
[javatest.batch] Finished Test:  PASSED........com/sun/ts/tests/jsonp/api/jsonparserfactorytests/Client.java#jsonParserFactoryTest5_from_standalone
[javatest.batch] ********************************************************************************
[javatest.batch] Number of tests completed:  64 (64 passed, 0 failed, 0 with errors)
[javatest.batch] Number of tests remaining:  105
[javatest.batch] ********************************************************************************
[javatest.batch] Beginning Test:  com/sun/ts/tests/jsonp/api/jsonparserfactorytests/Client.java#jsonParserFactoryTest6_from_standalone
[javatest.batch] ********************************************************************************
[javatest.batch] 
[javatest.batch] 07-30-2019 12:33:20:  Harness - harness.executeMode is set to "2"
[javatest.batch] 07-30-2019 12:33:20:  Harness - keywords (to be passed to tests) set to:  all
[javatest.batch] 07-30-2019 12:33:20:  Harness - sClassPathFromExecProps = 
[javatest.batch] command: com.sun.ts.lib.harness.ExecTSTestCmd CLASSPATH=:/home/jenkins/workspace/TCK_JSONP_run/jsonp-tck/bin/xml/../../lib/tsharness.jar:/home/jenkins/workspace/TCK_JSONP_run/jsonp-tck/bin/xml/../../lib/sigtest.jar:/home/jenkins/workspace/TCK_JSONP_run/jsonp-tck/bin/xml/../../lib/jsonptck.jar:/home/jenkins/workspace/TCK_JSONP_run/jsonp-tck/bin/xml/../../classes:/home/jenkins/workspace/TCK_JSONP_run/jsonp-tck/bin/xml/../../bin:jsonp.alt.provider.classes:/home/jenkins/workspace/TCK_JSONP_run/jsonp-tck/bin/xml/../../src/com/sun/ts/tests/jsonp/resources:/home/jenkins/workspace/TCK_JSONP_run/jsonp-tck/bin/xml/../../../glassfish5/glassfish/modules/cdi-api.jar:/home/jenkins/workspace/TCK_JSONP_run/jsonp-tck/bin/xml/../../../glassfish5/glassfish/modules/jakarta.ejb-api.jar:/home/jenkins/workspace/TCK_JSONP_run/jsonp-tck/bin/xml/../../../glassfish5/glassfish/modules/jakarta.inject.jar:/home/jenkins/workspace/TCK_JSONP_run/jsonp-tck/bin/xml/../../../glassfish5/glassfish/modules/jakarta.json.jar:/home/jenkins/workspace/TCK_JSONP_run/jsonp-tck/bin/xml/../../../glassfish5/glassfish/modules/jakarta.json-api.jar:/home/jenkins/workspace/TCK_JSONP_run/jsonp-tck/bin/xml/../../../glassfish5/glassfish/modules/jakarta.persistence.jar:/home/jenkins/workspace/TCK_JSONP_run/jsonp-tck/bin/xml/../../../glassfish5/glassfish/modules/jakarta.servlet-api.jar:/home/jenkins/workspace/TCK_JSONP_run/jsonp-tck/bin/xml/../../../glassfish5/glassfish/modules/jakarta.transaction-api.jar DISPLAY=:0.0 HOME=/home/jenkins windir= SYSTEMROOT= /opt/tools/java/oracle/jdk-8/1.8.0_202/jre/bin/java -Djava.security.policy=/home/jenkins/workspace/TCK_JSONP_run/jsonp-tck/bin/xml/../../bin/harness.policy -Djava.security.manager -Ddeliverable.class=com.sun.ts.lib.deliverable.jsonp.JSONPDeliverable com.sun.ts.tests.common.vehicle.VehicleClient -p /home/jenkins/workspace/TCK_JSONP_run/jsonp-tck/bin/xml/../../tmp/tstest.jte -t jsonParserFactoryTest6 -vehicle standalone
[javatest.batch] ************************************************************
[javatest.batch] * props file set to "/tmp/default-cts-props.txt"
[javatest.batch] ************************************************************
[javatest.batch] 07-30-2019 12:33:20:  TRACE: #######  Value of harness.socket.retry.count is "10"
[javatest.batch] 07-30-2019 12:33:20:  TRACE: #######  Value of harness.log.port is "2000"
[javatest.batch] 07-30-2019 12:33:20:  TRACE: #######  Actual bind value of harness.log.port is "2000"
[javatest.batch] 07-30-2019 12:33:20:  TRACE: in ServiceEETest.run() method
[javatest.batch] 07-30-2019 12:33:20:  TRACE: Vehicle to be used for this test is:  standalone
[javatest.batch] 07-30-2019 12:33:20:  TRACE: in custom vehicle so call on EETest.
[javatest.batch] 07-30-2019 12:33:20:  TRACE: *** in EETest.run(argv,p)
[javatest.batch] 07-30-2019 12:33:20:  TRACE: TESTCLASS=com.sun.ts.tests.jsonp.api.jsonparserfactorytests.Client
[javatest.batch] 07-30-2019 12:33:20:  TRACE: ** IN getRunMethod: testClass=com.sun.ts.tests.jsonp.api.jsonparserfactorytests.Client
[javatest.batch] 07-30-2019 12:33:20:  TRACE: ** IN getRunMethod: testname=jsonParserFactoryTest6
[javatest.batch] 07-30-2019 12:33:20:  TRACE: ** GOT RUN METHOD!
[javatest.batch] 07-30-2019 12:33:20:  TRACE: **runmethod=jsonParserFactoryTest6
[javatest.batch] 07-30-2019 12:33:20:  TRACE: ABOUT TO GET SETUP METHOD!
[javatest.batch] 07-30-2019 12:33:20:  TRACE: No setupMethod annotation present
[javatest.batch] 07-30-2019 12:33:20:  TRACE: getSetupMethod - checking for testcase specific setup method:  jsonParserFactoryTest6_setup
[javatest.batch] 07-30-2019 12:33:20:  TRACE: getSetupMethod - checking for default class specific setup method
[javatest.batch] 07-30-2019 12:33:20:  TRACE: GOT SETUP METHOD!
[javatest.batch] 07-30-2019 12:33:20:  TRACE: No cleanupMethod annotation present
[javatest.batch] 07-30-2019 12:33:20:  TRACE: getCleanupMethod - checking for testcase specific cleanup method:  jsonParserFactoryTest6_cleanup
[javatest.batch] 07-30-2019 12:33:20:  TRACE: getCleanupMethod - checking for default class specific cleanup method
[javatest.batch] 07-30-2019 12:33:20:  TRACE: GOT CLEANUP METHOD!
[javatest.batch] 07-30-2019 12:33:20:  TRACE: ABOUT TO INVOKE SETUP METHOD!
[javatest.batch] 07-30-2019 12:33:20:  setup ok
[javatest.batch] 07-30-2019 12:33:20:  TRACE: INVOKED SETUP METHOD!
[javatest.batch] 07-30-2019 12:33:20:  TRACE: ABOUT TO INVOKE EETEST RUN METHOD!
[javatest.batch] 07-30-2019 12:33:20:  ----------------------------------------------
[javatest.batch] 07-30-2019 12:33:20:  Test scenario1: no supported provider property
[javatest.batch] 07-30-2019 12:33:20:  ----------------------------------------------
[javatest.batch] 07-30-2019 12:33:20:  Create JsonParserFactory with Map<String, ?> with EMPTY config
[javatest.batch] 07-30-2019 12:33:20:  getEmptyConfig
[javatest.batch] 07-30-2019 12:33:20:  *** Beg: Dumping Config Map contents ***
[javatest.batch] 07-30-2019 12:33:20:  *** End: Dumping Config Map contents ***
[javatest.batch] 07-30-2019 12:33:20:  Checking factory configuration property size
[javatest.batch] 07-30-2019 12:33:20:  Expecting no of properties=0, got=0
[javatest.batch] 07-30-2019 12:33:20:  -----------------------------------------------
[javatest.batch] 07-30-2019 12:33:20:  Test scenario2: non supported provider property
[javatest.batch] 07-30-2019 12:33:20:  -----------------------------------------------
[javatest.batch] 07-30-2019 12:33:20:  Create JsonParserFactory with Map<String, ?> with FOO config
[javatest.batch] 07-30-2019 12:33:20:  getFooConfig
[javatest.batch] 07-30-2019 12:33:20:  Added property: JSONP_Util.FOO_CONFIG
[javatest.batch] 07-30-2019 12:33:20:  *** Beg: Dumping Config Map contents ***
[javatest.batch] 07-30-2019 12:33:20:  *** End: Dumping Config Map contents ***
[javatest.batch] 07-30-2019 12:33:20:  Checking factory configuration property size
[javatest.batch] 07-30-2019 12:33:20:  Expecting no of properties=0, got=0
[javatest.batch] 07-30-2019 12:33:20:  cleanup ok
[javatest.batch] 07-30-2019 12:33:21:  TRACE: SLEPT FOR:  1000
[javatest.batch] STATUS:Passed.
[javatest.batch] Passed.
[javatest.batch] ********************************************************************************
[javatest.batch] Finished Test:  PASSED........com/sun/ts/tests/jsonp/api/jsonparserfactorytests/Client.java#jsonParserFactoryTest6_from_standalone
[javatest.batch] ********************************************************************************
[javatest.batch] Number of tests completed:  65 (65 passed, 0 failed, 0 with errors)
[javatest.batch] Number of tests remaining:  104
[javatest.batch] ********************************************************************************
[javatest.batch] Beginning Test:  com/sun/ts/tests/jsonp/api/jsonparsertests/Client.java#invalidLiteralNamesTest_from_standalone
[javatest.batch] ********************************************************************************
[javatest.batch] 
[javatest.batch] 07-30-2019 12:33:22:  Harness - harness.executeMode is set to "2"
[javatest.batch] 07-30-2019 12:33:22:  Harness - keywords (to be passed to tests) set to:  all
[javatest.batch] 07-30-2019 12:33:22:  Harness - sClassPathFromExecProps = 
[javatest.batch] command: com.sun.ts.lib.harness.ExecTSTestCmd CLASSPATH=:/home/jenkins/workspace/TCK_JSONP_run/jsonp-tck/bin/xml/../../lib/tsharness.jar:/home/jenkins/workspace/TCK_JSONP_run/jsonp-tck/bin/xml/../../lib/sigtest.jar:/home/jenkins/workspace/TCK_JSONP_run/jsonp-tck/bin/xml/../../lib/jsonptck.jar:/home/jenkins/workspace/TCK_JSONP_run/jsonp-tck/bin/xml/../../classes:/home/jenkins/workspace/TCK_JSONP_run/jsonp-tck/bin/xml/../../bin:jsonp.alt.provider.classes:/home/jenkins/workspace/TCK_JSONP_run/jsonp-tck/bin/xml/../../src/com/sun/ts/tests/jsonp/resources:/home/jenkins/workspace/TCK_JSONP_run/jsonp-tck/bin/xml/../../../glassfish5/glassfish/modules/cdi-api.jar:/home/jenkins/workspace/TCK_JSONP_run/jsonp-tck/bin/xml/../../../glassfish5/glassfish/modules/jakarta.ejb-api.jar:/home/jenkins/workspace/TCK_JSONP_run/jsonp-tck/bin/xml/../../../glassfish5/glassfish/modules/jakarta.inject.jar:/home/jenkins/workspace/TCK_JSONP_run/jsonp-tck/bin/xml/../../../glassfish5/glassfish/modules/jakarta.json.jar:/home/jenkins/workspace/TCK_JSONP_run/jsonp-tck/bin/xml/../../../glassfish5/glassfish/modules/jakarta.json-api.jar:/home/jenkins/workspace/TCK_JSONP_run/jsonp-tck/bin/xml/../../../glassfish5/glassfish/modules/jakarta.persistence.jar:/home/jenkins/workspace/TCK_JSONP_run/jsonp-tck/bin/xml/../../../glassfish5/glassfish/modules/jakarta.servlet-api.jar:/home/jenkins/workspace/TCK_JSONP_run/jsonp-tck/bin/xml/../../../glassfish5/glassfish/modules/jakarta.transaction-api.jar DISPLAY=:0.0 HOME=/home/jenkins windir= SYSTEMROOT= /opt/tools/java/oracle/jdk-8/1.8.0_202/jre/bin/java -Djava.security.policy=/home/jenkins/workspace/TCK_JSONP_run/jsonp-tck/bin/xml/../../bin/harness.policy -Djava.security.manager -Ddeliverable.class=com.sun.ts.lib.deliverable.jsonp.JSONPDeliverable com.sun.ts.tests.common.vehicle.VehicleClient -p /home/jenkins/workspace/TCK_JSONP_run/jsonp-tck/bin/xml/../../tmp/tstest.jte -t invalidLiteralNamesTest -vehicle standalone
[javatest.batch] ************************************************************
[javatest.batch] * props file set to "/tmp/default-cts-props.txt"
[javatest.batch] ************************************************************
[javatest.batch] 07-30-2019 12:33:22:  TRACE: #######  Value of harness.socket.retry.count is "10"
[javatest.batch] 07-30-2019 12:33:22:  TRACE: #######  Value of harness.log.port is "2000"
[javatest.batch] 07-30-2019 12:33:22:  TRACE: #######  Actual bind value of harness.log.port is "2000"
[javatest.batch] 07-30-2019 12:33:22:  TRACE: in ServiceEETest.run() method
[javatest.batch] 07-30-2019 12:33:22:  TRACE: Vehicle to be used for this test is:  standalone
[javatest.batch] 07-30-2019 12:33:22:  TRACE: in custom vehicle so call on EETest.
[javatest.batch] 07-30-2019 12:33:22:  TRACE: *** in EETest.run(argv,p)
[javatest.batch] 07-30-2019 12:33:22:  TRACE: TESTCLASS=com.sun.ts.tests.jsonp.api.jsonparsertests.Client
[javatest.batch] 07-30-2019 12:33:22:  TRACE: ** IN getRunMethod: testClass=com.sun.ts.tests.jsonp.api.jsonparsertests.Client
[javatest.batch] 07-30-2019 12:33:22:  TRACE: ** IN getRunMethod: testname=invalidLiteralNamesTest
[javatest.batch] 07-30-2019 12:33:22:  TRACE: ** GOT RUN METHOD!
[javatest.batch] 07-30-2019 12:33:22:  TRACE: **runmethod=invalidLiteralNamesTest
[javatest.batch] 07-30-2019 12:33:22:  TRACE: ABOUT TO GET SETUP METHOD!
[javatest.batch] 07-30-2019 12:33:22:  TRACE: No setupMethod annotation present
[javatest.batch] 07-30-2019 12:33:22:  TRACE: getSetupMethod - checking for testcase specific setup method:  invalidLiteralNamesTest_setup
[javatest.batch] 07-30-2019 12:33:22:  TRACE: getSetupMethod - checking for default class specific setup method
[javatest.batch] 07-30-2019 12:33:22:  TRACE: GOT SETUP METHOD!
[javatest.batch] 07-30-2019 12:33:22:  TRACE: No cleanupMethod annotation present
[javatest.batch] 07-30-2019 12:33:22:  TRACE: getCleanupMethod - checking for testcase specific cleanup method:  invalidLiteralNamesTest_cleanup
[javatest.batch] 07-30-2019 12:33:22:  TRACE: getCleanupMethod - checking for default class specific cleanup method
[javatest.batch] 07-30-2019 12:33:22:  TRACE: GOT CLEANUP METHOD!
[javatest.batch] 07-30-2019 12:33:22:  TRACE: ABOUT TO INVOKE SETUP METHOD!
[javatest.batch] 07-30-2019 12:33:22:  setup ok
[javatest.batch] 07-30-2019 12:33:22:  TRACE: INVOKED SETUP METHOD!
[javatest.batch] 07-30-2019 12:33:22:  TRACE: ABOUT TO INVOKE EETEST RUN METHOD!
[javatest.batch] 07-30-2019 12:33:22:  Trip JsonParsingException for JsonParser.next() if invalid liternal TRUE instead of true.
[javatest.batch] 07-30-2019 12:33:22:  Reading [TRUE]
[javatest.batch] 07-30-2019 12:33:22:  Caught expected JsonParsingException
[javatest.batch] 07-30-2019 12:33:22:  Trip JsonParsingException for JsonParser.next() if invalid liternal FALSE instead of false.
[javatest.batch] 07-30-2019 12:33:22:  Reading [FALSE]
[javatest.batch] 07-30-2019 12:33:22:  Caught expected JsonParsingException
[javatest.batch] 07-30-2019 12:33:22:  Trip JsonParsingException for JsonParser.next() if invalid liternal NULL instead of null.
[javatest.batch] 07-30-2019 12:33:22:  Reading [NULL]
[javatest.batch] 07-30-2019 12:33:22:  Caught expected JsonParsingException
[javatest.batch] 07-30-2019 12:33:22:  cleanup ok
[javatest.batch] 07-30-2019 12:33:23:  TRACE: SLEPT FOR:  1000
[javatest.batch] STATUS:Passed.
[javatest.batch] Passed.
[javatest.batch] ********************************************************************************
[javatest.batch] Finished Test:  PASSED........com/sun/ts/tests/jsonp/api/jsonparsertests/Client.java#invalidLiteralNamesTest_from_standalone
[javatest.batch] ********************************************************************************
[javatest.batch] Number of tests completed:  66 (66 passed, 0 failed, 0 with errors)
[javatest.batch] Number of tests remaining:  103
[javatest.batch] ********************************************************************************
[javatest.batch] Beginning Test:  com/sun/ts/tests/jsonp/api/jsonparsertests/Client.java#jsonParser11Test_from_standalone
[javatest.batch] ********************************************************************************
[javatest.batch] 
[javatest.batch] 07-30-2019 12:33:24:  Harness - harness.executeMode is set to "2"
[javatest.batch] 07-30-2019 12:33:24:  Harness - keywords (to be passed to tests) set to:  all
[javatest.batch] 07-30-2019 12:33:24:  Harness - sClassPathFromExecProps = 
[javatest.batch] command: com.sun.ts.lib.harness.ExecTSTestCmd CLASSPATH=:/home/jenkins/workspace/TCK_JSONP_run/jsonp-tck/bin/xml/../../lib/tsharness.jar:/home/jenkins/workspace/TCK_JSONP_run/jsonp-tck/bin/xml/../../lib/sigtest.jar:/home/jenkins/workspace/TCK_JSONP_run/jsonp-tck/bin/xml/../../lib/jsonptck.jar:/home/jenkins/workspace/TCK_JSONP_run/jsonp-tck/bin/xml/../../classes:/home/jenkins/workspace/TCK_JSONP_run/jsonp-tck/bin/xml/../../bin:jsonp.alt.provider.classes:/home/jenkins/workspace/TCK_JSONP_run/jsonp-tck/bin/xml/../../src/com/sun/ts/tests/jsonp/resources:/home/jenkins/workspace/TCK_JSONP_run/jsonp-tck/bin/xml/../../../glassfish5/glassfish/modules/cdi-api.jar:/home/jenkins/workspace/TCK_JSONP_run/jsonp-tck/bin/xml/../../../glassfish5/glassfish/modules/jakarta.ejb-api.jar:/home/jenkins/workspace/TCK_JSONP_run/jsonp-tck/bin/xml/../../../glassfish5/glassfish/modules/jakarta.inject.jar:/home/jenkins/workspace/TCK_JSONP_run/jsonp-tck/bin/xml/../../../glassfish5/glassfish/modules/jakarta.json.jar:/home/jenkins/workspace/TCK_JSONP_run/jsonp-tck/bin/xml/../../../glassfish5/glassfish/modules/jakarta.json-api.jar:/home/jenkins/workspace/TCK_JSONP_run/jsonp-tck/bin/xml/../../../glassfish5/glassfish/modules/jakarta.persistence.jar:/home/jenkins/workspace/TCK_JSONP_run/jsonp-tck/bin/xml/../../../glassfish5/glassfish/modules/jakarta.servlet-api.jar:/home/jenkins/workspace/TCK_JSONP_run/jsonp-tck/bin/xml/../../../glassfish5/glassfish/modules/jakarta.transaction-api.jar DISPLAY=:0.0 HOME=/home/jenkins windir= SYSTEMROOT= /opt/tools/java/oracle/jdk-8/1.8.0_202/jre/bin/java -Djava.security.policy=/home/jenkins/workspace/TCK_JSONP_run/jsonp-tck/bin/xml/../../bin/harness.policy -Djava.security.manager -Ddeliverable.class=com.sun.ts.lib.deliverable.jsonp.JSONPDeliverable com.sun.ts.tests.common.vehicle.VehicleClient -p /home/jenkins/workspace/TCK_JSONP_run/jsonp-tck/bin/xml/../../tmp/tstest.jte -t jsonParser11Test -vehicle standalone
[javatest.batch] ************************************************************
[javatest.batch] * props file set to "/tmp/default-cts-props.txt"
[javatest.batch] ************************************************************
[javatest.batch] 07-30-2019 12:33:24:  TRACE: #######  Value of harness.socket.retry.count is "10"
[javatest.batch] 07-30-2019 12:33:24:  TRACE: #######  Value of harness.log.port is "2000"
[javatest.batch] 07-30-2019 12:33:24:  TRACE: #######  Actual bind value of harness.log.port is "2000"
[javatest.batch] 07-30-2019 12:33:24:  TRACE: in ServiceEETest.run() method
[javatest.batch] 07-30-2019 12:33:24:  TRACE: Vehicle to be used for this test is:  standalone
[javatest.batch] 07-30-2019 12:33:24:  TRACE: in custom vehicle so call on EETest.
[javatest.batch] 07-30-2019 12:33:24:  TRACE: *** in EETest.run(argv,p)
[javatest.batch] 07-30-2019 12:33:24:  TRACE: TESTCLASS=com.sun.ts.tests.jsonp.api.jsonparsertests.Client
[javatest.batch] 07-30-2019 12:33:24:  TRACE: ** IN getRunMethod: testClass=com.sun.ts.tests.jsonp.api.jsonparsertests.Client
[javatest.batch] 07-30-2019 12:33:24:  TRACE: ** IN getRunMethod: testname=jsonParser11Test
[javatest.batch] 07-30-2019 12:33:24:  TRACE: ** GOT RUN METHOD!
[javatest.batch] 07-30-2019 12:33:24:  TRACE: **runmethod=jsonParser11Test
[javatest.batch] 07-30-2019 12:33:24:  TRACE: ABOUT TO GET SETUP METHOD!
[javatest.batch] 07-30-2019 12:33:24:  TRACE: No setupMethod annotation present
[javatest.batch] 07-30-2019 12:33:24:  TRACE: getSetupMethod - checking for testcase specific setup method:  jsonParser11Test_setup
[javatest.batch] 07-30-2019 12:33:24:  TRACE: getSetupMethod - checking for default class specific setup method
[javatest.batch] 07-30-2019 12:33:24:  TRACE: GOT SETUP METHOD!
[javatest.batch] 07-30-2019 12:33:24:  TRACE: No cleanupMethod annotation present
[javatest.batch] 07-30-2019 12:33:24:  TRACE: getCleanupMethod - checking for testcase specific cleanup method:  jsonParser11Test_cleanup
[javatest.batch] 07-30-2019 12:33:24:  TRACE: getCleanupMethod - checking for default class specific cleanup method
[javatest.batch] 07-30-2019 12:33:24:  TRACE: GOT CLEANUP METHOD!
[javatest.batch] 07-30-2019 12:33:24:  TRACE: ABOUT TO INVOKE SETUP METHOD!
[javatest.batch] 07-30-2019 12:33:24:  setup ok
[javatest.batch] 07-30-2019 12:33:24:  TRACE: INVOKED SETUP METHOD!
[javatest.batch] 07-30-2019 12:33:24:  TRACE: ABOUT TO INVOKE EETEST RUN METHOD!
[javatest.batch] 07-30-2019 12:33:24:  JsonParser API methods added in JSON-P 1.1.
[javatest.batch] 07-30-2019 12:33:24:   - getObject() on {"address":"In a galaxy far far away"}
[javatest.batch] 07-30-2019 12:33:24:       Checking {"address":"In a galaxy far far away"}
[javatest.batch] 07-30-2019 12:33:24:   - getObject() on {"age":42}
[javatest.batch] 07-30-2019 12:33:24:       Checking {"age":42}
[javatest.batch] 07-30-2019 12:33:24:   - getObject() on {"married":true}
[javatest.batch] 07-30-2019 12:33:24:       Checking {"married":true}
[javatest.batch] 07-30-2019 12:33:24:   - getObject() on {"wife":{"name":"Sarah Connor","age":32}}
[javatest.batch] 07-30-2019 12:33:24:       Checking {"wife":{"name":"Sarah Connor","age":32}}
[javatest.batch] 07-30-2019 12:33:24:   - getObject() on {"name":"John Smith","address":"In a galaxy far far away"}
[javatest.batch] 07-30-2019 12:33:24:       Checking {"name":"John Smith","address":"In a galaxy far far away"}
[javatest.batch] 07-30-2019 12:33:24:   - getObject() on "In a galaxy far far away"
[javatest.batch] 07-30-2019 12:33:24:        Expected exception: JsonParser#getObject() or JsonParser#getObjectStream() is valid only for START_OBJECT parser state. But current parser state is VALUE_STRING
[javatest.batch] 07-30-2019 12:33:24:   - getObject() on 42
[javatest.batch] 07-30-2019 12:33:24:        Expected exception: JsonParser#getObject() or JsonParser#getObjectStream() is valid only for START_OBJECT parser state. But current parser state is VALUE_NUMBER
[javatest.batch] 07-30-2019 12:33:24:   - getObject() on 9223372036854775765
[javatest.batch] 07-30-2019 12:33:24:        Expected exception: JsonParser#getObject() or JsonParser#getObjectStream() is valid only for START_OBJECT parser state. But current parser state is VALUE_NUMBER
[javatest.batch] 07-30-2019 12:33:24:   - getObject() on 3.441073578556931E+305
[javatest.batch] 07-30-2019 12:33:24:        Expected exception: JsonParser#getObject() or JsonParser#getObjectStream() is valid only for START_OBJECT parser state. But current parser state is VALUE_NUMBER
[javatest.batch] 07-30-2019 12:33:24:   - getObject() on true
[javatest.batch] 07-30-2019 12:33:24:        Expected exception: JsonParser#getObject() or JsonParser#getObjectStream() is valid only for START_OBJECT parser state. But current parser state is VALUE_TRUE
[javatest.batch] 07-30-2019 12:33:24:   - getObject() on 123456789012345678901234567890.1234567890
[javatest.batch] 07-30-2019 12:33:24:        Expected exception: JsonParser#getObject() or JsonParser#getObjectStream() is valid only for START_OBJECT parser state. But current parser state is VALUE_NUMBER
[javatest.batch] 07-30-2019 12:33:24:   - getObject() on 123456789012345678901234567890
[javatest.batch] 07-30-2019 12:33:24:        Expected exception: JsonParser#getObject() or JsonParser#getObjectStream() is valid only for START_OBJECT parser state. But current parser state is VALUE_NUMBER
[javatest.batch] 07-30-2019 12:33:24:   - getObject() on ["In a galaxy far far away"]
[javatest.batch] 07-30-2019 12:33:24:        Expected exception: JsonParser#getObject() or JsonParser#getObjectStream() is valid only for START_OBJECT parser state. But current parser state is START_ARRAY
[javatest.batch] 07-30-2019 12:33:24:   - getObject() on [42]
[javatest.batch] 07-30-2019 12:33:24:        Expected exception: JsonParser#getObject() or JsonParser#getObjectStream() is valid only for START_OBJECT parser state. But current parser state is START_ARRAY
[javatest.batch] 07-30-2019 12:33:24:   - getObject() on [true]
[javatest.batch] 07-30-2019 12:33:24:        Expected exception: JsonParser#getObject() or JsonParser#getObjectStream() is valid only for START_OBJECT parser state. But current parser state is START_ARRAY
[javatest.batch] 07-30-2019 12:33:24:   - getObject() on [{"name":"Sarah Connor","age":32}]
[javatest.batch] 07-30-2019 12:33:24:        Expected exception: JsonParser#getObject() or JsonParser#getObjectStream() is valid only for START_OBJECT parser state. But current parser state is START_ARRAY
[javatest.batch] 07-30-2019 12:33:24:   - getArray() on ["In a galaxy far far away"]
[javatest.batch] 07-30-2019 12:33:24:       Checking ["In a galaxy far far away"]
[javatest.batch] 07-30-2019 12:33:24:   - getArray() on [42]
[javatest.batch] 07-30-2019 12:33:24:       Checking [42]
[javatest.batch] 07-30-2019 12:33:24:   - getArray() on [true]
[javatest.batch] 07-30-2019 12:33:24:       Checking [true]
[javatest.batch] 07-30-2019 12:33:24:   - getArray() on [{"name":"Sarah Connor","age":32}]
[javatest.batch] 07-30-2019 12:33:24:       Checking [{"name":"Sarah Connor","age":32}]
[javatest.batch] 07-30-2019 12:33:24:   - getArray() on "In a galaxy far far away"
[javatest.batch] 07-30-2019 12:33:24:        Expected exception: JsonParser#getArray() or JsonParser#getArrayStream() is valid only for START_ARRAY parser state. But current parser state is VALUE_STRING
[javatest.batch] 07-30-2019 12:33:24:   - getArray() on 42
[javatest.batch] 07-30-2019 12:33:24:        Expected exception: JsonParser#getArray() or JsonParser#getArrayStream() is valid only for START_ARRAY parser state. But current parser state is VALUE_NUMBER
[javatest.batch] 07-30-2019 12:33:24:   - getArray() on 9223372036854775765
[javatest.batch] 07-30-2019 12:33:24:        Expected exception: JsonParser#getArray() or JsonParser#getArrayStream() is valid only for START_ARRAY parser state. But current parser state is VALUE_NUMBER
[javatest.batch] 07-30-2019 12:33:24:   - getArray() on 3.441073578556931E+305
[javatest.batch] 07-30-2019 12:33:24:        Expected exception: JsonParser#getArray() or JsonParser#getArrayStream() is valid only for START_ARRAY parser state. But current parser state is VALUE_NUMBER
[javatest.batch] 07-30-2019 12:33:24:   - getArray() on true
[javatest.batch] 07-30-2019 12:33:24:        Expected exception: JsonParser#getArray() or JsonParser#getArrayStream() is valid only for START_ARRAY parser state. But current parser state is VALUE_TRUE
[javatest.batch] 07-30-2019 12:33:24:   - getArray() on 123456789012345678901234567890.1234567890
[javatest.batch] 07-30-2019 12:33:24:        Expected exception: JsonParser#getArray() or JsonParser#getArrayStream() is valid only for START_ARRAY parser state. But current parser state is VALUE_NUMBER
[javatest.batch] 07-30-2019 12:33:24:   - getArray() on 123456789012345678901234567890
[javatest.batch] 07-30-2019 12:33:24:        Expected exception: JsonParser#getArray() or JsonParser#getArrayStream() is valid only for START_ARRAY parser state. But current parser state is VALUE_NUMBER
[javatest.batch] 07-30-2019 12:33:24:   - getArray() on {"address":"In a galaxy far far away"}
[javatest.batch] 07-30-2019 12:33:24:        Expected exception: JsonParser#getArray() or JsonParser#getArrayStream() is valid only for START_ARRAY parser state. But current parser state is START_OBJECT
[javatest.batch] 07-30-2019 12:33:24:   - getArray() on {"age":42}
[javatest.batch] 07-30-2019 12:33:24:        Expected exception: JsonParser#getArray() or JsonParser#getArrayStream() is valid only for START_ARRAY parser state. But current parser state is START_OBJECT
[javatest.batch] 07-30-2019 12:33:24:   - getArray() on {"married":true}
[javatest.batch] 07-30-2019 12:33:24:        Expected exception: JsonParser#getArray() or JsonParser#getArrayStream() is valid only for START_ARRAY parser state. But current parser state is START_OBJECT
[javatest.batch] 07-30-2019 12:33:24:   - getArray() on {"wife":{"name":"Sarah Connor","age":32}}
[javatest.batch] 07-30-2019 12:33:24:        Expected exception: JsonParser#getArray() or JsonParser#getArrayStream() is valid only for START_ARRAY parser state. But current parser state is START_OBJECT
[javatest.batch] 07-30-2019 12:33:24:   - getValue() on "In a galaxy far far away"
[javatest.batch] 07-30-2019 12:33:24:       Checking In a galaxy far far away
[javatest.batch] 07-30-2019 12:33:24:   - getValue() on 42
[javatest.batch] 07-30-2019 12:33:24:       Checking 42
[javatest.batch] 07-30-2019 12:33:24:   - getValue() on 9223372036854775765
[javatest.batch] 07-30-2019 12:33:24:       Checking 9223372036854775765
[javatest.batch] 07-30-2019 12:33:24:   - getValue() on 3.441073578556931E+305
[javatest.batch] 07-30-2019 12:33:24:       Checking 3.441073578556931E+305
[javatest.batch] 07-30-2019 12:33:24:   - getValue() on true
[javatest.batch] 07-30-2019 12:33:24:       Checking true
[javatest.batch] 07-30-2019 12:33:24:   - getValue() on 123456789012345678901234567890.1234567890
[javatest.batch] 07-30-2019 12:33:24:       Checking 123456789012345678901234567890.1234567890
[javatest.batch] 07-30-2019 12:33:24:   - getValue() on 123456789012345678901234567890
[javatest.batch] 07-30-2019 12:33:24:       Checking 123456789012345678901234567890
[javatest.batch] 07-30-2019 12:33:24:   - getValue() on {"address":"In a galaxy far far away"}
[javatest.batch] 07-30-2019 12:33:24:       Checking {"address":"In a galaxy far far away"}
[javatest.batch] 07-30-2019 12:33:24:   - getValue() on {"age":42}
[javatest.batch] 07-30-2019 12:33:24:       Checking {"age":42}
[javatest.batch] 07-30-2019 12:33:24:   - getValue() on {"married":true}
[javatest.batch] 07-30-2019 12:33:24:       Checking {"married":true}
[javatest.batch] 07-30-2019 12:33:24:   - getValue() on {"wife":{"name":"Sarah Connor","age":32}}
[javatest.batch] 07-30-2019 12:33:24:       Checking {"wife":{"name":"Sarah Connor","age":32}}
[javatest.batch] 07-30-2019 12:33:24:   - getValue() on ["In a galaxy far far away"]
[javatest.batch] 07-30-2019 12:33:24:       Checking ["In a galaxy far far away"]
[javatest.batch] 07-30-2019 12:33:24:   - getValue() on [42]
[javatest.batch] 07-30-2019 12:33:24:       Checking [42]
[javatest.batch] 07-30-2019 12:33:24:   - getValue() on [true]
[javatest.batch] 07-30-2019 12:33:24:       Checking [true]
[javatest.batch] 07-30-2019 12:33:24:   - getValue() on [{"name":"Sarah Connor","age":32}]
[javatest.batch] 07-30-2019 12:33:24:       Checking [{"name":"Sarah Connor","age":32}]
[javatest.batch] 07-30-2019 12:33:24:   - getValue() on 2nd lexical element of {}
[javatest.batch] 07-30-2019 12:33:24:        Expected exception: JsonParser#getValue() is valid only for START_ARRAY, START_OBJECT, KEY_NAME, VALUE_STRING, VALUE_NUMBER, VALUE_NULL, VALUE_FALSE, VALUE_TRUE parser states. But current parser state is END_OBJECT
[javatest.batch] 07-30-2019 12:33:24:   - getValue() on 2nd lexical element of []
[javatest.batch] 07-30-2019 12:33:24:        Expected exception: JsonParser#getValue() is valid only for START_ARRAY, START_OBJECT, KEY_NAME, VALUE_STRING, VALUE_NUMBER, VALUE_NULL, VALUE_FALSE, VALUE_TRUE parser states. But current parser state is END_ARRAY
[javatest.batch] 07-30-2019 12:33:24:   - getObjectStream() on {"address":"In a galaxy far far away"}
[javatest.batch] 07-30-2019 12:33:24:       Checking In a galaxy far far away
[javatest.batch] 07-30-2019 12:33:24:   - getObjectStream() on {"age":42}
[javatest.batch] 07-30-2019 12:33:24:       Checking 42
[javatest.batch] 07-30-2019 12:33:24:   - getObjectStream() on {"married":true}
[javatest.batch] 07-30-2019 12:33:24:       Checking true
[javatest.batch] 07-30-2019 12:33:24:   - getObjectStream() on {"wife":{"name":"Sarah Connor","age":32}}
[javatest.batch] 07-30-2019 12:33:24:       Checking {"name":"Sarah Connor","age":32}
[javatest.batch] 07-30-2019 12:33:24:   - getObjectStream() on {"name":"John Smith","address":"In a galaxy far far away"}
[javatest.batch] 07-30-2019 12:33:24:       Checking John Smith
[javatest.batch] 07-30-2019 12:33:24:       Checking In a galaxy far far away
[javatest.batch] 07-30-2019 12:33:24:   - getObjectStream() on "In a galaxy far far away"
[javatest.batch] 07-30-2019 12:33:24:        Expected exception: JsonParser#getObject() or JsonParser#getObjectStream() is valid only for START_OBJECT parser state. But current parser state is VALUE_STRING
[javatest.batch] 07-30-2019 12:33:24:   - getObjectStream() on 42
[javatest.batch] 07-30-2019 12:33:24:        Expected exception: JsonParser#getObject() or JsonParser#getObjectStream() is valid only for START_OBJECT parser state. But current parser state is VALUE_NUMBER
[javatest.batch] 07-30-2019 12:33:24:   - getObjectStream() on 9223372036854775765
[javatest.batch] 07-30-2019 12:33:24:        Expected exception: JsonParser#getObject() or JsonParser#getObjectStream() is valid only for START_OBJECT parser state. But current parser state is VALUE_NUMBER
[javatest.batch] 07-30-2019 12:33:24:   - getObjectStream() on 3.441073578556931E+305
[javatest.batch] 07-30-2019 12:33:24:        Expected exception: JsonParser#getObject() or JsonParser#getObjectStream() is valid only for START_OBJECT parser state. But current parser state is VALUE_NUMBER
[javatest.batch] 07-30-2019 12:33:24:   - getObjectStream() on true
[javatest.batch] 07-30-2019 12:33:24:        Expected exception: JsonParser#getObject() or JsonParser#getObjectStream() is valid only for START_OBJECT parser state. But current parser state is VALUE_TRUE
[javatest.batch] 07-30-2019 12:33:24:   - getObjectStream() on 123456789012345678901234567890.1234567890
[javatest.batch] 07-30-2019 12:33:24:        Expected exception: JsonParser#getObject() or JsonParser#getObjectStream() is valid only for START_OBJECT parser state. But current parser state is VALUE_NUMBER
[javatest.batch] 07-30-2019 12:33:24:   - getObjectStream() on 123456789012345678901234567890
[javatest.batch] 07-30-2019 12:33:24:        Expected exception: JsonParser#getObject() or JsonParser#getObjectStream() is valid only for START_OBJECT parser state. But current parser state is VALUE_NUMBER
[javatest.batch] 07-30-2019 12:33:24:   - getObjectStream() on ["In a galaxy far far away"]
[javatest.batch] 07-30-2019 12:33:24:        Expected exception: JsonParser#getObject() or JsonParser#getObjectStream() is valid only for START_OBJECT parser state. But current parser state is START_ARRAY
[javatest.batch] 07-30-2019 12:33:24:   - getObjectStream() on [42]
[javatest.batch] 07-30-2019 12:33:24:        Expected exception: JsonParser#getObject() or JsonParser#getObjectStream() is valid only for START_OBJECT parser state. But current parser state is START_ARRAY
[javatest.batch] 07-30-2019 12:33:24:   - getObjectStream() on [true]
[javatest.batch] 07-30-2019 12:33:24:        Expected exception: JsonParser#getObject() or JsonParser#getObjectStream() is valid only for START_OBJECT parser state. But current parser state is START_ARRAY
[javatest.batch] 07-30-2019 12:33:24:   - getObjectStream() on [{"name":"Sarah Connor","age":32}]
[javatest.batch] 07-30-2019 12:33:24:        Expected exception: JsonParser#getObject() or JsonParser#getObjectStream() is valid only for START_OBJECT parser state. But current parser state is START_ARRAY
[javatest.batch] 07-30-2019 12:33:24:   - getArrayStream() on ["In a galaxy far far away"]
[javatest.batch] 07-30-2019 12:33:24:       Checking In a galaxy far far away
[javatest.batch] 07-30-2019 12:33:24:   - getArrayStream() on [42]
[javatest.batch] 07-30-2019 12:33:24:       Checking 42
[javatest.batch] 07-30-2019 12:33:24:   - getArrayStream() on [true]
[javatest.batch] 07-30-2019 12:33:24:       Checking true
[javatest.batch] 07-30-2019 12:33:24:   - getArrayStream() on [{"name":"Sarah Connor","age":32}]
[javatest.batch] 07-30-2019 12:33:24:       Checking {"name":"Sarah Connor","age":32}
[javatest.batch] 07-30-2019 12:33:24:   - getArrayStream() on "In a galaxy far far away"
[javatest.batch] 07-30-2019 12:33:24:        Expected exception: JsonParser#getArray() or JsonParser#getArrayStream() is valid only for START_ARRAY parser state. But current parser state is VALUE_STRING
[javatest.batch] 07-30-2019 12:33:24:   - getArrayStream() on 42
[javatest.batch] 07-30-2019 12:33:24:        Expected exception: JsonParser#getArray() or JsonParser#getArrayStream() is valid only for START_ARRAY parser state. But current parser state is VALUE_NUMBER
[javatest.batch] 07-30-2019 12:33:24:   - getArrayStream() on 9223372036854775765
[javatest.batch] 07-30-2019 12:33:24:        Expected exception: JsonParser#getArray() or JsonParser#getArrayStream() is valid only for START_ARRAY parser state. But current parser state is VALUE_NUMBER
[javatest.batch] 07-30-2019 12:33:24:   - getArrayStream() on 3.441073578556931E+305
[javatest.batch] 07-30-2019 12:33:24:        Expected exception: JsonParser#getArray() or JsonParser#getArrayStream() is valid only for START_ARRAY parser state. But current parser state is VALUE_NUMBER
[javatest.batch] 07-30-2019 12:33:24:   - getArrayStream() on true
[javatest.batch] 07-30-2019 12:33:24:        Expected exception: JsonParser#getArray() or JsonParser#getArrayStream() is valid only for START_ARRAY parser state. But current parser state is VALUE_TRUE
[javatest.batch] 07-30-2019 12:33:24:   - getArrayStream() on 123456789012345678901234567890.1234567890
[javatest.batch] 07-30-2019 12:33:24:        Expected exception: JsonParser#getArray() or JsonParser#getArrayStream() is valid only for START_ARRAY parser state. But current parser state is VALUE_NUMBER
[javatest.batch] 07-30-2019 12:33:24:   - getArrayStream() on 123456789012345678901234567890
[javatest.batch] 07-30-2019 12:33:24:        Expected exception: JsonParser#getArray() or JsonParser#getArrayStream() is valid only for START_ARRAY parser state. But current parser state is VALUE_NUMBER
[javatest.batch] 07-30-2019 12:33:24:   - getArrayStream() on {"address":"In a galaxy far far away"}
[javatest.batch] 07-30-2019 12:33:24:        Expected exception: JsonParser#getArray() or JsonParser#getArrayStream() is valid only for START_ARRAY parser state. But current parser state is START_OBJECT
[javatest.batch] 07-30-2019 12:33:24:   - getArrayStream() on {"age":42}
[javatest.batch] 07-30-2019 12:33:24:        Expected exception: JsonParser#getArray() or JsonParser#getArrayStream() is valid only for START_ARRAY parser state. But current parser state is START_OBJECT
[javatest.batch] 07-30-2019 12:33:24:   - getArrayStream() on {"married":true}
[javatest.batch] 07-30-2019 12:33:24:        Expected exception: JsonParser#getArray() or JsonParser#getArrayStream() is valid only for START_ARRAY parser state. But current parser state is START_OBJECT
[javatest.batch] 07-30-2019 12:33:24:   - getArrayStream() on {"wife":{"name":"Sarah Connor","age":32}}
[javatest.batch] 07-30-2019 12:33:24:        Expected exception: JsonParser#getArray() or JsonParser#getArrayStream() is valid only for START_ARRAY parser state. But current parser state is START_OBJECT
[javatest.batch] 07-30-2019 12:33:24:   - getValueStream() on "In a galaxy far far away"
[javatest.batch] 07-30-2019 12:33:24:       Checking In a galaxy far far away
[javatest.batch] 07-30-2019 12:33:24:   - getValueStream() on 42
[javatest.batch] 07-30-2019 12:33:24:       Checking 42
[javatest.batch] 07-30-2019 12:33:24:   - getValueStream() on 9223372036854775765
[javatest.batch] 07-30-2019 12:33:24:       Checking 9223372036854775765
[javatest.batch] 07-30-2019 12:33:24:   - getValueStream() on 3.441073578556931E+305
[javatest.batch] 07-30-2019 12:33:24:       Checking 3.441073578556931E+305
[javatest.batch] 07-30-2019 12:33:24:   - getValueStream() on true
[javatest.batch] 07-30-2019 12:33:24:       Checking true
[javatest.batch] 07-30-2019 12:33:24:   - getValueStream() on 123456789012345678901234567890.1234567890
[javatest.batch] 07-30-2019 12:33:24:       Checking 123456789012345678901234567890.1234567890
[javatest.batch] 07-30-2019 12:33:24:   - getValueStream() on 123456789012345678901234567890
[javatest.batch] 07-30-2019 12:33:24:       Checking 123456789012345678901234567890
[javatest.batch] 07-30-2019 12:33:24:   - getValueStream() on {"address":"In a galaxy far far away"}
[javatest.batch] 07-30-2019 12:33:24:       Checking {"address":"In a galaxy far far away"}
[javatest.batch] 07-30-2019 12:33:24:   - getValueStream() on {"age":42}
[javatest.batch] 07-30-2019 12:33:24:       Checking {"age":42}
[javatest.batch] 07-30-2019 12:33:24:   - getValueStream() on {"married":true}
[javatest.batch] 07-30-2019 12:33:24:       Checking {"married":true}
[javatest.batch] 07-30-2019 12:33:24:   - getValueStream() on {"wife":{"name":"Sarah Connor","age":32}}
[javatest.batch] 07-30-2019 12:33:24:       Checking {"wife":{"name":"Sarah Connor","age":32}}
[javatest.batch] 07-30-2019 12:33:24:   - getValueStream() on ["In a galaxy far far away"]
[javatest.batch] 07-30-2019 12:33:24:       Checking ["In a galaxy far far away"]
[javatest.batch] 07-30-2019 12:33:24:   - getValueStream() on [42]
[javatest.batch] 07-30-2019 12:33:24:       Checking [42]
[javatest.batch] 07-30-2019 12:33:24:   - getValueStream() on [true]
[javatest.batch] 07-30-2019 12:33:24:       Checking [true]
[javatest.batch] 07-30-2019 12:33:24:   - getValueStream() on [{"name":"Sarah Connor","age":32}]
[javatest.batch] 07-30-2019 12:33:24:       Checking [{"name":"Sarah Connor","age":32}]
[javatest.batch] 07-30-2019 12:33:24:   - getValueStream() inside {"address":"In a galaxy far far away"}
[javatest.batch] 07-30-2019 12:33:24:        Expected exception: JsonParser#getValueStream() the parser must not be in an array or object. But current parser state is {0}
[javatest.batch] 07-30-2019 12:33:24:   - getValueStream() inside {"age":42}
[javatest.batch] 07-30-2019 12:33:24:        Expected exception: JsonParser#getValueStream() the parser must not be in an array or object. But current parser state is {0}
[javatest.batch] 07-30-2019 12:33:24:   - getValueStream() inside {"married":true}
[javatest.batch] 07-30-2019 12:33:24:        Expected exception: JsonParser#getValueStream() the parser must not be in an array or object. But current parser state is {0}
[javatest.batch] 07-30-2019 12:33:24:   - getValueStream() inside {"wife":{"name":"Sarah Connor","age":32}}
[javatest.batch] 07-30-2019 12:33:24:        Expected exception: JsonParser#getValueStream() the parser must not be in an array or object. But current parser state is {0}
[javatest.batch] 07-30-2019 12:33:24:   - getValueStream() inside ["In a galaxy far far away"]
[javatest.batch] 07-30-2019 12:33:24:        Expected exception: JsonParser#getValueStream() the parser must not be in an array or object. But current parser state is {0}
[javatest.batch] 07-30-2019 12:33:24:   - getValueStream() inside [42]
[javatest.batch] 07-30-2019 12:33:24:        Expected exception: JsonParser#getValueStream() the parser must not be in an array or object. But current parser state is {0}
[javatest.batch] 07-30-2019 12:33:24:   - getValueStream() inside [true]
[javatest.batch] 07-30-2019 12:33:24:        Expected exception: JsonParser#getValueStream() the parser must not be in an array or object. But current parser state is {0}
[javatest.batch] 07-30-2019 12:33:24:   - getValueStream() inside [{"name":"Sarah Connor","age":32}]
[javatest.batch] 07-30-2019 12:33:24:        Expected exception: JsonParser#getValueStream() the parser must not be in an array or object. But current parser state is {0}
[javatest.batch] 07-30-2019 12:33:24:   - skipArray() on ["In a galaxy far far away"]
[javatest.batch] 07-30-2019 12:33:24:   - skipArray() on [42]
[javatest.batch] 07-30-2019 12:33:24:   - skipArray() on [true]
[javatest.batch] 07-30-2019 12:33:24:   - skipArray() on [{"name":"Sarah Connor","age":32}]
[javatest.batch] 07-30-2019 12:33:24:   - skipArray() on "In a galaxy far far away"
[javatest.batch] 07-30-2019 12:33:24:       Checking In a galaxy far far away
[javatest.batch] 07-30-2019 12:33:24:   - skipArray() on 42
[javatest.batch] 07-30-2019 12:33:24:       Checking 42
[javatest.batch] 07-30-2019 12:33:24:   - skipArray() on 9223372036854775765
[javatest.batch] 07-30-2019 12:33:24:       Checking 9223372036854775765
[javatest.batch] 07-30-2019 12:33:24:   - skipArray() on 3.441073578556931E+305
[javatest.batch] 07-30-2019 12:33:24:       Checking 3.441073578556931E+305
[javatest.batch] 07-30-2019 12:33:24:   - skipArray() on true
[javatest.batch] 07-30-2019 12:33:24:       Checking true
[javatest.batch] 07-30-2019 12:33:24:   - skipArray() on 123456789012345678901234567890.1234567890
[javatest.batch] 07-30-2019 12:33:24:       Checking 123456789012345678901234567890.1234567890
[javatest.batch] 07-30-2019 12:33:24:   - skipArray() on 123456789012345678901234567890
[javatest.batch] 07-30-2019 12:33:24:       Checking 123456789012345678901234567890
[javatest.batch] 07-30-2019 12:33:24:   - skipArray() on {"address":"In a galaxy far far away"}
[javatest.batch] 07-30-2019 12:33:24:       Checking {"address":"In a galaxy far far away"}
[javatest.batch] 07-30-2019 12:33:24:   - skipArray() on {"age":42}
[javatest.batch] 07-30-2019 12:33:24:       Checking {"age":42}
[javatest.batch] 07-30-2019 12:33:24:   - skipArray() on {"married":true}
[javatest.batch] 07-30-2019 12:33:24:       Checking {"married":true}
[javatest.batch] 07-30-2019 12:33:24:   - skipArray() on {"wife":{"name":"Sarah Connor","age":32}}
[javatest.batch] 07-30-2019 12:33:24:       Checking {"wife":{"name":"Sarah Connor","age":32}}
[javatest.batch] 07-30-2019 12:33:24:   - skipObject() on {"address":"In a galaxy far far away"}
[javatest.batch] 07-30-2019 12:33:24:   - skipObject() on {"age":42}
[javatest.batch] 07-30-2019 12:33:24:   - skipObject() on {"married":true}
[javatest.batch] 07-30-2019 12:33:24:   - skipObject() on {"wife":{"name":"Sarah Connor","age":32}}
[javatest.batch] 07-30-2019 12:33:24:   - skipObject() on {"name":"John Smith","address":"In a galaxy far far away"}
[javatest.batch] 07-30-2019 12:33:24:   - skipObject() on "In a galaxy far far away"
[javatest.batch] 07-30-2019 12:33:24:       Checking In a galaxy far far away
[javatest.batch] 07-30-2019 12:33:24:   - skipObject() on 42
[javatest.batch] 07-30-2019 12:33:24:       Checking 42
[javatest.batch] 07-30-2019 12:33:24:   - skipObject() on 9223372036854775765
[javatest.batch] 07-30-2019 12:33:24:       Checking 9223372036854775765
[javatest.batch] 07-30-2019 12:33:24:   - skipObject() on 3.441073578556931E+305
[javatest.batch] 07-30-2019 12:33:24:       Checking 3.441073578556931E+305
[javatest.batch] 07-30-2019 12:33:24:   - skipObject() on true
[javatest.batch] 07-30-2019 12:33:24:       Checking true
[javatest.batch] 07-30-2019 12:33:24:   - skipObject() on 123456789012345678901234567890.1234567890
[javatest.batch] 07-30-2019 12:33:24:       Checking 123456789012345678901234567890.1234567890
[javatest.batch] 07-30-2019 12:33:24:   - skipObject() on 123456789012345678901234567890
[javatest.batch] 07-30-2019 12:33:24:       Checking 123456789012345678901234567890
[javatest.batch] 07-30-2019 12:33:24:   - skipObject() on ["In a galaxy far far away"]
[javatest.batch] 07-30-2019 12:33:24:       Checking ["In a galaxy far far away"]
[javatest.batch] 07-30-2019 12:33:24:   - skipObject() on [42]
[javatest.batch] 07-30-2019 12:33:24:       Checking [42]
[javatest.batch] 07-30-2019 12:33:24:   - skipObject() on [true]
[javatest.batch] 07-30-2019 12:33:24:       Checking [true]
[javatest.batch] 07-30-2019 12:33:24:   - skipObject() on [{"name":"Sarah Connor","age":32}]
[javatest.batch] 07-30-2019 12:33:24:       Checking [{"name":"Sarah Connor","age":32}]
[javatest.batch] 07-30-2019 12:33:24:  cleanup ok
[javatest.batch] 07-30-2019 12:33:25:  TRACE: SLEPT FOR:  1000
[javatest.batch] STATUS:Passed.
[javatest.batch] Passed.
[javatest.batch] ********************************************************************************
[javatest.batch] Finished Test:  PASSED........com/sun/ts/tests/jsonp/api/jsonparsertests/Client.java#jsonParser11Test_from_standalone
[javatest.batch] ********************************************************************************
[javatest.batch] Number of tests completed:  67 (67 passed, 0 failed, 0 with errors)
[javatest.batch] Number of tests remaining:  102
[javatest.batch] ********************************************************************************
[javatest.batch] Beginning Test:  com/sun/ts/tests/jsonp/api/jsonparsertests/Client.java#jsonParserExceptionTests_from_standalone
[javatest.batch] ********************************************************************************
[javatest.batch] 
[javatest.batch] 07-30-2019 12:33:25:  Harness - harness.executeMode is set to "2"
[javatest.batch] 07-30-2019 12:33:25:  Harness - keywords (to be passed to tests) set to:  all
[javatest.batch] 07-30-2019 12:33:25:  Harness - sClassPathFromExecProps = 
[javatest.batch] command: com.sun.ts.lib.harness.ExecTSTestCmd CLASSPATH=:/home/jenkins/workspace/TCK_JSONP_run/jsonp-tck/bin/xml/../../lib/tsharness.jar:/home/jenkins/workspace/TCK_JSONP_run/jsonp-tck/bin/xml/../../lib/sigtest.jar:/home/jenkins/workspace/TCK_JSONP_run/jsonp-tck/bin/xml/../../lib/jsonptck.jar:/home/jenkins/workspace/TCK_JSONP_run/jsonp-tck/bin/xml/../../classes:/home/jenkins/workspace/TCK_JSONP_run/jsonp-tck/bin/xml/../../bin:jsonp.alt.provider.classes:/home/jenkins/workspace/TCK_JSONP_run/jsonp-tck/bin/xml/../../src/com/sun/ts/tests/jsonp/resources:/home/jenkins/workspace/TCK_JSONP_run/jsonp-tck/bin/xml/../../../glassfish5/glassfish/modules/cdi-api.jar:/home/jenkins/workspace/TCK_JSONP_run/jsonp-tck/bin/xml/../../../glassfish5/glassfish/modules/jakarta.ejb-api.jar:/home/jenkins/workspace/TCK_JSONP_run/jsonp-tck/bin/xml/../../../glassfish5/glassfish/modules/jakarta.inject.jar:/home/jenkins/workspace/TCK_JSONP_run/jsonp-tck/bin/xml/../../../glassfish5/glassfish/modules/jakarta.json.jar:/home/jenkins/workspace/TCK_JSONP_run/jsonp-tck/bin/xml/../../../glassfish5/glassfish/modules/jakarta.json-api.jar:/home/jenkins/workspace/TCK_JSONP_run/jsonp-tck/bin/xml/../../../glassfish5/glassfish/modules/jakarta.persistence.jar:/home/jenkins/workspace/TCK_JSONP_run/jsonp-tck/bin/xml/../../../glassfish5/glassfish/modules/jakarta.servlet-api.jar:/home/jenkins/workspace/TCK_JSONP_run/jsonp-tck/bin/xml/../../../glassfish5/glassfish/modules/jakarta.transaction-api.jar DISPLAY=:0.0 HOME=/home/jenkins windir= SYSTEMROOT= /opt/tools/java/oracle/jdk-8/1.8.0_202/jre/bin/java -Djava.security.policy=/home/jenkins/workspace/TCK_JSONP_run/jsonp-tck/bin/xml/../../bin/harness.policy -Djava.security.manager -Ddeliverable.class=com.sun.ts.lib.deliverable.jsonp.JSONPDeliverable com.sun.ts.tests.common.vehicle.VehicleClient -p /home/jenkins/workspace/TCK_JSONP_run/jsonp-tck/bin/xml/../../tmp/tstest.jte -t jsonParserExceptionTests -vehicle standalone
[javatest.batch] ************************************************************
[javatest.batch] * props file set to "/tmp/default-cts-props.txt"
[javatest.batch] ************************************************************
[javatest.batch] 07-30-2019 12:33:25:  TRACE: #######  Value of harness.socket.retry.count is "10"
[javatest.batch] 07-30-2019 12:33:25:  TRACE: #######  Value of harness.log.port is "2000"
[javatest.batch] 07-30-2019 12:33:25:  TRACE: #######  Actual bind value of harness.log.port is "2000"
[javatest.batch] 07-30-2019 12:33:25:  TRACE: in ServiceEETest.run() method
[javatest.batch] 07-30-2019 12:33:25:  TRACE: Vehicle to be used for this test is:  standalone
[javatest.batch] 07-30-2019 12:33:25:  TRACE: in custom vehicle so call on EETest.
[javatest.batch] 07-30-2019 12:33:25:  TRACE: *** in EETest.run(argv,p)
[javatest.batch] 07-30-2019 12:33:25:  TRACE: TESTCLASS=com.sun.ts.tests.jsonp.api.jsonparsertests.Client
[javatest.batch] 07-30-2019 12:33:25:  TRACE: ** IN getRunMethod: testClass=com.sun.ts.tests.jsonp.api.jsonparsertests.Client
[javatest.batch] 07-30-2019 12:33:25:  TRACE: ** IN getRunMethod: testname=jsonParserExceptionTests
[javatest.batch] 07-30-2019 12:33:25:  TRACE: ** GOT RUN METHOD!
[javatest.batch] 07-30-2019 12:33:25:  TRACE: **runmethod=jsonParserExceptionTests
[javatest.batch] 07-30-2019 12:33:25:  TRACE: ABOUT TO GET SETUP METHOD!
[javatest.batch] 07-30-2019 12:33:25:  TRACE: No setupMethod annotation present
[javatest.batch] 07-30-2019 12:33:25:  TRACE: getSetupMethod - checking for testcase specific setup method:  jsonParserExceptionTests_setup
[javatest.batch] 07-30-2019 12:33:25:  TRACE: getSetupMethod - checking for default class specific setup method
[javatest.batch] 07-30-2019 12:33:25:  TRACE: GOT SETUP METHOD!
[javatest.batch] 07-30-2019 12:33:25:  TRACE: No cleanupMethod annotation present
[javatest.batch] 07-30-2019 12:33:25:  TRACE: getCleanupMethod - checking for testcase specific cleanup method:  jsonParserExceptionTests_cleanup
[javatest.batch] 07-30-2019 12:33:25:  TRACE: getCleanupMethod - checking for default class specific cleanup method
[javatest.batch] 07-30-2019 12:33:25:  TRACE: GOT CLEANUP METHOD!
[javatest.batch] 07-30-2019 12:33:25:  TRACE: ABOUT TO INVOKE SETUP METHOD!
[javatest.batch] 07-30-2019 12:33:25:  setup ok
[javatest.batch] 07-30-2019 12:33:25:  TRACE: INVOKED SETUP METHOD!
[javatest.batch] 07-30-2019 12:33:25:  TRACE: ABOUT TO INVOKE EETEST RUN METHOD!
[javatest.batch] 07-30-2019 12:33:25:  Trip JsonParsingException for JsonParser.next() if incorrect JSON is encountered
[javatest.batch] 07-30-2019 12:33:26:  Caught expected JsonParsingException
[javatest.batch] 07-30-2019 12:33:26:  Trip NoSuchElementException for JsonParser.next() if no more parsing states
[javatest.batch] 07-30-2019 12:33:26:  Caught expected NoSuchElementException
[javatest.batch] 07-30-2019 12:33:26:  cleanup ok
[javatest.batch] 07-30-2019 12:33:27:  TRACE: SLEPT FOR:  1000
[javatest.batch] STATUS:Passed.
[javatest.batch] Passed.
[javatest.batch] ********************************************************************************
[javatest.batch] Finished Test:  PASSED........com/sun/ts/tests/jsonp/api/jsonparsertests/Client.java#jsonParserExceptionTests_from_standalone
[javatest.batch] ********************************************************************************
[javatest.batch] Number of tests completed:  68 (68 passed, 0 failed, 0 with errors)
[javatest.batch] Number of tests remaining:  101
[javatest.batch] ********************************************************************************
[javatest.batch] Beginning Test:  com/sun/ts/tests/jsonp/api/jsonparsertests/Client.java#jsonParserIllegalExceptionTests_from_standalone
[javatest.batch] ********************************************************************************
[javatest.batch] 
[javatest.batch] 07-30-2019 12:33:27:  Harness - harness.executeMode is set to "2"
[javatest.batch] 07-30-2019 12:33:27:  Harness - keywords (to be passed to tests) set to:  all
[javatest.batch] 07-30-2019 12:33:27:  Harness - sClassPathFromExecProps = 
[javatest.batch] command: com.sun.ts.lib.harness.ExecTSTestCmd CLASSPATH=:/home/jenkins/workspace/TCK_JSONP_run/jsonp-tck/bin/xml/../../lib/tsharness.jar:/home/jenkins/workspace/TCK_JSONP_run/jsonp-tck/bin/xml/../../lib/sigtest.jar:/home/jenkins/workspace/TCK_JSONP_run/jsonp-tck/bin/xml/../../lib/jsonptck.jar:/home/jenkins/workspace/TCK_JSONP_run/jsonp-tck/bin/xml/../../classes:/home/jenkins/workspace/TCK_JSONP_run/jsonp-tck/bin/xml/../../bin:jsonp.alt.provider.classes:/home/jenkins/workspace/TCK_JSONP_run/jsonp-tck/bin/xml/../../src/com/sun/ts/tests/jsonp/resources:/home/jenkins/workspace/TCK_JSONP_run/jsonp-tck/bin/xml/../../../glassfish5/glassfish/modules/cdi-api.jar:/home/jenkins/workspace/TCK_JSONP_run/jsonp-tck/bin/xml/../../../glassfish5/glassfish/modules/jakarta.ejb-api.jar:/home/jenkins/workspace/TCK_JSONP_run/jsonp-tck/bin/xml/../../../glassfish5/glassfish/modules/jakarta.inject.jar:/home/jenkins/workspace/TCK_JSONP_run/jsonp-tck/bin/xml/../../../glassfish5/glassfish/modules/jakarta.json.jar:/home/jenkins/workspace/TCK_JSONP_run/jsonp-tck/bin/xml/../../../glassfish5/glassfish/modules/jakarta.json-api.jar:/home/jenkins/workspace/TCK_JSONP_run/jsonp-tck/bin/xml/../../../glassfish5/glassfish/modules/jakarta.persistence.jar:/home/jenkins/workspace/TCK_JSONP_run/jsonp-tck/bin/xml/../../../glassfish5/glassfish/modules/jakarta.servlet-api.jar:/home/jenkins/workspace/TCK_JSONP_run/jsonp-tck/bin/xml/../../../glassfish5/glassfish/modules/jakarta.transaction-api.jar DISPLAY=:0.0 HOME=/home/jenkins windir= SYSTEMROOT= /opt/tools/java/oracle/jdk-8/1.8.0_202/jre/bin/java -Djava.security.policy=/home/jenkins/workspace/TCK_JSONP_run/jsonp-tck/bin/xml/../../bin/harness.policy -Djava.security.manager -Ddeliverable.class=com.sun.ts.lib.deliverable.jsonp.JSONPDeliverable com.sun.ts.tests.common.vehicle.VehicleClient -p /home/jenkins/workspace/TCK_JSONP_run/jsonp-tck/bin/xml/../../tmp/tstest.jte -t jsonParserIllegalExceptionTests -vehicle standalone
[javatest.batch] ************************************************************
[javatest.batch] * props file set to "/tmp/default-cts-props.txt"
[javatest.batch] ************************************************************
[javatest.batch] 07-30-2019 12:33:27:  TRACE: #######  Value of harness.socket.retry.count is "10"
[javatest.batch] 07-30-2019 12:33:27:  TRACE: #######  Value of harness.log.port is "2000"
[javatest.batch] 07-30-2019 12:33:27:  TRACE: #######  Actual bind value of harness.log.port is "2000"
[javatest.batch] 07-30-2019 12:33:27:  TRACE: in ServiceEETest.run() method
[javatest.batch] 07-30-2019 12:33:27:  TRACE: Vehicle to be used for this test is:  standalone
[javatest.batch] 07-30-2019 12:33:27:  TRACE: in custom vehicle so call on EETest.
[javatest.batch] 07-30-2019 12:33:27:  TRACE: *** in EETest.run(argv,p)
[javatest.batch] 07-30-2019 12:33:27:  TRACE: TESTCLASS=com.sun.ts.tests.jsonp.api.jsonparsertests.Client
[javatest.batch] 07-30-2019 12:33:27:  TRACE: ** IN getRunMethod: testClass=com.sun.ts.tests.jsonp.api.jsonparsertests.Client
[javatest.batch] 07-30-2019 12:33:27:  TRACE: ** IN getRunMethod: testname=jsonParserIllegalExceptionTests
[javatest.batch] 07-30-2019 12:33:27:  TRACE: ** GOT RUN METHOD!
[javatest.batch] 07-30-2019 12:33:27:  TRACE: **runmethod=jsonParserIllegalExceptionTests
[javatest.batch] 07-30-2019 12:33:27:  TRACE: ABOUT TO GET SETUP METHOD!
[javatest.batch] 07-30-2019 12:33:27:  TRACE: No setupMethod annotation present
[javatest.batch] 07-30-2019 12:33:27:  TRACE: getSetupMethod - checking for testcase specific setup method:  jsonParserIllegalExceptionTests_setup
[javatest.batch] 07-30-2019 12:33:27:  TRACE: getSetupMethod - checking for default class specific setup method
[javatest.batch] 07-30-2019 12:33:27:  TRACE: GOT SETUP METHOD!
[javatest.batch] 07-30-2019 12:33:27:  TRACE: No cleanupMethod annotation present
[javatest.batch] 07-30-2019 12:33:27:  TRACE: getCleanupMethod - checking for testcase specific cleanup method:  jsonParserIllegalExceptionTests_cleanup
[javatest.batch] 07-30-2019 12:33:27:  TRACE: getCleanupMethod - checking for default class specific cleanup method
[javatest.batch] 07-30-2019 12:33:27:  TRACE: GOT CLEANUP METHOD!
[javatest.batch] 07-30-2019 12:33:27:  TRACE: ABOUT TO INVOKE SETUP METHOD!
[javatest.batch] 07-30-2019 12:33:27:  setup ok
[javatest.batch] 07-30-2019 12:33:27:  TRACE: INVOKED SETUP METHOD!
[javatest.batch] 07-30-2019 12:33:27:  TRACE: ABOUT TO INVOKE EETEST RUN METHOD!
[javatest.batch] 07-30-2019 12:33:27:  Create JsonParser
[javatest.batch] 07-30-2019 12:33:27:  getEmptyConfig
[javatest.batch] 07-30-2019 12:33:27:  Event=START_ARRAY
[javatest.batch] 07-30-2019 12:33:27:  Testing call to JsonParser.getString()
[javatest.batch] 07-30-2019 12:33:27:  Trip IllegalStateException by calling JsonParser.getString()
[javatest.batch] 07-30-2019 12:33:27:  Got expected IllegalStateException
[javatest.batch] 07-30-2019 12:33:27:  Testing call to JsonParser.isIntegralNumber()
[javatest.batch] 07-30-2019 12:33:27:  Trip IllegalStateException by calling JsonParser.isIntegralNumber()
[javatest.batch] 07-30-2019 12:33:27:  Got expected IllegalStateException
[javatest.batch] 07-30-2019 12:33:27:  Testing call to JsonParser.getBigDecimal()
[javatest.batch] 07-30-2019 12:33:27:  Trip IllegalStateException by calling JsonParser.getBigDecimal()
[javatest.batch] 07-30-2019 12:33:27:  Got expected IllegalStateException
[javatest.batch] 07-30-2019 12:33:27:  Testing call to JsonParser.getInt()
[javatest.batch] 07-30-2019 12:33:27:  Trip IllegalStateException by calling JsonParser.getInt()
[javatest.batch] 07-30-2019 12:33:27:  Got expected IllegalStateException
[javatest.batch] 07-30-2019 12:33:27:  Testing call to JsonParser.getLong()
[javatest.batch] 07-30-2019 12:33:27:  Trip IllegalStateException by calling JsonParser.getLong()
[javatest.batch] 07-30-2019 12:33:27:  Got expected IllegalStateException
[javatest.batch] 07-30-2019 12:33:27:  Event=VALUE_STRING
[javatest.batch] 07-30-2019 12:33:27:  Testing call to JsonParser.getString()
[javatest.batch] 07-30-2019 12:33:27:  No testing for IllegalStateException for this scenario.
[javatest.batch] 07-30-2019 12:33:27:  Testing call to JsonParser.isIntegralNumber()
[javatest.batch] 07-30-2019 12:33:27:  Trip IllegalStateException by calling JsonParser.isIntegralNumber()
[javatest.batch] 07-30-2019 12:33:27:  Got expected IllegalStateException
[javatest.batch] 07-30-2019 12:33:27:  Testing call to JsonParser.getBigDecimal()
[javatest.batch] 07-30-2019 12:33:27:  Trip IllegalStateException by calling JsonParser.getBigDecimal()
[javatest.batch] 07-30-2019 12:33:27:  Got expected IllegalStateException
[javatest.batch] 07-30-2019 12:33:27:  Testing call to JsonParser.getInt()
[javatest.batch] 07-30-2019 12:33:27:  Trip IllegalStateException by calling JsonParser.getInt()
[javatest.batch] 07-30-2019 12:33:27:  Got expected IllegalStateException
[javatest.batch] 07-30-2019 12:33:27:  Testing call to JsonParser.getLong()
[javatest.batch] 07-30-2019 12:33:27:  Trip IllegalStateException by calling JsonParser.getLong()
[javatest.batch] 07-30-2019 12:33:27:  Got expected IllegalStateException
[javatest.batch] 07-30-2019 12:33:27:  Event=VALUE_NUMBER
[javatest.batch] 07-30-2019 12:33:27:  Testing call to JsonParser.getString()
[javatest.batch] 07-30-2019 12:33:27:  No testing for IllegalStateException for this scenario.
[javatest.batch] 07-30-2019 12:33:27:  Testing call to JsonParser.isIntegralNumber()
[javatest.batch] 07-30-2019 12:33:27:  No testing for IllegalStateException for this scenario.
[javatest.batch] 07-30-2019 12:33:27:  Testing call to JsonParser.getBigDecimal()
[javatest.batch] 07-30-2019 12:33:27:  No testing for IllegalStateException for this scenario.
[javatest.batch] 07-30-2019 12:33:27:  Testing call to JsonParser.getInt()
[javatest.batch] 07-30-2019 12:33:27:  No testing for IllegalStateException for this scenario.
[javatest.batch] 07-30-2019 12:33:27:  Testing call to JsonParser.getLong()
[javatest.batch] 07-30-2019 12:33:27:  No testing for IllegalStateException for this scenario.
[javatest.batch] 07-30-2019 12:33:27:  Event=VALUE_FALSE
[javatest.batch] 07-30-2019 12:33:27:  Testing call to JsonParser.getString()
[javatest.batch] 07-30-2019 12:33:27:  Trip IllegalStateException by calling JsonParser.getString()
[javatest.batch] 07-30-2019 12:33:27:  Got expected IllegalStateException
[javatest.batch] 07-30-2019 12:33:27:  Testing call to JsonParser.isIntegralNumber()
[javatest.batch] 07-30-2019 12:33:27:  Trip IllegalStateException by calling JsonParser.isIntegralNumber()
[javatest.batch] 07-30-2019 12:33:27:  Got expected IllegalStateException
[javatest.batch] 07-30-2019 12:33:27:  Testing call to JsonParser.getBigDecimal()
[javatest.batch] 07-30-2019 12:33:27:  Trip IllegalStateException by calling JsonParser.getBigDecimal()
[javatest.batch] 07-30-2019 12:33:27:  Got expected IllegalStateException
[javatest.batch] 07-30-2019 12:33:27:  Testing call to JsonParser.getInt()
[javatest.batch] 07-30-2019 12:33:27:  Trip IllegalStateException by calling JsonParser.getInt()
[javatest.batch] 07-30-2019 12:33:27:  Got expected IllegalStateException
[javatest.batch] 07-30-2019 12:33:27:  Testing call to JsonParser.getLong()
[javatest.batch] 07-30-2019 12:33:27:  Trip IllegalStateException by calling JsonParser.getLong()
[javatest.batch] 07-30-2019 12:33:27:  Got expected IllegalStateException
[javatest.batch] 07-30-2019 12:33:27:  Event=VALUE_NULL
[javatest.batch] 07-30-2019 12:33:27:  Testing call to JsonParser.getString()
[javatest.batch] 07-30-2019 12:33:27:  Trip IllegalStateException by calling JsonParser.getString()
[javatest.batch] 07-30-2019 12:33:27:  Got expected IllegalStateException
[javatest.batch] 07-30-2019 12:33:27:  Testing call to JsonParser.isIntegralNumber()
[javatest.batch] 07-30-2019 12:33:27:  Trip IllegalStateException by calling JsonParser.isIntegralNumber()
[javatest.batch] 07-30-2019 12:33:27:  Got expected IllegalStateException
[javatest.batch] 07-30-2019 12:33:27:  Testing call to JsonParser.getBigDecimal()
[javatest.batch] 07-30-2019 12:33:27:  Trip IllegalStateException by calling JsonParser.getBigDecimal()
[javatest.batch] 07-30-2019 12:33:27:  Got expected IllegalStateException
[javatest.batch] 07-30-2019 12:33:27:  Testing call to JsonParser.getInt()
[javatest.batch] 07-30-2019 12:33:27:  Trip IllegalStateException by calling JsonParser.getInt()
[javatest.batch] 07-30-2019 12:33:27:  Got expected IllegalStateException
[javatest.batch] 07-30-2019 12:33:27:  Testing call to JsonParser.getLong()
[javatest.batch] 07-30-2019 12:33:27:  Trip IllegalStateException by calling JsonParser.getLong()
[javatest.batch] 07-30-2019 12:33:27:  Got expected IllegalStateException
[javatest.batch] 07-30-2019 12:33:27:  Event=VALUE_TRUE
[javatest.batch] 07-30-2019 12:33:27:  Testing call to JsonParser.getString()
[javatest.batch] 07-30-2019 12:33:27:  Trip IllegalStateException by calling JsonParser.getString()
[javatest.batch] 07-30-2019 12:33:27:  Got expected IllegalStateException
[javatest.batch] 07-30-2019 12:33:27:  Testing call to JsonParser.isIntegralNumber()
[javatest.batch] 07-30-2019 12:33:27:  Trip IllegalStateException by calling JsonParser.isIntegralNumber()
[javatest.batch] 07-30-2019 12:33:27:  Got expected IllegalStateException
[javatest.batch] 07-30-2019 12:33:27:  Testing call to JsonParser.getBigDecimal()
[javatest.batch] 07-30-2019 12:33:27:  Trip IllegalStateException by calling JsonParser.getBigDecimal()
[javatest.batch] 07-30-2019 12:33:27:  Got expected IllegalStateException
[javatest.batch] 07-30-2019 12:33:27:  Testing call to JsonParser.getInt()
[javatest.batch] 07-30-2019 12:33:27:  Trip IllegalStateException by calling JsonParser.getInt()
[javatest.batch] 07-30-2019 12:33:27:  Got expected IllegalStateException
[javatest.batch] 07-30-2019 12:33:27:  Testing call to JsonParser.getLong()
[javatest.batch] 07-30-2019 12:33:27:  Trip IllegalStateException by calling JsonParser.getLong()
[javatest.batch] 07-30-2019 12:33:27:  Got expected IllegalStateException
[javatest.batch] 07-30-2019 12:33:27:  Event=START_OBJECT
[javatest.batch] 07-30-2019 12:33:27:  Testing call to JsonParser.getString()
[javatest.batch] 07-30-2019 12:33:27:  Trip IllegalStateException by calling JsonParser.getString()
[javatest.batch] 07-30-2019 12:33:27:  Got expected IllegalStateException
[javatest.batch] 07-30-2019 12:33:27:  Testing call to JsonParser.isIntegralNumber()
[javatest.batch] 07-30-2019 12:33:27:  Trip IllegalStateException by calling JsonParser.isIntegralNumber()
[javatest.batch] 07-30-2019 12:33:27:  Got expected IllegalStateException
[javatest.batch] 07-30-2019 12:33:27:  Testing call to JsonParser.getBigDecimal()
[javatest.batch] 07-30-2019 12:33:27:  Trip IllegalStateException by calling JsonParser.getBigDecimal()
[javatest.batch] 07-30-2019 12:33:27:  Got expected IllegalStateException
[javatest.batch] 07-30-2019 12:33:27:  Testing call to JsonParser.getInt()
[javatest.batch] 07-30-2019 12:33:27:  Trip IllegalStateException by calling JsonParser.getInt()
[javatest.batch] 07-30-2019 12:33:27:  Got expected IllegalStateException
[javatest.batch] 07-30-2019 12:33:27:  Testing call to JsonParser.getLong()
[javatest.batch] 07-30-2019 12:33:27:  Trip IllegalStateException by calling JsonParser.getLong()
[javatest.batch] 07-30-2019 12:33:27:  Got expected IllegalStateException
[javatest.batch] 07-30-2019 12:33:27:  Event=KEY_NAME
[javatest.batch] 07-30-2019 12:33:27:  Testing call to JsonParser.getString()
[javatest.batch] 07-30-2019 12:33:27:  No testing for IllegalStateException for this scenario.
[javatest.batch] 07-30-2019 12:33:27:  Testing call to JsonParser.isIntegralNumber()
[javatest.batch] 07-30-2019 12:33:27:  Trip IllegalStateException by calling JsonParser.isIntegralNumber()
[javatest.batch] 07-30-2019 12:33:27:  Got expected IllegalStateException
[javatest.batch] 07-30-2019 12:33:27:  Testing call to JsonParser.getBigDecimal()
[javatest.batch] 07-30-2019 12:33:27:  Trip IllegalStateException by calling JsonParser.getBigDecimal()
[javatest.batch] 07-30-2019 12:33:27:  Got expected IllegalStateException
[javatest.batch] 07-30-2019 12:33:27:  Testing call to JsonParser.getInt()
[javatest.batch] 07-30-2019 12:33:27:  Trip IllegalStateException by calling JsonParser.getInt()
[javatest.batch] 07-30-2019 12:33:27:  Got expected IllegalStateException
[javatest.batch] 07-30-2019 12:33:27:  Testing call to JsonParser.getLong()
[javatest.batch] 07-30-2019 12:33:27:  Trip IllegalStateException by calling JsonParser.getLong()
[javatest.batch] 07-30-2019 12:33:27:  Got expected IllegalStateException
[javatest.batch] 07-30-2019 12:33:27:  Event=VALUE_STRING
[javatest.batch] 07-30-2019 12:33:27:  Testing call to JsonParser.getString()
[javatest.batch] 07-30-2019 12:33:27:  No testing for IllegalStateException for this scenario.
[javatest.batch] 07-30-2019 12:33:27:  Testing call to JsonParser.isIntegralNumber()
[javatest.batch] 07-30-2019 12:33:27:  Trip IllegalStateException by calling JsonParser.isIntegralNumber()
[javatest.batch] 07-30-2019 12:33:27:  Got expected IllegalStateException
[javatest.batch] 07-30-2019 12:33:27:  Testing call to JsonParser.getBigDecimal()
[javatest.batch] 07-30-2019 12:33:27:  Trip IllegalStateException by calling JsonParser.getBigDecimal()
[javatest.batch] 07-30-2019 12:33:27:  Got expected IllegalStateException
[javatest.batch] 07-30-2019 12:33:27:  Testing call to JsonParser.getInt()
[javatest.batch] 07-30-2019 12:33:27:  Trip IllegalStateException by calling JsonParser.getInt()
[javatest.batch] 07-30-2019 12:33:27:  Got expected IllegalStateException
[javatest.batch] 07-30-2019 12:33:27:  Testing call to JsonParser.getLong()
[javatest.batch] 07-30-2019 12:33:27:  Trip IllegalStateException by calling JsonParser.getLong()
[javatest.batch] 07-30-2019 12:33:27:  Got expected IllegalStateException
[javatest.batch] 07-30-2019 12:33:27:  Event=END_OBJECT
[javatest.batch] 07-30-2019 12:33:27:  Testing call to JsonParser.getString()
[javatest.batch] 07-30-2019 12:33:27:  Trip IllegalStateException by calling JsonParser.getString()
[javatest.batch] 07-30-2019 12:33:27:  Got expected IllegalStateException
[javatest.batch] 07-30-2019 12:33:27:  Testing call to JsonParser.isIntegralNumber()
[javatest.batch] 07-30-2019 12:33:27:  Trip IllegalStateException by calling JsonParser.isIntegralNumber()
[javatest.batch] 07-30-2019 12:33:27:  Got expected IllegalStateException
[javatest.batch] 07-30-2019 12:33:27:  Testing call to JsonParser.getBigDecimal()
[javatest.batch] 07-30-2019 12:33:27:  Trip IllegalStateException by calling JsonParser.getBigDecimal()
[javatest.batch] 07-30-2019 12:33:27:  Got expected IllegalStateException
[javatest.batch] 07-30-2019 12:33:27:  Testing call to JsonParser.getInt()
[javatest.batch] 07-30-2019 12:33:27:  Trip IllegalStateException by calling JsonParser.getInt()
[javatest.batch] 07-30-2019 12:33:27:  Got expected IllegalStateException
[javatest.batch] 07-30-2019 12:33:27:  Testing call to JsonParser.getLong()
[javatest.batch] 07-30-2019 12:33:27:  Trip IllegalStateException by calling JsonParser.getLong()
[javatest.batch] 07-30-2019 12:33:27:  Got expected IllegalStateException
[javatest.batch] 07-30-2019 12:33:27:  Event=END_ARRAY
[javatest.batch] 07-30-2019 12:33:27:  Testing call to JsonParser.getString()
[javatest.batch] 07-30-2019 12:33:27:  Trip IllegalStateException by calling JsonParser.getString()
[javatest.batch] 07-30-2019 12:33:27:  Got expected IllegalStateException
[javatest.batch] 07-30-2019 12:33:27:  Testing call to JsonParser.isIntegralNumber()
[javatest.batch] 07-30-2019 12:33:27:  Trip IllegalStateException by calling JsonParser.isIntegralNumber()
[javatest.batch] 07-30-2019 12:33:27:  Got expected IllegalStateException
[javatest.batch] 07-30-2019 12:33:27:  Testing call to JsonParser.getBigDecimal()
[javatest.batch] 07-30-2019 12:33:27:  Trip IllegalStateException by calling JsonParser.getBigDecimal()
[javatest.batch] 07-30-2019 12:33:27:  Got expected IllegalStateException
[javatest.batch] 07-30-2019 12:33:27:  Testing call to JsonParser.getInt()
[javatest.batch] 07-30-2019 12:33:27:  Trip IllegalStateException by calling JsonParser.getInt()
[javatest.batch] 07-30-2019 12:33:27:  Got expected IllegalStateException
[javatest.batch] 07-30-2019 12:33:27:  Testing call to JsonParser.getLong()
[javatest.batch] 07-30-2019 12:33:27:  Trip IllegalStateException by calling JsonParser.getLong()
[javatest.batch] 07-30-2019 12:33:27:  Got expected IllegalStateException
[javatest.batch] 07-30-2019 12:33:27:  cleanup ok
[javatest.batch] 07-30-2019 12:33:28:  TRACE: SLEPT FOR:  1000
[javatest.batch] STATUS:Passed.
[javatest.batch] Passed.
[javatest.batch] ********************************************************************************
[javatest.batch] Finished Test:  PASSED........com/sun/ts/tests/jsonp/api/jsonparsertests/Client.java#jsonParserIllegalExceptionTests_from_standalone
[javatest.batch] ********************************************************************************
[javatest.batch] Number of tests completed:  69 (69 passed, 0 failed, 0 with errors)
[javatest.batch] Number of tests remaining:  100
[javatest.batch] ********************************************************************************
[javatest.batch] Beginning Test:  com/sun/ts/tests/jsonp/api/jsonparsertests/Client.java#jsonParserIOErrorTests_from_standalone
[javatest.batch] ********************************************************************************
[javatest.batch] 
[javatest.batch] 07-30-2019 12:33:28:  Harness - harness.executeMode is set to "2"
[javatest.batch] 07-30-2019 12:33:28:  Harness - keywords (to be passed to tests) set to:  all
[javatest.batch] 07-30-2019 12:33:28:  Harness - sClassPathFromExecProps = 
[javatest.batch] command: com.sun.ts.lib.harness.ExecTSTestCmd CLASSPATH=:/home/jenkins/workspace/TCK_JSONP_run/jsonp-tck/bin/xml/../../lib/tsharness.jar:/home/jenkins/workspace/TCK_JSONP_run/jsonp-tck/bin/xml/../../lib/sigtest.jar:/home/jenkins/workspace/TCK_JSONP_run/jsonp-tck/bin/xml/../../lib/jsonptck.jar:/home/jenkins/workspace/TCK_JSONP_run/jsonp-tck/bin/xml/../../classes:/home/jenkins/workspace/TCK_JSONP_run/jsonp-tck/bin/xml/../../bin:jsonp.alt.provider.classes:/home/jenkins/workspace/TCK_JSONP_run/jsonp-tck/bin/xml/../../src/com/sun/ts/tests/jsonp/resources:/home/jenkins/workspace/TCK_JSONP_run/jsonp-tck/bin/xml/../../../glassfish5/glassfish/modules/cdi-api.jar:/home/jenkins/workspace/TCK_JSONP_run/jsonp-tck/bin/xml/../../../glassfish5/glassfish/modules/jakarta.ejb-api.jar:/home/jenkins/workspace/TCK_JSONP_run/jsonp-tck/bin/xml/../../../glassfish5/glassfish/modules/jakarta.inject.jar:/home/jenkins/workspace/TCK_JSONP_run/jsonp-tck/bin/xml/../../../glassfish5/glassfish/modules/jakarta.json.jar:/home/jenkins/workspace/TCK_JSONP_run/jsonp-tck/bin/xml/../../../glassfish5/glassfish/modules/jakarta.json-api.jar:/home/jenkins/workspace/TCK_JSONP_run/jsonp-tck/bin/xml/../../../glassfish5/glassfish/modules/jakarta.persistence.jar:/home/jenkins/workspace/TCK_JSONP_run/jsonp-tck/bin/xml/../../../glassfish5/glassfish/modules/jakarta.servlet-api.jar:/home/jenkins/workspace/TCK_JSONP_run/jsonp-tck/bin/xml/../../../glassfish5/glassfish/modules/jakarta.transaction-api.jar DISPLAY=:0.0 HOME=/home/jenkins windir= SYSTEMROOT= /opt/tools/java/oracle/jdk-8/1.8.0_202/jre/bin/java -Djava.security.policy=/home/jenkins/workspace/TCK_JSONP_run/jsonp-tck/bin/xml/../../bin/harness.policy -Djava.security.manager -Ddeliverable.class=com.sun.ts.lib.deliverable.jsonp.JSONPDeliverable com.sun.ts.tests.common.vehicle.VehicleClient -p /home/jenkins/workspace/TCK_JSONP_run/jsonp-tck/bin/xml/../../tmp/tstest.jte -t jsonParserIOErrorTests -vehicle standalone
[javatest.batch] ************************************************************
[javatest.batch] * props file set to "/tmp/default-cts-props.txt"
[javatest.batch] ************************************************************
[javatest.batch] 07-30-2019 12:33:29:  TRACE: #######  Value of harness.socket.retry.count is "10"
[javatest.batch] 07-30-2019 12:33:29:  TRACE: #######  Value of harness.log.port is "2000"
[javatest.batch] 07-30-2019 12:33:29:  TRACE: #######  Actual bind value of harness.log.port is "2000"
[javatest.batch] 07-30-2019 12:33:29:  TRACE: in ServiceEETest.run() method
[javatest.batch] 07-30-2019 12:33:29:  TRACE: Vehicle to be used for this test is:  standalone
[javatest.batch] 07-30-2019 12:33:29:  TRACE: in custom vehicle so call on EETest.
[javatest.batch] 07-30-2019 12:33:29:  TRACE: *** in EETest.run(argv,p)
[javatest.batch] 07-30-2019 12:33:29:  TRACE: TESTCLASS=com.sun.ts.tests.jsonp.api.jsonparsertests.Client
[javatest.batch] 07-30-2019 12:33:29:  TRACE: ** IN getRunMethod: testClass=com.sun.ts.tests.jsonp.api.jsonparsertests.Client
[javatest.batch] 07-30-2019 12:33:29:  TRACE: ** IN getRunMethod: testname=jsonParserIOErrorTests
[javatest.batch] 07-30-2019 12:33:29:  TRACE: ** GOT RUN METHOD!
[javatest.batch] 07-30-2019 12:33:29:  TRACE: **runmethod=jsonParserIOErrorTests
[javatest.batch] 07-30-2019 12:33:29:  TRACE: ABOUT TO GET SETUP METHOD!
[javatest.batch] 07-30-2019 12:33:29:  TRACE: No setupMethod annotation present
[javatest.batch] 07-30-2019 12:33:29:  TRACE: getSetupMethod - checking for testcase specific setup method:  jsonParserIOErrorTests_setup
[javatest.batch] 07-30-2019 12:33:29:  TRACE: getSetupMethod - checking for default class specific setup method
[javatest.batch] 07-30-2019 12:33:29:  TRACE: GOT SETUP METHOD!
[javatest.batch] 07-30-2019 12:33:29:  TRACE: No cleanupMethod annotation present
[javatest.batch] 07-30-2019 12:33:29:  TRACE: getCleanupMethod - checking for testcase specific cleanup method:  jsonParserIOErrorTests_cleanup
[javatest.batch] 07-30-2019 12:33:29:  TRACE: getCleanupMethod - checking for default class specific cleanup method
[javatest.batch] 07-30-2019 12:33:29:  TRACE: GOT CLEANUP METHOD!
[javatest.batch] 07-30-2019 12:33:29:  TRACE: ABOUT TO INVOKE SETUP METHOD!
[javatest.batch] 07-30-2019 12:33:29:  setup ok
[javatest.batch] 07-30-2019 12:33:29:  TRACE: INVOKED SETUP METHOD!
[javatest.batch] 07-30-2019 12:33:29:  TRACE: ABOUT TO INVOKE EETEST RUN METHOD!
[javatest.batch] 07-30-2019 12:33:29:  Trip JsonException if there is an i/o error on Json.createParser(InputStream).
[javatest.batch] 07-30-2019 12:33:29:  Parsing {"name1":"value1","name2":"value2"}
[javatest.batch] 07-30-2019 12:33:29:  Calling Json.createParser(InputStream)
[javatest.batch] 07-30-2019 12:33:29:  MyBufferedInputStream->checkToTripIOException: *** tripping an IOException ***
[javatest.batch] 07-30-2019 12:33:29:  Caught expected JsonException
[javatest.batch] 07-30-2019 12:33:29:  Trip JsonException if there is an i/o error on JsonParser.next().
[javatest.batch] 07-30-2019 12:33:29:  Parsing {"name1":"value1","name2":"value2"}
[javatest.batch] 07-30-2019 12:33:29:  MyBufferedInputStream->checkToTripIOException: *** tripping an IOException ***
[javatest.batch] 07-30-2019 12:33:29:  Caught expected JsonException
[javatest.batch] 07-30-2019 12:33:29:  Trip JsonException if there is an i/o error on JsonParser.close().
[javatest.batch] 07-30-2019 12:33:29:  Parsing {"name1":"value1","name2":"value2"}
[javatest.batch] 07-30-2019 12:33:29:  Calling JsonParser.close()
[javatest.batch] 07-30-2019 12:33:29:  MyBufferedInputStream->checkToTripIOException: *** tripping an IOException ***
[javatest.batch] 07-30-2019 12:33:29:  Caught expected JsonException
[javatest.batch] 07-30-2019 12:33:29:  cleanup ok
[javatest.batch] 07-30-2019 12:33:30:  TRACE: SLEPT FOR:  1000
[javatest.batch] STATUS:Passed.
[javatest.batch] Passed.
[javatest.batch] ********************************************************************************
[javatest.batch] Finished Test:  PASSED........com/sun/ts/tests/jsonp/api/jsonparsertests/Client.java#jsonParserIOErrorTests_from_standalone
[javatest.batch] ********************************************************************************
[javatest.batch] Number of tests completed:  70 (70 passed, 0 failed, 0 with errors)
[javatest.batch] Number of tests remaining:  99
[javatest.batch] ********************************************************************************
[javatest.batch] Beginning Test:  com/sun/ts/tests/jsonp/api/jsonparsertests/Client.java#jsonParserIsIntegralNumberTest_from_standalone
[javatest.batch] ********************************************************************************
[javatest.batch] 
[javatest.batch] 07-30-2019 12:33:30:  Harness - harness.executeMode is set to "2"
[javatest.batch] 07-30-2019 12:33:30:  Harness - keywords (to be passed to tests) set to:  all
[javatest.batch] 07-30-2019 12:33:30:  Harness - sClassPathFromExecProps = 
[javatest.batch] command: com.sun.ts.lib.harness.ExecTSTestCmd CLASSPATH=:/home/jenkins/workspace/TCK_JSONP_run/jsonp-tck/bin/xml/../../lib/tsharness.jar:/home/jenkins/workspace/TCK_JSONP_run/jsonp-tck/bin/xml/../../lib/sigtest.jar:/home/jenkins/workspace/TCK_JSONP_run/jsonp-tck/bin/xml/../../lib/jsonptck.jar:/home/jenkins/workspace/TCK_JSONP_run/jsonp-tck/bin/xml/../../classes:/home/jenkins/workspace/TCK_JSONP_run/jsonp-tck/bin/xml/../../bin:jsonp.alt.provider.classes:/home/jenkins/workspace/TCK_JSONP_run/jsonp-tck/bin/xml/../../src/com/sun/ts/tests/jsonp/resources:/home/jenkins/workspace/TCK_JSONP_run/jsonp-tck/bin/xml/../../../glassfish5/glassfish/modules/cdi-api.jar:/home/jenkins/workspace/TCK_JSONP_run/jsonp-tck/bin/xml/../../../glassfish5/glassfish/modules/jakarta.ejb-api.jar:/home/jenkins/workspace/TCK_JSONP_run/jsonp-tck/bin/xml/../../../glassfish5/glassfish/modules/jakarta.inject.jar:/home/jenkins/workspace/TCK_JSONP_run/jsonp-tck/bin/xml/../../../glassfish5/glassfish/modules/jakarta.json.jar:/home/jenkins/workspace/TCK_JSONP_run/jsonp-tck/bin/xml/../../../glassfish5/glassfish/modules/jakarta.json-api.jar:/home/jenkins/workspace/TCK_JSONP_run/jsonp-tck/bin/xml/../../../glassfish5/glassfish/modules/jakarta.persistence.jar:/home/jenkins/workspace/TCK_JSONP_run/jsonp-tck/bin/xml/../../../glassfish5/glassfish/modules/jakarta.servlet-api.jar:/home/jenkins/workspace/TCK_JSONP_run/jsonp-tck/bin/xml/../../../glassfish5/glassfish/modules/jakarta.transaction-api.jar DISPLAY=:0.0 HOME=/home/jenkins windir= SYSTEMROOT= /opt/tools/java/oracle/jdk-8/1.8.0_202/jre/bin/java -Djava.security.policy=/home/jenkins/workspace/TCK_JSONP_run/jsonp-tck/bin/xml/../../bin/harness.policy -Djava.security.manager -Ddeliverable.class=com.sun.ts.lib.deliverable.jsonp.JSONPDeliverable com.sun.ts.tests.common.vehicle.VehicleClient -p /home/jenkins/workspace/TCK_JSONP_run/jsonp-tck/bin/xml/../../tmp/tstest.jte -t jsonParserIsIntegralNumberTest -vehicle standalone
[javatest.batch] ************************************************************
[javatest.batch] * props file set to "/tmp/default-cts-props.txt"
[javatest.batch] ************************************************************
[javatest.batch] 07-30-2019 12:33:30:  TRACE: #######  Value of harness.socket.retry.count is "10"
[javatest.batch] 07-30-2019 12:33:30:  TRACE: #######  Value of harness.log.port is "2000"
[javatest.batch] 07-30-2019 12:33:30:  TRACE: #######  Actual bind value of harness.log.port is "2000"
[javatest.batch] 07-30-2019 12:33:30:  TRACE: in ServiceEETest.run() method
[javatest.batch] 07-30-2019 12:33:30:  TRACE: Vehicle to be used for this test is:  standalone
[javatest.batch] 07-30-2019 12:33:30:  TRACE: in custom vehicle so call on EETest.
[javatest.batch] 07-30-2019 12:33:30:  TRACE: *** in EETest.run(argv,p)
[javatest.batch] 07-30-2019 12:33:30:  TRACE: TESTCLASS=com.sun.ts.tests.jsonp.api.jsonparsertests.Client
[javatest.batch] 07-30-2019 12:33:30:  TRACE: ** IN getRunMethod: testClass=com.sun.ts.tests.jsonp.api.jsonparsertests.Client
[javatest.batch] 07-30-2019 12:33:30:  TRACE: ** IN getRunMethod: testname=jsonParserIsIntegralNumberTest
[javatest.batch] 07-30-2019 12:33:30:  TRACE: ** GOT RUN METHOD!
[javatest.batch] 07-30-2019 12:33:30:  TRACE: **runmethod=jsonParserIsIntegralNumberTest
[javatest.batch] 07-30-2019 12:33:30:  TRACE: ABOUT TO GET SETUP METHOD!
[javatest.batch] 07-30-2019 12:33:30:  TRACE: No setupMethod annotation present
[javatest.batch] 07-30-2019 12:33:30:  TRACE: getSetupMethod - checking for testcase specific setup method:  jsonParserIsIntegralNumberTest_setup
[javatest.batch] 07-30-2019 12:33:30:  TRACE: getSetupMethod - checking for default class specific setup method
[javatest.batch] 07-30-2019 12:33:30:  TRACE: GOT SETUP METHOD!
[javatest.batch] 07-30-2019 12:33:30:  TRACE: No cleanupMethod annotation present
[javatest.batch] 07-30-2019 12:33:30:  TRACE: getCleanupMethod - checking for testcase specific cleanup method:  jsonParserIsIntegralNumberTest_cleanup
[javatest.batch] 07-30-2019 12:33:30:  TRACE: getCleanupMethod - checking for default class specific cleanup method
[javatest.batch] 07-30-2019 12:33:30:  TRACE: GOT CLEANUP METHOD!
[javatest.batch] 07-30-2019 12:33:30:  TRACE: ABOUT TO INVOKE SETUP METHOD!
[javatest.batch] 07-30-2019 12:33:30:  setup ok
[javatest.batch] 07-30-2019 12:33:30:  TRACE: INVOKED SETUP METHOD!
[javatest.batch] 07-30-2019 12:33:30:  TRACE: ABOUT TO INVOKE EETEST RUN METHOD!
[javatest.batch] 07-30-2019 12:33:30:  Create JsonParser
[javatest.batch] 07-30-2019 12:33:30:  JsonParser.Event=VALUE_NUMBER
[javatest.batch] 07-30-2019 12:33:30:  Json NumberType match
[javatest.batch] 07-30-2019 12:33:30:  Expected: INTEGRAL
[javatest.batch] 07-30-2019 12:33:30:  Actual:   INTEGRAL
[javatest.batch] 07-30-2019 12:33:30:  int match
[javatest.batch] 07-30-2019 12:33:30:  Expected: 123
[javatest.batch] 07-30-2019 12:33:30:  Actual:   123
[javatest.batch] 07-30-2019 12:33:30:  JsonParser.Event=VALUE_NUMBER
[javatest.batch] 07-30-2019 12:33:30:  Json NumberType match
[javatest.batch] 07-30-2019 12:33:30:  Expected: NON_INTEGRAL
[javatest.batch] 07-30-2019 12:33:30:  Actual:   NON_INTEGRAL
[javatest.batch] 07-30-2019 12:33:30:  double match
[javatest.batch] 07-30-2019 12:33:30:  Expected: 12345.45
[javatest.batch] 07-30-2019 12:33:30:  Actual:   12345.45
[javatest.batch] 07-30-2019 12:33:30:  cleanup ok
$ ssh-agent -k
unset SSH_AUTH_SOCK;
unset SSH_AGENT_PID;
echo Agent pid 79 killed;
[ssh-agent] Stopped.
Build was aborted
Aborted by Dmitry Kornilov
Skipped archiving because build is not successful
Started calculate disk usage of build
Finished Calculation of disk usage of build in 0 seconds
Started calculate disk usage of workspace
[javatest.batch] 07-30-2019 12:33:31:  TRACE: SLEPT FOR:  1000
[javatest.batch] STATUS:Passed.
[javatest.batch] Passed.
[javatest.batch] ********************************************************************************
[javatest.batch] Finished Test:  PASSED........com/sun/ts/tests/jsonp/api/jsonparsertests/Client.java#jsonParserIsIntegralNumberTest_from_standalone
[javatest.batch] ********************************************************************************
[javatest.batch] Number of tests completed:  71 (71 passed, 0 failed, 0 with errors)
[javatest.batch] Number of tests remaining:  98
[javatest.batch] ********************************************************************************
[javatest.batch] Beginning Test:  com/sun/ts/tests/jsonp/api/jsonparsertests/Client.java#jsonParserTest1_from_standalone
[javatest.batch] ********************************************************************************
[javatest.batch] 
[javatest.batch] 07-30-2019 12:33:32:  Harness - harness.executeMode is set to "2"
[javatest.batch] 07-30-2019 12:33:32:  Harness - keywords (to be passed to tests) set to:  all
[javatest.batch] 07-30-2019 12:33:32:  Harness - sClassPathFromExecProps = 
[javatest.batch] command: com.sun.ts.lib.harness.ExecTSTestCmd CLASSPATH=:/home/jenkins/workspace/TCK_JSONP_run/jsonp-tck/bin/xml/../../lib/tsharness.jar:/home/jenkins/workspace/TCK_JSONP_run/jsonp-tck/bin/xml/../../lib/sigtest.jar:/home/jenkins/workspace/TCK_JSONP_run/jsonp-tck/bin/xml/../../lib/jsonptck.jar:/home/jenkins/workspace/TCK_JSONP_run/jsonp-tck/bin/xml/../../classes:/home/jenkins/workspace/TCK_JSONP_run/jsonp-tck/bin/xml/../../bin:jsonp.alt.provider.classes:/home/jenkins/workspace/TCK_JSONP_run/jsonp-tck/bin/xml/../../src/com/sun/ts/tests/jsonp/resources:/home/jenkins/workspace/TCK_JSONP_run/jsonp-tck/bin/xml/../../../glassfish5/glassfish/modules/cdi-api.jar:/home/jenkins/workspace/TCK_JSONP_run/jsonp-tck/bin/xml/../../../glassfish5/glassfish/modules/jakarta.ejb-api.jar:/home/jenkins/workspace/TCK_JSONP_run/jsonp-tck/bin/xml/../../../glassfish5/glassfish/modules/jakarta.inject.jar:/home/jenkins/workspace/TCK_JSONP_run/jsonp-tck/bin/xml/../../../glassfish5/glassfish/modules/jakarta.json.jar:/home/jenkins/workspace/TCK_JSONP_run/jsonp-tck/bin/xml/../../../glassfish5/glassfish/modules/jakarta.json-api.jar:/home/jenkins/workspace/TCK_JSONP_run/jsonp-tck/bin/xml/../../../glassfish5/glassfish/modules/jakarta.persistence.jar:/home/jenkins/workspace/TCK_JSONP_run/jsonp-tck/bin/xml/../../../glassfish5/glassfish/modules/jakarta.servlet-api.jar:/home/jenkins/workspace/TCK_JSONP_run/jsonp-tck/bin/xml/../../../glassfish5/glassfish/modules/jakarta.transaction-api.jar DISPLAY=:0.0 HOME=/home/jenkins windir= SYSTEMROOT= /opt/tools/java/oracle/jdk-8/1.8.0_202/jre/bin/java -Djava.security.policy=/home/jenkins/workspace/TCK_JSONP_run/jsonp-tck/bin/xml/../../bin/harness.policy -Djava.security.manager -Ddeliverable.class=com.sun.ts.lib.deliverable.jsonp.JSONPDeliverable com.sun.ts.tests.common.vehicle.VehicleClient -p /home/jenkins/workspace/TCK_JSONP_run/jsonp-tck/bin/xml/../../tmp/tstest.jte -t jsonParserTest1 -vehicle standalone
[javatest.batch] ************************************************************
[javatest.batch] * props file set to "/tmp/default-cts-props.txt"
[javatest.batch] ************************************************************
[javatest.batch] 07-30-2019 12:33:32:  TRACE: #######  Value of harness.socket.retry.count is "10"
[javatest.batch] 07-30-2019 12:33:32:  TRACE: #######  Value of harness.log.port is "2000"
[javatest.batch] 07-30-2019 12:33:32:  TRACE: #######  Actual bind value of harness.log.port is "2000"
[javatest.batch] 07-30-2019 12:33:32:  TRACE: in ServiceEETest.run() method
[javatest.batch] 07-30-2019 12:33:32:  TRACE: Vehicle to be used for this test is:  standalone
[javatest.batch] 07-30-2019 12:33:32:  TRACE: in custom vehicle so call on EETest.
[javatest.batch] 07-30-2019 12:33:32:  TRACE: *** in EETest.run(argv,p)
[javatest.batch] 07-30-2019 12:33:32:  TRACE: TESTCLASS=com.sun.ts.tests.jsonp.api.jsonparsertests.Client
[javatest.batch] 07-30-2019 12:33:32:  TRACE: ** IN getRunMethod: testClass=com.sun.ts.tests.jsonp.api.jsonparsertests.Client
[javatest.batch] 07-30-2019 12:33:32:  TRACE: ** IN getRunMethod: testname=jsonParserTest1
[javatest.batch] 07-30-2019 12:33:32:  TRACE: ** GOT RUN METHOD!
[javatest.batch] 07-30-2019 12:33:32:  TRACE: **runmethod=jsonParserTest1
[javatest.batch] 07-30-2019 12:33:32:  TRACE: ABOUT TO GET SETUP METHOD!
[javatest.batch] 07-30-2019 12:33:32:  TRACE: No setupMethod annotation present
[javatest.batch] 07-30-2019 12:33:32:  TRACE: getSetupMethod - checking for testcase specific setup method:  jsonParserTest1_setup
[javatest.batch] 07-30-2019 12:33:32:  TRACE: getSetupMethod - checking for default class specific setup method
[javatest.batch] 07-30-2019 12:33:32:  TRACE: GOT SETUP METHOD!
[javatest.batch] 07-30-2019 12:33:32:  TRACE: No cleanupMethod annotation present
[javatest.batch] 07-30-2019 12:33:32:  TRACE: getCleanupMethod - checking for testcase specific cleanup method:  jsonParserTest1_cleanup
[javatest.batch] 07-30-2019 12:33:32:  TRACE: getCleanupMethod - checking for default class specific cleanup method
[javatest.batch] 07-30-2019 12:33:32:  TRACE: GOT CLEANUP METHOD!
[javatest.batch] 07-30-2019 12:33:32:  TRACE: ABOUT TO INVOKE SETUP METHOD!
[javatest.batch] 07-30-2019 12:33:32:  setup ok
[javatest.batch] 07-30-2019 12:33:32:  TRACE: INVOKED SETUP METHOD!
[javatest.batch] 07-30-2019 12:33:32:  TRACE: ABOUT TO INVOKE EETEST RUN METHOD!
[javatest.batch] 07-30-2019 12:33:32:  -------------------------------------
[javatest.batch] 07-30-2019 12:33:32:  TEST CASE [Json.createParser(Reader)]
[javatest.batch] 07-30-2019 12:33:32:  -------------------------------------
[javatest.batch] 07-30-2019 12:33:32:  Create Reader from (JSONP_Data.jsonObjectWithAllTypesOfData)
[javatest.batch] 07-30-2019 12:33:32:  Create JsonParser from the Reader
[javatest.batch] 07-30-2019 12:33:32:  Verify that JSON Parser Events/Data matches (JSONP_Data.jsonObjectWithAllTypesOfData)
[javatest.batch] 07-30-2019 12:33:32:  Got expected event: START_OBJECT
[javatest.batch] 07-30-2019 12:33:32:  Got expected event: KEY_NAME
[javatest.batch] 07-30-2019 12:33:32:  Got expected keyname: emptyString
[javatest.batch] 07-30-2019 12:33:32:  Got expected keyvalue: 
[javatest.batch] 07-30-2019 12:33:32:  Got expected event: KEY_NAME
[javatest.batch] 07-30-2019 12:33:32:  Got expected keyname: emptyArray
[javatest.batch] 07-30-2019 12:33:32:  Got expected event: START_ARRAY
[javatest.batch] 07-30-2019 12:33:32:  Got expected event: END_ARRAY
[javatest.batch] 07-30-2019 12:33:32:  Got expected event: KEY_NAME
[javatest.batch] 07-30-2019 12:33:32:  Got expected keyname: emptyObject
[javatest.batch] 07-30-2019 12:33:32:  Got expected event: START_OBJECT
[javatest.batch] 07-30-2019 12:33:32:  Got expected event: END_OBJECT
[javatest.batch] 07-30-2019 12:33:32:  Got expected event: KEY_NAME
[javatest.batch] 07-30-2019 12:33:32:  Got expected keyname: string
[javatest.batch] 07-30-2019 12:33:32:  Got expected keyvalue: string
[javatest.batch] 07-30-2019 12:33:32:  Got expected event: KEY_NAME
[javatest.batch] 07-30-2019 12:33:32:  Got expected keyname: number
[javatest.batch] 07-30-2019 12:33:32:  Got expected event: VALUE_NUMBER
[javatest.batch] 07-30-2019 12:33:32:  Got expected keyvalue: 100
[javatest.batch] 07-30-2019 12:33:32:  Got expected event: KEY_NAME
[javatest.batch] 07-30-2019 12:33:32:  Got expected keyname: true
[javatest.batch] 07-30-2019 12:33:32:  Got expected event: VALUE_TRUE
[javatest.batch] 07-30-2019 12:33:32:  Got expected event: KEY_NAME
[javatest.batch] 07-30-2019 12:33:32:  Got expected keyname: false
[javatest.batch] 07-30-2019 12:33:32:  Got expected event: VALUE_FALSE
[javatest.batch] 07-30-2019 12:33:32:  Got expected event: KEY_NAME
[javatest.batch] 07-30-2019 12:33:32:  Got expected keyname: null
[javatest.batch] 07-30-2019 12:33:32:  Got expected event: VALUE_NULL
[javatest.batch] 07-30-2019 12:33:32:  Got expected event: KEY_NAME
[javatest.batch] 07-30-2019 12:33:32:  Got expected keyname: object
[javatest.batch] 07-30-2019 12:33:32:  Got expected event: START_OBJECT
[javatest.batch] 07-30-2019 12:33:32:  Got expected event: KEY_NAME
[javatest.batch] 07-30-2019 12:33:32:  Got expected keyname: emptyString
[javatest.batch] 07-30-2019 12:33:32:  Got expected keyvalue: 
[javatest.batch] 07-30-2019 12:33:32:  Got expected event: KEY_NAME
[javatest.batch] 07-30-2019 12:33:32:  Got expected keyname: emptyArray
[javatest.batch] 07-30-2019 12:33:32:  Got expected event: START_ARRAY
[javatest.batch] 07-30-2019 12:33:32:  Got expected event: END_ARRAY
[javatest.batch] 07-30-2019 12:33:32:  Got expected event: KEY_NAME
[javatest.batch] 07-30-2019 12:33:32:  Got expected keyname: emptyObject
[javatest.batch] 07-30-2019 12:33:32:  Got expected event: START_OBJECT
[javatest.batch] 07-30-2019 12:33:32:  Got expected event: END_OBJECT
[javatest.batch] 07-30-2019 12:33:32:  Got expected event: KEY_NAME
[javatest.batch] 07-30-2019 12:33:32:  Got expected keyname: string
[javatest.batch] 07-30-2019 12:33:32:  Got expected keyvalue: string
[javatest.batch] 07-30-2019 12:33:32:  Got expected event: KEY_NAME
[javatest.batch] 07-30-2019 12:33:32:  Got expected keyname: number
[javatest.batch] 07-30-2019 12:33:32:  Got expected event: VALUE_NUMBER
[javatest.batch] 07-30-2019 12:33:32:  Got expected keyvalue: 100
[javatest.batch] 07-30-2019 12:33:32:  Got expected event: KEY_NAME
[javatest.batch] 07-30-2019 12:33:32:  Got expected keyname: true
[javatest.batch] 07-30-2019 12:33:32:  Got expected event: VALUE_TRUE
[javatest.batch] 07-30-2019 12:33:32:  Got expected event: KEY_NAME
[javatest.batch] 07-30-2019 12:33:32:  Got expected keyname: false
[javatest.batch] 07-30-2019 12:33:32:  Got expected event: VALUE_FALSE
[javatest.batch] 07-30-2019 12:33:32:  Got expected event: KEY_NAME
[javatest.batch] 07-30-2019 12:33:32:  Got expected keyname: null
[javatest.batch] 07-30-2019 12:33:32:  Got expected event: VALUE_NULL
[javatest.batch] 07-30-2019 12:33:32:  Got expected event: KEY_NAME
[javatest.batch] 07-30-2019 12:33:32:  Got expected keyname: object
[javatest.batch] 07-30-2019 12:33:32:  Got expected event: START_OBJECT
[javatest.batch] 07-30-2019 12:33:32:  Got expected event: KEY_NAME
[javatest.batch] 07-30-2019 12:33:32:  Got expected keyname: name
[javatest.batch] 07-30-2019 12:33:32:  Got expected keyvalue: value
[javatest.batch] 07-30-2019 12:33:32:  Got expected event: END_OBJECT
[javatest.batch] 07-30-2019 12:33:32:  Got expected event: KEY_NAME
[javatest.batch] 07-30-2019 12:33:32:  Got expected keyname: array
[javatest.batch] 07-30-2019 12:33:32:  Got expected event: START_ARRAY
[javatest.batch] 07-30-2019 12:33:32:  Got expected event: VALUE_STRING
[javatest.batch] 07-30-2019 12:33:32:  Got expected keyvalue: one
[javatest.batch] 07-30-2019 12:33:32:  Got expected event: VALUE_STRING
[javatest.batch] 07-30-2019 12:33:32:  Got expected keyvalue: two
[javatest.batch] 07-30-2019 12:33:32:  Got expected event: END_ARRAY
[javatest.batch] 07-30-2019 12:33:32:  Got expected event: END_OBJECT
[javatest.batch] 07-30-2019 12:33:32:  Got expected event: KEY_NAME
[javatest.batch] 07-30-2019 12:33:32:  Got expected keyname: array
[javatest.batch] 07-30-2019 12:33:32:  Got expected event: START_ARRAY
[javatest.batch] 07-30-2019 12:33:32:  Got expected event: VALUE_STRING
[javatest.batch] 07-30-2019 12:33:32:  Got expected keyvalue: string
[javatest.batch] 07-30-2019 12:33:32:  Got expected event: VALUE_NUMBER
[javatest.batch] 07-30-2019 12:33:32:  Got expected keyvalue: 100
[javatest.batch] 07-30-2019 12:33:32:  Got expected event: VALUE_TRUE
[javatest.batch] 07-30-2019 12:33:32:  Got expected event: VALUE_FALSE
[javatest.batch] 07-30-2019 12:33:32:  Got expected event: VALUE_NULL
[javatest.batch] 07-30-2019 12:33:32:  Got expected event: START_OBJECT
[javatest.batch] 07-30-2019 12:33:32:  Got expected event: KEY_NAME
[javatest.batch] 07-30-2019 12:33:32:  Got expected keyname: name
[javatest.batch] 07-30-2019 12:33:32:  Got expected keyvalue: value
[javatest.batch] 07-30-2019 12:33:32:  Got expected event: END_OBJECT
[javatest.batch] 07-30-2019 12:33:32:  Got expected event: START_ARRAY
[javatest.batch] 07-30-2019 12:33:32:  Got expected event: VALUE_STRING
[javatest.batch] 07-30-2019 12:33:32:  Got expected keyvalue: one
[javatest.batch] 07-30-2019 12:33:32:  Got expected event: VALUE_STRING
[javatest.batch] 07-30-2019 12:33:32:  Got expected keyvalue: two
[javatest.batch] 07-30-2019 12:33:32:  Got expected event: END_ARRAY
[javatest.batch] 07-30-2019 12:33:32:  Got expected event: END_ARRAY
[javatest.batch] 07-30-2019 12:33:32:  Got expected event: KEY_NAME
[javatest.batch] 07-30-2019 12:33:32:  Got expected keyname: intPositive
[javatest.batch] 07-30-2019 12:33:32:  Got expected event: VALUE_NUMBER
[javatest.batch] 07-30-2019 12:33:32:  Got expected keyvalue: 100
[javatest.batch] 07-30-2019 12:33:32:  Got expected event: KEY_NAME
[javatest.batch] 07-30-2019 12:33:32:  Got expected keyname: intNegative
[javatest.batch] 07-30-2019 12:33:32:  Got expected event: VALUE_NUMBER
[javatest.batch] 07-30-2019 12:33:32:  Got expected keyvalue: -100
[javatest.batch] 07-30-2019 12:33:32:  Got expected event: KEY_NAME
[javatest.batch] 07-30-2019 12:33:32:  Got expected keyname: longMax
[javatest.batch] 07-30-2019 12:33:32:  Got expected event: VALUE_NUMBER
[javatest.batch] 07-30-2019 12:33:32:  Got expected keyvalue: 9223372036854775807
[javatest.batch] 07-30-2019 12:33:32:  Got expected event: KEY_NAME
[javatest.batch] 07-30-2019 12:33:32:  Got expected keyname: longMin
[javatest.batch] 07-30-2019 12:33:32:  Got expected event: VALUE_NUMBER
[javatest.batch] 07-30-2019 12:33:32:  Got expected keyvalue: -9223372036854775808
[javatest.batch] 07-30-2019 12:33:32:  Got expected event: KEY_NAME
[javatest.batch] 07-30-2019 12:33:32:  Got expected keyname: fracPositive
[javatest.batch] 07-30-2019 12:33:32:  Got expected event: VALUE_NUMBER
[javatest.batch] 07-30-2019 12:33:32:  Got expected keyvalue: 0.5
[javatest.batch] 07-30-2019 12:33:32:  Got expected event: KEY_NAME
[javatest.batch] 07-30-2019 12:33:32:  Got expected keyname: fracNegative
[javatest.batch] 07-30-2019 12:33:32:  Got expected event: VALUE_NUMBER
[javatest.batch] 07-30-2019 12:33:32:  Got expected keyvalue: -0.5
[javatest.batch] 07-30-2019 12:33:32:  Got expected event: KEY_NAME
[javatest.batch] 07-30-2019 12:33:32:  Got expected keyname: expPositive1
[javatest.batch] 07-30-2019 12:33:32:  Got expected event: VALUE_NUMBER
[javatest.batch] 07-30-2019 12:33:32:  Got expected keyvalue: 7000.0
[javatest.batch] 07-30-2019 12:33:32:  Got expected event: KEY_NAME
[javatest.batch] 07-30-2019 12:33:32:  Got expected keyname: expPositive2
[javatest.batch] 07-30-2019 12:33:32:  Got expected event: VALUE_NUMBER
[javatest.batch] 07-30-2019 12:33:32:  Got expected keyvalue: 7000.0
[javatest.batch] 07-30-2019 12:33:32:  Got expected event: KEY_NAME
[javatest.batch] 07-30-2019 12:33:32:  Got expected keyname: expPositive3
[javatest.batch] 07-30-2019 12:33:32:  Got expected event: VALUE_NUMBER
[javatest.batch] 07-30-2019 12:33:32:  Got expected keyvalue: 9000.0
[javatest.batch] 07-30-2019 12:33:32:  Got expected event: KEY_NAME
[javatest.batch] 07-30-2019 12:33:32:  Got expected keyname: expPositive4
[javatest.batch] 07-30-2019 12:33:32:  Got expected event: VALUE_NUMBER
[javatest.batch] 07-30-2019 12:33:32:  Got expected keyvalue: 9000.0
[javatest.batch] 07-30-2019 12:33:32:  Got expected event: KEY_NAME
[javatest.batch] 07-30-2019 12:33:32:  Got expected keyname: expNegative1
[javatest.batch] 07-30-2019 12:33:32:  Got expected event: VALUE_NUMBER
[javatest.batch] 07-30-2019 12:33:32:  Got expected keyvalue: 0.007
[javatest.batch] 07-30-2019 12:33:32:  Got expected event: KEY_NAME
[javatest.batch] 07-30-2019 12:33:32:  Got expected keyname: expNegative2
[javatest.batch] 07-30-2019 12:33:32:  Got expected event: VALUE_NUMBER
[javatest.batch] 07-30-2019 12:33:32:  Got expected keyvalue: 0.007
[javatest.batch] 07-30-2019 12:33:32:  Got expected event: KEY_NAME
[javatest.batch] 07-30-2019 12:33:32:  Got expected keyname: asciiChars
[javatest.batch] 07-30-2019 12:33:32:  Got expected keyvalue: !@#$%^&*()_+|~1234567890-=;',./<>? qwertyuiopasdfghjklzxcvbnmQWERTYUIOPASDFGHJKLZXCVBNM
[javatest.batch] 07-30-2019 12:33:32:  Got expected event: END_OBJECT
[javatest.batch] 07-30-2019 12:33:32:  cleanup ok
Finished Calculation of disk usage of workspace in  1 second
Finished: ABORTED