FailedConsole Output

Skipping 68 KB.. Full Log
a-query/target/apidocs/org/eclipse/jnosql/diana/query/QueryParser.NumberContext.html...
Generating /home/jenkins/agent/workspace/jnosql-sonar/diana/diana-query/target/apidocs/org/eclipse/jnosql/diana/query/QueryParser.Object_jsonContext.html...
Generating /home/jenkins/agent/workspace/jnosql-sonar/diana/diana-query/target/apidocs/org/eclipse/jnosql/diana/query/QueryParser.OrContext.html...
Generating /home/jenkins/agent/workspace/jnosql-sonar/diana/diana-query/target/apidocs/org/eclipse/jnosql/diana/query/QueryParser.OrderContext.html...
Generating /home/jenkins/agent/workspace/jnosql-sonar/diana/diana-query/target/apidocs/org/eclipse/jnosql/diana/query/QueryParser.OrderNameContext.html...
Generating /home/jenkins/agent/workspace/jnosql-sonar/diana/diana-query/target/apidocs/org/eclipse/jnosql/diana/query/QueryParser.Pair_jsonContext.html...
Generating /home/jenkins/agent/workspace/jnosql-sonar/diana/diana-query/target/apidocs/org/eclipse/jnosql/diana/query/QueryParser.ParameterContext.html...
Generating /home/jenkins/agent/workspace/jnosql-sonar/diana/diana-query/target/apidocs/org/eclipse/jnosql/diana/query/QueryParser.PutContext.html...
Generating /home/jenkins/agent/workspace/jnosql-sonar/diana/diana-query/target/apidocs/org/eclipse/jnosql/diana/query/QueryParser.SelectContext.html...
Generating /home/jenkins/agent/workspace/jnosql-sonar/diana/diana-query/target/apidocs/org/eclipse/jnosql/diana/query/QueryParser.SkipContext.html...
Generating /home/jenkins/agent/workspace/jnosql-sonar/diana/diana-query/target/apidocs/org/eclipse/jnosql/diana/query/QueryParser.StarContext.html...
Generating /home/jenkins/agent/workspace/jnosql-sonar/diana/diana-query/target/apidocs/org/eclipse/jnosql/diana/query/QueryParser.StringContext.html...
Generating /home/jenkins/agent/workspace/jnosql-sonar/diana/diana-query/target/apidocs/org/eclipse/jnosql/diana/query/QueryParser.TtlContext.html...
Generating /home/jenkins/agent/workspace/jnosql-sonar/diana/diana-query/target/apidocs/org/eclipse/jnosql/diana/query/QueryParser.UnitContext.html...
Generating /home/jenkins/agent/workspace/jnosql-sonar/diana/diana-query/target/apidocs/org/eclipse/jnosql/diana/query/QueryParser.UpdateContext.html...
Generating /home/jenkins/agent/workspace/jnosql-sonar/diana/diana-query/target/apidocs/org/eclipse/jnosql/diana/query/QueryParser.Value_jsonContext.html...
Generating /home/jenkins/agent/workspace/jnosql-sonar/diana/diana-query/target/apidocs/org/eclipse/jnosql/diana/query/QueryParser.ValueContext.html...
Generating /home/jenkins/agent/workspace/jnosql-sonar/diana/diana-query/target/apidocs/org/eclipse/jnosql/diana/query/QueryParser.WhereContext.html...
Generating /home/jenkins/agent/workspace/jnosql-sonar/diana/diana-query/target/apidocs/org/eclipse/jnosql/diana/query/cache/CachedDeleteQueryProvider.html...
Generating /home/jenkins/agent/workspace/jnosql-sonar/diana/diana-query/target/apidocs/org/eclipse/jnosql/diana/query/cache/CachedDelQueryProvider.html...
Generating /home/jenkins/agent/workspace/jnosql-sonar/diana/diana-query/target/apidocs/org/eclipse/jnosql/diana/query/cache/CachedGetQueryProvider.html...
Generating /home/jenkins/agent/workspace/jnosql-sonar/diana/diana-query/target/apidocs/org/eclipse/jnosql/diana/query/cache/CachedInsertQueryProvider.html...
Generating /home/jenkins/agent/workspace/jnosql-sonar/diana/diana-query/target/apidocs/org/eclipse/jnosql/diana/query/cache/CachedPutQueryProvider.html...
Generating /home/jenkins/agent/workspace/jnosql-sonar/diana/diana-query/target/apidocs/org/eclipse/jnosql/diana/query/cache/CachedSelectQueryProvider.html...
Generating /home/jenkins/agent/workspace/jnosql-sonar/diana/diana-query/target/apidocs/org/eclipse/jnosql/diana/query/cache/CachedUpdateQueryProvider.html...
Generating /home/jenkins/agent/workspace/jnosql-sonar/diana/diana-query/target/apidocs/org/eclipse/jnosql/diana/query/method/DeleteMethodProvider.html...
Generating /home/jenkins/agent/workspace/jnosql-sonar/diana/diana-query/target/apidocs/org/eclipse/jnosql/diana/query/method/MethodBaseListener.html...
Generating /home/jenkins/agent/workspace/jnosql-sonar/diana/diana-query/target/apidocs/org/eclipse/jnosql/diana/query/method/MethodLexer.html...
Generating /home/jenkins/agent/workspace/jnosql-sonar/diana/diana-query/target/apidocs/org/eclipse/jnosql/diana/query/method/MethodListener.html...
Generating /home/jenkins/agent/workspace/jnosql-sonar/diana/diana-query/target/apidocs/org/eclipse/jnosql/diana/query/method/MethodParser.html...
Generating /home/jenkins/agent/workspace/jnosql-sonar/diana/diana-query/target/apidocs/org/eclipse/jnosql/diana/query/method/MethodParser.AndContext.html...
Generating /home/jenkins/agent/workspace/jnosql-sonar/diana/diana-query/target/apidocs/org/eclipse/jnosql/diana/query/method/MethodParser.AscContext.html...
Generating /home/jenkins/agent/workspace/jnosql-sonar/diana/diana-query/target/apidocs/org/eclipse/jnosql/diana/query/method/MethodParser.BetweenContext.html...
Generating /home/jenkins/agent/workspace/jnosql-sonar/diana/diana-query/target/apidocs/org/eclipse/jnosql/diana/query/method/MethodParser.ConditionContext.html...
Generating /home/jenkins/agent/workspace/jnosql-sonar/diana/diana-query/target/apidocs/org/eclipse/jnosql/diana/query/method/MethodParser.DeleteByContext.html...
Generating /home/jenkins/agent/workspace/jnosql-sonar/diana/diana-query/target/apidocs/org/eclipse/jnosql/diana/query/method/MethodParser.DescContext.html...
Generating /home/jenkins/agent/workspace/jnosql-sonar/diana/diana-query/target/apidocs/org/eclipse/jnosql/diana/query/method/MethodParser.EqContext.html...
Generating /home/jenkins/agent/workspace/jnosql-sonar/diana/diana-query/target/apidocs/org/eclipse/jnosql/diana/query/method/MethodParser.FindByContext.html...
Generating /home/jenkins/agent/workspace/jnosql-sonar/diana/diana-query/target/apidocs/org/eclipse/jnosql/diana/query/method/MethodParser.GtContext.html...
Generating /home/jenkins/agent/workspace/jnosql-sonar/diana/diana-query/target/apidocs/org/eclipse/jnosql/diana/query/method/MethodParser.GteContext.html...
Generating /home/jenkins/agent/workspace/jnosql-sonar/diana/diana-query/target/apidocs/org/eclipse/jnosql/diana/query/method/MethodParser.InContext.html...
Generating /home/jenkins/agent/workspace/jnosql-sonar/diana/diana-query/target/apidocs/org/eclipse/jnosql/diana/query/method/MethodParser.LikeContext.html...
Generating /home/jenkins/agent/workspace/jnosql-sonar/diana/diana-query/target/apidocs/org/eclipse/jnosql/diana/query/method/MethodParser.LtContext.html...
Generating /home/jenkins/agent/workspace/jnosql-sonar/diana/diana-query/target/apidocs/org/eclipse/jnosql/diana/query/method/MethodParser.LteContext.html...
Generating /home/jenkins/agent/workspace/jnosql-sonar/diana/diana-query/target/apidocs/org/eclipse/jnosql/diana/query/method/MethodParser.NotContext.html...
Generating /home/jenkins/agent/workspace/jnosql-sonar/diana/diana-query/target/apidocs/org/eclipse/jnosql/diana/query/method/MethodParser.OrContext.html...
Generating /home/jenkins/agent/workspace/jnosql-sonar/diana/diana-query/target/apidocs/org/eclipse/jnosql/diana/query/method/MethodParser.OrderContext.html...
Generating /home/jenkins/agent/workspace/jnosql-sonar/diana/diana-query/target/apidocs/org/eclipse/jnosql/diana/query/method/MethodParser.OrderNameContext.html...
Generating /home/jenkins/agent/workspace/jnosql-sonar/diana/diana-query/target/apidocs/org/eclipse/jnosql/diana/query/method/MethodParser.VariableContext.html...
Generating /home/jenkins/agent/workspace/jnosql-sonar/diana/diana-query/target/apidocs/org/eclipse/jnosql/diana/query/method/MethodParser.WhereContext.html...
Generating /home/jenkins/agent/workspace/jnosql-sonar/diana/diana-query/target/apidocs/org/eclipse/jnosql/diana/query/method/MethodQuery.html...
Generating /home/jenkins/agent/workspace/jnosql-sonar/diana/diana-query/target/apidocs/org/eclipse/jnosql/diana/query/method/SelectMethodProvider.html...
Generating /home/jenkins/agent/workspace/jnosql-sonar/diana/diana-query/target/apidocs/overview-frame.html...
Generating /home/jenkins/agent/workspace/jnosql-sonar/diana/diana-query/target/apidocs/org/eclipse/jnosql/diana/query/package-frame.html...
Generating /home/jenkins/agent/workspace/jnosql-sonar/diana/diana-query/target/apidocs/org/eclipse/jnosql/diana/query/package-summary.html...
Generating /home/jenkins/agent/workspace/jnosql-sonar/diana/diana-query/target/apidocs/org/eclipse/jnosql/diana/query/package-tree.html...
Generating /home/jenkins/agent/workspace/jnosql-sonar/diana/diana-query/target/apidocs/org/eclipse/jnosql/diana/query/cache/package-frame.html...
Generating /home/jenkins/agent/workspace/jnosql-sonar/diana/diana-query/target/apidocs/org/eclipse/jnosql/diana/query/cache/package-summary.html...
Generating /home/jenkins/agent/workspace/jnosql-sonar/diana/diana-query/target/apidocs/org/eclipse/jnosql/diana/query/cache/package-tree.html...
Generating /home/jenkins/agent/workspace/jnosql-sonar/diana/diana-query/target/apidocs/org/eclipse/jnosql/diana/query/method/package-frame.html...
Generating /home/jenkins/agent/workspace/jnosql-sonar/diana/diana-query/target/apidocs/org/eclipse/jnosql/diana/query/method/package-summary.html...
Generating /home/jenkins/agent/workspace/jnosql-sonar/diana/diana-query/target/apidocs/org/eclipse/jnosql/diana/query/method/package-tree.html...
Generating /home/jenkins/agent/workspace/jnosql-sonar/diana/diana-query/target/apidocs/constant-values.html...
Generating /home/jenkins/agent/workspace/jnosql-sonar/diana/diana-query/target/apidocs/org/eclipse/jnosql/diana/query/class-use/QueryBaseListener.html...
Generating /home/jenkins/agent/workspace/jnosql-sonar/diana/diana-query/target/apidocs/org/eclipse/jnosql/diana/query/class-use/QueryListener.html...
Generating /home/jenkins/agent/workspace/jnosql-sonar/diana/diana-query/target/apidocs/org/eclipse/jnosql/diana/query/class-use/QueryParser.html...
Generating /home/jenkins/agent/workspace/jnosql-sonar/diana/diana-query/target/apidocs/org/eclipse/jnosql/diana/query/class-use/QueryParser.SelectContext.html...
Generating /home/jenkins/agent/workspace/jnosql-sonar/diana/diana-query/target/apidocs/org/eclipse/jnosql/diana/query/class-use/QueryParser.DeleteContext.html...
Generating /home/jenkins/agent/workspace/jnosql-sonar/diana/diana-query/target/apidocs/org/eclipse/jnosql/diana/query/class-use/QueryParser.InsertContext.html...
Generating /home/jenkins/agent/workspace/jnosql-sonar/diana/diana-query/target/apidocs/org/eclipse/jnosql/diana/query/class-use/QueryParser.UpdateContext.html...
Generating /home/jenkins/agent/workspace/jnosql-sonar/diana/diana-query/target/apidocs/org/eclipse/jnosql/diana/query/class-use/QueryParser.GetContext.html...
Generating /home/jenkins/agent/workspace/jnosql-sonar/diana/diana-query/target/apidocs/org/eclipse/jnosql/diana/query/class-use/QueryParser.DelContext.html...
Generating /home/jenkins/agent/workspace/jnosql-sonar/diana/diana-query/target/apidocs/org/eclipse/jnosql/diana/query/class-use/QueryParser.PutContext.html...
Generating /home/jenkins/agent/workspace/jnosql-sonar/diana/diana-query/target/apidocs/org/eclipse/jnosql/diana/query/class-use/QueryParser.FieldsContext.html...
Generating /home/jenkins/agent/workspace/jnosql-sonar/diana/diana-query/target/apidocs/org/eclipse/jnosql/diana/query/class-use/QueryParser.DeleteFieldsContext.html...
Generating /home/jenkins/agent/workspace/jnosql-sonar/diana/diana-query/target/apidocs/org/eclipse/jnosql/diana/query/class-use/QueryParser.ConditionsContext.html...
Generating /home/jenkins/agent/workspace/jnosql-sonar/diana/diana-query/target/apidocs/org/eclipse/jnosql/diana/query/class-use/QueryParser.StarContext.html...
Generating /home/jenkins/agent/workspace/jnosql-sonar/diana/diana-query/target/apidocs/org/eclipse/jnosql/diana/query/class-use/QueryParser.SkipContext.html...
Generating /home/jenkins/agent/workspace/jnosql-sonar/diana/diana-query/target/apidocs/org/eclipse/jnosql/diana/query/class-use/QueryParser.LimitContext.html...
Generating /home/jenkins/agent/workspace/jnosql-sonar/diana/diana-query/target/apidocs/org/eclipse/jnosql/diana/query/class-use/QueryParser.OrderContext.html...
Generating /home/jenkins/agent/workspace/jnosql-sonar/diana/diana-query/target/apidocs/org/eclipse/jnosql/diana/query/class-use/QueryParser.OrderNameContext.html...
Generating /home/jenkins/agent/workspace/jnosql-sonar/diana/diana-query/target/apidocs/org/eclipse/jnosql/diana/query/class-use/QueryParser.WhereContext.html...
Generating /home/jenkins/agent/workspace/jnosql-sonar/diana/diana-query/target/apidocs/org/eclipse/jnosql/diana/query/class-use/QueryParser.ConditionContext.html...
Generating /home/jenkins/agent/workspace/jnosql-sonar/diana/diana-query/target/apidocs/org/eclipse/jnosql/diana/query/class-use/QueryParser.EqContext.html...
Generating /home/jenkins/agent/workspace/jnosql-sonar/diana/diana-query/target/apidocs/org/eclipse/jnosql/diana/query/class-use/QueryParser.GtContext.html...
Generating /home/jenkins/agent/workspace/jnosql-sonar/diana/diana-query/target/apidocs/org/eclipse/jnosql/diana/query/class-use/QueryParser.GteContext.html...
Generating /home/jenkins/agent/workspace/jnosql-sonar/diana/diana-query/target/apidocs/org/eclipse/jnosql/diana/query/class-use/QueryParser.LtContext.html...
Generating /home/jenkins/agent/workspace/jnosql-sonar/diana/diana-query/target/apidocs/org/eclipse/jnosql/diana/query/class-use/QueryParser.LteContext.html...
Generating /home/jenkins/agent/workspace/jnosql-sonar/diana/diana-query/target/apidocs/org/eclipse/jnosql/diana/query/class-use/QueryParser.BetweenContext.html...
Generating /home/jenkins/agent/workspace/jnosql-sonar/diana/diana-query/target/apidocs/org/eclipse/jnosql/diana/query/class-use/QueryParser.InContext.html...
Generating /home/jenkins/agent/workspace/jnosql-sonar/diana/diana-query/target/apidocs/org/eclipse/jnosql/diana/query/class-use/QueryParser.LikeContext.html...
Generating /home/jenkins/agent/workspace/jnosql-sonar/diana/diana-query/target/apidocs/org/eclipse/jnosql/diana/query/class-use/QueryParser.NotContext.html...
Generating /home/jenkins/agent/workspace/jnosql-sonar/diana/diana-query/target/apidocs/org/eclipse/jnosql/diana/query/class-use/QueryParser.AscContext.html...
Generating /home/jenkins/agent/workspace/jnosql-sonar/diana/diana-query/target/apidocs/org/eclipse/jnosql/diana/query/class-use/QueryParser.DescContext.html...
Generating /home/jenkins/agent/workspace/jnosql-sonar/diana/diana-query/target/apidocs/org/eclipse/jnosql/diana/query/class-use/QueryParser.AndContext.html...
Generating /home/jenkins/agent/workspace/jnosql-sonar/diana/diana-query/target/apidocs/org/eclipse/jnosql/diana/query/class-use/QueryParser.OrContext.html...
Generating /home/jenkins/agent/workspace/jnosql-sonar/diana/diana-query/target/apidocs/org/eclipse/jnosql/diana/query/class-use/QueryParser.TtlContext.html...
Generating /home/jenkins/agent/workspace/jnosql-sonar/diana/diana-query/target/apidocs/org/eclipse/jnosql/diana/query/class-use/QueryParser.UnitContext.html...
Generating /home/jenkins/agent/workspace/jnosql-sonar/diana/diana-query/target/apidocs/org/eclipse/jnosql/diana/query/class-use/QueryParser.ChangesContext.html...
Generating /home/jenkins/agent/workspace/jnosql-sonar/diana/diana-query/target/apidocs/org/eclipse/jnosql/diana/query/class-use/QueryParser.ChangeContext.html...
Generating /home/jenkins/agent/workspace/jnosql-sonar/diana/diana-query/target/apidocs/org/eclipse/jnosql/diana/query/class-use/QueryParser.KeyContext.html...
Generating /home/jenkins/agent/workspace/jnosql-sonar/diana/diana-query/target/apidocs/org/eclipse/jnosql/diana/query/class-use/QueryParser.KeysContext.html...
Generating /home/jenkins/agent/workspace/jnosql-sonar/diana/diana-query/target/apidocs/org/eclipse/jnosql/diana/query/class-use/QueryParser.ValueContext.html...
Generating /home/jenkins/agent/workspace/jnosql-sonar/diana/diana-query/target/apidocs/org/eclipse/jnosql/diana/query/class-use/QueryParser.NameContext.html...
Generating /home/jenkins/agent/workspace/jnosql-sonar/diana/diana-query/target/apidocs/org/eclipse/jnosql/diana/query/class-use/QueryParser.EntityContext.html...
Generating /home/jenkins/agent/workspace/jnosql-sonar/diana/diana-query/target/apidocs/org/eclipse/jnosql/diana/query/class-use/QueryParser.ArrayContext.html...
Generating /home/jenkins/agent/workspace/jnosql-sonar/diana/diana-query/target/apidocs/org/eclipse/jnosql/diana/query/class-use/QueryParser.FunctionContext.html...
Generating /home/jenkins/agent/workspace/jnosql-sonar/diana/diana-query/target/apidocs/org/eclipse/jnosql/diana/query/class-use/QueryParser.ConvertContext.html...
Generating /home/jenkins/agent/workspace/jnosql-sonar/diana/diana-query/target/apidocs/org/eclipse/jnosql/diana/query/class-use/QueryParser.ElementContext.html...
Generating /home/jenkins/agent/workspace/jnosql-sonar/diana/diana-query/target/apidocs/org/eclipse/jnosql/diana/query/class-use/QueryParser.NumberContext.html...
Generating /home/jenkins/agent/workspace/jnosql-sonar/diana/diana-query/target/apidocs/org/eclipse/jnosql/diana/query/class-use/QueryParser.StringContext.html...
Generating /home/jenkins/agent/workspace/jnosql-sonar/diana/diana-query/target/apidocs/org/eclipse/jnosql/diana/query/class-use/QueryParser.JsonContext.html...
Generating /home/jenkins/agent/workspace/jnosql-sonar/diana/diana-query/target/apidocs/org/eclipse/jnosql/diana/query/class-use/QueryParser.Object_jsonContext.html...
Generating /home/jenkins/agent/workspace/jnosql-sonar/diana/diana-query/target/apidocs/org/eclipse/jnosql/diana/query/class-use/QueryParser.Pair_jsonContext.html...
Generating /home/jenkins/agent/workspace/jnosql-sonar/diana/diana-query/target/apidocs/org/eclipse/jnosql/diana/query/class-use/QueryParser.Value_jsonContext.html...
Generating /home/jenkins/agent/workspace/jnosql-sonar/diana/diana-query/target/apidocs/org/eclipse/jnosql/diana/query/class-use/QueryParser.Array_jsonContext.html...
Generating /home/jenkins/agent/workspace/jnosql-sonar/diana/diana-query/target/apidocs/org/eclipse/jnosql/diana/query/class-use/QueryParser.ParameterContext.html...
Generating /home/jenkins/agent/workspace/jnosql-sonar/diana/diana-query/target/apidocs/org/eclipse/jnosql/diana/query/class-use/QueryLexer.html...
Generating /home/jenkins/agent/workspace/jnosql-sonar/diana/diana-query/target/apidocs/org/eclipse/jnosql/diana/query/class-use/QueryErrorListener.html...
Generating /home/jenkins/agent/workspace/jnosql-sonar/diana/diana-query/target/apidocs/org/eclipse/jnosql/diana/query/class-use/AntlrUpdateQueryProvider.html...
Generating /home/jenkins/agent/workspace/jnosql-sonar/diana/diana-query/target/apidocs/org/eclipse/jnosql/diana/query/class-use/AntlrSelectQueryProvider.html...
Generating /home/jenkins/agent/workspace/jnosql-sonar/diana/diana-query/target/apidocs/org/eclipse/jnosql/diana/query/class-use/AntlrPutQueryProvider.html...
Generating /home/jenkins/agent/workspace/jnosql-sonar/diana/diana-query/target/apidocs/org/eclipse/jnosql/diana/query/class-use/AntlrInsertQueryProvider.html...
Generating /home/jenkins/agent/workspace/jnosql-sonar/diana/diana-query/target/apidocs/org/eclipse/jnosql/diana/query/class-use/AntlrGetQueryProvider.html...
Generating /home/jenkins/agent/workspace/jnosql-sonar/diana/diana-query/target/apidocs/org/eclipse/jnosql/diana/query/class-use/AntlrDeleteQueryProvider.html...
Generating /home/jenkins/agent/workspace/jnosql-sonar/diana/diana-query/target/apidocs/org/eclipse/jnosql/diana/query/class-use/AntlrDelQueryProvider.html...
Generating /home/jenkins/agent/workspace/jnosql-sonar/diana/diana-query/target/apidocs/org/eclipse/jnosql/diana/query/cache/class-use/CachedUpdateQueryProvider.html...
Generating /home/jenkins/agent/workspace/jnosql-sonar/diana/diana-query/target/apidocs/org/eclipse/jnosql/diana/query/cache/class-use/CachedSelectQueryProvider.html...
Generating /home/jenkins/agent/workspace/jnosql-sonar/diana/diana-query/target/apidocs/org/eclipse/jnosql/diana/query/cache/class-use/CachedPutQueryProvider.html...
Generating /home/jenkins/agent/workspace/jnosql-sonar/diana/diana-query/target/apidocs/org/eclipse/jnosql/diana/query/cache/class-use/CachedInsertQueryProvider.html...
Generating /home/jenkins/agent/workspace/jnosql-sonar/diana/diana-query/target/apidocs/org/eclipse/jnosql/diana/query/cache/class-use/CachedGetQueryProvider.html...
Generating /home/jenkins/agent/workspace/jnosql-sonar/diana/diana-query/target/apidocs/org/eclipse/jnosql/diana/query/cache/class-use/CachedDeleteQueryProvider.html...
Generating /home/jenkins/agent/workspace/jnosql-sonar/diana/diana-query/target/apidocs/org/eclipse/jnosql/diana/query/cache/class-use/CachedDelQueryProvider.html...
Generating /home/jenkins/agent/workspace/jnosql-sonar/diana/diana-query/target/apidocs/org/eclipse/jnosql/diana/query/method/class-use/MethodBaseListener.html...
Generating /home/jenkins/agent/workspace/jnosql-sonar/diana/diana-query/target/apidocs/org/eclipse/jnosql/diana/query/method/class-use/MethodListener.html...
Generating /home/jenkins/agent/workspace/jnosql-sonar/diana/diana-query/target/apidocs/org/eclipse/jnosql/diana/query/method/class-use/MethodParser.html...
Generating /home/jenkins/agent/workspace/jnosql-sonar/diana/diana-query/target/apidocs/org/eclipse/jnosql/diana/query/method/class-use/MethodParser.FindByContext.html...
Generating /home/jenkins/agent/workspace/jnosql-sonar/diana/diana-query/target/apidocs/org/eclipse/jnosql/diana/query/method/class-use/MethodParser.DeleteByContext.html...
Generating /home/jenkins/agent/workspace/jnosql-sonar/diana/diana-query/target/apidocs/org/eclipse/jnosql/diana/query/method/class-use/MethodParser.WhereContext.html...
Generating /home/jenkins/agent/workspace/jnosql-sonar/diana/diana-query/target/apidocs/org/eclipse/jnosql/diana/query/method/class-use/MethodParser.ConditionContext.html...
Generating /home/jenkins/agent/workspace/jnosql-sonar/diana/diana-query/target/apidocs/org/eclipse/jnosql/diana/query/method/class-use/MethodParser.OrderContext.html...
Generating /home/jenkins/agent/workspace/jnosql-sonar/diana/diana-query/target/apidocs/org/eclipse/jnosql/diana/query/method/class-use/MethodParser.OrderNameContext.html...
Generating /home/jenkins/agent/workspace/jnosql-sonar/diana/diana-query/target/apidocs/org/eclipse/jnosql/diana/query/method/class-use/MethodParser.AndContext.html...
Generating /home/jenkins/agent/workspace/jnosql-sonar/diana/diana-query/target/apidocs/org/eclipse/jnosql/diana/query/method/class-use/MethodParser.OrContext.html...
Generating /home/jenkins/agent/workspace/jnosql-sonar/diana/diana-query/target/apidocs/org/eclipse/jnosql/diana/query/method/class-use/MethodParser.AscContext.html...
Generating /home/jenkins/agent/workspace/jnosql-sonar/diana/diana-query/target/apidocs/org/eclipse/jnosql/diana/query/method/class-use/MethodParser.DescContext.html...
Generating /home/jenkins/agent/workspace/jnosql-sonar/diana/diana-query/target/apidocs/org/eclipse/jnosql/diana/query/method/class-use/MethodParser.EqContext.html...
Generating /home/jenkins/agent/workspace/jnosql-sonar/diana/diana-query/target/apidocs/org/eclipse/jnosql/diana/query/method/class-use/MethodParser.GtContext.html...
Generating /home/jenkins/agent/workspace/jnosql-sonar/diana/diana-query/target/apidocs/org/eclipse/jnosql/diana/query/method/class-use/MethodParser.GteContext.html...
Generating /home/jenkins/agent/workspace/jnosql-sonar/diana/diana-query/target/apidocs/org/eclipse/jnosql/diana/query/method/class-use/MethodParser.LtContext.html...
Generating /home/jenkins/agent/workspace/jnosql-sonar/diana/diana-query/target/apidocs/org/eclipse/jnosql/diana/query/method/class-use/MethodParser.LteContext.html...
Generating /home/jenkins/agent/workspace/jnosql-sonar/diana/diana-query/target/apidocs/org/eclipse/jnosql/diana/query/method/class-use/MethodParser.BetweenContext.html...
Generating /home/jenkins/agent/workspace/jnosql-sonar/diana/diana-query/target/apidocs/org/eclipse/jnosql/diana/query/method/class-use/MethodParser.InContext.html...
Generating /home/jenkins/agent/workspace/jnosql-sonar/diana/diana-query/target/apidocs/org/eclipse/jnosql/diana/query/method/class-use/MethodParser.LikeContext.html...
Generating /home/jenkins/agent/workspace/jnosql-sonar/diana/diana-query/target/apidocs/org/eclipse/jnosql/diana/query/method/class-use/MethodParser.NotContext.html...
Generating /home/jenkins/agent/workspace/jnosql-sonar/diana/diana-query/target/apidocs/org/eclipse/jnosql/diana/query/method/class-use/MethodParser.VariableContext.html...
Generating /home/jenkins/agent/workspace/jnosql-sonar/diana/diana-query/target/apidocs/org/eclipse/jnosql/diana/query/method/class-use/MethodLexer.html...
Generating /home/jenkins/agent/workspace/jnosql-sonar/diana/diana-query/target/apidocs/org/eclipse/jnosql/diana/query/method/class-use/SelectMethodProvider.html...
Generating /home/jenkins/agent/workspace/jnosql-sonar/diana/diana-query/target/apidocs/org/eclipse/jnosql/diana/query/method/class-use/MethodQuery.html...
Generating /home/jenkins/agent/workspace/jnosql-sonar/diana/diana-query/target/apidocs/org/eclipse/jnosql/diana/query/method/class-use/DeleteMethodProvider.html...
Generating /home/jenkins/agent/workspace/jnosql-sonar/diana/diana-query/target/apidocs/org/eclipse/jnosql/diana/query/package-use.html...
Generating /home/jenkins/agent/workspace/jnosql-sonar/diana/diana-query/target/apidocs/org/eclipse/jnosql/diana/query/cache/package-use.html...
Generating /home/jenkins/agent/workspace/jnosql-sonar/diana/diana-query/target/apidocs/org/eclipse/jnosql/diana/query/method/package-use.html...
Building index for all the packages and classes...
Generating /home/jenkins/agent/workspace/jnosql-sonar/diana/diana-query/target/apidocs/overview-tree.html...
Generating /home/jenkins/agent/workspace/jnosql-sonar/diana/diana-query/target/apidocs/index-all.html...
Generating /home/jenkins/agent/workspace/jnosql-sonar/diana/diana-query/target/apidocs/deprecated-list.html...
Building index for all classes...
Generating /home/jenkins/agent/workspace/jnosql-sonar/diana/diana-query/target/apidocs/allclasses-frame.html...
Generating /home/jenkins/agent/workspace/jnosql-sonar/diana/diana-query/target/apidocs/allclasses-noframe.html...
Generating /home/jenkins/agent/workspace/jnosql-sonar/diana/diana-query/target/apidocs/index.html...
Generating /home/jenkins/agent/workspace/jnosql-sonar/diana/diana-query/target/apidocs/overview-summary.html...
Generating /home/jenkins/agent/workspace/jnosql-sonar/diana/diana-query/target/apidocs/help-doc.html...
[WARNING] Javadoc Warnings
[WARNING] Picked up JAVA_TOOL_OPTIONS: -XX:+IgnoreUnrecognizedVMOptions -XX:+UseContainerSupport -XX:+UnlockExperimentalVMOptions -XX:+UseCGroupMemoryLimitForHeap
[WARNING] Picked up _JAVA_OPTIONS: -XX:MaxRAMPercentage=64.0
[INFO] Building jar: /home/jenkins/agent/workspace/jnosql-sonar/diana/diana-query/target/diana-query-0.1.0-SNAPSHOT-javadoc.jar
[INFO] 
[INFO] >>> maven-source-plugin:3.0.1:jar (attach-sources) > generate-sources @ diana-query >>>
[INFO] 
[INFO] --- apache-rat-plugin:0.12:check (default) @ diana-query ---
[INFO] Added 1 additional default licenses.
[INFO] Enabled default license matchers.
[INFO] Added 1 custom approved licenses.
[INFO] Will parse SCM ignores for exclusions...
[INFO] Parsing exclusions from /home/jenkins/agent/workspace/jnosql-sonar/diana/diana-query/.gitignore
[INFO] Finished adding exclusions from SCM ignore files.
[INFO] 75 implicit excludes (use -debug for more details).
[INFO] No excludes explicitly specified.
[INFO] 95 resources included (use -debug for more details)
[INFO] Rat check: Summary over all files. Unapproved: 0, unknown: 0, generated: 0, approved: 95 licenses.
[INFO] 
[INFO] --- jacoco-maven-plugin:0.7.9:prepare-agent (pre-test) @ diana-query ---
[INFO] argLine set to -javaagent:/home/jenkins/.m2/repository/org/jacoco/org.jacoco.agent/0.7.9/org.jacoco.agent-0.7.9-runtime.jar=destfile=/home/jenkins/agent/workspace/jnosql-sonar/diana/target/jacoco.exec,append=true
[INFO] 
[INFO] --- antlr4-maven-plugin:4.7.2:antlr4 (default) @ diana-query ---
[INFO] No grammars to process
[INFO] ANTLR 4: Processing source directory /home/jenkins/agent/workspace/jnosql-sonar/diana/diana-query/src/main/java
[INFO] 
[INFO] <<< maven-source-plugin:3.0.1:jar (attach-sources) < generate-sources @ diana-query <<<
[INFO] 
[INFO] 
[INFO] --- maven-source-plugin:3.0.1:jar (attach-sources) @ diana-query ---
[INFO] Building jar: /home/jenkins/agent/workspace/jnosql-sonar/diana/diana-query/target/diana-query-0.1.0-SNAPSHOT-sources.jar
[INFO] 
[INFO] --- maven-install-plugin:2.4:install (default-install) @ diana-query ---
[INFO] Installing /home/jenkins/agent/workspace/jnosql-sonar/diana/diana-query/target/diana-query-0.1.0-SNAPSHOT.jar to /home/jenkins/.m2/repository/org/eclipse/jnosql/diana/diana-query/0.1.0-SNAPSHOT/diana-query-0.1.0-SNAPSHOT.jar
[INFO] Installing /home/jenkins/agent/workspace/jnosql-sonar/diana/diana-query/pom.xml to /home/jenkins/.m2/repository/org/eclipse/jnosql/diana/diana-query/0.1.0-SNAPSHOT/diana-query-0.1.0-SNAPSHOT.pom
[INFO] Installing /home/jenkins/agent/workspace/jnosql-sonar/diana/diana-query/target/diana-query-0.1.0-SNAPSHOT-javadoc.jar to /home/jenkins/.m2/repository/org/eclipse/jnosql/diana/diana-query/0.1.0-SNAPSHOT/diana-query-0.1.0-SNAPSHOT-javadoc.jar
[INFO] Installing /home/jenkins/agent/workspace/jnosql-sonar/diana/diana-query/target/diana-query-0.1.0-SNAPSHOT-sources.jar to /home/jenkins/.m2/repository/org/eclipse/jnosql/diana/diana-query/0.1.0-SNAPSHOT/diana-query-0.1.0-SNAPSHOT-sources.jar
[INFO] 
[INFO] --------------< org.eclipse.jnosql.diana:diana-key-value >--------------
[INFO] Building diana-key-value 0.1.0-SNAPSHOT                           [5/14]
[INFO] --------------------------------[ jar ]---------------------------------
[INFO] 
[INFO] --- maven-clean-plugin:2.5:clean (default-clean) @ diana-key-value ---
[INFO] 
[INFO] --- apache-rat-plugin:0.12:check (default) @ diana-key-value ---
[INFO] Added 1 additional default licenses.
[INFO] Enabled default license matchers.
[INFO] Added 1 custom approved licenses.
[INFO] Will parse SCM ignores for exclusions...
[INFO] Parsing exclusions from /home/jenkins/agent/workspace/jnosql-sonar/diana/diana-key-value/.gitignore
[INFO] Finished adding exclusions from SCM ignore files.
[INFO] 74 implicit excludes (use -debug for more details).
[INFO] No excludes explicitly specified.
[INFO] 16 resources included (use -debug for more details)
[INFO] Rat check: Summary over all files. Unapproved: 0, unknown: 0, generated: 0, approved: 16 licenses.
[INFO] 
[INFO] --- jacoco-maven-plugin:0.7.9:prepare-agent (pre-test) @ diana-key-value ---
[INFO] argLine set to -javaagent:/home/jenkins/.m2/repository/org/jacoco/org.jacoco.agent/0.7.9/org.jacoco.agent-0.7.9-runtime.jar=destfile=/home/jenkins/agent/workspace/jnosql-sonar/diana/target/jacoco.exec,append=true
[INFO] 
[INFO] --- maven-resources-plugin:2.6:resources (default-resources) @ diana-key-value ---
[INFO] Using 'UTF-8' encoding to copy filtered resources.
[INFO] Copying 2 resources
[INFO] 
[INFO] --- maven-compiler-plugin:3.8.0:compile (default-compile) @ diana-key-value ---
[INFO] Changes detected - recompiling the module!
[INFO] Compiling 9 source files to /home/jenkins/agent/workspace/jnosql-sonar/diana/diana-key-value/target/classes
[INFO] 
[INFO] --- maven-checkstyle-plugin:3.0.0:check (verify-style) @ diana-key-value ---
[INFO] Starting audit...
Audit done.
[INFO] 
[INFO] --- maven-resources-plugin:2.6:testResources (default-testResources) @ diana-key-value ---
[INFO] Using 'UTF-8' encoding to copy filtered resources.
[INFO] skip non existing resourceDirectory /home/jenkins/agent/workspace/jnosql-sonar/diana/diana-key-value/src/test/resources
[INFO] 
[INFO] --- maven-compiler-plugin:3.8.0:testCompile (default-testCompile) @ diana-key-value ---
[INFO] Changes detected - recompiling the module!
[INFO] Compiling 6 source files to /home/jenkins/agent/workspace/jnosql-sonar/diana/diana-key-value/target/test-classes
[INFO] /home/jenkins/agent/workspace/jnosql-sonar/diana/diana-key-value/src/test/java/org/eclipse/jnosql/diana/keyvalue/query/DefaultKeyValueQueryParserTest.java: Some input files use unchecked or unsafe operations.
[INFO] /home/jenkins/agent/workspace/jnosql-sonar/diana/diana-key-value/src/test/java/org/eclipse/jnosql/diana/keyvalue/query/DefaultKeyValueQueryParserTest.java: Recompile with -Xlint:unchecked for details.
[INFO] 
[INFO] --- maven-surefire-plugin:2.22.1:test (default-test) @ diana-key-value ---
[INFO] 
[INFO] -------------------------------------------------------
[INFO]  T E S T S
[INFO] -------------------------------------------------------
[INFO] Running org.eclipse.jnosql.diana.keyvalue.query.PutQueryParserTest
[INFO] Tests run: 5, Failures: 0, Errors: 0, Skipped: 0, Time elapsed: 1.019 s - in org.eclipse.jnosql.diana.keyvalue.query.PutQueryParserTest
[INFO] Running org.eclipse.jnosql.diana.keyvalue.query.GetQueryParserTest
[INFO] Tests run: 8, Failures: 0, Errors: 0, Skipped: 0, Time elapsed: 0.098 s - in org.eclipse.jnosql.diana.keyvalue.query.GetQueryParserTest
[INFO] Running org.eclipse.jnosql.diana.keyvalue.query.DefaultKeyValueQueryParserTest
[INFO] Tests run: 9, Failures: 0, Errors: 0, Skipped: 0, Time elapsed: 0.061 s - in org.eclipse.jnosql.diana.keyvalue.query.DefaultKeyValueQueryParserTest
[INFO] Running org.eclipse.jnosql.diana.keyvalue.query.DelQueryParserTest
[INFO] Tests run: 8, Failures: 0, Errors: 0, Skipped: 0, Time elapsed: 0.022 s - in org.eclipse.jnosql.diana.keyvalue.query.DelQueryParserTest
[INFO] Running org.eclipse.jnosql.diana.keyvalue.query.ParamsTest
[INFO] Tests run: 3, Failures: 0, Errors: 0, Skipped: 0, Time elapsed: 0.004 s - in org.eclipse.jnosql.diana.keyvalue.query.ParamsTest
[INFO] Running org.eclipse.jnosql.diana.keyvalue.DefaultKeyValueEntityTest
[INFO] Tests run: 9, Failures: 0, Errors: 0, Skipped: 0, Time elapsed: 0.008 s - in org.eclipse.jnosql.diana.keyvalue.DefaultKeyValueEntityTest
[INFO] 
[INFO] Results:
[INFO] 
[INFO] Tests run: 42, Failures: 0, Errors: 0, Skipped: 0
[INFO] 
[INFO] 
[INFO] --- maven-jar-plugin:2.4:jar (default-jar) @ diana-key-value ---
[INFO] Building jar: /home/jenkins/agent/workspace/jnosql-sonar/diana/diana-key-value/target/diana-key-value-0.1.0-SNAPSHOT.jar
[INFO] 
[INFO] --- maven-javadoc-plugin:3.0.1:jar (attach-javadocs) @ diana-key-value ---
[INFO] 
Loading source files for package org.eclipse.jnosql.diana.keyvalue...
Loading source files for package org.eclipse.jnosql.diana.keyvalue.query...
Constructing Javadoc information...
Standard Doclet version 1.8.0_202
Building tree for all the packages and classes...
Generating /home/jenkins/agent/workspace/jnosql-sonar/diana/diana-key-value/target/apidocs/org/eclipse/jnosql/diana/keyvalue/DefaultKeyValueEntityProvider.html...
Generating /home/jenkins/agent/workspace/jnosql-sonar/diana/diana-key-value/target/apidocs/org/eclipse/jnosql/diana/keyvalue/query/DefaultKeyValueQueryParser.html...
Generating /home/jenkins/agent/workspace/jnosql-sonar/diana/diana-key-value/target/apidocs/overview-frame.html...
Generating /home/jenkins/agent/workspace/jnosql-sonar/diana/diana-key-value/target/apidocs/org/eclipse/jnosql/diana/keyvalue/package-frame.html...
Generating /home/jenkins/agent/workspace/jnosql-sonar/diana/diana-key-value/target/apidocs/org/eclipse/jnosql/diana/keyvalue/package-summary.html...
Generating /home/jenkins/agent/workspace/jnosql-sonar/diana/diana-key-value/target/apidocs/org/eclipse/jnosql/diana/keyvalue/package-tree.html...
Generating /home/jenkins/agent/workspace/jnosql-sonar/diana/diana-key-value/target/apidocs/org/eclipse/jnosql/diana/keyvalue/query/package-frame.html...
Generating /home/jenkins/agent/workspace/jnosql-sonar/diana/diana-key-value/target/apidocs/org/eclipse/jnosql/diana/keyvalue/query/package-summary.html...
Generating /home/jenkins/agent/workspace/jnosql-sonar/diana/diana-key-value/target/apidocs/org/eclipse/jnosql/diana/keyvalue/query/package-tree.html...
Generating /home/jenkins/agent/workspace/jnosql-sonar/diana/diana-key-value/target/apidocs/constant-values.html...
Generating /home/jenkins/agent/workspace/jnosql-sonar/diana/diana-key-value/target/apidocs/org/eclipse/jnosql/diana/keyvalue/class-use/DefaultKeyValueEntityProvider.html...
Generating /home/jenkins/agent/workspace/jnosql-sonar/diana/diana-key-value/target/apidocs/org/eclipse/jnosql/diana/keyvalue/query/class-use/DefaultKeyValueQueryParser.html...
Generating /home/jenkins/agent/workspace/jnosql-sonar/diana/diana-key-value/target/apidocs/org/eclipse/jnosql/diana/keyvalue/package-use.html...
Generating /home/jenkins/agent/workspace/jnosql-sonar/diana/diana-key-value/target/apidocs/org/eclipse/jnosql/diana/keyvalue/query/package-use.html...
Building index for all the packages and classes...
Generating /home/jenkins/agent/workspace/jnosql-sonar/diana/diana-key-value/target/apidocs/overview-tree.html...
Generating /home/jenkins/agent/workspace/jnosql-sonar/diana/diana-key-value/target/apidocs/index-all.html...
Generating /home/jenkins/agent/workspace/jnosql-sonar/diana/diana-key-value/target/apidocs/deprecated-list.html...
Building index for all classes...
Generating /home/jenkins/agent/workspace/jnosql-sonar/diana/diana-key-value/target/apidocs/allclasses-frame.html...
Generating /home/jenkins/agent/workspace/jnosql-sonar/diana/diana-key-value/target/apidocs/allclasses-noframe.html...
Generating /home/jenkins/agent/workspace/jnosql-sonar/diana/diana-key-value/target/apidocs/index.html...
Generating /home/jenkins/agent/workspace/jnosql-sonar/diana/diana-key-value/target/apidocs/overview-summary.html...
Generating /home/jenkins/agent/workspace/jnosql-sonar/diana/diana-key-value/target/apidocs/help-doc.html...
[WARNING] Javadoc Warnings
[WARNING] Picked up JAVA_TOOL_OPTIONS: -XX:+IgnoreUnrecognizedVMOptions -XX:+UseContainerSupport -XX:+UnlockExperimentalVMOptions -XX:+UseCGroupMemoryLimitForHeap
[WARNING] Picked up _JAVA_OPTIONS: -XX:MaxRAMPercentage=64.0
[INFO] Building jar: /home/jenkins/agent/workspace/jnosql-sonar/diana/diana-key-value/target/diana-key-value-0.1.0-SNAPSHOT-javadoc.jar
[INFO] 
[INFO] >>> maven-source-plugin:3.0.1:jar (attach-sources) > generate-sources @ diana-key-value >>>
[INFO] 
[INFO] --- apache-rat-plugin:0.12:check (default) @ diana-key-value ---
[INFO] Added 1 additional default licenses.
[INFO] Enabled default license matchers.
[INFO] Added 1 custom approved licenses.
[INFO] Will parse SCM ignores for exclusions...
[INFO] Parsing exclusions from /home/jenkins/agent/workspace/jnosql-sonar/diana/diana-key-value/.gitignore
[INFO] Finished adding exclusions from SCM ignore files.
[INFO] 74 implicit excludes (use -debug for more details).
[INFO] No excludes explicitly specified.
[INFO] 16 resources included (use -debug for more details)
[INFO] Rat check: Summary over all files. Unapproved: 0, unknown: 0, generated: 0, approved: 16 licenses.
[INFO] 
[INFO] --- jacoco-maven-plugin:0.7.9:prepare-agent (pre-test) @ diana-key-value ---
[INFO] argLine set to -javaagent:/home/jenkins/.m2/repository/org/jacoco/org.jacoco.agent/0.7.9/org.jacoco.agent-0.7.9-runtime.jar=destfile=/home/jenkins/agent/workspace/jnosql-sonar/diana/target/jacoco.exec,append=true
[INFO] 
[INFO] <<< maven-source-plugin:3.0.1:jar (attach-sources) < generate-sources @ diana-key-value <<<
[INFO] 
[INFO] 
[INFO] --- maven-source-plugin:3.0.1:jar (attach-sources) @ diana-key-value ---
[INFO] Building jar: /home/jenkins/agent/workspace/jnosql-sonar/diana/diana-key-value/target/diana-key-value-0.1.0-SNAPSHOT-sources.jar
[INFO] 
[INFO] --- maven-install-plugin:2.4:install (default-install) @ diana-key-value ---
[INFO] Installing /home/jenkins/agent/workspace/jnosql-sonar/diana/diana-key-value/target/diana-key-value-0.1.0-SNAPSHOT.jar to /home/jenkins/.m2/repository/org/eclipse/jnosql/diana/diana-key-value/0.1.0-SNAPSHOT/diana-key-value-0.1.0-SNAPSHOT.jar
[INFO] Installing /home/jenkins/agent/workspace/jnosql-sonar/diana/diana-key-value/pom.xml to /home/jenkins/.m2/repository/org/eclipse/jnosql/diana/diana-key-value/0.1.0-SNAPSHOT/diana-key-value-0.1.0-SNAPSHOT.pom
[INFO] Installing /home/jenkins/agent/workspace/jnosql-sonar/diana/diana-key-value/target/diana-key-value-0.1.0-SNAPSHOT-javadoc.jar to /home/jenkins/.m2/repository/org/eclipse/jnosql/diana/diana-key-value/0.1.0-SNAPSHOT/diana-key-value-0.1.0-SNAPSHOT-javadoc.jar
[INFO] Installing /home/jenkins/agent/workspace/jnosql-sonar/diana/diana-key-value/target/diana-key-value-0.1.0-SNAPSHOT-sources.jar to /home/jenkins/.m2/repository/org/eclipse/jnosql/diana/diana-key-value/0.1.0-SNAPSHOT/diana-key-value-0.1.0-SNAPSHOT-sources.jar
[INFO] 
[INFO] ---------------< org.eclipse.jnosql.diana:diana-column >----------------
[INFO] Building diana-column 0.1.0-SNAPSHOT                              [6/14]
[INFO] --------------------------------[ jar ]---------------------------------
[INFO] 
[INFO] --- maven-clean-plugin:2.5:clean (default-clean) @ diana-column ---
[INFO] 
[INFO] --- apache-rat-plugin:0.12:check (default) @ diana-column ---
[INFO] Added 1 additional default licenses.
[INFO] Enabled default license matchers.
[INFO] Added 1 custom approved licenses.
[INFO] Will parse SCM ignores for exclusions...
[INFO] Parsing exclusions from /home/jenkins/agent/workspace/jnosql-sonar/diana/diana-column/.gitignore
[INFO] Finished adding exclusions from SCM ignore files.
[INFO] 74 implicit excludes (use -debug for more details).
[INFO] No excludes explicitly specified.
[INFO] 49 resources included (use -debug for more details)
[INFO] Rat check: Summary over all files. Unapproved: 0, unknown: 0, generated: 0, approved: 49 licenses.
[INFO] 
[INFO] --- jacoco-maven-plugin:0.7.9:prepare-agent (pre-test) @ diana-column ---
[INFO] argLine set to -javaagent:/home/jenkins/.m2/repository/org/jacoco/org.jacoco.agent/0.7.9/org.jacoco.agent-0.7.9-runtime.jar=destfile=/home/jenkins/agent/workspace/jnosql-sonar/diana/target/jacoco.exec,append=true
[INFO] 
[INFO] --- maven-resources-plugin:2.6:resources (default-resources) @ diana-column ---
[INFO] Using 'UTF-8' encoding to copy filtered resources.
[INFO] Copying 9 resources
[INFO] 
[INFO] --- maven-compiler-plugin:3.8.0:compile (default-compile) @ diana-column ---
[INFO] Changes detected - recompiling the module!
[INFO] Compiling 33 source files to /home/jenkins/agent/workspace/jnosql-sonar/diana/diana-column/target/classes
[INFO] /home/jenkins/agent/workspace/jnosql-sonar/diana/diana-column/src/main/java/org/eclipse/jnosql/diana/column/DefaultColumnCondition.java: Some input files use unchecked or unsafe operations.
[INFO] /home/jenkins/agent/workspace/jnosql-sonar/diana/diana-column/src/main/java/org/eclipse/jnosql/diana/column/DefaultColumnCondition.java: Recompile with -Xlint:unchecked for details.
[INFO] 
[INFO] --- maven-checkstyle-plugin:3.0.0:check (verify-style) @ diana-column ---
[INFO] Starting audit...
Audit done.
[INFO] 
[INFO] --- maven-resources-plugin:2.6:testResources (default-testResources) @ diana-column ---
[INFO] Using 'UTF-8' encoding to copy filtered resources.
[INFO] skip non existing resourceDirectory /home/jenkins/agent/workspace/jnosql-sonar/diana/diana-column/src/test/resources
[INFO] 
[INFO] --- maven-compiler-plugin:3.8.0:testCompile (default-testCompile) @ diana-column ---
[INFO] Changes detected - recompiling the module!
[INFO] Compiling 15 source files to /home/jenkins/agent/workspace/jnosql-sonar/diana/diana-column/target/test-classes
[INFO] /home/jenkins/agent/workspace/jnosql-sonar/diana/diana-column/src/test/java/org/eclipse/jnosql/diana/column/ColumnEntityTest.java: Some input files use unchecked or unsafe operations.
[INFO] /home/jenkins/agent/workspace/jnosql-sonar/diana/diana-column/src/test/java/org/eclipse/jnosql/diana/column/ColumnEntityTest.java: Recompile with -Xlint:unchecked for details.
[INFO] 
[INFO] --- maven-surefire-plugin:2.22.1:test (default-test) @ diana-column ---
[INFO] 
[INFO] -------------------------------------------------------
[INFO]  T E S T S
[INFO] -------------------------------------------------------
[INFO] Running org.eclipse.jnosql.diana.column.query.DefaultColumnQueryTest
[INFO] Tests run: 2, Failures: 0, Errors: 0, Skipped: 0, Time elapsed: 0.063 s - in org.eclipse.jnosql.diana.column.query.DefaultColumnQueryTest
[INFO] Running org.eclipse.jnosql.diana.column.query.DefaultColumnQueryParserTest
[INFO] Tests run: 13, Failures: 0, Errors: 0, Skipped: 0, Time elapsed: 1.111 s - in org.eclipse.jnosql.diana.column.query.DefaultColumnQueryParserTest
[INFO] Running org.eclipse.jnosql.diana.column.query.ColumnParamsTest
[INFO] Tests run: 3, Failures: 0, Errors: 0, Skipped: 0, Time elapsed: 0.008 s - in org.eclipse.jnosql.diana.column.query.ColumnParamsTest
[INFO] Running org.eclipse.jnosql.diana.column.query.DefaultSelectQueryBuilderTest
[INFO] Tests run: 24, Failures: 0, Errors: 0, Skipped: 0, Time elapsed: 0.086 s - in org.eclipse.jnosql.diana.column.query.DefaultSelectQueryBuilderTest
[INFO] Running org.eclipse.jnosql.diana.column.query.DefaultDeleteQueryBuilderTest
[INFO] Tests run: 18, Failures: 0, Errors: 0, Skipped: 0, Time elapsed: 0.047 s - in org.eclipse.jnosql.diana.column.query.DefaultDeleteQueryBuilderTest
[INFO] Running org.eclipse.jnosql.diana.column.query.DefaultColumnDeleteQueryTest
[INFO] Tests run: 1, Failures: 0, Errors: 0, Skipped: 0, Time elapsed: 0.001 s - in org.eclipse.jnosql.diana.column.query.DefaultColumnDeleteQueryTest
[INFO] Running org.eclipse.jnosql.diana.column.query.DefaultColumnQueryParserAsyncTest
[INFO] Tests run: 13, Failures: 0, Errors: 0, Skipped: 0, Time elapsed: 0.114 s - in org.eclipse.jnosql.diana.column.query.DefaultColumnQueryParserAsyncTest
[INFO] Running org.eclipse.jnosql.diana.column.query.UpdateQueryParserTest
[INFO] Tests run: 10, Failures: 0, Errors: 0, Skipped: 0, Time elapsed: 0.218 s - in org.eclipse.jnosql.diana.column.query.UpdateQueryParserTest
[INFO] Running org.eclipse.jnosql.diana.column.query.DefaultDeleteQueryConverterTest
[INFO] Tests run: 25, Failures: 0, Errors: 0, Skipped: 0, Time elapsed: 0.092 s - in org.eclipse.jnosql.diana.column.query.DefaultDeleteQueryConverterTest
[INFO] Running org.eclipse.jnosql.diana.column.query.DefaultSelectQueryConverterTest
[INFO] Tests run: 31, Failures: 0, Errors: 0, Skipped: 0, Time elapsed: 0.093 s - in org.eclipse.jnosql.diana.column.query.DefaultSelectQueryConverterTest
[INFO] Running org.eclipse.jnosql.diana.column.query.InsertQueryParserTest
[INFO] Tests run: 17, Failures: 0, Errors: 0, Skipped: 0, Time elapsed: 0.035 s - in org.eclipse.jnosql.diana.column.query.InsertQueryParserTest
[INFO] Running org.eclipse.jnosql.diana.column.DefaultColumnConditionTest
[INFO] Tests run: 20, Failures: 0, Errors: 0, Skipped: 0, Time elapsed: 0.037 s - in org.eclipse.jnosql.diana.column.DefaultColumnConditionTest
[INFO] Running org.eclipse.jnosql.diana.column.ColumnEntityTest
[INFO] Tests run: 34, Failures: 0, Errors: 0, Skipped: 0, Time elapsed: 0.015 s - in org.eclipse.jnosql.diana.column.ColumnEntityTest
[INFO] Running org.eclipse.jnosql.diana.column.ColumnTest
[INFO] Tests run: 7, Failures: 0, Errors: 0, Skipped: 0, Time elapsed: 0.002 s - in org.eclipse.jnosql.diana.column.ColumnTest
[INFO] Running org.eclipse.jnosql.diana.column.ColumnsTest
[INFO] Tests run: 3, Failures: 0, Errors: 0, Skipped: 0, Time elapsed: 0 s - in org.eclipse.jnosql.diana.column.ColumnsTest
[INFO] 
[INFO] Results:
[INFO] 
[INFO] Tests run: 221, Failures: 0, Errors: 0, Skipped: 0
[INFO] 
[INFO] 
[INFO] --- maven-jar-plugin:2.4:jar (default-jar) @ diana-column ---
[INFO] Building jar: /home/jenkins/agent/workspace/jnosql-sonar/diana/diana-column/target/diana-column-0.1.0-SNAPSHOT.jar
[INFO] 
[INFO] --- maven-javadoc-plugin:3.0.1:jar (attach-javadocs) @ diana-column ---
[INFO] 
Loading source files for package org.eclipse.jnosql.diana.column...
Loading source files for package org.eclipse.jnosql.diana.column.query...
Constructing Javadoc information...
Standard Doclet version 1.8.0_202
Building tree for all the packages and classes...
Generating /home/jenkins/agent/workspace/jnosql-sonar/diana/diana-column/target/apidocs/org/eclipse/jnosql/diana/column/Columns.html...
Generating /home/jenkins/agent/workspace/jnosql-sonar/diana/diana-column/target/apidocs/org/eclipse/jnosql/diana/column/DefaultColumnConditionProvider.html...
Generating /home/jenkins/agent/workspace/jnosql-sonar/diana/diana-column/target/apidocs/org/eclipse/jnosql/diana/column/DefaultColumnEntityProvider.html...
Generating /home/jenkins/agent/workspace/jnosql-sonar/diana/diana-column/target/apidocs/org/eclipse/jnosql/diana/column/DefaultColumnProvider.html...
Generating /home/jenkins/agent/workspace/jnosql-sonar/diana/diana-column/target/apidocs/org/eclipse/jnosql/diana/column/query/DefaultColumnDeleteProvider.html...
Generating /home/jenkins/agent/workspace/jnosql-sonar/diana/diana-column/target/apidocs/org/eclipse/jnosql/diana/column/query/DefaultColumnQueryParser.html...
Generating /home/jenkins/agent/workspace/jnosql-sonar/diana/diana-column/target/apidocs/org/eclipse/jnosql/diana/column/query/DefaultColumnQueryParserAsync.html...
Generating /home/jenkins/agent/workspace/jnosql-sonar/diana/diana-column/target/apidocs/org/eclipse/jnosql/diana/column/query/DefaultColumnSelectProvider.html...
Generating /home/jenkins/agent/workspace/jnosql-sonar/diana/diana-column/target/apidocs/org/eclipse/jnosql/diana/column/query/DefaultDeleteQueryConverter.html...
Generating /home/jenkins/agent/workspace/jnosql-sonar/diana/diana-column/target/apidocs/org/eclipse/jnosql/diana/column/query/DefaultSelectQueryConverter.html...
Generating /home/jenkins/agent/workspace/jnosql-sonar/diana/diana-column/target/apidocs/overview-frame.html...
Generating /home/jenkins/agent/workspace/jnosql-sonar/diana/diana-column/target/apidocs/org/eclipse/jnosql/diana/column/package-frame.html...
Generating /home/jenkins/agent/workspace/jnosql-sonar/diana/diana-column/target/apidocs/org/eclipse/jnosql/diana/column/package-summary.html...
Generating /home/jenkins/agent/workspace/jnosql-sonar/diana/diana-column/target/apidocs/org/eclipse/jnosql/diana/column/package-tree.html...
Generating /home/jenkins/agent/workspace/jnosql-sonar/diana/diana-column/target/apidocs/org/eclipse/jnosql/diana/column/query/package-frame.html...
Generating /home/jenkins/agent/workspace/jnosql-sonar/diana/diana-column/target/apidocs/org/eclipse/jnosql/diana/column/query/package-summary.html...
Generating /home/jenkins/agent/workspace/jnosql-sonar/diana/diana-column/target/apidocs/org/eclipse/jnosql/diana/column/query/package-tree.html...
Generating /home/jenkins/agent/workspace/jnosql-sonar/diana/diana-column/target/apidocs/constant-values.html...
Generating /home/jenkins/agent/workspace/jnosql-sonar/diana/diana-column/target/apidocs/org/eclipse/jnosql/diana/column/class-use/DefaultColumnProvider.html...
Generating /home/jenkins/agent/workspace/jnosql-sonar/diana/diana-column/target/apidocs/org/eclipse/jnosql/diana/column/class-use/DefaultColumnEntityProvider.html...
Generating /home/jenkins/agent/workspace/jnosql-sonar/diana/diana-column/target/apidocs/org/eclipse/jnosql/diana/column/class-use/DefaultColumnConditionProvider.html...
Generating /home/jenkins/agent/workspace/jnosql-sonar/diana/diana-column/target/apidocs/org/eclipse/jnosql/diana/column/class-use/Columns.html...
Generating /home/jenkins/agent/workspace/jnosql-sonar/diana/diana-column/target/apidocs/org/eclipse/jnosql/diana/column/query/class-use/DefaultSelectQueryConverter.html...
Generating /home/jenkins/agent/workspace/jnosql-sonar/diana/diana-column/target/apidocs/org/eclipse/jnosql/diana/column/query/class-use/DefaultDeleteQueryConverter.html...
Generating /home/jenkins/agent/workspace/jnosql-sonar/diana/diana-column/target/apidocs/org/eclipse/jnosql/diana/column/query/class-use/DefaultColumnSelectProvider.html...
Generating /home/jenkins/agent/workspace/jnosql-sonar/diana/diana-column/target/apidocs/org/eclipse/jnosql/diana/column/query/class-use/DefaultColumnQueryParserAsync.html...
Generating /home/jenkins/agent/workspace/jnosql-sonar/diana/diana-column/target/apidocs/org/eclipse/jnosql/diana/column/query/class-use/DefaultColumnQueryParser.html...
Generating /home/jenkins/agent/workspace/jnosql-sonar/diana/diana-column/target/apidocs/org/eclipse/jnosql/diana/column/query/class-use/DefaultColumnDeleteProvider.html...
Generating /home/jenkins/agent/workspace/jnosql-sonar/diana/diana-column/target/apidocs/org/eclipse/jnosql/diana/column/package-use.html...
Generating /home/jenkins/agent/workspace/jnosql-sonar/diana/diana-column/target/apidocs/org/eclipse/jnosql/diana/column/query/package-use.html...
Building index for all the packages and classes...
Generating /home/jenkins/agent/workspace/jnosql-sonar/diana/diana-column/target/apidocs/overview-tree.html...
Generating /home/jenkins/agent/workspace/jnosql-sonar/diana/diana-column/target/apidocs/index-all.html...
Generating /home/jenkins/agent/workspace/jnosql-sonar/diana/diana-column/target/apidocs/deprecated-list.html...
Building index for all classes...
Generating /home/jenkins/agent/workspace/jnosql-sonar/diana/diana-column/target/apidocs/allclasses-frame.html...
Generating /home/jenkins/agent/workspace/jnosql-sonar/diana/diana-column/target/apidocs/allclasses-noframe.html...
Generating /home/jenkins/agent/workspace/jnosql-sonar/diana/diana-column/target/apidocs/index.html...
Generating /home/jenkins/agent/workspace/jnosql-sonar/diana/diana-column/target/apidocs/overview-summary.html...
Generating /home/jenkins/agent/workspace/jnosql-sonar/diana/diana-column/target/apidocs/help-doc.html...
[WARNING] Javadoc Warnings
[WARNING] Picked up JAVA_TOOL_OPTIONS: -XX:+IgnoreUnrecognizedVMOptions -XX:+UseContainerSupport -XX:+UnlockExperimentalVMOptions -XX:+UseCGroupMemoryLimitForHeap
[WARNING] Picked up _JAVA_OPTIONS: -XX:MaxRAMPercentage=64.0
[INFO] Building jar: /home/jenkins/agent/workspace/jnosql-sonar/diana/diana-column/target/diana-column-0.1.0-SNAPSHOT-javadoc.jar
[INFO] 
[INFO] >>> maven-source-plugin:3.0.1:jar (attach-sources) > generate-sources @ diana-column >>>
[INFO] 
[INFO] --- apache-rat-plugin:0.12:check (default) @ diana-column ---
[INFO] Added 1 additional default licenses.
[INFO] Enabled default license matchers.
[INFO] Added 1 custom approved licenses.
[INFO] Will parse SCM ignores for exclusions...
[INFO] Parsing exclusions from /home/jenkins/agent/workspace/jnosql-sonar/diana/diana-column/.gitignore
[INFO] Finished adding exclusions from SCM ignore files.
[INFO] 74 implicit excludes (use -debug for more details).
[INFO] No excludes explicitly specified.
[INFO] 49 resources included (use -debug for more details)
[INFO] Rat check: Summary over all files. Unapproved: 0, unknown: 0, generated: 0, approved: 49 licenses.
[INFO] 
[INFO] --- jacoco-maven-plugin:0.7.9:prepare-agent (pre-test) @ diana-column ---
[INFO] argLine set to -javaagent:/home/jenkins/.m2/repository/org/jacoco/org.jacoco.agent/0.7.9/org.jacoco.agent-0.7.9-runtime.jar=destfile=/home/jenkins/agent/workspace/jnosql-sonar/diana/target/jacoco.exec,append=true
[INFO] 
[INFO] <<< maven-source-plugin:3.0.1:jar (attach-sources) < generate-sources @ diana-column <<<
[INFO] 
[INFO] 
[INFO] --- maven-source-plugin:3.0.1:jar (attach-sources) @ diana-column ---
[INFO] Building jar: /home/jenkins/agent/workspace/jnosql-sonar/diana/diana-column/target/diana-column-0.1.0-SNAPSHOT-sources.jar
[INFO] 
[INFO] --- maven-install-plugin:2.4:install (default-install) @ diana-column ---
[INFO] Installing /home/jenkins/agent/workspace/jnosql-sonar/diana/diana-column/target/diana-column-0.1.0-SNAPSHOT.jar to /home/jenkins/.m2/repository/org/eclipse/jnosql/diana/diana-column/0.1.0-SNAPSHOT/diana-column-0.1.0-SNAPSHOT.jar
[INFO] Installing /home/jenkins/agent/workspace/jnosql-sonar/diana/diana-column/pom.xml to /home/jenkins/.m2/repository/org/eclipse/jnosql/diana/diana-column/0.1.0-SNAPSHOT/diana-column-0.1.0-SNAPSHOT.pom
[INFO] Installing /home/jenkins/agent/workspace/jnosql-sonar/diana/diana-column/target/diana-column-0.1.0-SNAPSHOT-javadoc.jar to /home/jenkins/.m2/repository/org/eclipse/jnosql/diana/diana-column/0.1.0-SNAPSHOT/diana-column-0.1.0-SNAPSHOT-javadoc.jar
[INFO] Installing /home/jenkins/agent/workspace/jnosql-sonar/diana/diana-column/target/diana-column-0.1.0-SNAPSHOT-sources.jar to /home/jenkins/.m2/repository/org/eclipse/jnosql/diana/diana-column/0.1.0-SNAPSHOT/diana-column-0.1.0-SNAPSHOT-sources.jar
[INFO] 
[INFO] --------------< org.eclipse.jnosql.diana:diana-document >---------------
[INFO] Building diana-document 0.1.0-SNAPSHOT                            [7/14]
[INFO] --------------------------------[ jar ]---------------------------------
[INFO] 
[INFO] --- maven-clean-plugin:2.5:clean (default-clean) @ diana-document ---
[INFO] 
[INFO] --- apache-rat-plugin:0.12:check (default) @ diana-document ---
[INFO] Added 1 additional default licenses.
[INFO] Enabled default license matchers.
[INFO] Added 1 custom approved licenses.
[INFO] Will parse SCM ignores for exclusions...
[INFO] Parsing exclusions from /home/jenkins/agent/workspace/jnosql-sonar/diana/diana-document/.gitignore
[INFO] Finished adding exclusions from SCM ignore files.
[INFO] 74 implicit excludes (use -debug for more details).
[INFO] No excludes explicitly specified.
[INFO] 49 resources included (use -debug for more details)
[INFO] Rat check: Summary over all files. Unapproved: 0, unknown: 0, generated: 0, approved: 49 licenses.
[INFO] 
[INFO] --- jacoco-maven-plugin:0.7.9:prepare-agent (pre-test) @ diana-document ---
[INFO] argLine set to -javaagent:/home/jenkins/.m2/repository/org/jacoco/org.jacoco.agent/0.7.9/org.jacoco.agent-0.7.9-runtime.jar=destfile=/home/jenkins/agent/workspace/jnosql-sonar/diana/target/jacoco.exec,append=true
[INFO] 
[INFO] --- maven-resources-plugin:2.6:resources (default-resources) @ diana-document ---
[INFO] Using 'UTF-8' encoding to copy filtered resources.
[INFO] Copying 9 resources
[INFO] 
[INFO] --- maven-compiler-plugin:3.8.0:compile (default-compile) @ diana-document ---
[INFO] Changes detected - recompiling the module!
[INFO] Compiling 33 source files to /home/jenkins/agent/workspace/jnosql-sonar/diana/diana-document/target/classes
[INFO] /home/jenkins/agent/workspace/jnosql-sonar/diana/diana-document/src/main/java/org/eclipse/jnosql/diana/document/Documents.java: Some input files use unchecked or unsafe operations.
[INFO] /home/jenkins/agent/workspace/jnosql-sonar/diana/diana-document/src/main/java/org/eclipse/jnosql/diana/document/Documents.java: Recompile with -Xlint:unchecked for details.
[INFO] 
[INFO] --- maven-checkstyle-plugin:3.0.0:check (verify-style) @ diana-document ---
[INFO] Starting audit...
Audit done.
[INFO] 
[INFO] --- maven-resources-plugin:2.6:testResources (default-testResources) @ diana-document ---
[INFO] Using 'UTF-8' encoding to copy filtered resources.
[INFO] skip non existing resourceDirectory /home/jenkins/agent/workspace/jnosql-sonar/diana/diana-document/src/test/resources
[INFO] 
[INFO] --- maven-compiler-plugin:3.8.0:testCompile (default-testCompile) @ diana-document ---
[INFO] Changes detected - recompiling the module!
[INFO] Compiling 15 source files to /home/jenkins/agent/workspace/jnosql-sonar/diana/diana-document/target/test-classes
[INFO] /home/jenkins/agent/workspace/jnosql-sonar/diana/diana-document/src/test/java/org/eclipse/jnosql/diana/document/query/InsertQueryParserTest.java: Some input files use unchecked or unsafe operations.
[INFO] /home/jenkins/agent/workspace/jnosql-sonar/diana/diana-document/src/test/java/org/eclipse/jnosql/diana/document/query/InsertQueryParserTest.java: Recompile with -Xlint:unchecked for details.
[INFO] 
[INFO] --- maven-surefire-plugin:2.22.1:test (default-test) @ diana-document ---
[INFO] 
[INFO] -------------------------------------------------------
[INFO]  T E S T S
[INFO] -------------------------------------------------------
[INFO] Running org.eclipse.jnosql.diana.document.query.DefaultDocumentnDeleteQueryTest
[INFO] Tests run: 1, Failures: 0, Errors: 0, Skipped: 0, Time elapsed: 0.046 s - in org.eclipse.jnosql.diana.document.query.DefaultDocumentnDeleteQueryTest
[INFO] Running org.eclipse.jnosql.diana.document.query.InsertQueryParserTest
[INFO] Tests run: 17, Failures: 0, Errors: 0, Skipped: 0, Time elapsed: 1.268 s - in org.eclipse.jnosql.diana.document.query.InsertQueryParserTest
[INFO] Running org.eclipse.jnosql.diana.document.query.UpdateQueryParserTest
[INFO] Tests run: 10, Failures: 0, Errors: 0, Skipped: 0, Time elapsed: 0.029 s - in org.eclipse.jnosql.diana.document.query.UpdateQueryParserTest
[INFO] Running org.eclipse.jnosql.diana.document.query.DocumentParamsTest
[INFO] Tests run: 3, Failures: 0, Errors: 0, Skipped: 0, Time elapsed: 0.002 s - in org.eclipse.jnosql.diana.document.query.DocumentParamsTest
[INFO] Running org.eclipse.jnosql.diana.document.query.DefaultDocumentQueryParserTest
[INFO] Tests run: 13, Failures: 0, Errors: 0, Skipped: 0, Time elapsed: 0.101 s - in org.eclipse.jnosql.diana.document.query.DefaultDocumentQueryParserTest
[INFO] Running org.eclipse.jnosql.diana.document.query.DefaultDeleteQueryBuilderTest
[INFO] Tests run: 18, Failures: 0, Errors: 0, Skipped: 0, Time elapsed: 0.039 s - in org.eclipse.jnosql.diana.document.query.DefaultDeleteQueryBuilderTest
[INFO] Running org.eclipse.jnosql.diana.document.query.DeleteQueryParserTest
[INFO] Tests run: 25, Failures: 0, Errors: 0, Skipped: 0, Time elapsed: 0.099 s - in org.eclipse.jnosql.diana.document.query.DeleteQueryParserTest
[INFO] Running org.eclipse.jnosql.diana.document.query.SelectQueryParserTest
[INFO] Tests run: 31, Failures: 0, Errors: 0, Skipped: 0, Time elapsed: 0.097 s - in org.eclipse.jnosql.diana.document.query.SelectQueryParserTest
[INFO] Running org.eclipse.jnosql.diana.document.query.DefaultDocumentQueryParserAsyncTest
[INFO] Tests run: 13, Failures: 0, Errors: 0, Skipped: 0, Time elapsed: 0.026 s - in org.eclipse.jnosql.diana.document.query.DefaultDocumentQueryParserAsyncTest
[INFO] Running org.eclipse.jnosql.diana.document.query.DefaultDocumentQueryTest
[INFO] Tests run: 2, Failures: 0, Errors: 0, Skipped: 0, Time elapsed: 0.005 s - in org.eclipse.jnosql.diana.document.query.DefaultDocumentQueryTest
[INFO] Running org.eclipse.jnosql.diana.document.query.DefaultSelectQueryBuilderTest
[INFO] Tests run: 24, Failures: 0, Errors: 0, Skipped: 0, Time elapsed: 0.016 s - in org.eclipse.jnosql.diana.document.query.DefaultSelectQueryBuilderTest
[INFO] Running org.eclipse.jnosql.diana.document.DocumentTest
[INFO] Tests run: 7, Failures: 0, Errors: 0, Skipped: 0, Time elapsed: 0.001 s - in org.eclipse.jnosql.diana.document.DocumentTest
[INFO] Running org.eclipse.jnosql.diana.document.DocumentsTest
[INFO] Tests run: 3, Failures: 0, Errors: 0, Skipped: 0, Time elapsed: 0.001 s - in org.eclipse.jnosql.diana.document.DocumentsTest
[INFO] Running org.eclipse.jnosql.diana.document.DocumentEntityTest
[INFO] Tests run: 33, Failures: 0, Errors: 0, Skipped: 0, Time elapsed: 0.016 s - in org.eclipse.jnosql.diana.document.DocumentEntityTest
[INFO] Running org.eclipse.jnosql.diana.document.DefaultDocumentConditionTest
[INFO] Tests run: 20, Failures: 0, Errors: 0, Skipped: 0, Time elapsed: 0.013 s - in org.eclipse.jnosql.diana.document.DefaultDocumentConditionTest
[INFO] 
[INFO] Results:
[INFO] 
[INFO] Tests run: 220, Failures: 0, Errors: 0, Skipped: 0
[INFO] 
[INFO] 
[INFO] --- maven-jar-plugin:2.4:jar (default-jar) @ diana-document ---
[INFO] Building jar: /home/jenkins/agent/workspace/jnosql-sonar/diana/diana-document/target/diana-document-0.1.0-SNAPSHOT.jar
[INFO] 
[INFO] --- maven-javadoc-plugin:3.0.1:jar (attach-javadocs) @ diana-document ---
[INFO] 
Loading source files for package org.eclipse.jnosql.diana.document...
Loading source files for package org.eclipse.jnosql.diana.document.query...
Constructing Javadoc information...
Standard Doclet version 1.8.0_202
Building tree for all the packages and classes...
Generating /home/jenkins/agent/workspace/jnosql-sonar/diana/diana-document/target/apidocs/org/eclipse/jnosql/diana/document/DefaultDocumentConditionProvider.html...
Generating /home/jenkins/agent/workspace/jnosql-sonar/diana/diana-document/target/apidocs/org/eclipse/jnosql/diana/document/DefaultDocumentEntityProvider.html...
Generating /home/jenkins/agent/workspace/jnosql-sonar/diana/diana-document/target/apidocs/org/eclipse/jnosql/diana/document/DefaultDocumentProvider.html...
Generating /home/jenkins/agent/workspace/jnosql-sonar/diana/diana-document/target/apidocs/org/eclipse/jnosql/diana/document/Documents.html...
Generating /home/jenkins/agent/workspace/jnosql-sonar/diana/diana-document/target/apidocs/org/eclipse/jnosql/diana/document/query/DefaultDocumentDeleteProvider.html...
Generating /home/jenkins/agent/workspace/jnosql-sonar/diana/diana-document/target/apidocs/org/eclipse/jnosql/diana/document/query/DefaultDocumentQueryParser.html...
Generating /home/jenkins/agent/workspace/jnosql-sonar/diana/diana-document/target/apidocs/org/eclipse/jnosql/diana/document/query/DefaultDocumentQueryParserAsync.html...
Generating /home/jenkins/agent/workspace/jnosql-sonar/diana/diana-document/target/apidocs/org/eclipse/jnosql/diana/document/query/DefaultDocumentSelectProvider.html...
Generating /home/jenkins/agent/workspace/jnosql-sonar/diana/diana-document/target/apidocs/org/eclipse/jnosql/diana/document/query/DeleteQueryParser.html...
Generating /home/jenkins/agent/workspace/jnosql-sonar/diana/diana-document/target/apidocs/org/eclipse/jnosql/diana/document/query/SelectQueryParser.html...
Generating /home/jenkins/agent/workspace/jnosql-sonar/diana/diana-document/target/apidocs/overview-frame.html...
Generating /home/jenkins/agent/workspace/jnosql-sonar/diana/diana-document/target/apidocs/org/eclipse/jnosql/diana/document/package-frame.html...
Generating /home/jenkins/agent/workspace/jnosql-sonar/diana/diana-document/target/apidocs/org/eclipse/jnosql/diana/document/package-summary.html...
Generating /home/jenkins/agent/workspace/jnosql-sonar/diana/diana-document/target/apidocs/org/eclipse/jnosql/diana/document/package-tree.html...
Generating /home/jenkins/agent/workspace/jnosql-sonar/diana/diana-document/target/apidocs/org/eclipse/jnosql/diana/document/query/package-frame.html...
Generating /home/jenkins/agent/workspace/jnosql-sonar/diana/diana-document/target/apidocs/org/eclipse/jnosql/diana/document/query/package-summary.html...
Generating /home/jenkins/agent/workspace/jnosql-sonar/diana/diana-document/target/apidocs/org/eclipse/jnosql/diana/document/query/package-tree.html...
Generating /home/jenkins/agent/workspace/jnosql-sonar/diana/diana-document/target/apidocs/constant-values.html...
Generating /home/jenkins/agent/workspace/jnosql-sonar/diana/diana-document/target/apidocs/org/eclipse/jnosql/diana/document/class-use/Documents.html...
Generating /home/jenkins/agent/workspace/jnosql-sonar/diana/diana-document/target/apidocs/org/eclipse/jnosql/diana/document/class-use/DefaultDocumentProvider.html...
Generating /home/jenkins/agent/workspace/jnosql-sonar/diana/diana-document/target/apidocs/org/eclipse/jnosql/diana/document/class-use/DefaultDocumentEntityProvider.html...
Generating /home/jenkins/agent/workspace/jnosql-sonar/diana/diana-document/target/apidocs/org/eclipse/jnosql/diana/document/class-use/DefaultDocumentConditionProvider.html...
Generating /home/jenkins/agent/workspace/jnosql-sonar/diana/diana-document/target/apidocs/org/eclipse/jnosql/diana/document/query/class-use/SelectQueryParser.html...
Generating /home/jenkins/agent/workspace/jnosql-sonar/diana/diana-document/target/apidocs/org/eclipse/jnosql/diana/document/query/class-use/DeleteQueryParser.html...
Generating /home/jenkins/agent/workspace/jnosql-sonar/diana/diana-document/target/apidocs/org/eclipse/jnosql/diana/document/query/class-use/DefaultDocumentSelectProvider.html...
Generating /home/jenkins/agent/workspace/jnosql-sonar/diana/diana-document/target/apidocs/org/eclipse/jnosql/diana/document/query/class-use/DefaultDocumentQueryParserAsync.html...
Generating /home/jenkins/agent/workspace/jnosql-sonar/diana/diana-document/target/apidocs/org/eclipse/jnosql/diana/document/query/class-use/DefaultDocumentQueryParser.html...
Generating /home/jenkins/agent/workspace/jnosql-sonar/diana/diana-document/target/apidocs/org/eclipse/jnosql/diana/document/query/class-use/DefaultDocumentDeleteProvider.html...
Generating /home/jenkins/agent/workspace/jnosql-sonar/diana/diana-document/target/apidocs/org/eclipse/jnosql/diana/document/package-use.html...
Generating /home/jenkins/agent/workspace/jnosql-sonar/diana/diana-document/target/apidocs/org/eclipse/jnosql/diana/document/query/package-use.html...
Building index for all the packages and classes...
Generating /home/jenkins/agent/workspace/jnosql-sonar/diana/diana-document/target/apidocs/overview-tree.html...
Generating /home/jenkins/agent/workspace/jnosql-sonar/diana/diana-document/target/apidocs/index-all.html...
Generating /home/jenkins/agent/workspace/jnosql-sonar/diana/diana-document/target/apidocs/deprecated-list.html...
Building index for all classes...
Generating /home/jenkins/agent/workspace/jnosql-sonar/diana/diana-document/target/apidocs/allclasses-frame.html...
Generating /home/jenkins/agent/workspace/jnosql-sonar/diana/diana-document/target/apidocs/allclasses-noframe.html...
Generating /home/jenkins/agent/workspace/jnosql-sonar/diana/diana-document/target/apidocs/index.html...
Generating /home/jenkins/agent/workspace/jnosql-sonar/diana/diana-document/target/apidocs/overview-summary.html...
Generating /home/jenkins/agent/workspace/jnosql-sonar/diana/diana-document/target/apidocs/help-doc.html...
[WARNING] Javadoc Warnings
[WARNING] Picked up JAVA_TOOL_OPTIONS: -XX:+IgnoreUnrecognizedVMOptions -XX:+UseContainerSupport -XX:+UnlockExperimentalVMOptions -XX:+UseCGroupMemoryLimitForHeap
[WARNING] Picked up _JAVA_OPTIONS: -XX:MaxRAMPercentage=64.0
[INFO] Building jar: /home/jenkins/agent/workspace/jnosql-sonar/diana/diana-document/target/diana-document-0.1.0-SNAPSHOT-javadoc.jar
[INFO] 
[INFO] >>> maven-source-plugin:3.0.1:jar (attach-sources) > generate-sources @ diana-document >>>
[INFO] 
[INFO] --- apache-rat-plugin:0.12:check (default) @ diana-document ---
[INFO] Added 1 additional default licenses.
[INFO] Enabled default license matchers.
[INFO] Added 1 custom approved licenses.
[INFO] Will parse SCM ignores for exclusions...
[INFO] Parsing exclusions from /home/jenkins/agent/workspace/jnosql-sonar/diana/diana-document/.gitignore
[INFO] Finished adding exclusions from SCM ignore files.
[INFO] 74 implicit excludes (use -debug for more details).
[INFO] No excludes explicitly specified.
[INFO] 49 resources included (use -debug for more details)
[INFO] Rat check: Summary over all files. Unapproved: 0, unknown: 0, generated: 0, approved: 49 licenses.
[INFO] 
[INFO] --- jacoco-maven-plugin:0.7.9:prepare-agent (pre-test) @ diana-document ---
[INFO] argLine set to -javaagent:/home/jenkins/.m2/repository/org/jacoco/org.jacoco.agent/0.7.9/org.jacoco.agent-0.7.9-runtime.jar=destfile=/home/jenkins/agent/workspace/jnosql-sonar/diana/target/jacoco.exec,append=true
[INFO] 
[INFO] <<< maven-source-plugin:3.0.1:jar (attach-sources) < generate-sources @ diana-document <<<
[INFO] 
[INFO] 
[INFO] --- maven-source-plugin:3.0.1:jar (attach-sources) @ diana-document ---
[INFO] Building jar: /home/jenkins/agent/workspace/jnosql-sonar/diana/diana-document/target/diana-document-0.1.0-SNAPSHOT-sources.jar
[INFO] 
[INFO] --- maven-install-plugin:2.4:install (default-install) @ diana-document ---
[INFO] Installing /home/jenkins/agent/workspace/jnosql-sonar/diana/diana-document/target/diana-document-0.1.0-SNAPSHOT.jar to /home/jenkins/.m2/repository/org/eclipse/jnosql/diana/diana-document/0.1.0-SNAPSHOT/diana-document-0.1.0-SNAPSHOT.jar
[INFO] Installing /home/jenkins/agent/workspace/jnosql-sonar/diana/diana-document/pom.xml to /home/jenkins/.m2/repository/org/eclipse/jnosql/diana/diana-document/0.1.0-SNAPSHOT/diana-document-0.1.0-SNAPSHOT.pom
[INFO] Installing /home/jenkins/agent/workspace/jnosql-sonar/diana/diana-document/target/diana-document-0.1.0-SNAPSHOT-javadoc.jar to /home/jenkins/.m2/repository/org/eclipse/jnosql/diana/diana-document/0.1.0-SNAPSHOT/diana-document-0.1.0-SNAPSHOT-javadoc.jar
[INFO] Installing /home/jenkins/agent/workspace/jnosql-sonar/diana/diana-document/target/diana-document-0.1.0-SNAPSHOT-sources.jar to /home/jenkins/.m2/repository/org/eclipse/jnosql/diana/diana-document/0.1.0-SNAPSHOT/diana-document-0.1.0-SNAPSHOT-sources.jar
[INFO] 
[INFO] -------------< org.eclipse.jnosql.artemis:artemis-parent >--------------
[INFO] Building artemis-parent 0.1.0-SNAPSHOT                            [8/14]
[INFO] --------------------------------[ pom ]---------------------------------
[INFO] 
[INFO] --- maven-clean-plugin:2.5:clean (default-clean) @ artemis-parent ---
[INFO] 
[INFO] --- apache-rat-plugin:0.12:check (default) @ artemis-parent ---
[INFO] Added 1 additional default licenses.
[INFO] Enabled default license matchers.
[INFO] Added 1 custom approved licenses.
[INFO] Will parse SCM ignores for exclusions...
[INFO] Finished adding exclusions from SCM ignore files.
[INFO] 67 implicit excludes (use -debug for more details).
[INFO] No excludes explicitly specified.
[INFO] 1 resources included (use -debug for more details)
[INFO] Rat check: Summary over all files. Unapproved: 0, unknown: 0, generated: 0, approved: 1 licenses.
[INFO] 
[INFO] --- jacoco-maven-plugin:0.7.9:prepare-agent (pre-test) @ artemis-parent ---
[INFO] argLine set to -javaagent:/home/jenkins/.m2/repository/org/jacoco/org.jacoco.agent/0.7.9/org.jacoco.agent-0.7.9-runtime.jar=destfile=/home/jenkins/agent/workspace/jnosql-sonar/target/jacoco.exec,append=true
[INFO] 
[INFO] --- maven-checkstyle-plugin:3.0.0:check (verify-style) @ artemis-parent ---
[INFO] Starting audit...
Audit done.
[INFO] 
[INFO] --- maven-javadoc-plugin:3.0.1:jar (attach-javadocs) @ artemis-parent ---
[INFO] Not executing Javadoc as the project is not a Java classpath-capable package
[INFO] 
[INFO] >>> maven-source-plugin:3.0.1:jar (attach-sources) > generate-sources @ artemis-parent >>>
[INFO] 
[INFO] --- apache-rat-plugin:0.12:check (default) @ artemis-parent ---
[INFO] Added 1 additional default licenses.
[INFO] Enabled default license matchers.
[INFO] Added 1 custom approved licenses.
[INFO] Will parse SCM ignores for exclusions...
[INFO] Finished adding exclusions from SCM ignore files.
[INFO] 67 implicit excludes (use -debug for more details).
[INFO] No excludes explicitly specified.
[INFO] 1 resources included (use -debug for more details)
[INFO] Rat check: Summary over all files. Unapproved: 0, unknown: 0, generated: 0, approved: 1 licenses.
[INFO] 
[INFO] --- jacoco-maven-plugin:0.7.9:prepare-agent (pre-test) @ artemis-parent ---
[INFO] argLine set to -javaagent:/home/jenkins/.m2/repository/org/jacoco/org.jacoco.agent/0.7.9/org.jacoco.agent-0.7.9-runtime.jar=destfile=/home/jenkins/agent/workspace/jnosql-sonar/target/jacoco.exec,append=true
[INFO] 
[INFO] <<< maven-source-plugin:3.0.1:jar (attach-sources) < generate-sources @ artemis-parent <<<
[INFO] 
[INFO] 
[INFO] --- maven-source-plugin:3.0.1:jar (attach-sources) @ artemis-parent ---
[INFO] 
[INFO] --- maven-install-plugin:2.4:install (default-install) @ artemis-parent ---
[INFO] Installing /home/jenkins/agent/workspace/jnosql-sonar/artemis/pom.xml to /home/jenkins/.m2/repository/org/eclipse/jnosql/artemis/artemis-parent/0.1.0-SNAPSHOT/artemis-parent-0.1.0-SNAPSHOT.pom
[INFO] 
[INFO] --------------< org.eclipse.jnosql.artemis:artemis-core >---------------
[INFO] Building artemis-core 0.1.0-SNAPSHOT                              [9/14]
[INFO] --------------------------------[ jar ]---------------------------------
[INFO] 
[INFO] --- maven-clean-plugin:2.5:clean (default-clean) @ artemis-core ---
[INFO] 
[INFO] --- apache-rat-plugin:0.12:check (default) @ artemis-core ---
[INFO] Added 1 additional default licenses.
[INFO] Enabled default license matchers.
[INFO] Added 1 custom approved licenses.
[INFO] Will parse SCM ignores for exclusions...
[INFO] Parsing exclusions from /home/jenkins/agent/workspace/jnosql-sonar/artemis/artemis-core/.gitignore
[INFO] Finished adding exclusions from SCM ignore files.
[INFO] 73 implicit excludes (use -debug for more details).
[INFO] No excludes explicitly specified.
[INFO] 130 resources included (use -debug for more details)
[INFO] Rat check: Summary over all files. Unapproved: 0, unknown: 0, generated: 0, approved: 130 licenses.
[INFO] 
[INFO] --- jacoco-maven-plugin:0.7.9:prepare-agent (pre-test) @ artemis-core ---
[INFO] argLine set to -javaagent:/home/jenkins/.m2/repository/org/jacoco/org.jacoco.agent/0.7.9/org.jacoco.agent-0.7.9-runtime.jar=destfile=/home/jenkins/agent/workspace/jnosql-sonar/artemis/target/jacoco.exec,append=true
[INFO] 
[INFO] --- maven-resources-plugin:2.6:resources (default-resources) @ artemis-core ---
[INFO] Using 'UTF-8' encoding to copy filtered resources.
[INFO] Copying 9 resources
[INFO] 
[INFO] --- maven-compiler-plugin:3.8.0:compile (default-compile) @ artemis-core ---
[INFO] Changes detected - recompiling the module!
[INFO] Compiling 66 source files to /home/jenkins/agent/workspace/jnosql-sonar/artemis/artemis-core/target/classes
[INFO] /home/jenkins/agent/workspace/jnosql-sonar/artemis/artemis-core/src/main/java/org/eclipse/jnosql/artemis/configuration/AbstractConfiguration.java: Some input files use unchecked or unsafe operations.
[INFO] /home/jenkins/agent/workspace/jnosql-sonar/artemis/artemis-core/src/main/java/org/eclipse/jnosql/artemis/configuration/AbstractConfiguration.java: Recompile with -Xlint:unchecked for details.
[INFO] 
[INFO] --- maven-checkstyle-plugin:3.0.0:check (verify-style) @ artemis-core ---
[INFO] Starting audit...
Audit done.
[INFO] 
[INFO] --- maven-resources-plugin:2.6:testResources (default-testResources) @ artemis-core ---
[INFO] Using 'UTF-8' encoding to copy filtered resources.
[INFO] Copying 16 resources
[INFO] 
[INFO] --- maven-compiler-plugin:3.8.0:testCompile (default-testCompile) @ artemis-core ---
[INFO] Changes detected - recompiling the module!
[INFO] Compiling 56 source files to /home/jenkins/agent/workspace/jnosql-sonar/artemis/artemis-core/target/test-classes
[INFO] /home/jenkins/agent/workspace/jnosql-sonar/artemis/artemis-core/src/test/java/org/eclipse/jnosql/artemis/reflection/DefaultDynamicExecutorQueryConverterTest.java: Some input files use unchecked or unsafe operations.
[INFO] /home/jenkins/agent/workspace/jnosql-sonar/artemis/artemis-core/src/test/java/org/eclipse/jnosql/artemis/reflection/DefaultDynamicExecutorQueryConverterTest.java: Recompile with -Xlint:unchecked for details.
[INFO] 
[INFO] --- maven-surefire-plugin:2.22.1:test (default-test) @ artemis-core ---
[INFO] 
[INFO] -------------------------------------------------------
[INFO]  T E S T S
[INFO] -------------------------------------------------------
[INFO] Running org.eclipse.jnosql.artemis.DefaultPaginationTest
[INFO] Tests run: 7, Failures: 0, Errors: 0, Skipped: 0, Time elapsed: 0.076 s - in org.eclipse.jnosql.artemis.DefaultPaginationTest
[INFO] Running org.eclipse.jnosql.artemis.reflection.DefaultDynamicExecutorQueryConverterTest
[INFO] Tests run: 10, Failures: 0, Errors: 0, Skipped: 0, Time elapsed: 0.02 s - in org.eclipse.jnosql.artemis.reflection.DefaultDynamicExecutorQueryConverterTest
Nov 27, 2019 9:40:35 AM org.jboss.weld.bootstrap.WeldStartup <clinit>
INFO: WELD-000900: 3.1.2 (Final)
Nov 27, 2019 9:40:35 AM org.eclipse.jnosql.artemis.reflection.ClassOperationFactory get
INFO: Logging the operation factory
Nov 27, 2019 9:40:35 AM org.eclipse.jnosql.artemis.reflection.ClassOperationFactory get
INFO: ClassOperation does not found, using the default implementation
Nov 27, 2019 9:40:36 AM org.jboss.weld.bootstrap.WeldStartup startContainer
INFO: WELD-000101: Transactional services not available. Injection of @Inject UserTransaction not available. Transactional observers will be invoked synchronously.
Nov 27, 2019 9:40:36 AM org.jboss.weld.event.ExtensionObserverMethodImpl checkRequiredTypeAnnotations
INFO: WELD-000411: Observer method [BackedAnnotatedMethod] public org.eclipse.jnosql.artemis.reflection.ClassMappingExtension.initializePropertyLoading(@Observes ProcessAnnotatedType<T>) receives events for all annotated types. Consider restricting events using @WithAnnotations or a generic type with bounds.
Nov 27, 2019 9:40:36 AM org.eclipse.jnosql.artemis.reflection.ClassConverter create
INFO: Scanned org.eclipse.jnosql.artemis.model.Actor loaded with time 36 ms
Nov 27, 2019 9:40:37 AM org.eclipse.jnosql.artemis.reflection.ClassConverter create
INFO: Scanned org.eclipse.jnosql.artemis.model.Address loaded with time 1170 ms
Nov 27, 2019 9:40:37 AM org.eclipse.jnosql.artemis.reflection.ClassConverter create
INFO: Scanned org.eclipse.jnosql.artemis.model.Director loaded with time 2 ms
Nov 27, 2019 9:40:37 AM org.eclipse.jnosql.artemis.reflection.ClassConverter create
INFO: Scanned org.eclipse.jnosql.artemis.model.Person loaded with time 18 ms
Nov 27, 2019 9:40:37 AM org.eclipse.jnosql.artemis.reflection.ClassConverter create
INFO: Scanned org.eclipse.jnosql.artemis.model.Contact loaded with time 1 ms
Nov 27, 2019 9:40:37 AM org.eclipse.jnosql.artemis.reflection.ClassConverter create
INFO: Scanned org.eclipse.jnosql.artemis.reflection.FieldMappingTest$BarClass loaded with time 34 ms
Nov 27, 2019 9:40:37 AM org.eclipse.jnosql.artemis.reflection.ClassConverter create
INFO: Scanned org.eclipse.jnosql.artemis.model.AppointmentBook loaded with time 1 ms
Nov 27, 2019 9:40:37 AM org.eclipse.jnosql.artemis.reflection.ClassConverter create
INFO: Scanned org.eclipse.jnosql.artemis.model.Job loaded with time 126 ms
Nov 27, 2019 9:40:38 AM org.eclipse.jnosql.artemis.reflection.ClassConverter create
INFO: Scanned org.eclipse.jnosql.artemis.model.Worker loaded with time 399 ms
Nov 27, 2019 9:40:38 AM org.eclipse.jnosql.artemis.reflection.ClassConverter create
INFO: Scanned org.eclipse.jnosql.artemis.model.Zipcode loaded with time 88 ms
Nov 27, 2019 9:40:38 AM org.eclipse.jnosql.artemis.reflection.ClassConverter create
INFO: Scanned org.eclipse.jnosql.artemis.model.Movie loaded with time 1 ms
Nov 27, 2019 9:40:38 AM org.jboss.weld.util.Beans omitIllegalBeanTypes
INFO: WELD-001125: Illegal bean type java.util.function.Function<java.lang.reflect.Constructor<?>, jakarta.nosql.mapping.reflection.InstanceSupplier> ignored on [EnhancedAnnotatedTypeImpl]  class org.eclipse.jnosql.artemis.reflection.ReflectionInstanceSupplierFactory
Nov 27, 2019 9:40:38 AM org.jboss.weld.environment.se.WeldContainer fireContainerInitializedEvent
INFO: WELD-ENV-002003: Weld SE container fdc2e513-e871-426c-a0e6-073fea19f955 initialized
[INFO] Running org.eclipse.jnosql.artemis.reflection.ReflectionsTest
[INFO] Tests run: 3, Failures: 0, Errors: 0, Skipped: 0, Time elapsed: 0.029 s - in org.eclipse.jnosql.artemis.reflection.ReflectionsTest
[INFO] Running org.eclipse.jnosql.artemis.reflection.DynamicReturnTest
[INFO] Tests run: 25, Failures: 0, Errors: 0, Skipped: 0, Time elapsed: 0.03 s - in org.eclipse.jnosql.artemis.reflection.DynamicReturnTest
[INFO] Running org.eclipse.jnosql.artemis.reflection.DynamicReturnPaginationTest
[INFO] Tests run: 14, Failures: 0, Errors: 0, Skipped: 0, Time elapsed: 0.608 s - in org.eclipse.jnosql.artemis.reflection.DynamicReturnPaginationTest
[INFO] Running org.eclipse.jnosql.artemis.reflection.FieldMappingTest
Nov 27, 2019 9:40:39 AM org.eclipse.jnosql.artemis.reflection.ClassOperationFactory get
INFO: Logging the operation factory
Nov 27, 2019 9:40:39 AM org.eclipse.jnosql.artemis.reflection.ClassOperationFactory get
INFO: ClassOperation does not found, using the default implementation
Nov 27, 2019 9:40:39 AM org.eclipse.jnosql.artemis.reflection.ClassConverter create
INFO: Scanned org.eclipse.jnosql.artemis.reflection.FieldMappingTest$ForClass loaded with time 19 ms
Nov 27, 2019 9:40:39 AM org.eclipse.jnosql.artemis.reflection.ClassConverter create
INFO: Scanned org.eclipse.jnosql.artemis.reflection.FieldMappingTest$ForClass loaded with time 18 ms
Nov 27, 2019 9:40:39 AM org.eclipse.jnosql.artemis.reflection.ClassConverter create
INFO: Scanned org.eclipse.jnosql.artemis.reflection.FieldMappingTest$ForClass loaded with time 18 ms
Nov 27, 2019 9:40:39 AM org.eclipse.jnosql.artemis.reflection.ClassConverter create
INFO: Scanned org.eclipse.jnosql.artemis.reflection.FieldMappingTest$ForClass loaded with time 41 ms
Nov 27, 2019 9:40:39 AM org.eclipse.jnosql.artemis.reflection.ClassConverter create
INFO: Scanned org.eclipse.jnosql.artemis.reflection.FieldMappingTest$ForClass loaded with time 17 ms
Nov 27, 2019 9:40:39 AM org.eclipse.jnosql.artemis.reflection.ClassConverter create
INFO: Scanned org.eclipse.jnosql.artemis.reflection.FieldMappingTest$ForClass loaded with time 17 ms
[INFO] Tests run: 6, Failures: 0, Errors: 0, Skipped: 0, Time elapsed: 0.143 s - in org.eclipse.jnosql.artemis.reflection.FieldMappingTest
[INFO] Running org.eclipse.jnosql.artemis.reflection.ClassConverterJavaFieldParserTest
Nov 27, 2019 9:40:39 AM org.eclipse.jnosql.artemis.reflection.ClassConverter create
INFO: Scanned org.eclipse.jnosql.artemis.model.Worker loaded with time 209 ms
Nov 27, 2019 9:40:40 AM org.eclipse.jnosql.artemis.reflection.ClassConverter create
INFO: Scanned org.eclipse.jnosql.artemis.model.Address loaded with time 284 ms
Nov 27, 2019 9:40:40 AM org.eclipse.jnosql.artemis.reflection.ClassConverter create
INFO: Scanned org.eclipse.jnosql.artemis.model.Worker loaded with time 207 ms
Nov 27, 2019 9:40:40 AM org.eclipse.jnosql.artemis.reflection.ClassConverter create
INFO: Scanned org.eclipse.jnosql.artemis.model.Person loaded with time 0 ms
Nov 27, 2019 9:40:40 AM org.eclipse.jnosql.artemis.reflection.ClassConverter create
INFO: Scanned org.eclipse.jnosql.artemis.model.Person loaded with time 1 ms
Nov 27, 2019 9:40:40 AM org.eclipse.jnosql.artemis.reflection.ClassConverter create
INFO: Scanned org.eclipse.jnosql.artemis.model.Address loaded with time 217 ms
Nov 27, 2019 9:40:40 AM org.eclipse.jnosql.artemis.reflection.ClassConverter create
INFO: Scanned org.eclipse.jnosql.artemis.model.Worker loaded with time 184 ms
Nov 27, 2019 9:40:40 AM org.eclipse.jnosql.artemis.reflection.ClassConverter create
INFO: Scanned org.eclipse.jnosql.artemis.model.AppointmentBook loaded with time 1 ms
[INFO] Tests run: 8, Failures: 0, Errors: 0, Skipped: 0, Time elapsed: 1.113 s - in org.eclipse.jnosql.artemis.reflection.ClassConverterJavaFieldParserTest
[INFO] Running org.eclipse.jnosql.artemis.reflection.InstanceProducerTest
[INFO] Tests run: 1, Failures: 0, Errors: 0, Skipped: 0, Time elapsed: 0.003 s - in org.eclipse.jnosql.artemis.reflection.InstanceProducerTest
[INFO] Running org.eclipse.jnosql.artemis.reflection.JavaCompilerFieldWriterFactoryTest
[INFO] Tests run: 3, Failures: 0, Errors: 0, Skipped: 0, Time elapsed: 0.046 s - in org.eclipse.jnosql.artemis.reflection.JavaCompilerFieldWriterFactoryTest
[INFO] Running org.eclipse.jnosql.artemis.reflection.DefaultInstanceProducerTest
[INFO] Tests run: 2, Failures: 0, Errors: 0, Skipped: 0, Time elapsed: 0.001 s - in org.eclipse.jnosql.artemis.reflection.DefaultInstanceProducerTest
[INFO] Running org.eclipse.jnosql.artemis.reflection.ReflectionFieldWriterFactoryTest
[INFO] Tests run: 2, Failures: 0, Errors: 0, Skipped: 0, Time elapsed: 0.002 s - in org.eclipse.jnosql.artemis.reflection.ReflectionFieldWriterFactoryTest
[INFO] Running org.eclipse.jnosql.artemis.reflection.JavaCompilerInstanceSupplierFactoryTest
[INFO] Tests run: 2, Failures: 0, Errors: 0, Skipped: 0, Time elapsed: 0.016 s - in org.eclipse.jnosql.artemis.reflection.JavaCompilerInstanceSupplierFactoryTest
[INFO] Running org.eclipse.jnosql.artemis.reflection.DynamicAsyncQueryMethodReturnTest
[INFO] Tests run: 2, Failures: 0, Errors: 0, Skipped: 0, Time elapsed: 0.026 s - in org.eclipse.jnosql.artemis.reflection.DynamicAsyncQueryMethodReturnTest
[INFO] Running org.eclipse.jnosql.artemis.reflection.DynamicQueryMethodReturnTest
[INFO] Tests run: 11, Failures: 0, Errors: 0, Skipped: 0, Time elapsed: 0.051 s - in org.eclipse.jnosql.artemis.reflection.DynamicQueryMethodReturnTest
[INFO] Running org.eclipse.jnosql.artemis.reflection.DynamicReturnTypeTest
[INFO] Tests run: 14, Failures: 0, Errors: 0, Skipped: 0, Time elapsed: 0.005 s - in org.eclipse.jnosql.artemis.reflection.DynamicReturnTypeTest
[INFO] Running org.eclipse.jnosql.artemis.reflection.PaginationDynamicExecutorQueryConverterTest
[INFO] Tests run: 10, Failures: 0, Errors: 0, Skipped: 0, Time elapsed: 0.066 s - in org.eclipse.jnosql.artemis.reflection.PaginationDynamicExecutorQueryConverterTest
[INFO] Running org.eclipse.jnosql.artemis.reflection.JavaCompilerFieldReaderFactoryTest
[INFO] Tests run: 3, Failures: 0, Errors: 0, Skipped: 0, Time elapsed: 0.333 s - in org.eclipse.jnosql.artemis.reflection.JavaCompilerFieldReaderFactoryTest
[INFO] Running org.eclipse.jnosql.artemis.reflection.ReflectionFieldReaderFactoryTest
[INFO] Tests run: 2, Failures: 0, Errors: 0, Skipped: 0, Time elapsed: 0.001 s - in org.eclipse.jnosql.artemis.reflection.ReflectionFieldReaderFactoryTest
[INFO] Running org.eclipse.jnosql.artemis.reflection.ReflectionInstanceSupplierFactoryTest
[INFO] Tests run: 2, Failures: 0, Errors: 0, Skipped: 0, Time elapsed: 0.001 s - in org.eclipse.jnosql.artemis.reflection.ReflectionInstanceSupplierFactoryTest
[INFO] Running org.eclipse.jnosql.artemis.reflection.ClassConverterTest
Nov 27, 2019 9:40:41 AM org.eclipse.jnosql.artemis.reflection.ClassConverter create
INFO: Scanned org.eclipse.jnosql.artemis.model.Person loaded with time 0 ms
Nov 27, 2019 9:40:41 AM org.eclipse.jnosql.artemis.reflection.ClassConverter create
INFO: Scanned org.eclipse.jnosql.artemis.model.User loaded with time 316 ms
Nov 27, 2019 9:40:41 AM org.eclipse.jnosql.artemis.reflection.ClassConverter create
INFO: Scanned org.eclipse.jnosql.artemis.model.Worker loaded with time 211 ms
Nov 27, 2019 9:40:41 AM org.eclipse.jnosql.artemis.reflection.ClassConverter create
INFO: Scanned org.eclipse.jnosql.artemis.model.Machine loaded with time 52 ms
Nov 27, 2019 9:40:41 AM org.eclipse.jnosql.artemis.reflection.ClassConverter create
INFO: Scanned org.eclipse.jnosql.artemis.model.Actor loaded with time 0 ms
Nov 27, 2019 9:40:41 AM org.eclipse.jnosql.artemis.reflection.ClassConverter create
INFO: Scanned org.eclipse.jnosql.artemis.model.Director loaded with time 1 ms
[INFO] Tests run: 7, Failures: 0, Errors: 0, Skipped: 0, Time elapsed: 0.591 s - in org.eclipse.jnosql.artemis.reflection.ClassConverterTest
[INFO] Running org.eclipse.jnosql.artemis.reflection.FieldTypeUtilTest
[INFO] Tests run: 6, Failures: 0, Errors: 0, Skipped: 0, Time elapsed: 0 s - in org.eclipse.jnosql.artemis.reflection.FieldTypeUtilTest
[INFO] Running org.eclipse.jnosql.artemis.reflection.JavaCompilerFacadeTest
[INFO] Tests run: 1, Failures: 0, Errors: 0, Skipped: 0, Time elapsed: 0.017 s - in org.eclipse.jnosql.artemis.reflection.JavaCompilerFacadeTest
[INFO] Running org.eclipse.jnosql.artemis.DefaultSortsTest
[INFO] Tests run: 6, Failures: 0, Errors: 0, Skipped: 0, Time elapsed: 0.003 s - in org.eclipse.jnosql.artemis.DefaultSortsTest
[INFO] Running org.eclipse.jnosql.artemis.configuration.SettingsConverterTest
[INFO] Tests run: 3, Failures: 0, Errors: 0, Skipped: 0, Time elapsed: 0.048 s - in org.eclipse.jnosql.artemis.configuration.SettingsConverterTest
[INFO] Running org.eclipse.jnosql.artemis.DefaultConvertersTest
[INFO] Tests run: 3, Failures: 0, Errors: 0, Skipped: 0, Time elapsed: 0.009 s - in org.eclipse.jnosql.artemis.DefaultConvertersTest
[INFO] Running org.eclipse.jnosql.artemis.DatabaseQualifierTest
[INFO] Tests run: 12, Failures: 0, Errors: 0, Skipped: 0, Time elapsed: 0.005 s - in org.eclipse.jnosql.artemis.DatabaseQualifierTest
[INFO] Running org.eclipse.jnosql.artemis.DatabaseMetadataTest
[INFO] Tests run: 4, Failures: 0, Errors: 0, Skipped: 0, Time elapsed: 0.021 s - in org.eclipse.jnosql.artemis.DatabaseMetadataTest
[INFO] Running org.eclipse.jnosql.artemis.util.BeanManagersTest
[INFO] Tests run: 5, Failures: 0, Errors: 0, Skipped: 0, Time elapsed: 0.01 s - in org.eclipse.jnosql.artemis.util.BeanManagersTest
[INFO] Running org.eclipse.jnosql.artemis.util.ConverterUtilTest
[INFO] Tests run: 3, Failures: 0, Errors: 0, Skipped: 0, Time elapsed: 0.031 s - in org.eclipse.jnosql.artemis.util.ConverterUtilTest
[INFO] Running org.eclipse.jnosql.artemis.query.RepositoryTypeTest
[INFO] Tests run: 14, Failures: 0, Errors: 0, Skipped: 0, Time elapsed: 0.005 s - in org.eclipse.jnosql.artemis.query.RepositoryTypeTest
Weld SE container fdc2e513-e871-426c-a0e6-073fea19f955 shut down by shutdown hook
[INFO] 
[INFO] Results:
[INFO] 
[INFO] Tests run: 191, Failures: 0, Errors: 0, Skipped: 0
[INFO] 
[INFO] 
[INFO] --- maven-jar-plugin:2.4:jar (default-jar) @ artemis-core ---
[INFO] Building jar: /home/jenkins/agent/workspace/jnosql-sonar/artemis/artemis-core/target/artemis-core-0.1.0-SNAPSHOT.jar
[INFO] 
[INFO] --- maven-javadoc-plugin:3.0.1:jar (attach-javadocs) @ artemis-core ---
[INFO] 
Loading source files for package org.eclipse.jnosql.artemis...
Loading source files for package org.eclipse.jnosql.artemis.configuration...
Loading source files for package org.eclipse.jnosql.artemis.query...
Loading source files for package org.eclipse.jnosql.artemis.reflection...
Loading source files for package org.eclipse.jnosql.artemis.spi...
Loading source files for package org.eclipse.jnosql.artemis.util...
Constructing Javadoc information...
Standard Doclet version 1.8.0_202
Building tree for all the packages and classes...
Generating /home/jenkins/agent/workspace/jnosql-sonar/artemis/artemis-core/target/apidocs/org/eclipse/jnosql/artemis/DatabaseMetadata.html...
Generating /home/jenkins/agent/workspace/jnosql-sonar/artemis/artemis-core/target/apidocs/org/eclipse/jnosql/artemis/DatabaseQualifier.html...
Generating /home/jenkins/agent/workspace/jnosql-sonar/artemis/artemis-core/target/apidocs/org/eclipse/jnosql/artemis/Databases.html...
Generating /home/jenkins/agent/workspace/jnosql-sonar/artemis/artemis-core/target/apidocs/org/eclipse/jnosql/artemis/DefaultEntityPostPersist.html...
Generating /home/jenkins/agent/workspace/jnosql-sonar/artemis/artemis-core/target/apidocs/org/eclipse/jnosql/artemis/DefaultEntityPrePersist.html...
Generating /home/jenkins/agent/workspace/jnosql-sonar/artemis/artemis-core/target/apidocs/org/eclipse/jnosql/artemis/DefaultPaginationBuilderProvider.html...
Generating /home/jenkins/agent/workspace/jnosql-sonar/artemis/artemis-core/target/apidocs/org/eclipse/jnosql/artemis/DefaultSortsProvider.html...
Generating /home/jenkins/agent/workspace/jnosql-sonar/artemis/artemis-core/target/apidocs/org/eclipse/jnosql/artemis/configuration/AbstractConfiguration.html...
Generating /home/jenkins/agent/workspace/jnosql-sonar/artemis/artemis-core/target/apidocs/org/eclipse/jnosql/artemis/configuration/ConfigurationException.html...
Generating /home/jenkins/agent/workspace/jnosql-sonar/artemis/artemis-core/target/apidocs/org/eclipse/jnosql/artemis/configuration/SettingsConverter.html...
Generating /home/jenkins/agent/workspace/jnosql-sonar/artemis/artemis-core/target/apidocs/org/eclipse/jnosql/artemis/query/RepositoryType.html...
Generating /home/jenkins/agent/workspace/jnosql-sonar/artemis/artemis-core/target/apidocs/org/eclipse/jnosql/artemis/reflection/ClassMappingExtension.html...
Generating /home/jenkins/agent/workspace/jnosql-sonar/artemis/artemis-core/target/apidocs/org/eclipse/jnosql/artemis/reflection/ConstructorException.html...
Generating /home/jenkins/agent/workspace/jnosql-sonar/artemis/artemis-core/target/apidocs/org/eclipse/jnosql/artemis/reflection/DefaultFieldMapping.html...
Generating /home/jenkins/agent/workspace/jnosql-sonar/artemis/artemis-core/target/apidocs/org/eclipse/jnosql/artemis/reflection/DefaultFieldValue.html...
Generating /home/jenkins/agent/workspace/jnosql-sonar/artemis/artemis-core/target/apidocs/org/eclipse/jnosql/artemis/reflection/DefaultReflections.html...
Generating /home/jenkins/agent/workspace/jnosql-sonar/artemis/artemis-core/target/apidocs/org/eclipse/jnosql/artemis/reflection/DynamicAsyncQueryMethodReturn.html...
Generating /home/jenkins/agent/workspace/jnosql-sonar/artemis/artemis-core/target/apidocs/org/eclipse/jnosql/artemis/reflection/DynamicAsyncQueryMethodReturn.DynamicAsyncQueryMethodReturnBuilder.html...
Generating /home/jenkins/agent/workspace/jnosql-sonar/artemis/artemis-core/target/apidocs/org/eclipse/jnosql/artemis/reflection/DynamicQueryMethodReturn.html...
Generating /home/jenkins/agent/workspace/jnosql-sonar/artemis/artemis-core/target/apidocs/org/eclipse/jnosql/artemis/reflection/DynamicQueryMethodReturn.DynamicQueryMethodReturnBuilder.html...
Generating /home/jenkins/agent/workspace/jnosql-sonar/artemis/artemis-core/target/apidocs/org/eclipse/jnosql/artemis/reflection/DynamicReturn.html...
Generating /home/jenkins/agent/workspace/jnosql-sonar/artemis/artemis-core/target/apidocs/org/eclipse/jnosql/artemis/reflection/DynamicReturn.DefaultDynamicReturnBuilder.html...
Generating /home/jenkins/agent/workspace/jnosql-sonar/artemis/artemis-core/target/apidocs/org/eclipse/jnosql/artemis/reflection/EmbeddedFieldMapping.html...
Generating /home/jenkins/agent/workspace/jnosql-sonar/artemis/artemis-core/target/apidocs/org/eclipse/jnosql/artemis/reflection/FieldTypeUtil.html...
Generating /home/jenkins/agent/workspace/jnosql-sonar/artemis/artemis-core/target/apidocs/org/eclipse/jnosql/artemis/reflection/GenericFieldMapping.html...
Generating /home/jenkins/agent/workspace/jnosql-sonar/artemis/artemis-core/target/apidocs/org/eclipse/jnosql/artemis/reflection/RepositoryReflectionUtils.html...
Generating /home/jenkins/agent/workspace/jnosql-sonar/artemis/artemis-core/target/apidocs/org/eclipse/jnosql/artemis/spi/AbstractBean.html...
Generating /home/jenkins/agent/workspace/jnosql-sonar/artemis/artemis-core/target/apidocs/org/eclipse/jnosql/artemis/util/AnnotationLiteralUtil.html...
Generating /home/jenkins/agent/workspace/jnosql-sonar/artemis/artemis-core/target/apidocs/org/eclipse/jnosql/artemis/util/BeanManagers.html...
Generating /home/jenkins/agent/workspace/jnosql-sonar/artemis/artemis-core/target/apidocs/org/eclipse/jnosql/artemis/util/ConverterUtil.html...
Generating /home/jenkins/agent/workspace/jnosql-sonar/artemis/artemis-core/target/apidocs/org/eclipse/jnosql/artemis/util/ParamsBinder.html...
Generating /home/jenkins/agent/workspace/jnosql-sonar/artemis/artemis-core/target/apidocs/org/eclipse/jnosql/artemis/util/StringUtils.html...
Generating /home/jenkins/agent/workspace/jnosql-sonar/artemis/artemis-core/target/apidocs/overview-frame.html...
Generating /home/jenkins/agent/workspace/jnosql-sonar/artemis/artemis-core/target/apidocs/org/eclipse/jnosql/artemis/package-frame.html...
Generating /home/jenkins/agent/workspace/jnosql-sonar/artemis/artemis-core/target/apidocs/org/eclipse/jnosql/artemis/package-summary.html...
Generating /home/jenkins/agent/workspace/jnosql-sonar/artemis/artemis-core/target/apidocs/org/eclipse/jnosql/artemis/package-tree.html...
Generating /home/jenkins/agent/workspace/jnosql-sonar/artemis/artemis-core/target/apidocs/org/eclipse/jnosql/artemis/configuration/package-frame.html...
Generating /home/jenkins/agent/workspace/jnosql-sonar/artemis/artemis-core/target/apidocs/org/eclipse/jnosql/artemis/configuration/package-summary.html...
Generating /home/jenkins/agent/workspace/jnosql-sonar/artemis/artemis-core/target/apidocs/org/eclipse/jnosql/artemis/configuration/package-tree.html...
Generating /home/jenkins/agent/workspace/jnosql-sonar/artemis/artemis-core/target/apidocs/org/eclipse/jnosql/artemis/query/package-frame.html...
Generating /home/jenkins/agent/workspace/jnosql-sonar/artemis/artemis-core/target/apidocs/org/eclipse/jnosql/artemis/query/package-summary.html...
Generating /home/jenkins/agent/workspace/jnosql-sonar/artemis/artemis-core/target/apidocs/org/eclipse/jnosql/artemis/query/package-tree.html...
Generating /home/jenkins/agent/workspace/jnosql-sonar/artemis/artemis-core/target/apidocs/org/eclipse/jnosql/artemis/reflection/package-frame.html...
Generating /home/jenkins/agent/workspace/jnosql-sonar/artemis/artemis-core/target/apidocs/org/eclipse/jnosql/artemis/reflection/package-summary.html...
Generating /home/jenkins/agent/workspace/jnosql-sonar/artemis/artemis-core/target/apidocs/org/eclipse/jnosql/artemis/reflection/package-tree.html...
Generating /home/jenkins/agent/workspace/jnosql-sonar/artemis/artemis-core/target/apidocs/org/eclipse/jnosql/artemis/spi/package-frame.html...
Generating /home/jenkins/agent/workspace/jnosql-sonar/artemis/artemis-core/target/apidocs/org/eclipse/jnosql/artemis/spi/package-summary.html...
Generating /home/jenkins/agent/workspace/jnosql-sonar/artemis/artemis-core/target/apidocs/org/eclipse/jnosql/artemis/spi/package-tree.html...
Generating /home/jenkins/agent/workspace/jnosql-sonar/artemis/artemis-core/target/apidocs/org/eclipse/jnosql/artemis/util/package-frame.html...
Generating /home/jenkins/agent/workspace/jnosql-sonar/artemis/artemis-core/target/apidocs/org/eclipse/jnosql/artemis/util/package-summary.html...
Generating /home/jenkins/agent/workspace/jnosql-sonar/artemis/artemis-core/target/apidocs/org/eclipse/jnosql/artemis/util/package-tree.html...
Generating /home/jenkins/agent/workspace/jnosql-sonar/artemis/artemis-core/target/apidocs/constant-values.html...
Generating /home/jenkins/agent/workspace/jnosql-sonar/artemis/artemis-core/target/apidocs/serialized-form.html...
Generating /home/jenkins/agent/workspace/jnosql-sonar/artemis/artemis-core/target/apidocs/org/eclipse/jnosql/artemis/class-use/DefaultSortsProvider.html...
Generating /home/jenkins/agent/workspace/jnosql-sonar/artemis/artemis-core/target/apidocs/org/eclipse/jnosql/artemis/class-use/DefaultPaginationBuilderProvider.html...
Generating /home/jenkins/agent/workspace/jnosql-sonar/artemis/artemis-core/target/apidocs/org/eclipse/jnosql/artemis/class-use/DefaultEntityPrePersist.html...
Generating /home/jenkins/agent/workspace/jnosql-sonar/artemis/artemis-core/target/apidocs/org/eclipse/jnosql/artemis/class-use/DefaultEntityPostPersist.html...
Generating /home/jenkins/agent/workspace/jnosql-sonar/artemis/artemis-core/target/apidocs/org/eclipse/jnosql/artemis/class-use/Databases.html...
Generating /home/jenkins/agent/workspace/jnosql-sonar/artemis/artemis-core/target/apidocs/org/eclipse/jnosql/artemis/class-use/DatabaseQualifier.html...
Generating /home/jenkins/agent/workspace/jnosql-sonar/artemis/artemis-core/target/apidocs/org/eclipse/jnosql/artemis/class-use/DatabaseMetadata.html...
Generating /home/jenkins/agent/workspace/jnosql-sonar/artemis/artemis-core/target/apidocs/org/eclipse/jnosql/artemis/configuration/class-use/SettingsConverter.html...
Generating /home/jenkins/agent/workspace/jnosql-sonar/artemis/artemis-core/target/apidocs/org/eclipse/jnosql/artemis/configuration/class-use/ConfigurationException.html...
Generating /home/jenkins/agent/workspace/jnosql-sonar/artemis/artemis-core/target/apidocs/org/eclipse/jnosql/artemis/configuration/class-use/AbstractConfiguration.html...
Generating /home/jenkins/agent/workspace/jnosql-sonar/artemis/artemis-core/target/apidocs/org/eclipse/jnosql/artemis/query/class-use/RepositoryType.html...
Generating /home/jenkins/agent/workspace/jnosql-sonar/artemis/artemis-core/target/apidocs/org/eclipse/jnosql/artemis/reflection/class-use/RepositoryReflectionUtils.html...
Generating /home/jenkins/agent/workspace/jnosql-sonar/artemis/artemis-core/target/apidocs/org/eclipse/jnosql/artemis/reflection/class-use/GenericFieldMapping.html...
Generating /home/jenkins/agent/workspace/jnosql-sonar/artemis/artemis-core/target/apidocs/org/eclipse/jnosql/artemis/reflection/class-use/FieldTypeUtil.html...
Generating /home/jenkins/agent/workspace/jnosql-sonar/artemis/artemis-core/target/apidocs/org/eclipse/jnosql/artemis/reflection/class-use/EmbeddedFieldMapping.html...
Generating /home/jenkins/agent/workspace/jnosql-sonar/artemis/artemis-core/target/apidocs/org/eclipse/jnosql/artemis/reflection/class-use/DynamicReturn.html...
Generating /home/jenkins/agent/workspace/jnosql-sonar/artemis/artemis-core/target/apidocs/org/eclipse/jnosql/artemis/reflection/class-use/DynamicReturn.DefaultDynamicReturnBuilder.html...
Generating /home/jenkins/agent/workspace/jnosql-sonar/artemis/artemis-core/target/apidocs/org/eclipse/jnosql/artemis/reflection/class-use/DynamicQueryMethodReturn.html...
Generating /home/jenkins/agent/workspace/jnosql-sonar/artemis/artemis-core/target/apidocs/org/eclipse/jnosql/artemis/reflection/class-use/DynamicQueryMethodReturn.DynamicQueryMethodReturnBuilder.html...
Generating /home/jenkins/agent/workspace/jnosql-sonar/artemis/artemis-core/target/apidocs/org/eclipse/jnosql/artemis/reflection/class-use/DynamicAsyncQueryMethodReturn.html...
Generating /home/jenkins/agent/workspace/jnosql-sonar/artemis/artemis-core/target/apidocs/org/eclipse/jnosql/artemis/reflection/class-use/DynamicAsyncQueryMethodReturn.DynamicAsyncQueryMethodReturnBuilder.html...
Generating /home/jenkins/agent/workspace/jnosql-sonar/artemis/artemis-core/target/apidocs/org/eclipse/jnosql/artemis/reflection/class-use/DefaultReflections.html...
Generating /home/jenkins/agent/workspace/jnosql-sonar/artemis/artemis-core/target/apidocs/org/eclipse/jnosql/artemis/reflection/class-use/DefaultFieldValue.html...
Generating /home/jenkins/agent/workspace/jnosql-sonar/artemis/artemis-core/target/apidocs/org/eclipse/jnosql/artemis/reflection/class-use/DefaultFieldMapping.html...
Generating /home/jenkins/agent/workspace/jnosql-sonar/artemis/artemis-core/target/apidocs/org/eclipse/jnosql/artemis/reflection/class-use/ConstructorException.html...
Generating /home/jenkins/agent/workspace/jnosql-sonar/artemis/artemis-core/target/apidocs/org/eclipse/jnosql/artemis/reflection/class-use/ClassMappingExtension.html...
Generating /home/jenkins/agent/workspace/jnosql-sonar/artemis/artemis-core/target/apidocs/org/eclipse/jnosql/artemis/spi/class-use/AbstractBean.html...
Generating /home/jenkins/agent/workspace/jnosql-sonar/artemis/artemis-core/target/apidocs/org/eclipse/jnosql/artemis/util/class-use/StringUtils.html...
Generating /home/jenkins/agent/workspace/jnosql-sonar/artemis/artemis-core/target/apidocs/org/eclipse/jnosql/artemis/util/class-use/ParamsBinder.html...
Generating /home/jenkins/agent/workspace/jnosql-sonar/artemis/artemis-core/target/apidocs/org/eclipse/jnosql/artemis/util/class-use/ConverterUtil.html...
Generating /home/jenkins/agent/workspace/jnosql-sonar/artemis/artemis-core/target/apidocs/org/eclipse/jnosql/artemis/util/class-use/BeanManagers.html...
Generating /home/jenkins/agent/workspace/jnosql-sonar/artemis/artemis-core/target/apidocs/org/eclipse/jnosql/artemis/util/class-use/AnnotationLiteralUtil.html...
Generating /home/jenkins/agent/workspace/jnosql-sonar/artemis/artemis-core/target/apidocs/org/eclipse/jnosql/artemis/package-use.html...
Generating /home/jenkins/agent/workspace/jnosql-sonar/artemis/artemis-core/target/apidocs/org/eclipse/jnosql/artemis/configuration/package-use.html...
Generating /home/jenkins/agent/workspace/jnosql-sonar/artemis/artemis-core/target/apidocs/org/eclipse/jnosql/artemis/query/package-use.html...
Generating /home/jenkins/agent/workspace/jnosql-sonar/artemis/artemis-core/target/apidocs/org/eclipse/jnosql/artemis/reflection/package-use.html...
Generating /home/jenkins/agent/workspace/jnosql-sonar/artemis/artemis-core/target/apidocs/org/eclipse/jnosql/artemis/spi/package-use.html...
Generating /home/jenkins/agent/workspace/jnosql-sonar/artemis/artemis-core/target/apidocs/org/eclipse/jnosql/artemis/util/package-use.html...
Building index for all the packages and classes...
Generating /home/jenkins/agent/workspace/jnosql-sonar/artemis/artemis-core/target/apidocs/overview-tree.html...
Generating /home/jenkins/agent/workspace/jnosql-sonar/artemis/artemis-core/target/apidocs/index-all.html...
Generating /home/jenkins/agent/workspace/jnosql-sonar/artemis/artemis-core/target/apidocs/deprecated-list.html...
Building index for all classes...
Generating /home/jenkins/agent/workspace/jnosql-sonar/artemis/artemis-core/target/apidocs/allclasses-frame.html...
Generating /home/jenkins/agent/workspace/jnosql-sonar/artemis/artemis-core/target/apidocs/allclasses-noframe.html...
Generating /home/jenkins/agent/workspace/jnosql-sonar/artemis/artemis-core/target/apidocs/index.html...
Generating /home/jenkins/agent/workspace/jnosql-sonar/artemis/artemis-core/target/apidocs/overview-summary.html...
Generating /home/jenkins/agent/workspace/jnosql-sonar/artemis/artemis-core/target/apidocs/help-doc.html...
[WARNING] Javadoc Warnings
[WARNING] Picked up JAVA_TOOL_OPTIONS: -XX:+IgnoreUnrecognizedVMOptions -XX:+UseContainerSupport -XX:+UnlockExperimentalVMOptions -XX:+UseCGroupMemoryLimitForHeap
[WARNING] Picked up _JAVA_OPTIONS: -XX:MaxRAMPercentage=64.0
[INFO] Building jar: /home/jenkins/agent/workspace/jnosql-sonar/artemis/artemis-core/target/artemis-core-0.1.0-SNAPSHOT-javadoc.jar
[INFO] 
[INFO] >>> maven-source-plugin:3.0.1:jar (attach-sources) > generate-sources @ artemis-core >>>
[INFO] 
[INFO] --- apache-rat-plugin:0.12:check (default) @ artemis-core ---
[INFO] Added 1 additional default licenses.
[INFO] Enabled default license matchers.
[INFO] Added 1 custom approved licenses.
[INFO] Will parse SCM ignores for exclusions...
[INFO] Parsing exclusions from /home/jenkins/agent/workspace/jnosql-sonar/artemis/artemis-core/.gitignore
[INFO] Finished adding exclusions from SCM ignore files.
[INFO] 73 implicit excludes (use -debug for more details).
[INFO] No excludes explicitly specified.
[INFO] 130 resources included (use -debug for more details)
[INFO] Rat check: Summary over all files. Unapproved: 0, unknown: 0, generated: 0, approved: 130 licenses.
[INFO] 
[INFO] --- jacoco-maven-plugin:0.7.9:prepare-agent (pre-test) @ artemis-core ---
[INFO] argLine set to -javaagent:/home/jenkins/.m2/repository/org/jacoco/org.jacoco.agent/0.7.9/org.jacoco.agent-0.7.9-runtime.jar=destfile=/home/jenkins/agent/workspace/jnosql-sonar/artemis/target/jacoco.exec,append=true
[INFO] 
[INFO] <<< maven-source-plugin:3.0.1:jar (attach-sources) < generate-sources @ artemis-core <<<
[INFO] 
[INFO] 
[INFO] --- maven-source-plugin:3.0.1:jar (attach-sources) @ artemis-core ---
[INFO] Building jar: /home/jenkins/agent/workspace/jnosql-sonar/artemis/artemis-core/target/artemis-core-0.1.0-SNAPSHOT-sources.jar
[INFO] 
[INFO] --- maven-install-plugin:2.4:install (default-install) @ artemis-core ---
[INFO] Installing /home/jenkins/agent/workspace/jnosql-sonar/artemis/artemis-core/target/artemis-core-0.1.0-SNAPSHOT.jar to /home/jenkins/.m2/repository/org/eclipse/jnosql/artemis/artemis-core/0.1.0-SNAPSHOT/artemis-core-0.1.0-SNAPSHOT.jar
[INFO] Installing /home/jenkins/agent/workspace/jnosql-sonar/artemis/artemis-core/pom.xml to /home/jenkins/.m2/repository/org/eclipse/jnosql/artemis/artemis-core/0.1.0-SNAPSHOT/artemis-core-0.1.0-SNAPSHOT.pom
[INFO] Installing /home/jenkins/agent/workspace/jnosql-sonar/artemis/artemis-core/target/artemis-core-0.1.0-SNAPSHOT-javadoc.jar to /home/jenkins/.m2/repository/org/eclipse/jnosql/artemis/artemis-core/0.1.0-SNAPSHOT/artemis-core-0.1.0-SNAPSHOT-javadoc.jar
[INFO] Installing /home/jenkins/agent/workspace/jnosql-sonar/artemis/artemis-core/target/artemis-core-0.1.0-SNAPSHOT-sources.jar to /home/jenkins/.m2/repository/org/eclipse/jnosql/artemis/artemis-core/0.1.0-SNAPSHOT/artemis-core-0.1.0-SNAPSHOT-sources.jar
[INFO] 
[INFO] --------------< org.eclipse.jnosql.artemis:artemis-graph >--------------
[INFO] Building artemis-graph 0.1.0-SNAPSHOT                            [10/14]
[INFO] --------------------------------[ jar ]---------------------------------
[INFO] 
[INFO] --- maven-clean-plugin:2.5:clean (default-clean) @ artemis-graph ---
[INFO] 
[INFO] --- apache-rat-plugin:0.12:check (default) @ artemis-graph ---
[INFO] Added 1 additional default licenses.
[INFO] Enabled default license matchers.
[INFO] Added 1 custom approved licenses.
[INFO] Will parse SCM ignores for exclusions...
[INFO] Finished adding exclusions from SCM ignore files.
[INFO] 61 implicit excludes (use -debug for more details).
[INFO] No excludes explicitly specified.
[INFO] 140 resources included (use -debug for more details)
[INFO] Rat check: Summary over all files. Unapproved: 0, unknown: 0, generated: 0, approved: 140 licenses.
[INFO] 
[INFO] --- jacoco-maven-plugin:0.7.9:prepare-agent (pre-test) @ artemis-graph ---
[INFO] argLine set to -javaagent:/home/jenkins/.m2/repository/org/jacoco/org.jacoco.agent/0.7.9/org.jacoco.agent-0.7.9-runtime.jar=destfile=/home/jenkins/agent/workspace/jnosql-sonar/artemis/target/jacoco.exec,append=true
[INFO] 
[INFO] --- maven-resources-plugin:2.6:resources (default-resources) @ artemis-graph ---
[INFO] Using 'UTF-8' encoding to copy filtered resources.
[INFO] Copying 3 resources
[INFO] 
[INFO] --- maven-compiler-plugin:3.8.0:compile (default-compile) @ artemis-graph ---
[INFO] Changes detected - recompiling the module!
[INFO] Compiling 81 source files to /home/jenkins/agent/workspace/jnosql-sonar/artemis/artemis-graph/target/classes
[INFO] /home/jenkins/agent/workspace/jnosql-sonar/artemis/artemis-graph/src/main/java/org/eclipse/jnosql/artemis/graph/DefaultEdgeTraversal.java: Some input files use or override a deprecated API.
[INFO] /home/jenkins/agent/workspace/jnosql-sonar/artemis/artemis-graph/src/main/java/org/eclipse/jnosql/artemis/graph/DefaultEdgeTraversal.java: Recompile with -Xlint:deprecation for details.
[INFO] /home/jenkins/agent/workspace/jnosql-sonar/artemis/artemis-graph/src/main/java/org/eclipse/jnosql/artemis/graph/GremlinExecutor.java: Some input files use unchecked or unsafe operations.
[INFO] /home/jenkins/agent/workspace/jnosql-sonar/artemis/artemis-graph/src/main/java/org/eclipse/jnosql/artemis/graph/GremlinExecutor.java: Recompile with -Xlint:unchecked for details.
[INFO] 
[INFO] --- maven-checkstyle-plugin:3.0.0:check (verify-style) @ artemis-graph ---
[INFO] Starting audit...
Audit done.
[INFO] 
[INFO] --- maven-resources-plugin:2.6:testResources (default-testResources) @ artemis-graph ---
[INFO] Using 'UTF-8' encoding to copy filtered resources.
[INFO] Copying 2 resources
[INFO] 
[INFO] --- maven-compiler-plugin:3.8.0:testCompile (default-testCompile) @ artemis-graph ---
[INFO] Changes detected - recompiling the module!
[INFO] Compiling 56 source files to /home/jenkins/agent/workspace/jnosql-sonar/artemis/artemis-graph/target/test-classes
[INFO] /home/jenkins/agent/workspace/jnosql-sonar/artemis/artemis-graph/src/test/java/org/eclipse/jnosql/artemis/graph/query/GraphRepositoryProxyPaginationTest.java: Some input files use unchecked or unsafe operations.
[INFO] /home/jenkins/agent/workspace/jnosql-sonar/artemis/artemis-graph/src/test/java/org/eclipse/jnosql/artemis/graph/query/GraphRepositoryProxyPaginationTest.java: Recompile with -Xlint:unchecked for details.
[INFO] 
[INFO] --- maven-surefire-plugin:2.22.1:test (default-test) @ artemis-graph ---
[INFO] 
[INFO] -------------------------------------------------------
[INFO]  T E S T S
[INFO] -------------------------------------------------------
[INFO] Running org.eclipse.jnosql.artemis.graph.DefaultGraphEventPersistManagerTest
[INFO] Tests run: 6, Failures: 0, Errors: 0, Skipped: 0, Time elapsed: 0.888 s - in org.eclipse.jnosql.artemis.graph.DefaultGraphEventPersistManagerTest
Nov 27, 2019 9:40:59 AM org.jboss.weld.bootstrap.WeldStartup <clinit>
INFO: WELD-000900: 3.1.2 (Final)
Nov 27, 2019 9:40:59 AM org.eclipse.jnosql.artemis.reflection.ClassOperationFactory get
INFO: Logging the operation factory
Nov 27, 2019 9:40:59 AM org.eclipse.jnosql.artemis.reflection.ClassOperationFactory get
INFO: ClassOperation does not found, using the default implementation
Nov 27, 2019 9:40:59 AM org.jboss.weld.bootstrap.WeldStartup startContainer
INFO: WELD-000101: Transactional services not available. Injection of @Inject UserTransaction not available. Transactional observers will be invoked synchronously.
Nov 27, 2019 9:40:59 AM org.jboss.weld.event.ExtensionObserverMethodImpl checkRequiredTypeAnnotations
INFO: WELD-000411: Observer method [BackedAnnotatedMethod] public org.eclipse.jnosql.artemis.reflection.ClassMappingExtension.initializePropertyLoading(@Observes ProcessAnnotatedType<T>) receives events for all annotated types. Consider restricting events using @WithAnnotations or a generic type with bounds.
Nov 27, 2019 9:40:59 AM org.eclipse.jnosql.artemis.graph.spi.GraphProducerExtension observes
INFO: Adding a new Repository as discovered on Graph: interface org.eclipse.jnosql.artemis.graph.query.GraphRepositoryProxySortTest$PersonRepository
Nov 27, 2019 9:40:59 AM org.eclipse.jnosql.artemis.graph.spi.GraphProducerExtension observes
INFO: Adding a new Repository as discovered on Graph: interface org.eclipse.jnosql.artemis.graph.query.GraphRepositoryProxyTest$VendorRepository
Nov 27, 2019 9:40:59 AM org.eclipse.jnosql.artemis.reflection.ClassConverter create
INFO: Scanned org.eclipse.jnosql.artemis.graph.model.Movie loaded with time 11 ms
Nov 27, 2019 9:41:01 AM org.eclipse.jnosql.artemis.reflection.ClassConverter create
INFO: Scanned org.eclipse.jnosql.artemis.graph.model.Job loaded with time 1576 ms
Nov 27, 2019 9:41:02 AM org.eclipse.jnosql.artemis.reflection.ClassConverter create
INFO: Scanned org.eclipse.jnosql.artemis.graph.model.Worker loaded with time 881 ms
Nov 27, 2019 9:41:02 AM org.eclipse.jnosql.artemis.reflection.ClassConverter create
INFO: Scanned org.eclipse.jnosql.artemis.graph.model.Animal loaded with time 2 ms
Nov 27, 2019 9:41:02 AM org.eclipse.jnosql.artemis.graph.spi.GraphProducerExtension observes
INFO: Adding a new Repository as discovered on Graph: interface org.eclipse.jnosql.artemis.graph.BookRepository
Nov 27, 2019 9:41:02 AM org.eclipse.jnosql.artemis.reflection.ClassConverter create
INFO: Scanned org.eclipse.jnosql.artemis.graph.model.Director loaded with time 2 ms
Nov 27, 2019 9:41:02 AM org.eclipse.jnosql.artemis.graph.spi.GraphProducerExtension observes
INFO: Adding a new Repository as discovered on Graph: interface org.eclipse.jnosql.artemis.graph.query.DeleteQueryConverterTest$PersonRepository
Nov 27, 2019 9:41:02 AM org.eclipse.jnosql.artemis.reflection.ClassConverter create
INFO: Scanned org.eclipse.jnosql.artemis.graph.model.Vendor loaded with time 307 ms
Nov 27, 2019 9:41:02 AM org.eclipse.jnosql.artemis.reflection.ClassConverter create
INFO: Scanned org.eclipse.jnosql.artemis.graph.model.Actor loaded with time 1 ms
Nov 27, 2019 9:41:02 AM org.eclipse.jnosql.artemis.graph.spi.GraphProducerExtension observes
INFO: Adding a new Repository as discovered on Graph: interface org.eclipse.jnosql.artemis.graph.query.GraphRepositoryProxyPaginationTest$PersonRepository
Nov 27, 2019 9:41:02 AM org.eclipse.jnosql.artemis.reflection.ClassConverter create
INFO: Scanned org.eclipse.jnosql.artemis.graph.model.Person loaded with time 1 ms
Nov 27, 2019 9:41:02 AM org.eclipse.jnosql.artemis.graph.spi.GraphProducerExtension observes
INFO: Adding a new Repository as discovered on Graph: interface org.eclipse.jnosql.artemis.graph.query.GraphRepositoryProxyTest$PersonRepository
Nov 27, 2019 9:41:02 AM org.eclipse.jnosql.artemis.reflection.ClassConverter create
INFO: Scanned org.eclipse.jnosql.artemis.graph.model.Book loaded with time 0 ms
Nov 27, 2019 9:41:02 AM org.eclipse.jnosql.artemis.graph.spi.GraphProducerExtension observes
INFO: Adding a new Repository as discovered on Graph: interface org.eclipse.jnosql.artemis.graph.query.SelectQueryConverterTest$PersonRepository
Nov 27, 2019 9:41:02 AM org.jboss.weld.util.Beans omitIllegalBeanTypes
INFO: WELD-001125: Illegal bean type java.util.function.Function<java.lang.reflect.Constructor<?>, jakarta.nosql.mapping.reflection.InstanceSupplier> ignored on [EnhancedAnnotatedTypeImpl]  class org.eclipse.jnosql.artemis.reflection.ReflectionInstanceSupplierFactory
Nov 27, 2019 9:41:02 AM org.eclipse.jnosql.artemis.Databases addDatabase
INFO: Found the type GRAPH to databases []
Nov 27, 2019 9:41:02 AM org.eclipse.jnosql.artemis.Databases addDatabase
INFO: Found the type GRAPH to databases []
Nov 27, 2019 9:41:03 AM org.eclipse.jnosql.artemis.graph.spi.GraphProducerExtension onAfterBeanDiscovery
INFO: Starting to process on graphs: 1 databases crud 7
Nov 27, 2019 9:41:03 AM org.jboss.weld.environment.se.WeldContainer fireContainerInitializedEvent
INFO: WELD-ENV-002003: Weld SE container 3c99dbde-a277-429c-9cdc-8041c239e68b initialized
[INFO] Running org.eclipse.jnosql.artemis.graph.query.GraphRepositoryProxyPaginationTest
Nov 27, 2019 9:41:03 AM org.eclipse.jnosql.artemis.graph.cdi.GraphProducer init
INFO: Starting Graph database at directory: /home/jenkins/agent/workspace/jnosql-sonar/artemis/artemis-graph/target/jnosql-graph/1574847663342/
Nov 27, 2019 9:41:07 AM org.eclipse.jnosql.artemis.graph.cdi.GraphProducer init
INFO: Graph database created
[INFO] Tests run: 5, Failures: 0, Errors: 0, Skipped: 0, Time elapsed: 4.933 s - in org.eclipse.jnosql.artemis.graph.query.GraphRepositoryProxyPaginationTest
[INFO] Running org.eclipse.jnosql.artemis.graph.query.SelectQueryConverterTest
[INFO] Tests run: 13, Failures: 0, Errors: 0, Skipped: 0, Time elapsed: 0.187 s - in org.eclipse.jnosql.artemis.graph.query.SelectQueryConverterTest
[INFO] Running org.eclipse.jnosql.artemis.graph.query.DeleteQueryConverterTest
[INFO] Tests run: 10, Failures: 0, Errors: 0, Skipped: 0, Time elapsed: 0.07 s - in org.eclipse.jnosql.artemis.graph.query.DeleteQueryConverterTest
[INFO] Running org.eclipse.jnosql.artemis.graph.query.GraphRepositoryProxySortTest
[INFO] Tests run: 6, Failures: 0, Errors: 0, Skipped: 0, Time elapsed: 0.035 s - in org.eclipse.jnosql.artemis.graph.query.GraphRepositoryProxySortTest
[INFO] Running org.eclipse.jnosql.artemis.graph.query.DefaultGraphRepositoryProducerTest
[INFO] Tests run: 1, Failures: 0, Errors: 0, Skipped: 0, Time elapsed: 0.075 s - in org.eclipse.jnosql.artemis.graph.query.DefaultGraphRepositoryProducerTest
[INFO] Running org.eclipse.jnosql.artemis.graph.query.GraphRepositoryProxyTest
[INFO] Tests run: 22, Failures: 0, Errors: 0, Skipped: 0, Time elapsed: 0.175 s - in org.eclipse.jnosql.artemis.graph.query.GraphRepositoryProxyTest
[INFO] Running org.eclipse.jnosql.artemis.graph.DefaultPropertyTest
[INFO] Tests run: 6, Failures: 0, Errors: 0, Skipped: 0, Time elapsed: 0 s - in org.eclipse.jnosql.artemis.graph.DefaultPropertyTest
[INFO] Running org.eclipse.jnosql.artemis.graph.configuration.GraphConverterTest
[INFO] Tests run: 3, Failures: 0, Errors: 0, Skipped: 0, Time elapsed: 0.005 s - in org.eclipse.jnosql.artemis.graph.configuration.GraphConverterTest
[INFO] Running org.eclipse.jnosql.artemis.graph.configuration.GraphTemplateConverterTest
[INFO] Tests run: 1, Failures: 0, Errors: 0, Skipped: 0, Time elapsed: 0.001 s - in org.eclipse.jnosql.artemis.graph.configuration.GraphTemplateConverterTest
[INFO] Running org.eclipse.jnosql.artemis.graph.configuration.GraphIntegrationTest
[INFO] Tests run: 2, Failures: 0, Errors: 0, Skipped: 0, Time elapsed: 0.005 s - in org.eclipse.jnosql.artemis.graph.configuration.GraphIntegrationTest
[INFO] Running org.eclipse.jnosql.artemis.graph.DefaultGraphTraversalSourceTemplateTest
Nov 27, 2019 9:41:12 AM org.eclipse.jnosql.artemis.reflection.ClassOperationFactory get
INFO: Logging the operation factory
Nov 27, 2019 9:41:12 AM org.eclipse.jnosql.artemis.reflection.ClassOperationFactory get
INFO: ClassOperation does not found, using the default implementation
Nov 27, 2019 9:41:12 AM org.eclipse.jnosql.artemis.reflection.ClassConverter create
INFO: Scanned org.eclipse.jnosql.artemis.graph.model.WrongEntity loaded with time 1 ms
[INFO] Tests run: 39, Failures: 0, Errors: 0, Skipped: 0, Time elapsed: 4.166 s - in org.eclipse.jnosql.artemis.graph.DefaultGraphTraversalSourceTemplateTest
[INFO] Running org.eclipse.jnosql.artemis.graph.DefaultGraphWorkflowTest
[INFO] Tests run: 3, Failures: 0, Errors: 0, Skipped: 0, Time elapsed: 0.04 s - in org.eclipse.jnosql.artemis.graph.DefaultGraphWorkflowTest
[INFO] Running org.eclipse.jnosql.artemis.graph.DefaultValueMapTraversalTest
[INFO] Tests run: 7, Failures: 0, Errors: 0, Skipped: 0, Time elapsed: 1.784 s - in org.eclipse.jnosql.artemis.graph.DefaultValueMapTraversalTest
[INFO] Running org.eclipse.jnosql.artemis.graph.spi.GraphConfigurationProducerExtensionTest
[INFO] Tests run: 3, Failures: 0, Errors: 0, Skipped: 0, Time elapsed: 0.036 s - in org.eclipse.jnosql.artemis.graph.spi.GraphConfigurationProducerExtensionTest
[INFO] Running org.eclipse.jnosql.artemis.graph.DefaultGraphConverterTest
[INFO] Tests run: 18, Failures: 0, Errors: 0, Skipped: 0, Time elapsed: 0.255 s - in org.eclipse.jnosql.artemis.graph.DefaultGraphConverterTest
[INFO] Running org.eclipse.jnosql.artemis.graph.DefaultEntityTreeTest
[ERROR] Tests run: 7, Failures: 1, Errors: 0, Skipped: 0, Time elapsed: 1.613 s <<< FAILURE! - in org.eclipse.jnosql.artemis.graph.DefaultEntityTreeTest
[ERROR] shouldGetParentId  Time elapsed: 0.211 s  <<< FAILURE!
org.opentest4j.AssertionFailedError: array contents differ at index [0], expected: <Animal{name='zebra'}> but was: <Animal{name='giraffe'}>
	at org.eclipse.jnosql.artemis.graph.DefaultEntityTreeTest.shouldGetParentId(DefaultEntityTreeTest.java:147)

[INFO] Running org.eclipse.jnosql.artemis.graph.GraphTransactionUtilTest
[INFO] Tests run: 2, Failures: 0, Errors: 0, Skipped: 0, Time elapsed: 0 s - in org.eclipse.jnosql.artemis.graph.GraphTransactionUtilTest
[INFO] Running org.eclipse.jnosql.artemis.graph.GremlinExecutorTest
[INFO] Tests run: 14, Failures: 0, Errors: 0, Skipped: 0, Time elapsed: 0.202 s - in org.eclipse.jnosql.artemis.graph.GremlinExecutorTest
[INFO] Running org.eclipse.jnosql.artemis.graph.DefaultGraphTraversalSourceConverterTest
[INFO] Tests run: 18, Failures: 0, Errors: 0, Skipped: 0, Time elapsed: 0.061 s - in org.eclipse.jnosql.artemis.graph.DefaultGraphTraversalSourceConverterTest
[INFO] Running org.eclipse.jnosql.artemis.graph.DefaultVertexTraversalTest
[INFO] Tests run: 54, Failures: 0, Errors: 0, Skipped: 0, Time elapsed: 13.321 s - in org.eclipse.jnosql.artemis.graph.DefaultVertexTraversalTest
[INFO] Running org.eclipse.jnosql.artemis.graph.DefaultEdgeTraversalTest
[INFO] Tests run: 45, Failures: 0, Errors: 0, Skipped: 0, Time elapsed: 12.463 s - in org.eclipse.jnosql.artemis.graph.DefaultEdgeTraversalTest
[INFO] Running org.eclipse.jnosql.artemis.graph.DefaultGraphTemplateProducerTest
[INFO] Tests run: 3, Failures: 0, Errors: 0, Skipped: 0, Time elapsed: 0.018 s - in org.eclipse.jnosql.artemis.graph.DefaultGraphTemplateProducerTest
[INFO] Running org.eclipse.jnosql.artemis.graph.EdgeEntityTest
[INFO] Tests run: 26, Failures: 0, Errors: 0, Skipped: 0, Time elapsed: 1.716 s - in org.eclipse.jnosql.artemis.graph.EdgeEntityTest
[INFO] Running org.eclipse.jnosql.artemis.graph.GraphPageTest
[INFO] Tests run: 8, Failures: 0, Errors: 0, Skipped: 0, Time elapsed: 0.705 s - in org.eclipse.jnosql.artemis.graph.GraphPageTest
[INFO] Running org.eclipse.jnosql.artemis.graph.BookTemplateTest
[INFO] Tests run: 3, Failures: 0, Errors: 0, Skipped: 0, Time elapsed: 0.063 s - in org.eclipse.jnosql.artemis.graph.BookTemplateTest
[INFO] Running org.eclipse.jnosql.artemis.graph.GraphTemplateTest
[INFO] Tests run: 39, Failures: 0, Errors: 0, Skipped: 0, Time elapsed: 1.22 s - in org.eclipse.jnosql.artemis.graph.GraphTemplateTest
Weld SE container 3c99dbde-a277-429c-9cdc-8041c239e68b shut down by shutdown hook
[INFO] 
[INFO] Results:
[INFO] 
[ERROR] Failures: 
[ERROR]   DefaultEntityTreeTest.shouldGetParentId:147 array contents differ at index [0], expected: <Animal{name='zebra'}> but was: <Animal{name='giraffe'}>
[INFO] 
[ERROR] Tests run: 364, Failures: 1, Errors: 0, Skipped: 0
[INFO] 
[INFO] ------------------------------------------------------------------------
[INFO] Reactor Summary for jnosql-parent 0.1.0-SNAPSHOT:
[INFO] 
[INFO] jnosql-parent ...................................... SUCCESS [ 17.859 s]
[INFO] diana .............................................. SUCCESS [  0.281 s]
[INFO] diana-core ......................................... SUCCESS [ 14.551 s]
[INFO] diana-query ........................................ SUCCESS [ 17.848 s]
[INFO] diana-key-value .................................... SUCCESS [  4.874 s]
[INFO] diana-column ....................................... SUCCESS [ 14.147 s]
[INFO] diana-document ..................................... SUCCESS [  6.465 s]
[INFO] artemis-parent ..................................... SUCCESS [  2.720 s]
[INFO] artemis-core ....................................... SUCCESS [ 21.426 s]
[INFO] artemis-graph ...................................... FAILURE [01:13 min]
[INFO] artemis-document ................................... SKIPPED
[INFO] artemis-column ..................................... SKIPPED
[INFO] artemis-key-value .................................. SKIPPED
[INFO] artemis-validation ................................. SKIPPED
[INFO] ------------------------------------------------------------------------
[INFO] BUILD FAILURE
[INFO] ------------------------------------------------------------------------
[INFO] Total time:  03:11 min
[INFO] Finished at: 2019-11-27T09:41:57Z
[INFO] ------------------------------------------------------------------------
[ERROR] Failed to execute goal org.apache.maven.plugins:maven-surefire-plugin:2.22.1:test (default-test) on project artemis-graph: There are test failures.
[ERROR] 
[ERROR] Please refer to /home/jenkins/agent/workspace/jnosql-sonar/artemis/artemis-graph/target/surefire-reports for the individual test results.
[ERROR] Please refer to dump files (if any exist) [date].dump, [date]-jvmRun[N].dump and [date].dumpstream.
[ERROR] -> [Help 1]
[ERROR] 
[ERROR] To see the full stack trace of the errors, re-run Maven with the -e switch.
[ERROR] Re-run Maven using the -X switch to enable full debug logging.
[ERROR] 
[ERROR] For more information about the errors and possible solutions, please read the following articles:
[ERROR] [Help 1] http://cwiki.apache.org/confluence/display/MAVEN/MojoFailureException
[ERROR] 
[ERROR] After correcting the problems, you can resume the build with the command
[ERROR]   mvn <goals> -rf :artemis-graph
Build step 'Invoke top-level Maven targets' marked build as failure
Skipping sonar analysis due to bad build status FAILURE
Finished: FAILURE