Console Output

Started by user Marc Nuri
Running as Marc Nuri
Running in Durability level: PERFORMANCE_OPTIMIZED
[Pipeline] Start of Pipeline
[Pipeline] node
Still waiting to schedule task
Waiting for next available executor
Agent basic-hgwhg is provisioned from template basic
---
apiVersion: "v1"
kind: "Pod"
metadata:
  annotations: {}
  labels:
    jenkins: "slave"
    jenkins/label: ""
  name: "basic-hgwhg"
spec:
  containers:
  - env:
    - name: "JENKINS_SECRET"
      value: "********"
    - name: "JENKINS_TUNNEL"
      value: "jenkins-discovery.jkube.svc.cluster.local:50000"
    - name: "JENKINS_AGENT_NAME"
      value: "basic-hgwhg"
    - name: "JENKINS_REMOTING_JAVA_OPTS"
      value: "-showversion -XshowSettings:vm -Xmx256m -Dsun.zip.disableMemoryMapping=true\
        \ -Dorg.jenkinsci.remoting.engine.JnlpProtocol3.disabled=true -Dorg.jenkinsci.plugins.gitclient.CliGitAPIImpl.useSETSID=true"
    - name: "JAVA_TOOL_OPTIONS"
      value: ""
    - name: "_JAVA_OPTIONS"
      value: ""
    - name: "OPENJ9_JAVA_OPTIONS"
      value: "-XX:+IgnoreUnrecognizedVMOptions -XX:+IdleTuningCompactOnIdle -XX:+IdleTuningGcOnIdle"
    - name: "JENKINS_NAME"
      value: "basic-hgwhg"
    - name: "JENKINS_AGENT_WORKDIR"
      value: "/home/jenkins/agent"
    - name: "JENKINS_URL"
      value: "http://jenkins-ui.jkube.svc.cluster.local/jkube/"
    image: "docker.io/eclipsecbi/jiro-agent-basic:remoting-4.2.1"
    imagePullPolicy: "Always"
    name: "jnlp"
    resources:
      limits:
        memory: "4096Mi"
        cpu: "2000m"
      requests:
        memory: "4096Mi"
        cpu: "1000m"
    securityContext:
      privileged: false
    tty: true
    volumeMounts:
    - mountPath: "/home/jenkins/.m2/toolchains.xml"
      name: "m2-dir"
      readOnly: true
      subPath: "toolchains.xml"
    - mountPath: "/home/jenkins/.mavenrc"
      name: "m2-dir"
      readOnly: true
      subPath: ".mavenrc"
    - mountPath: "/opt/tools"
      name: "volume-0"
      readOnly: false
    - mountPath: "/home/jenkins"
      name: "volume-2"
      readOnly: false
    - mountPath: "/home/jenkins/.m2/repository"
      name: "volume-3"
      readOnly: false
    - mountPath: "/home/jenkins/.m2/settings-security.xml"
      name: "m2-secret-dir"
      readOnly: true
      subPath: "settings-security.xml"
    - mountPath: "/home/jenkins/.m2/wrapper"
      name: "volume-4"
      readOnly: false
    - mountPath: "/home/jenkins/.m2/settings.xml"
      name: "m2-secret-dir"
      readOnly: true
      subPath: "settings.xml"
    - mountPath: "/home/jenkins/.ssh"
      name: "volume-1"
      readOnly: false
    - mountPath: "/home/jenkins/agent"
      name: "workspace-volume"
      readOnly: false
    workingDir: "/home/jenkins/agent"
  nodeSelector:
    beta.kubernetes.io/os: "linux"
  restartPolicy: "Never"
  securityContext: {}
  volumes:
  - name: "volume-0"
    persistentVolumeClaim:
      claimName: "tools-claim-jiro-jkube"
      readOnly: true
  - name: "m2-secret-dir"
    secret:
      secretName: "m2-secret-dir"
  - emptyDir:
      medium: ""
    name: "volume-2"
  - configMap:
      name: "m2-dir"
    name: "m2-dir"
  - configMap:
      name: "known-hosts"
    name: "volume-1"
  - emptyDir:
      medium: ""
    name: "workspace-volume"
  - emptyDir:
      medium: ""
    name: "volume-4"
  - emptyDir:
      medium: ""
    name: "volume-3"

Running on basic-hgwhg in /home/jenkins/agent/workspace/simplified-downloads-eclipse-release
[Pipeline] {
[Pipeline] stage
[Pipeline] { (Declarative: Tool Install)
[Pipeline] tool
[Pipeline] envVarsForTool
[Pipeline] tool
[Pipeline] envVarsForTool
[Pipeline] }
[Pipeline] // stage
[Pipeline] withEnv
[Pipeline] {
[Pipeline] stage
[Pipeline] { (Build)
[Pipeline] tool
[Pipeline] envVarsForTool
[Pipeline] tool
[Pipeline] envVarsForTool
[Pipeline] withEnv
[Pipeline] {
[Pipeline] withCredentials
Masking supported pattern matches of $KEYRING
[Pipeline] {
[Pipeline] sh
+ gpg --batch --import ****
gpg: directory '/home/jenkins/.gnupg' created
gpg: keybox '/home/jenkins/.gnupg/pubring.kbx' created
gpg: /home/jenkins/.gnupg/trustdb.gpg: trustdb created
gpg: key 0E606F96DD7DFCF7: public key "Eclipse JKube Project <jkube-dev@eclipse.org>" imported
gpg: To migrate 'secring.gpg', with each smartcard, run: gpg --card-status
gpg: key 0E606F96DD7DFCF7: secret key imported
gpg: Total number processed: 1
gpg:               imported: 1
gpg:       secret keys read: 1
gpg:   secret keys imported: 1
[Pipeline] sh
+ gpg --list-keys --with-colons
+ awk -F: '/fpr:/ {print $10}'
+ sort -u
+ echo -e '5
y
'
+ gpg --batch --command-fd 0 --expert --edit-key 457838CBDA81BC97AFA6CA2FE5873BA480DD8283 trust
Secret subkeys are available.

pub  rsa4096/0E606F96DD7DFCF7
     created: 2019-12-16  expires: 2024-12-14  usage: SCEA
     trust: unknown       validity: unknown
ssb  rsa4096/E5873BA480DD8283
     created: 2019-12-16  expires: 2024-12-14  usage: S   
[ unknown] (1). Eclipse JKube Project <jkube-dev@eclipse.org>

pub  rsa4096/0E606F96DD7DFCF7
     created: 2019-12-16  expires: 2024-12-14  usage: SCEA
     trust: unknown       validity: unknown
ssb  rsa4096/E5873BA480DD8283
     created: 2019-12-16  expires: 2024-12-14  usage: S   
[ unknown] (1). Eclipse JKube Project <jkube-dev@eclipse.org>

Please decide how far you trust this user to correctly verify other users' keys
(by looking at passports, checking fingerprints from different sources, etc.)

  1 = I don't know or won't say
  2 = I do NOT trust
  3 = I trust marginally
  4 = I trust fully
  5 = I trust ultimately
  m = back to the main menu


pub  rsa4096/0E606F96DD7DFCF7
     created: 2019-12-16  expires: 2024-12-14  usage: SCEA
     trust: ultimate      validity: unknown
ssb  rsa4096/E5873BA480DD8283
     created: 2019-12-16  expires: 2024-12-14  usage: S   
[ unknown] (1). Eclipse JKube Project <jkube-dev@eclipse.org>
Please note that the shown key validity is not necessarily correct
unless you restart the program.

+ echo -e '5
y
'
+ gpg --batch --command-fd 0 --expert --edit-key 6706B5C326A62956291B76680E606F96DD7DFCF7 trust
Secret subkeys are available.

gpg: checking the trustdb
gpg: marginals needed: 3  completes needed: 1  trust model: pgp
gpg: depth: 0  valid:   1  signed:   0  trust: 0-, 0q, 0n, 0m, 0f, 1u
gpg: next trustdb check due at 2024-12-14
pub  rsa4096/0E606F96DD7DFCF7
     created: 2019-12-16  expires: 2024-12-14  usage: SCEA
     trust: ultimate      validity: ultimate
ssb  rsa4096/E5873BA480DD8283
     created: 2019-12-16  expires: 2024-12-14  usage: S   
[ultimate] (1). Eclipse JKube Project <jkube-dev@eclipse.org>

pub  rsa4096/0E606F96DD7DFCF7
     created: 2019-12-16  expires: 2024-12-14  usage: SCEA
     trust: ultimate      validity: ultimate
ssb  rsa4096/E5873BA480DD8283
     created: 2019-12-16  expires: 2024-12-14  usage: S   
[ultimate] (1). Eclipse JKube Project <jkube-dev@eclipse.org>

Please decide how far you trust this user to correctly verify other users' keys
(by looking at passports, checking fingerprints from different sources, etc.)

  1 = I don't know or won't say
  2 = I do NOT trust
  3 = I trust marginally
  4 = I trust fully
  5 = I trust ultimately
  m = back to the main menu


pub  rsa4096/0E606F96DD7DFCF7
     created: 2019-12-16  expires: 2024-12-14  usage: SCEA
     trust: ultimate      validity: ultimate
ssb  rsa4096/E5873BA480DD8283
     created: 2019-12-16  expires: 2024-12-14  usage: S   
[ultimate] (1). Eclipse JKube Project <jkube-dev@eclipse.org>

[Pipeline] }
[Pipeline] // withCredentials
[Pipeline] withCredentials
Masking supported pattern matches of $GH_TOKEN
[Pipeline] {
[Pipeline] }
[Pipeline] // withCredentials
[Pipeline] sshagent
[ssh-agent] Using credentials genie.jkube (ssh://genie.jkube@projects-storage.eclipse.org)
[ssh-agent] Looking for ssh-agent implementation...
[ssh-agent]   Exec ssh-agent (binary ssh-agent on a remote machine)
$ ssh-agent
SSH_AUTH_SOCK=/tmp/ssh-znRER5f2CabO/agent.131
SSH_AGENT_PID=133
Running ssh-add (command line suppressed)
Identity added: /home/jenkins/agent/workspace/simplified-downloads-eclipse-release@tmp/private_key_7662288616961017712.key (/home/jenkins/agent/workspace/simplified-downloads-eclipse-release@tmp/private_key_7662288616961017712.key)
[ssh-agent] Started.
[Pipeline] {
[Pipeline] sh
+ echo 'Cloning Project with tag v1.0.2'
Cloning Project with tag v1.0.2
+ git clone https://github.com/eclipse/jkube.git
Cloning into 'jkube'...
+ cd jkube
+ git fetch origin v1.0.2
From https://github.com/eclipse/jkube
 * tag                 v1.0.2     -> FETCH_HEAD
+ git checkout v1.0.2
Note: switching to 'v1.0.2'.

You are in 'detached HEAD' state. You can look around, make experimental
changes and commit them, and you can discard any commits you make in this
state without impacting any branches by switching back to a branch.

If you want to create a new branch to retain commits you create, you may
do so (now or later) by using -c with the switch command. Example:

  git switch -c <new-branch-name>

Or undo this operation with:

  git switch -

Turn off this advice by setting config variable advice.detachedHead to false

HEAD is now at 5703f015 [RELEASE] Updated project version to 1.0.2
+ PROJECT_VERSION=1.0.2
+ echo 'Releasing project with version 1.0.2 to downloads.eclipse.org'
Releasing project with version 1.0.2 to downloads.eclipse.org
+ mvn clean install
Apache Maven 3.6.3 (cecedd343002696d0abb50b32b541b8a6ba2883f)
Maven home: /opt/tools/apache-maven/latest
Java version: 1.8.0_252, vendor: AdoptOpenJDK, runtime: /opt/tools/java/adoptopenjdk/hotspot-jdk-8/1.8.0_252-b09/jre
Default locale: en_US, platform encoding: UTF-8
OS name: "linux", version: "3.10.0-1062.el7.x86_64", arch: "amd64", family: "unix"
[INFO] Scanning for projects...
[WARNING] 
[WARNING] Some problems were encountered while building the effective model for org.eclipse.jkube:openshift-maven-plugin:maven-plugin:1.0.2
[WARNING] 'dependencyManagement.dependencies.dependency.(groupId:artifactId:type:classifier)' must be unique: junit:junit:jar -> duplicate declaration of version ${version.junit} @ org.eclipse.jkube:openshift-maven-plugin-parent:1.0.2, /home/jenkins/agent/workspace/simplified-downloads-eclipse-release/jkube/openshift-maven-plugin/pom.xml, line 89, column 19
[WARNING] 
[WARNING] Some problems were encountered while building the effective model for org.eclipse.jkube:openshift-maven-plugin-parent:pom:1.0.2
[WARNING] 'dependencyManagement.dependencies.dependency.(groupId:artifactId:type:classifier)' must be unique: junit:junit:jar -> duplicate declaration of version ${version.junit} @ line 89, column 19
[WARNING] 
[WARNING] It is highly recommended to fix these problems because they threaten the stability of your build.
[WARNING] 
[WARNING] For this reason, future Maven versions might no longer support building such malformed projects.
[WARNING] 
[INFO] ------------------------------------------------------------------------
[INFO] Reactor Build Order:
[INFO] 
[INFO] Eclipse JKube                                                      [pom]
[INFO] JKube Kit :: Parent                                                [pom]
[INFO] JKube Kit :: Documentation                                         [jar]
[INFO] JKube Kit :: Common :: Test                                        [jar]
[INFO] JKube Kit :: Common                                                [jar]
[INFO] JKube Kit :: Common Maven                                          [jar]
[INFO] JKube Kit :: Config :: Image                                       [jar]
[INFO] JKube Kit :: Config :: Resource                                    [jar]
[INFO] JKube Kit :: Build :: API                                          [jar]
[INFO] JKube Kit :: Build :: Service :: Docker                            [jar]
[INFO] JKube Kit :: Build :: Service :: JIB                               [jar]
[INFO] JKube Kit :: Config :: Service                                     [jar]
[INFO] JKube Kit :: Generator :: API                                      [jar]
[INFO] JKube Kit :: Generator :: Java Exec                                [jar]
[INFO] JKube Kit :: Generator :: WildFly Swarm                            [jar]
[INFO] JKube Kit :: Generator :: Karaf                                    [jar]
[INFO] JKube Kit :: Generator :: WebApp                                   [jar]
[INFO] JKube Kit :: Enricher :: API                                       [jar]
[INFO] JKube Kit :: Enricher :: Generic                                   [jar]
[INFO] JKube Kit :: Enricher :: Specific                                  [jar]
[INFO] JKube Kit :: Profile                                               [jar]
[INFO] JKube Kit :: Resource :: Service                                   [jar]
[INFO] JKube Kit :: Resource :: Helm                                      [jar]
[INFO] JKube Kit :: Watcher :: API                                        [jar]
[INFO] JKube Kit :: Watcher :: Standard                                   [jar]
[INFO] JKube Kit :: Spring-Boot                                           [jar]
[INFO] JKube Kit :: Thorntail                                             [jar]
[INFO] JKube Kit :: Vert.x                                                [jar]
[INFO] JKube Kit :: Quarkus                                               [jar]
[INFO] JKube Kit :: Open Liberty                                          [jar]
[INFO] JKube Kit :: WildFly JAR                                           [jar]
[INFO] JKube Kit                                                          [pom]
[INFO] Kubernetes Maven Plugin :: Parent                                  [pom]
[INFO] Kubernetes Maven Plugin :: Plugin                         [maven-plugin]
[INFO] Kubernetes Maven Plugin :: Integration Tests                       [jar]
[INFO] Kubernetes Maven Plugin :: Documentation                           [jar]
[INFO] OpenShift Maven Plugin:: Parent                                    [pom]
[INFO] OpenShift Maven Plugin :: Plugin                          [maven-plugin]
[INFO] OpenShift Maven Plugin :: Integration Tests                        [jar]
[INFO] 
[INFO] ----------------------< org.eclipse.jkube:jkube >-----------------------
[INFO] Building Eclipse JKube 1.0.2                                      [1/39]
[INFO] --------------------------------[ pom ]---------------------------------
[INFO] 
[INFO] --- maven-clean-plugin:2.5:clean (default-clean) @ jkube ---
[INFO] 
[INFO] --- maven-enforcer-plugin:1.4.1:enforce (dependency-convergence) @ jkube ---
[INFO] 
[INFO] --- maven-install-plugin:2.4:install (default-install) @ jkube ---
[INFO] Installing /home/jenkins/agent/workspace/simplified-downloads-eclipse-release/jkube/pom.xml to /home/jenkins/.m2/repository/org/eclipse/jkube/jkube/1.0.2/jkube-1.0.2.pom
[INFO] 
[INFO] -----------------< org.eclipse.jkube:jkube-kit-parent >-----------------
[INFO] Building JKube Kit :: Parent 1.0.2                                [2/39]
[INFO] --------------------------------[ pom ]---------------------------------
[INFO] 
[INFO] --- maven-clean-plugin:2.5:clean (default-clean) @ jkube-kit-parent ---
[INFO] 
[INFO] --- maven-enforcer-plugin:1.4.1:enforce (dependency-convergence) @ jkube-kit-parent ---
[INFO] 
[INFO] --- maven-failsafe-plugin:2.19.1:integration-test (default) @ jkube-kit-parent ---
[INFO] No tests to run.
[WARNING] File encoding has not been set, using platform encoding UTF-8, i.e. build is platform dependent! The file encoding for reports output files should be provided by the POM property ${project.reporting.outputEncoding}.
[INFO] 
[INFO] --- maven-failsafe-plugin:2.19.1:verify (default) @ jkube-kit-parent ---
[WARNING] File encoding has not been set, using platform encoding UTF-8, i.e. build is platform dependent! The file encoding for reports output files should be provided by the POM property ${project.reporting.outputEncoding}.
[INFO] 
[INFO] --- maven-install-plugin:2.4:install (default-install) @ jkube-kit-parent ---
[INFO] Installing /home/jenkins/agent/workspace/simplified-downloads-eclipse-release/jkube/jkube-kit/parent/pom.xml to /home/jenkins/.m2/repository/org/eclipse/jkube/jkube-kit-parent/1.0.2/jkube-kit-parent-1.0.2.pom
[INFO] 
[INFO] ------------------< org.eclipse.jkube:jkube-kit-doc >-------------------
[INFO] Building JKube Kit :: Documentation 1.0.2                         [3/39]
[INFO] --------------------------------[ jar ]---------------------------------
[INFO] 
[INFO] --- maven-clean-plugin:2.5:clean (default-clean) @ jkube-kit-doc ---
[INFO] 
[INFO] --- maven-enforcer-plugin:1.4.1:enforce (dependency-convergence) @ jkube-kit-doc ---
[INFO] 
[INFO] --- maven-resources-plugin:2.6:resources (default-resources) @ jkube-kit-doc ---
[INFO] Using 'UTF-8' encoding to copy filtered resources.
[INFO] skip non existing resourceDirectory /home/jenkins/agent/workspace/simplified-downloads-eclipse-release/jkube/jkube-kit/doc/src/main/resources
[INFO] 
[INFO] --- maven-compiler-plugin:3.8.1:compile (default-compile) @ jkube-kit-doc ---
[INFO] No sources to compile
[INFO] 
[INFO] --- maven-resources-plugin:2.6:testResources (default-testResources) @ jkube-kit-doc ---
[INFO] Using 'UTF-8' encoding to copy filtered resources.
[INFO] skip non existing resourceDirectory /home/jenkins/agent/workspace/simplified-downloads-eclipse-release/jkube/jkube-kit/doc/src/test/resources
[INFO] 
[INFO] --- maven-compiler-plugin:3.8.1:testCompile (default-testCompile) @ jkube-kit-doc ---
[INFO] No sources to compile
[INFO] 
[INFO] --- maven-surefire-plugin:2.19.1:test (default-test) @ jkube-kit-doc ---
[INFO] No tests to run.
[INFO] 
[INFO] --- maven-jar-plugin:2.4:jar (default-jar) @ jkube-kit-doc ---
[WARNING] JAR will be empty - no content was marked for inclusion!
[INFO] Building jar: /home/jenkins/agent/workspace/simplified-downloads-eclipse-release/jkube/jkube-kit/doc/target/jkube-kit-doc-1.0.2.jar
[INFO] 
[INFO] --- asciidoctor-maven-plugin:1.5.5:process-asciidoc (output-html) @ jkube-kit-doc ---
[INFO] Using 'UTF-8' encoding to copy filtered resources.
[INFO] ignoreDelta true
[INFO] Copying 2 resources
[INFO] Copying file inc/diagrams/module-overview.puml
[INFO] Copying file inc/diagrams/overview.plantuml
java.io.IOException: Cannot run program "/usr/bin/dot": error=2, No such file or directory
	at java.lang.ProcessBuilder.start(ProcessBuilder.java:1048)
	at java.lang.Runtime.exec(Runtime.java:620)
	at net.sourceforge.plantuml.cucadiagram.dot.ProcessRunner$MainThread.startThreads(ProcessRunner.java:152)
	at net.sourceforge.plantuml.cucadiagram.dot.ProcessRunner$MainThread.runJob(ProcessRunner.java:112)
	at net.sourceforge.plantuml.api.TimeoutExecutor$MyThread.run(TimeoutExecutor.java:69)
Caused by: java.io.IOException: error=2, No such file or directory
	at java.lang.UNIXProcess.forkAndExec(Native Method)
	at java.lang.UNIXProcess.<init>(UNIXProcess.java:247)
	at java.lang.ProcessImpl.start(ProcessImpl.java:134)
	at java.lang.ProcessBuilder.start(ProcessBuilder.java:1029)
	... 4 more
java.io.IOException: Cannot run program "/usr/bin/dot": error=2, No such file or directory
	at java.lang.ProcessBuilder.start(ProcessBuilder.java:1048)
	at java.lang.Runtime.exec(Runtime.java:620)
	at net.sourceforge.plantuml.cucadiagram.dot.ProcessRunner$MainThread.startThreads(ProcessRunner.java:152)
	at net.sourceforge.plantuml.cucadiagram.dot.ProcessRunner$MainThread.runJob(ProcessRunner.java:112)
	at net.sourceforge.plantuml.api.TimeoutExecutor$MyThread.run(TimeoutExecutor.java:69)
Caused by: java.io.IOException: error=2, No such file or directory
	at java.lang.UNIXProcess.forkAndExec(Native Method)
	at java.lang.UNIXProcess.<init>(UNIXProcess.java:247)
	at java.lang.ProcessImpl.start(ProcessImpl.java:134)
	at java.lang.ProcessBuilder.start(ProcessBuilder.java:1029)
	... 4 more
[INFO] Rendered /home/jenkins/agent/workspace/simplified-downloads-eclipse-release/jkube/jkube-kit/doc/src/main/asciidoc/index.adoc
[INFO] 
[INFO] --- maven-failsafe-plugin:2.19.1:integration-test (default) @ jkube-kit-doc ---
[INFO] No tests to run.
[WARNING] File encoding has not been set, using platform encoding UTF-8, i.e. build is platform dependent! The file encoding for reports output files should be provided by the POM property ${project.reporting.outputEncoding}.
[INFO] 
[INFO] --- maven-failsafe-plugin:2.19.1:verify (default) @ jkube-kit-doc ---
[WARNING] File encoding has not been set, using platform encoding UTF-8, i.e. build is platform dependent! The file encoding for reports output files should be provided by the POM property ${project.reporting.outputEncoding}.
[INFO] 
[INFO] --- maven-install-plugin:2.4:install (default-install) @ jkube-kit-doc ---
[INFO] Installing /home/jenkins/agent/workspace/simplified-downloads-eclipse-release/jkube/jkube-kit/doc/target/jkube-kit-doc-1.0.2.jar to /home/jenkins/.m2/repository/org/eclipse/jkube/jkube-kit-doc/1.0.2/jkube-kit-doc-1.0.2.jar
[INFO] Installing /home/jenkins/agent/workspace/simplified-downloads-eclipse-release/jkube/jkube-kit/doc/pom.xml to /home/jenkins/.m2/repository/org/eclipse/jkube/jkube-kit-doc/1.0.2/jkube-kit-doc-1.0.2.pom
[INFO] 
[INFO] --------------< org.eclipse.jkube:jkube-kit-common-test >---------------
[INFO] Building JKube Kit :: Common :: Test 1.0.2                        [4/39]
[INFO] --------------------------------[ jar ]---------------------------------
[INFO] 
[INFO] --- maven-clean-plugin:2.5:clean (default-clean) @ jkube-kit-common-test ---
[INFO] 
[INFO] --- maven-enforcer-plugin:1.4.1:enforce (dependency-convergence) @ jkube-kit-common-test ---
[INFO] 
[INFO] --- maven-resources-plugin:2.6:resources (default-resources) @ jkube-kit-common-test ---
[INFO] Using 'UTF-8' encoding to copy filtered resources.
[INFO] skip non existing resourceDirectory /home/jenkins/agent/workspace/simplified-downloads-eclipse-release/jkube/jkube-kit/common-test/src/main/resources
[INFO] 
[INFO] --- maven-compiler-plugin:3.8.1:compile (default-compile) @ jkube-kit-common-test ---
[INFO] Changes detected - recompiling the module!
[INFO] Compiling 1 source file to /home/jenkins/agent/workspace/simplified-downloads-eclipse-release/jkube/jkube-kit/common-test/target/classes
[INFO] 
[INFO] --- maven-resources-plugin:2.6:testResources (default-testResources) @ jkube-kit-common-test ---
[INFO] Using 'UTF-8' encoding to copy filtered resources.
[INFO] skip non existing resourceDirectory /home/jenkins/agent/workspace/simplified-downloads-eclipse-release/jkube/jkube-kit/common-test/src/test/resources
[INFO] 
[INFO] --- maven-compiler-plugin:3.8.1:testCompile (default-testCompile) @ jkube-kit-common-test ---
[INFO] No sources to compile
[INFO] 
[INFO] --- maven-surefire-plugin:2.19.1:test (default-test) @ jkube-kit-common-test ---
[INFO] No tests to run.
[INFO] 
[INFO] --- maven-jar-plugin:2.4:jar (default-jar) @ jkube-kit-common-test ---
[INFO] Building jar: /home/jenkins/agent/workspace/simplified-downloads-eclipse-release/jkube/jkube-kit/common-test/target/jkube-kit-common-test-1.0.2.jar
[INFO] 
[INFO] --- maven-failsafe-plugin:2.19.1:integration-test (default) @ jkube-kit-common-test ---
[INFO] No tests to run.
[WARNING] File encoding has not been set, using platform encoding UTF-8, i.e. build is platform dependent! The file encoding for reports output files should be provided by the POM property ${project.reporting.outputEncoding}.
[INFO] 
[INFO] --- maven-failsafe-plugin:2.19.1:verify (default) @ jkube-kit-common-test ---
[WARNING] File encoding has not been set, using platform encoding UTF-8, i.e. build is platform dependent! The file encoding for reports output files should be provided by the POM property ${project.reporting.outputEncoding}.
[INFO] 
[INFO] --- maven-install-plugin:2.4:install (default-install) @ jkube-kit-common-test ---
[INFO] Installing /home/jenkins/agent/workspace/simplified-downloads-eclipse-release/jkube/jkube-kit/common-test/target/jkube-kit-common-test-1.0.2.jar to /home/jenkins/.m2/repository/org/eclipse/jkube/jkube-kit-common-test/1.0.2/jkube-kit-common-test-1.0.2.jar
[INFO] Installing /home/jenkins/agent/workspace/simplified-downloads-eclipse-release/jkube/jkube-kit/common-test/pom.xml to /home/jenkins/.m2/repository/org/eclipse/jkube/jkube-kit-common-test/1.0.2/jkube-kit-common-test-1.0.2.pom
[INFO] 
[INFO] -----------------< org.eclipse.jkube:jkube-kit-common >-----------------
[INFO] Building JKube Kit :: Common 1.0.2                                [5/39]
[INFO] --------------------------------[ jar ]---------------------------------
[INFO] 
[INFO] --- maven-clean-plugin:2.5:clean (default-clean) @ jkube-kit-common ---
[INFO] 
[INFO] --- maven-enforcer-plugin:1.4.1:enforce (dependency-convergence) @ jkube-kit-common ---
[INFO] 
[INFO] --- maven-resources-plugin:2.6:resources (default-resources) @ jkube-kit-common ---
[INFO] Using 'UTF-8' encoding to copy filtered resources.
[INFO] Copying 1 resource
[INFO] 
[INFO] --- maven-compiler-plugin:3.8.1:compile (default-compile) @ jkube-kit-common ---
[INFO] Changes detected - recompiling the module!
[INFO] Compiling 57 source files to /home/jenkins/agent/workspace/simplified-downloads-eclipse-release/jkube/jkube-kit/common/target/classes
[WARNING] /home/jenkins/agent/workspace/simplified-downloads-eclipse-release/jkube/jkube-kit/common/src/main/java/org/eclipse/jkube/kit/common/util/ResourceUtil.java:[95,46] WRITE_NULL_MAP_VALUES in com.fasterxml.jackson.databind.SerializationFeature has been deprecated
[WARNING] /home/jenkins/agent/workspace/simplified-downloads-eclipse-release/jkube/jkube-kit/common/src/main/java/org/eclipse/jkube/kit/common/util/ResourceUtil.java:[94,46] WRITE_EMPTY_JSON_ARRAYS in com.fasterxml.jackson.databind.SerializationFeature has been deprecated
[INFO] /home/jenkins/agent/workspace/simplified-downloads-eclipse-release/jkube/jkube-kit/common/src/main/java/org/eclipse/jkube/kit/common/util/KubernetesHelper.java: Some input files use unchecked or unsafe operations.
[INFO] /home/jenkins/agent/workspace/simplified-downloads-eclipse-release/jkube/jkube-kit/common/src/main/java/org/eclipse/jkube/kit/common/util/KubernetesHelper.java: Recompile with -Xlint:unchecked for details.
[INFO] 
[INFO] --- maven-resources-plugin:2.6:testResources (default-testResources) @ jkube-kit-common ---
[INFO] Using 'UTF-8' encoding to copy filtered resources.
[INFO] Copying 18 resources
[INFO] 
[INFO] --- maven-compiler-plugin:3.8.1:testCompile (default-testCompile) @ jkube-kit-common ---
[INFO] Changes detected - recompiling the module!
[INFO] Compiling 37 source files to /home/jenkins/agent/workspace/simplified-downloads-eclipse-release/jkube/jkube-kit/common/target/test-classes
[INFO] /home/jenkins/agent/workspace/simplified-downloads-eclipse-release/jkube/jkube-kit/common/src/test/java/org/eclipse/jkube/kit/common/util/UserConfigurationCompareTest.java: /home/jenkins/agent/workspace/simplified-downloads-eclipse-release/jkube/jkube-kit/common/src/test/java/org/eclipse/jkube/kit/common/util/UserConfigurationCompareTest.java uses unchecked or unsafe operations.
[INFO] /home/jenkins/agent/workspace/simplified-downloads-eclipse-release/jkube/jkube-kit/common/src/test/java/org/eclipse/jkube/kit/common/util/UserConfigurationCompareTest.java: Recompile with -Xlint:unchecked for details.
[INFO] 
[INFO] --- maven-surefire-plugin:2.19.1:test (default-test) @ jkube-kit-common ---

-------------------------------------------------------
 T E S T S
-------------------------------------------------------
Running org.eclipse.jkube.kit.common.util.KubernetesHelperTest
Tests run: 14, Failures: 0, Errors: 0, Skipped: 0, Time elapsed: 2.355 sec - in org.eclipse.jkube.kit.common.util.KubernetesHelperTest
Running org.eclipse.jkube.kit.common.util.ClassUtilTest
Tests run: 3, Failures: 0, Errors: 0, Skipped: 0, Time elapsed: 0.022 sec - in org.eclipse.jkube.kit.common.util.ClassUtilTest
Running org.eclipse.jkube.kit.common.util.JKubeProjectUtilTest
Tests run: 3, Failures: 0, Errors: 0, Skipped: 0, Time elapsed: 0.07 sec - in org.eclipse.jkube.kit.common.util.JKubeProjectUtilTest
Running org.eclipse.jkube.kit.common.util.XMLUtilTest
Tests run: 4, Failures: 0, Errors: 0, Skipped: 0, Time elapsed: 0.106 sec - in org.eclipse.jkube.kit.common.util.XMLUtilTest
Running org.eclipse.jkube.kit.common.util.FileUtilTest
Tests run: 9, Failures: 0, Errors: 0, Skipped: 1, Time elapsed: 0.031 sec - in org.eclipse.jkube.kit.common.util.FileUtilTest
Running org.eclipse.jkube.kit.common.util.UserConfigurationCompareTest
SLF4J: Failed to load class "org.slf4j.impl.StaticLoggerBinder".
SLF4J: Defaulting to no-operation (NOP) logger implementation
SLF4J: See http://www.slf4j.org/codes.html#StaticLoggerBinder for further details.
Tests run: 9, Failures: 0, Errors: 0, Skipped: 0, Time elapsed: 0.022 sec - in org.eclipse.jkube.kit.common.util.UserConfigurationCompareTest
Running org.eclipse.jkube.kit.common.util.MapUtilTest
Tests run: 3, Failures: 0, Errors: 0, Skipped: 0, Time elapsed: 0 sec - in org.eclipse.jkube.kit.common.util.MapUtilTest
Running org.eclipse.jkube.kit.common.util.SpringBootUtilTest
Tests run: 5, Failures: 0, Errors: 0, Skipped: 0, Time elapsed: 0.064 sec - in org.eclipse.jkube.kit.common.util.SpringBootUtilTest
Running org.eclipse.jkube.kit.common.util.validator.ResourceValidatorTest
Tests run: 2, Failures: 0, Errors: 0, Skipped: 0, Time elapsed: 0.209 sec - in org.eclipse.jkube.kit.common.util.validator.ResourceValidatorTest
Running org.eclipse.jkube.kit.common.util.Slf4jKitLoggerTest
Tests run: 5, Failures: 0, Errors: 0, Skipped: 0, Time elapsed: 0.023 sec - in org.eclipse.jkube.kit.common.util.Slf4jKitLoggerTest
Running org.eclipse.jkube.kit.common.util.OpenshiftHelperTest
Tests run: 19, Failures: 0, Errors: 0, Skipped: 0, Time elapsed: 0.303 sec - in org.eclipse.jkube.kit.common.util.OpenshiftHelperTest
Running org.eclipse.jkube.kit.common.util.TemplateUtilTest
Tests run: 1, Failures: 0, Errors: 0, Skipped: 0, Time elapsed: 0 sec - in org.eclipse.jkube.kit.common.util.TemplateUtilTest
Running org.eclipse.jkube.kit.common.util.ThorntailUtilTest
Tests run: 1, Failures: 0, Errors: 0, Skipped: 0, Time elapsed: 0.009 sec - in org.eclipse.jkube.kit.common.util.ThorntailUtilTest
Running org.eclipse.jkube.kit.common.util.IoUtilTest
Tests run: 3, Failures: 0, Errors: 0, Skipped: 0, Time elapsed: 0.001 sec - in org.eclipse.jkube.kit.common.util.IoUtilTest
Running org.eclipse.jkube.kit.common.util.ResourceUtilTest
Tests run: 1, Failures: 0, Errors: 0, Skipped: 0, Time elapsed: 0 sec - in org.eclipse.jkube.kit.common.util.ResourceUtilTest
Running org.eclipse.jkube.kit.common.util.CommandlineTest
Tests run: 8, Failures: 0, Errors: 0, Skipped: 0, Time elapsed: 0.023 sec - in org.eclipse.jkube.kit.common.util.CommandlineTest
Running org.eclipse.jkube.kit.common.util.PropertiesMappingParserTest
Tests run: 1, Failures: 0, Errors: 0, Skipped: 0, Time elapsed: 0.002 sec - in org.eclipse.jkube.kit.common.util.PropertiesMappingParserTest
Running org.eclipse.jkube.kit.common.util.AsciiDocParserTest
Tests run: 3, Failures: 0, Errors: 0, Skipped: 0, Time elapsed: 0.002 sec - in org.eclipse.jkube.kit.common.util.AsciiDocParserTest
Running org.eclipse.jkube.kit.common.util.PluginServiceFactoryTest
Tests run: 3, Failures: 0, Errors: 0, Skipped: 0, Time elapsed: 0.004 sec - in org.eclipse.jkube.kit.common.util.PluginServiceFactoryTest
Running org.eclipse.jkube.kit.common.util.LazyBuilderTest
Tests run: 2, Failures: 0, Errors: 0, Skipped: 0, Time elapsed: 0.003 sec - in org.eclipse.jkube.kit.common.util.LazyBuilderTest
Running org.eclipse.jkube.kit.common.util.ProjectClassLoadersTest
Tests run: 4, Failures: 0, Errors: 0, Skipped: 0, Time elapsed: 0.004 sec - in org.eclipse.jkube.kit.common.util.ProjectClassLoadersTest
Running org.eclipse.jkube.kit.common.util.EnvUtilTest
Tests run: 35, Failures: 0, Errors: 0, Skipped: 3, Time elapsed: 0.238 sec - in org.eclipse.jkube.kit.common.util.EnvUtilTest
Running org.eclipse.jkube.kit.common.util.YamlUtilTest
Tests run: 6, Failures: 0, Errors: 0, Skipped: 0, Time elapsed: 0.01 sec - in org.eclipse.jkube.kit.common.util.YamlUtilTest
Running org.eclipse.jkube.kit.common.util.Base64UtilTest
Tests run: 1, Failures: 0, Errors: 0, Skipped: 0, Time elapsed: 0.002 sec - in org.eclipse.jkube.kit.common.util.Base64UtilTest
Running org.eclipse.jkube.kit.common.archive.AssemblyFileSetUtilsProcessAssemblyFileSetTest
Tests run: 16, Failures: 0, Errors: 0, Skipped: 0, Time elapsed: 0.131 sec - in org.eclipse.jkube.kit.common.archive.AssemblyFileSetUtilsProcessAssemblyFileSetTest
Running org.eclipse.jkube.kit.common.archive.AssemblyFileSetUtilsTest
Tests run: 9, Failures: 0, Errors: 0, Skipped: 0, Time elapsed: 0.009 sec - in org.eclipse.jkube.kit.common.archive.AssemblyFileSetUtilsTest
Running org.eclipse.jkube.kit.common.archive.AssemblyFileUtilsTest
Tests run: 7, Failures: 0, Errors: 0, Skipped: 2, Time elapsed: 0.008 sec - in org.eclipse.jkube.kit.common.archive.AssemblyFileUtilsTest
Running org.eclipse.jkube.kit.common.AssemblyConfigurationTest
Tests run: 3, Failures: 0, Errors: 0, Skipped: 0, Time elapsed: 0.01 sec - in org.eclipse.jkube.kit.common.AssemblyConfigurationTest
Running org.eclipse.jkube.kit.common.service.MigrateServiceTest
Tests run: 4, Failures: 0, Errors: 0, Skipped: 0, Time elapsed: 0.108 sec - in org.eclipse.jkube.kit.common.service.MigrateServiceTest
Running org.eclipse.jkube.kit.common.ConfigsTest
Tests run: 20, Failures: 0, Errors: 0, Skipped: 0, Time elapsed: 0.099 sec - in org.eclipse.jkube.kit.common.ConfigsTest

Results :

Tests run: 204, Failures: 0, Errors: 0, Skipped: 6

[INFO] 
[INFO] --- maven-jar-plugin:2.4:jar (default-jar) @ jkube-kit-common ---
[INFO] Building jar: /home/jenkins/agent/workspace/simplified-downloads-eclipse-release/jkube/jkube-kit/common/target/jkube-kit-common-1.0.2.jar
[INFO] 
[INFO] --- maven-failsafe-plugin:2.19.1:integration-test (default) @ jkube-kit-common ---
[WARNING] File encoding has not been set, using platform encoding UTF-8, i.e. build is platform dependent! The file encoding for reports output files should be provided by the POM property ${project.reporting.outputEncoding}.
[INFO] 
[INFO] --- maven-failsafe-plugin:2.19.1:verify (default) @ jkube-kit-common ---
[WARNING] File encoding has not been set, using platform encoding UTF-8, i.e. build is platform dependent! The file encoding for reports output files should be provided by the POM property ${project.reporting.outputEncoding}.
[INFO] 
[INFO] --- maven-install-plugin:2.4:install (default-install) @ jkube-kit-common ---
[INFO] Installing /home/jenkins/agent/workspace/simplified-downloads-eclipse-release/jkube/jkube-kit/common/target/jkube-kit-common-1.0.2.jar to /home/jenkins/.m2/repository/org/eclipse/jkube/jkube-kit-common/1.0.2/jkube-kit-common-1.0.2.jar
[INFO] Installing /home/jenkins/agent/workspace/simplified-downloads-eclipse-release/jkube/jkube-kit/common/pom.xml to /home/jenkins/.m2/repository/org/eclipse/jkube/jkube-kit-common/1.0.2/jkube-kit-common-1.0.2.pom
[INFO] 
[INFO] --------------< org.eclipse.jkube:jkube-kit-common-maven >--------------
[INFO] Building JKube Kit :: Common Maven 1.0.2                          [6/39]
[INFO] --------------------------------[ jar ]---------------------------------
[INFO] 
[INFO] --- maven-clean-plugin:2.5:clean (default-clean) @ jkube-kit-common-maven ---
[INFO] 
[INFO] --- maven-enforcer-plugin:1.4.1:enforce (dependency-convergence) @ jkube-kit-common-maven ---
[INFO] 
[INFO] --- maven-resources-plugin:2.6:resources (default-resources) @ jkube-kit-common-maven ---
[INFO] Using 'UTF-8' encoding to copy filtered resources.
[INFO] skip non existing resourceDirectory /home/jenkins/agent/workspace/simplified-downloads-eclipse-release/jkube/jkube-kit/common-maven/src/main/resources
[INFO] 
[INFO] --- maven-compiler-plugin:3.8.1:compile (default-compile) @ jkube-kit-common-maven ---
[INFO] Changes detected - recompiling the module!
[INFO] Compiling 6 source files to /home/jenkins/agent/workspace/simplified-downloads-eclipse-release/jkube/jkube-kit/common-maven/target/classes
[WARNING] /home/jenkins/agent/workspace/simplified-downloads-eclipse-release/jkube/jkube-kit/common-maven/src/main/java/org/eclipse/jkube/kit/common/util/MavenUtil.java:[376,29] getExecutionProperties() in org.apache.maven.execution.MavenSession has been deprecated
[WARNING] /home/jenkins/agent/workspace/simplified-downloads-eclipse-release/jkube/jkube-kit/common-maven/src/main/java/org/eclipse/jkube/kit/common/util/MavenUtil.java:[377,47] getExecutionProperties() in org.apache.maven.execution.MavenSession has been deprecated
[INFO] /home/jenkins/agent/workspace/simplified-downloads-eclipse-release/jkube/jkube-kit/common-maven/src/main/java/org/eclipse/jkube/kit/common/util/MavenConfigurationExtractor.java: /home/jenkins/agent/workspace/simplified-downloads-eclipse-release/jkube/jkube-kit/common-maven/src/main/java/org/eclipse/jkube/kit/common/util/MavenConfigurationExtractor.java uses unchecked or unsafe operations.
[INFO] /home/jenkins/agent/workspace/simplified-downloads-eclipse-release/jkube/jkube-kit/common-maven/src/main/java/org/eclipse/jkube/kit/common/util/MavenConfigurationExtractor.java: Recompile with -Xlint:unchecked for details.
[INFO] 
[INFO] --- maven-resources-plugin:2.6:testResources (default-testResources) @ jkube-kit-common-maven ---
[INFO] Using 'UTF-8' encoding to copy filtered resources.
[INFO] Copying 5 resources
[INFO] 
[INFO] --- maven-compiler-plugin:3.8.1:testCompile (default-testCompile) @ jkube-kit-common-maven ---
[INFO] Changes detected - recompiling the module!
[INFO] Compiling 4 source files to /home/jenkins/agent/workspace/simplified-downloads-eclipse-release/jkube/jkube-kit/common-maven/target/test-classes
[WARNING] /home/jenkins/agent/workspace/simplified-downloads-eclipse-release/jkube/jkube-kit/common-maven/src/test/java/org/eclipse/jkube/kit/common/util/MavenUtilTest.java:[207,16] MavenSession(org.codehaus.plexus.PlexusContainer,org.apache.maven.settings.Settings,org.apache.maven.artifact.repository.ArtifactRepository,org.apache.maven.monitor.event.EventDispatcher,org.apache.maven.execution.ReactorManager,java.util.List<java.lang.String>,java.lang.String,java.util.Properties,java.util.Properties,java.util.Date) in org.apache.maven.execution.MavenSession has been deprecated
[INFO] /home/jenkins/agent/workspace/simplified-downloads-eclipse-release/jkube/jkube-kit/common-maven/src/test/java/org/eclipse/jkube/kit/common/util/MavenUtilTest.java: /home/jenkins/agent/workspace/simplified-downloads-eclipse-release/jkube/jkube-kit/common-maven/src/test/java/org/eclipse/jkube/kit/common/util/MavenUtilTest.java uses unchecked or unsafe operations.
[INFO] /home/jenkins/agent/workspace/simplified-downloads-eclipse-release/jkube/jkube-kit/common-maven/src/test/java/org/eclipse/jkube/kit/common/util/MavenUtilTest.java: Recompile with -Xlint:unchecked for details.
[INFO] 
[INFO] --- maven-surefire-plugin:2.19.1:test (default-test) @ jkube-kit-common-maven ---

-------------------------------------------------------
 T E S T S
-------------------------------------------------------
Running org.eclipse.jkube.kit.common.util.MavenConfigurationExtractorTest
Tests run: 5, Failures: 0, Errors: 0, Skipped: 0, Time elapsed: 0.095 sec - in org.eclipse.jkube.kit.common.util.MavenConfigurationExtractorTest
Running org.eclipse.jkube.kit.common.util.MavenUtilTest
Tests run: 5, Failures: 0, Errors: 0, Skipped: 0, Time elapsed: 0.25 sec - in org.eclipse.jkube.kit.common.util.MavenUtilTest
Running org.eclipse.jkube.kit.common.util.SpringBootUtilTest
SLF4J: Failed to load class "org.slf4j.impl.StaticLoggerBinder".
SLF4J: Defaulting to no-operation (NOP) logger implementation
SLF4J: See http://www.slf4j.org/codes.html#StaticLoggerBinder for further details.
Tests run: 6, Failures: 0, Errors: 0, Skipped: 0, Time elapsed: 0.171 sec - in org.eclipse.jkube.kit.common.util.SpringBootUtilTest
Running org.eclipse.jkube.kit.common.util.AnsiLoggerTest
[INFO] T>Skipping empty strings is possible
[INFO] T>Lowercase enables bright version of 8 colors
[INFO] T>Specific color is possible
[INFO] T>Info messages do not apply color codes when debug is enabled
[INFO] T>Yet another Test emphasis
[INFO] Test
[INFO] log: Unknown verbosity group bla. Ignoring...
[INFO] Test
[INFO] Test
[INFO] Test
[ERROR] T>Error messages could emphasise many things
[INFO] T>Disabling color causes logger to interpret and remove emphasis
[WARNING] T>Warning messages support emphasis too
Tests run: 10, Failures: 0, Errors: 0, Skipped: 0, Time elapsed: 0.017 sec - in org.eclipse.jkube.kit.common.util.AnsiLoggerTest

Results :

Tests run: 26, Failures: 0, Errors: 0, Skipped: 0

[INFO] 
[INFO] --- maven-jar-plugin:2.4:jar (default-jar) @ jkube-kit-common-maven ---
[INFO] Building jar: /home/jenkins/agent/workspace/simplified-downloads-eclipse-release/jkube/jkube-kit/common-maven/target/jkube-kit-common-maven-1.0.2.jar
[INFO] 
[INFO] --- maven-failsafe-plugin:2.19.1:integration-test (default) @ jkube-kit-common-maven ---
[WARNING] File encoding has not been set, using platform encoding UTF-8, i.e. build is platform dependent! The file encoding for reports output files should be provided by the POM property ${project.reporting.outputEncoding}.
[INFO] 
[INFO] --- maven-failsafe-plugin:2.19.1:verify (default) @ jkube-kit-common-maven ---
[WARNING] File encoding has not been set, using platform encoding UTF-8, i.e. build is platform dependent! The file encoding for reports output files should be provided by the POM property ${project.reporting.outputEncoding}.
[INFO] 
[INFO] --- maven-install-plugin:2.4:install (default-install) @ jkube-kit-common-maven ---
[INFO] Installing /home/jenkins/agent/workspace/simplified-downloads-eclipse-release/jkube/jkube-kit/common-maven/target/jkube-kit-common-maven-1.0.2.jar to /home/jenkins/.m2/repository/org/eclipse/jkube/jkube-kit-common-maven/1.0.2/jkube-kit-common-maven-1.0.2.jar
[INFO] Installing /home/jenkins/agent/workspace/simplified-downloads-eclipse-release/jkube/jkube-kit/common-maven/pom.xml to /home/jenkins/.m2/repository/org/eclipse/jkube/jkube-kit-common-maven/1.0.2/jkube-kit-common-maven-1.0.2.pom
[INFO] 
[INFO] --------------< org.eclipse.jkube:jkube-kit-config-image >--------------
[INFO] Building JKube Kit :: Config :: Image 1.0.2                       [7/39]
[INFO] --------------------------------[ jar ]---------------------------------
[INFO] 
[INFO] --- maven-clean-plugin:2.5:clean (default-clean) @ jkube-kit-config-image ---
[INFO] 
[INFO] --- maven-enforcer-plugin:1.4.1:enforce (dependency-convergence) @ jkube-kit-config-image ---
[INFO] 
[INFO] --- maven-resources-plugin:2.6:resources (default-resources) @ jkube-kit-config-image ---
[INFO] Using 'UTF-8' encoding to copy filtered resources.
[INFO] skip non existing resourceDirectory /home/jenkins/agent/workspace/simplified-downloads-eclipse-release/jkube/jkube-kit/config/image/src/main/resources
[INFO] 
[INFO] --- maven-compiler-plugin:3.8.1:compile (default-compile) @ jkube-kit-config-image ---
[INFO] Changes detected - recompiling the module!
[INFO] Compiling 26 source files to /home/jenkins/agent/workspace/simplified-downloads-eclipse-release/jkube/jkube-kit/config/image/target/classes
[INFO] /home/jenkins/agent/workspace/simplified-downloads-eclipse-release/jkube/jkube-kit/config/image/src/main/java/org/eclipse/jkube/kit/config/image/build/RegistryAuthConfiguration.java: /home/jenkins/agent/workspace/simplified-downloads-eclipse-release/jkube/jkube-kit/config/image/src/main/java/org/eclipse/jkube/kit/config/image/build/RegistryAuthConfiguration.java uses unchecked or unsafe operations.
[INFO] /home/jenkins/agent/workspace/simplified-downloads-eclipse-release/jkube/jkube-kit/config/image/src/main/java/org/eclipse/jkube/kit/config/image/build/RegistryAuthConfiguration.java: Recompile with -Xlint:unchecked for details.
[INFO] 
[INFO] --- maven-resources-plugin:2.6:testResources (default-testResources) @ jkube-kit-config-image ---
[INFO] Using 'UTF-8' encoding to copy filtered resources.
[INFO] Copying 11 resources
[INFO] 
[INFO] --- maven-compiler-plugin:3.8.1:testCompile (default-testCompile) @ jkube-kit-config-image ---
[INFO] Changes detected - recompiling the module!
[INFO] Compiling 6 source files to /home/jenkins/agent/workspace/simplified-downloads-eclipse-release/jkube/jkube-kit/config/image/target/test-classes
[INFO] 
[INFO] --- maven-surefire-plugin:2.19.1:test (default-test) @ jkube-kit-config-image ---

-------------------------------------------------------
 T E S T S
-------------------------------------------------------
Running org.eclipse.jkube.kit.config.image.build.BuildConfigurationTest
Tests run: 13, Failures: 0, Errors: 0, Skipped: 0, Time elapsed: 0.412 sec - in org.eclipse.jkube.kit.config.image.build.BuildConfigurationTest
Running org.eclipse.jkube.kit.config.image.build.CleanupModeTest
Tests run: 2, Failures: 0, Errors: 0, Skipped: 0, Time elapsed: 0 sec - in org.eclipse.jkube.kit.config.image.build.CleanupModeTest
Running org.eclipse.jkube.kit.config.image.build.HealthCheckConfigTest
Tests run: 14, Failures: 0, Errors: 0, Skipped: 0, Time elapsed: 0.006 sec - in org.eclipse.jkube.kit.config.image.build.HealthCheckConfigTest
Running org.eclipse.jkube.kit.config.image.build.DockerFileBuilderTest
Tests run: 21, Failures: 0, Errors: 0, Skipped: 0, Time elapsed: 0.032 sec - in org.eclipse.jkube.kit.config.image.build.DockerFileBuilderTest
Running org.eclipse.jkube.kit.config.image.ImageConfigurationTest
Tests run: 1, Failures: 0, Errors: 0, Skipped: 0, Time elapsed: 0.07 sec - in org.eclipse.jkube.kit.config.image.ImageConfigurationTest
Running org.eclipse.jkube.kit.config.image.ImageNameTest
Tests run: 6, Failures: 0, Errors: 0, Skipped: 0, Time elapsed: 0.013 sec - in org.eclipse.jkube.kit.config.image.ImageNameTest

Results :

Tests run: 57, Failures: 0, Errors: 0, Skipped: 0

[INFO] 
[INFO] --- maven-jar-plugin:2.4:jar (default-jar) @ jkube-kit-config-image ---
[INFO] Building jar: /home/jenkins/agent/workspace/simplified-downloads-eclipse-release/jkube/jkube-kit/config/image/target/jkube-kit-config-image-1.0.2.jar
[INFO] 
[INFO] --- maven-failsafe-plugin:2.19.1:integration-test (default) @ jkube-kit-config-image ---
[WARNING] File encoding has not been set, using platform encoding UTF-8, i.e. build is platform dependent! The file encoding for reports output files should be provided by the POM property ${project.reporting.outputEncoding}.
[INFO] 
[INFO] --- maven-failsafe-plugin:2.19.1:verify (default) @ jkube-kit-config-image ---
[WARNING] File encoding has not been set, using platform encoding UTF-8, i.e. build is platform dependent! The file encoding for reports output files should be provided by the POM property ${project.reporting.outputEncoding}.
[INFO] 
[INFO] --- maven-install-plugin:2.4:install (default-install) @ jkube-kit-config-image ---
[INFO] Installing /home/jenkins/agent/workspace/simplified-downloads-eclipse-release/jkube/jkube-kit/config/image/target/jkube-kit-config-image-1.0.2.jar to /home/jenkins/.m2/repository/org/eclipse/jkube/jkube-kit-config-image/1.0.2/jkube-kit-config-image-1.0.2.jar
[INFO] Installing /home/jenkins/agent/workspace/simplified-downloads-eclipse-release/jkube/jkube-kit/config/image/pom.xml to /home/jenkins/.m2/repository/org/eclipse/jkube/jkube-kit-config-image/1.0.2/jkube-kit-config-image-1.0.2.pom
[INFO] 
[INFO] ------------< org.eclipse.jkube:jkube-kit-config-resource >-------------
[INFO] Building JKube Kit :: Config :: Resource 1.0.2                    [8/39]
[INFO] --------------------------------[ jar ]---------------------------------
[INFO] 
[INFO] --- maven-clean-plugin:2.5:clean (default-clean) @ jkube-kit-config-resource ---
[INFO] 
[INFO] --- maven-enforcer-plugin:1.4.1:enforce (dependency-convergence) @ jkube-kit-config-resource ---
[INFO] 
[INFO] --- maven-resources-plugin:2.6:resources (default-resources) @ jkube-kit-config-resource ---
[INFO] Using 'UTF-8' encoding to copy filtered resources.
[INFO] skip non existing resourceDirectory /home/jenkins/agent/workspace/simplified-downloads-eclipse-release/jkube/jkube-kit/config/resource/src/main/resources
[INFO] 
[INFO] --- maven-compiler-plugin:3.8.1:compile (default-compile) @ jkube-kit-config-resource ---
[INFO] Changes detected - recompiling the module!
[INFO] Compiling 24 source files to /home/jenkins/agent/workspace/simplified-downloads-eclipse-release/jkube/jkube-kit/config/resource/target/classes
[INFO] /home/jenkins/agent/workspace/simplified-downloads-eclipse-release/jkube/jkube-kit/config/resource/src/main/java/org/eclipse/jkube/kit/config/access/ClusterAccess.java: /home/jenkins/agent/workspace/simplified-downloads-eclipse-release/jkube/jkube-kit/config/resource/src/main/java/org/eclipse/jkube/kit/config/access/ClusterAccess.java uses unchecked or unsafe operations.
[INFO] /home/jenkins/agent/workspace/simplified-downloads-eclipse-release/jkube/jkube-kit/config/resource/src/main/java/org/eclipse/jkube/kit/config/access/ClusterAccess.java: Recompile with -Xlint:unchecked for details.
[INFO] 
[INFO] --- maven-resources-plugin:2.6:testResources (default-testResources) @ jkube-kit-config-resource ---
[INFO] Using 'UTF-8' encoding to copy filtered resources.
[INFO] skip non existing resourceDirectory /home/jenkins/agent/workspace/simplified-downloads-eclipse-release/jkube/jkube-kit/config/resource/src/test/resources
[INFO] 
[INFO] --- maven-compiler-plugin:3.8.1:testCompile (default-testCompile) @ jkube-kit-config-resource ---
[INFO] Changes detected - recompiling the module!
[INFO] Compiling 3 source files to /home/jenkins/agent/workspace/simplified-downloads-eclipse-release/jkube/jkube-kit/config/resource/target/test-classes
[INFO] /home/jenkins/agent/workspace/simplified-downloads-eclipse-release/jkube/jkube-kit/config/resource/src/test/java/org/eclipse/jkube/kit/config/resource/ProcessorConfigTest.java: /home/jenkins/agent/workspace/simplified-downloads-eclipse-release/jkube/jkube-kit/config/resource/src/test/java/org/eclipse/jkube/kit/config/resource/ProcessorConfigTest.java uses unchecked or unsafe operations.
[INFO] /home/jenkins/agent/workspace/simplified-downloads-eclipse-release/jkube/jkube-kit/config/resource/src/test/java/org/eclipse/jkube/kit/config/resource/ProcessorConfigTest.java: Recompile with -Xlint:unchecked for details.
[INFO] 
[INFO] --- maven-surefire-plugin:2.19.1:test (default-test) @ jkube-kit-config-resource ---

-------------------------------------------------------
 T E S T S
-------------------------------------------------------
Running org.eclipse.jkube.kit.config.access.ClusterConfigurationTest
SLF4J: Failed to load class "org.slf4j.impl.StaticLoggerBinder".
SLF4J: Defaulting to no-operation (NOP) logger implementation
SLF4J: See http://www.slf4j.org/codes.html#StaticLoggerBinder for further details.
Tests run: 4, Failures: 0, Errors: 0, Skipped: 0, Time elapsed: 0.2 sec - in org.eclipse.jkube.kit.config.access.ClusterConfigurationTest
Running org.eclipse.jkube.kit.config.access.ClusterAccessTest
Tests run: 5, Failures: 0, Errors: 0, Skipped: 0, Time elapsed: 0.433 sec - in org.eclipse.jkube.kit.config.access.ClusterAccessTest
Running org.eclipse.jkube.kit.config.resource.ProcessorConfigTest
Tests run: 9, Failures: 0, Errors: 0, Skipped: 0, Time elapsed: 0.06 sec - in org.eclipse.jkube.kit.config.resource.ProcessorConfigTest

Results :

Tests run: 18, Failures: 0, Errors: 0, Skipped: 0

[INFO] 
[INFO] --- maven-jar-plugin:2.4:jar (default-jar) @ jkube-kit-config-resource ---
[INFO] Building jar: /home/jenkins/agent/workspace/simplified-downloads-eclipse-release/jkube/jkube-kit/config/resource/target/jkube-kit-config-resource-1.0.2.jar
[INFO] 
[INFO] --- maven-failsafe-plugin:2.19.1:integration-test (default) @ jkube-kit-config-resource ---
[WARNING] File encoding has not been set, using platform encoding UTF-8, i.e. build is platform dependent! The file encoding for reports output files should be provided by the POM property ${project.reporting.outputEncoding}.
[INFO] 
[INFO] --- maven-failsafe-plugin:2.19.1:verify (default) @ jkube-kit-config-resource ---
[WARNING] File encoding has not been set, using platform encoding UTF-8, i.e. build is platform dependent! The file encoding for reports output files should be provided by the POM property ${project.reporting.outputEncoding}.
[INFO] 
[INFO] --- maven-install-plugin:2.4:install (default-install) @ jkube-kit-config-resource ---
[INFO] Installing /home/jenkins/agent/workspace/simplified-downloads-eclipse-release/jkube/jkube-kit/config/resource/target/jkube-kit-config-resource-1.0.2.jar to /home/jenkins/.m2/repository/org/eclipse/jkube/jkube-kit-config-resource/1.0.2/jkube-kit-config-resource-1.0.2.jar
[INFO] Installing /home/jenkins/agent/workspace/simplified-downloads-eclipse-release/jkube/jkube-kit/config/resource/pom.xml to /home/jenkins/.m2/repository/org/eclipse/jkube/jkube-kit-config-resource/1.0.2/jkube-kit-config-resource-1.0.2.pom
[INFO] 
[INFO] ---------------< org.eclipse.jkube:jkube-kit-build-api >----------------
[INFO] Building JKube Kit :: Build :: API 1.0.2                          [9/39]
[INFO] --------------------------------[ jar ]---------------------------------
[INFO] 
[INFO] --- maven-clean-plugin:2.5:clean (default-clean) @ jkube-kit-build-api ---
[INFO] 
[INFO] --- maven-enforcer-plugin:1.4.1:enforce (dependency-convergence) @ jkube-kit-build-api ---
[INFO] 
[INFO] --- maven-resources-plugin:2.6:resources (default-resources) @ jkube-kit-build-api ---
[INFO] Using 'UTF-8' encoding to copy filtered resources.
[INFO] skip non existing resourceDirectory /home/jenkins/agent/workspace/simplified-downloads-eclipse-release/jkube/jkube-kit/build/api/src/main/resources
[INFO] 
[INFO] --- maven-compiler-plugin:3.8.1:compile (default-compile) @ jkube-kit-build-api ---
[INFO] Changes detected - recompiling the module!
[INFO] Compiling 25 source files to /home/jenkins/agent/workspace/simplified-downloads-eclipse-release/jkube/jkube-kit/build/api/target/classes
[INFO] /home/jenkins/agent/workspace/simplified-downloads-eclipse-release/jkube/jkube-kit/build/api/src/main/java/org/eclipse/jkube/kit/build/api/auth/handler/OpenShiftRegistryAuthHandler.java: /home/jenkins/agent/workspace/simplified-downloads-eclipse-release/jkube/jkube-kit/build/api/src/main/java/org/eclipse/jkube/kit/build/api/auth/handler/OpenShiftRegistryAuthHandler.java uses unchecked or unsafe operations.
[INFO] /home/jenkins/agent/workspace/simplified-downloads-eclipse-release/jkube/jkube-kit/build/api/src/main/java/org/eclipse/jkube/kit/build/api/auth/handler/OpenShiftRegistryAuthHandler.java: Recompile with -Xlint:unchecked for details.
[INFO] 
[INFO] --- maven-resources-plugin:2.6:testResources (default-testResources) @ jkube-kit-build-api ---
[INFO] Using 'UTF-8' encoding to copy filtered resources.
[INFO] Copying 21 resources
[INFO] 
[INFO] --- maven-compiler-plugin:3.8.1:testCompile (default-testCompile) @ jkube-kit-build-api ---
[INFO] Changes detected - recompiling the module!
[INFO] Compiling 10 source files to /home/jenkins/agent/workspace/simplified-downloads-eclipse-release/jkube/jkube-kit/build/api/target/test-classes
[WARNING] /home/jenkins/agent/workspace/simplified-downloads-eclipse-release/jkube/jkube-kit/build/api/src/test/java/org/eclipse/jkube/kit/build/api/auth/handler/SystemPropertyRegistryAuthHandlerTest.java:[45,67] none() in org.junit.rules.ExpectedException has been deprecated
[WARNING] /home/jenkins/agent/workspace/simplified-downloads-eclipse-release/jkube/jkube-kit/build/api/src/test/java/org/eclipse/jkube/kit/build/api/auth/handler/FromConfigRegistryAuthHandlerTest.java:[43,67] none() in org.junit.rules.ExpectedException has been deprecated
[WARNING] /home/jenkins/agent/workspace/simplified-downloads-eclipse-release/jkube/jkube-kit/build/api/src/test/java/org/eclipse/jkube/kit/build/api/auth/handler/OpenShiftRegistryAuthHandlerTest.java:[53,67] none() in org.junit.rules.ExpectedException has been deprecated
[INFO] 
[INFO] --- maven-surefire-plugin:2.19.1:test (default-test) @ jkube-kit-build-api ---

-------------------------------------------------------
 T E S T S
-------------------------------------------------------
Running org.eclipse.jkube.kit.build.api.auth.handler.SystemPropertyRegistryAuthHandlerTest
Tests run: 3, Failures: 0, Errors: 0, Skipped: 0, Time elapsed: 0.171 sec - in org.eclipse.jkube.kit.build.api.auth.handler.SystemPropertyRegistryAuthHandlerTest
Running org.eclipse.jkube.kit.build.api.auth.handler.FromConfigRegistryAuthHandlerTest
Tests run: 3, Failures: 0, Errors: 0, Skipped: 0, Time elapsed: 0.01 sec - in org.eclipse.jkube.kit.build.api.auth.handler.FromConfigRegistryAuthHandlerTest
Running org.eclipse.jkube.kit.build.api.auth.handler.OpenShiftRegistryAuthHandlerTest
Tests run: 4, Failures: 0, Errors: 0, Skipped: 0, Time elapsed: 0.056 sec - in org.eclipse.jkube.kit.build.api.auth.handler.OpenShiftRegistryAuthHandlerTest
Running org.eclipse.jkube.kit.build.api.auth.RegistryAuthTest
Tests run: 2, Failures: 0, Errors: 0, Skipped: 0, Time elapsed: 0.005 sec - in org.eclipse.jkube.kit.build.api.auth.RegistryAuthTest
Running org.eclipse.jkube.kit.build.api.helper.DockerFileUtilTest
Tests run: 14, Failures: 0, Errors: 0, Skipped: 0, Time elapsed: 0.032 sec - in org.eclipse.jkube.kit.build.api.helper.DockerFileUtilTest
Running org.eclipse.jkube.kit.build.api.helper.JKubeDockerfileInterpolatorTest
Tests run: 21, Failures: 0, Errors: 0, Skipped: 0, Time elapsed: 0.006 sec - in org.eclipse.jkube.kit.build.api.helper.JKubeDockerfileInterpolatorTest
Running org.eclipse.jkube.kit.build.api.assembly.AssemblyConfigurationUtilsTest
Tests run: 6, Failures: 0, Errors: 0, Skipped: 0, Time elapsed: 0.169 sec - in org.eclipse.jkube.kit.build.api.assembly.AssemblyConfigurationUtilsTest
Running org.eclipse.jkube.kit.build.api.assembly.AssemblyManagerTest
Tests run: 15, Failures: 0, Errors: 0, Skipped: 0, Time elapsed: 0.198 sec - in org.eclipse.jkube.kit.build.api.assembly.AssemblyManagerTest
Running org.eclipse.jkube.kit.build.api.assembly.AssemblyConfigurationSourceTest
Tests run: 5, Failures: 0, Errors: 0, Skipped: 0, Time elapsed: 0.012 sec - in org.eclipse.jkube.kit.build.api.assembly.AssemblyConfigurationSourceTest

Results :

Tests run: 73, Failures: 0, Errors: 0, Skipped: 0

[INFO] 
[INFO] --- maven-jar-plugin:2.4:jar (default-jar) @ jkube-kit-build-api ---
[INFO] Building jar: /home/jenkins/agent/workspace/simplified-downloads-eclipse-release/jkube/jkube-kit/build/api/target/jkube-kit-build-api-1.0.2.jar
[INFO] 
[INFO] --- maven-failsafe-plugin:2.19.1:integration-test (default) @ jkube-kit-build-api ---
[WARNING] File encoding has not been set, using platform encoding UTF-8, i.e. build is platform dependent! The file encoding for reports output files should be provided by the POM property ${project.reporting.outputEncoding}.
[INFO] 
[INFO] --- maven-failsafe-plugin:2.19.1:verify (default) @ jkube-kit-build-api ---
[WARNING] File encoding has not been set, using platform encoding UTF-8, i.e. build is platform dependent! The file encoding for reports output files should be provided by the POM property ${project.reporting.outputEncoding}.
[INFO] 
[INFO] --- maven-install-plugin:2.4:install (default-install) @ jkube-kit-build-api ---
[INFO] Installing /home/jenkins/agent/workspace/simplified-downloads-eclipse-release/jkube/jkube-kit/build/api/target/jkube-kit-build-api-1.0.2.jar to /home/jenkins/.m2/repository/org/eclipse/jkube/jkube-kit-build-api/1.0.2/jkube-kit-build-api-1.0.2.jar
[INFO] Installing /home/jenkins/agent/workspace/simplified-downloads-eclipse-release/jkube/jkube-kit/build/api/pom.xml to /home/jenkins/.m2/repository/org/eclipse/jkube/jkube-kit-build-api/1.0.2/jkube-kit-build-api-1.0.2.pom
[INFO] 
[INFO] ----------< org.eclipse.jkube:jkube-kit-build-service-docker >----------
[INFO] Building JKube Kit :: Build :: Service :: Docker 1.0.2           [10/39]
[INFO] --------------------------------[ jar ]---------------------------------
[INFO] 
[INFO] --- maven-clean-plugin:2.5:clean (default-clean) @ jkube-kit-build-service-docker ---
[INFO] 
[INFO] --- maven-enforcer-plugin:1.4.1:enforce (dependency-convergence) @ jkube-kit-build-service-docker ---
[INFO] 
[INFO] --- maven-resources-plugin:2.6:resources (default-resources) @ jkube-kit-build-service-docker ---
[INFO] Using 'UTF-8' encoding to copy filtered resources.
[INFO] skip non existing resourceDirectory /home/jenkins/agent/workspace/simplified-downloads-eclipse-release/jkube/jkube-kit/build/service/docker/src/main/resources
[INFO] 
[INFO] --- maven-compiler-plugin:3.8.1:compile (default-compile) @ jkube-kit-build-service-docker ---
[INFO] Changes detected - recompiling the module!
[INFO] Compiling 105 source files to /home/jenkins/agent/workspace/simplified-downloads-eclipse-release/jkube/jkube-kit/build/service/docker/target/classes
[WARNING] /home/jenkins/agent/workspace/simplified-downloads-eclipse-release/jkube/jkube-kit/build/service/docker/src/main/java/org/eclipse/jkube/kit/build/service/docker/access/ContainerCreateConfig.java:[22,31] org.apache.commons.text.StrSubstitutor in org.apache.commons.text has been deprecated
[WARNING] /home/jenkins/agent/workspace/simplified-downloads-eclipse-release/jkube/jkube-kit/build/service/docker/src/main/java/org/eclipse/jkube/kit/build/service/docker/WaitService.java:[39,31] org.apache.commons.text.StrSubstitutor in org.apache.commons.text has been deprecated
[WARNING] /home/jenkins/agent/workspace/simplified-downloads-eclipse-release/jkube/jkube-kit/build/service/docker/src/main/java/org/eclipse/jkube/kit/build/service/docker/access/ContainerCreateConfig.java:[22,31] org.apache.commons.text.StrSubstitutor in org.apache.commons.text has been deprecated
[WARNING] /home/jenkins/agent/workspace/simplified-downloads-eclipse-release/jkube/jkube-kit/build/service/docker/src/main/java/org/eclipse/jkube/kit/build/service/docker/WaitService.java:[39,31] org.apache.commons.text.StrSubstitutor in org.apache.commons.text has been deprecated
[WARNING] /home/jenkins/agent/workspace/simplified-downloads-eclipse-release/jkube/jkube-kit/build/service/docker/src/main/java/org/eclipse/jkube/kit/build/service/docker/access/ContainerCreateConfig.java:[22,31] org.apache.commons.text.StrSubstitutor in org.apache.commons.text has been deprecated
[WARNING] /home/jenkins/agent/workspace/simplified-downloads-eclipse-release/jkube/jkube-kit/build/service/docker/src/main/java/org/eclipse/jkube/kit/build/service/docker/WaitService.java:[39,31] org.apache.commons.text.StrSubstitutor in org.apache.commons.text has been deprecated
[WARNING] /home/jenkins/agent/workspace/simplified-downloads-eclipse-release/jkube/jkube-kit/build/service/docker/src/main/java/org/eclipse/jkube/kit/build/service/docker/access/ContainerCreateConfig.java:[22,31] org.apache.commons.text.StrSubstitutor in org.apache.commons.text has been deprecated
[WARNING] /home/jenkins/agent/workspace/simplified-downloads-eclipse-release/jkube/jkube-kit/build/service/docker/src/main/java/org/eclipse/jkube/kit/build/service/docker/WaitService.java:[39,31] org.apache.commons.text.StrSubstitutor in org.apache.commons.text has been deprecated
[WARNING] /home/jenkins/agent/workspace/simplified-downloads-eclipse-release/jkube/jkube-kit/build/service/docker/src/main/java/org/eclipse/jkube/kit/build/service/docker/access/ContainerCreateConfig.java:[22,31] org.apache.commons.text.StrSubstitutor in org.apache.commons.text has been deprecated
[WARNING] /home/jenkins/agent/workspace/simplified-downloads-eclipse-release/jkube/jkube-kit/build/service/docker/src/main/java/org/eclipse/jkube/kit/build/service/docker/WaitService.java:[39,31] org.apache.commons.text.StrSubstitutor in org.apache.commons.text has been deprecated
[WARNING] /home/jenkins/agent/workspace/simplified-downloads-eclipse-release/jkube/jkube-kit/build/service/docker/src/main/java/org/eclipse/jkube/kit/build/service/docker/access/ContainerCreateConfig.java:[90,46] org.apache.commons.text.StrSubstitutor in org.apache.commons.text has been deprecated
[WARNING] /home/jenkins/agent/workspace/simplified-downloads-eclipse-release/jkube/jkube-kit/build/service/docker/src/main/java/org/eclipse/jkube/kit/build/service/docker/WaitService.java:[150,26] org.apache.commons.text.StrSubstitutor in org.apache.commons.text has been deprecated
[INFO] /home/jenkins/agent/workspace/simplified-downloads-eclipse-release/jkube/jkube-kit/build/service/docker/src/main/java/org/eclipse/jkube/kit/build/service/docker/access/ContainerCreateConfig.java: Some input files use unchecked or unsafe operations.
[INFO] /home/jenkins/agent/workspace/simplified-downloads-eclipse-release/jkube/jkube-kit/build/service/docker/src/main/java/org/eclipse/jkube/kit/build/service/docker/access/ContainerCreateConfig.java: Recompile with -Xlint:unchecked for details.
[INFO] 
[INFO] --- maven-resources-plugin:2.6:testResources (default-testResources) @ jkube-kit-build-service-docker ---
[INFO] Using 'UTF-8' encoding to copy filtered resources.
[INFO] Copying 7 resources
[INFO] 
[INFO] --- maven-compiler-plugin:3.8.1:testCompile (default-testCompile) @ jkube-kit-build-service-docker ---
[INFO] Changes detected - recompiling the module!
[INFO] Compiling 15 source files to /home/jenkins/agent/workspace/simplified-downloads-eclipse-release/jkube/jkube-kit/build/service/docker/target/test-classes
[WARNING] /home/jenkins/agent/workspace/simplified-downloads-eclipse-release/jkube/jkube-kit/build/service/docker/src/test/java/org/eclipse/jkube/kit/build/service/docker/access/KeyStoreUtilTest.java:[33,59] none() in org.junit.rules.ExpectedException has been deprecated
[WARNING] /home/jenkins/agent/workspace/simplified-downloads-eclipse-release/jkube/jkube-kit/build/service/docker/src/test/java/org/eclipse/jkube/kit/build/service/docker/auth/ecr/DockerRegistryAuthHandlerTest.java:[55,67] none() in org.junit.rules.ExpectedException has been deprecated
[INFO] /home/jenkins/agent/workspace/simplified-downloads-eclipse-release/jkube/jkube-kit/build/service/docker/src/test/java/org/eclipse/jkube/kit/build/service/docker/access/hc/ApacheHttpClientDelegateTest.java: Some input files use unchecked or unsafe operations.
[INFO] /home/jenkins/agent/workspace/simplified-downloads-eclipse-release/jkube/jkube-kit/build/service/docker/src/test/java/org/eclipse/jkube/kit/build/service/docker/access/hc/ApacheHttpClientDelegateTest.java: Recompile with -Xlint:unchecked for details.
[INFO] 
[INFO] --- maven-surefire-plugin:2.19.1:test (default-test) @ jkube-kit-build-service-docker ---

-------------------------------------------------------
 T E S T S
-------------------------------------------------------
Running org.eclipse.jkube.kit.build.service.docker.access.BuildConfigTest
Tests run: 6, Failures: 0, Errors: 0, Skipped: 0, Time elapsed: 0.107 sec - in org.eclipse.jkube.kit.build.service.docker.access.BuildConfigTest
Running org.eclipse.jkube.kit.build.service.docker.access.hc.HcChunkedResponseHandlerWrapperTest
Tests run: 3, Failures: 0, Errors: 0, Skipped: 0, Time elapsed: 0.176 sec - in org.eclipse.jkube.kit.build.service.docker.access.hc.HcChunkedResponseHandlerWrapperTest
Running org.eclipse.jkube.kit.build.service.docker.access.hc.ApacheHttpClientDelegateTest
Tests run: 5, Failures: 0, Errors: 0, Skipped: 0, Time elapsed: 0.092 sec - in org.eclipse.jkube.kit.build.service.docker.access.hc.ApacheHttpClientDelegateTest
Running org.eclipse.jkube.kit.build.service.docker.access.hc.DockerAccessWithHcClientTest
Tests run: 7, Failures: 0, Errors: 0, Skipped: 0, Time elapsed: 0.132 sec - in org.eclipse.jkube.kit.build.service.docker.access.hc.DockerAccessWithHcClientTest
Running org.eclipse.jkube.kit.build.service.docker.access.KeyStoreUtilTest
Tests run: 5, Failures: 0, Errors: 0, Skipped: 0, Time elapsed: 0.62 sec - in org.eclipse.jkube.kit.build.service.docker.access.KeyStoreUtilTest
Running org.eclipse.jkube.kit.build.service.docker.WatchServiceTest
Tests run: 4, Failures: 0, Errors: 0, Skipped: 0, Time elapsed: 0.088 sec - in org.eclipse.jkube.kit.build.service.docker.WatchServiceTest
Running org.eclipse.jkube.kit.build.service.docker.auth.AuthConfigFactoryTest
Tests run: 8, Failures: 0, Errors: 0, Skipped: 0, Time elapsed: 0.147 sec - in org.eclipse.jkube.kit.build.service.docker.auth.AuthConfigFactoryTest
Running org.eclipse.jkube.kit.build.service.docker.auth.ecr.AwsSigner4RequestTest
Tests run: 2, Failures: 0, Errors: 0, Skipped: 0, Time elapsed: 0.026 sec - in org.eclipse.jkube.kit.build.service.docker.auth.ecr.AwsSigner4RequestTest
Running org.eclipse.jkube.kit.build.service.docker.auth.ecr.EcrExtendedAuthTest
Tests run: 4, Failures: 0, Errors: 0, Skipped: 0, Time elapsed: 0.028 sec - in org.eclipse.jkube.kit.build.service.docker.auth.ecr.EcrExtendedAuthTest
Running org.eclipse.jkube.kit.build.service.docker.auth.ecr.DockerRegistryAuthHandlerTest
Tests run: 7, Failures: 0, Errors: 0, Skipped: 0, Time elapsed: 0.046 sec - in org.eclipse.jkube.kit.build.service.docker.auth.ecr.DockerRegistryAuthHandlerTest
Running org.eclipse.jkube.kit.build.service.docker.config.handler.RegistryServerConfigurationTest
Tests run: 1, Failures: 0, Errors: 0, Skipped: 0, Time elapsed: 0.006 sec - in org.eclipse.jkube.kit.build.service.docker.config.handler.RegistryServerConfigurationTest
Running org.eclipse.jkube.kit.build.service.docker.ImageConfigurationTest
Tests run: 1, Failures: 0, Errors: 0, Skipped: 0, Time elapsed: 0.071 sec - in org.eclipse.jkube.kit.build.service.docker.ImageConfigurationTest
Running org.eclipse.jkube.kit.build.service.docker.helper.AutoPullModeTest
Tests run: 2, Failures: 0, Errors: 0, Skipped: 0, Time elapsed: 0.002 sec - in org.eclipse.jkube.kit.build.service.docker.helper.AutoPullModeTest
Running org.eclipse.jkube.kit.build.service.docker.helper.ImageNameFormatterTest
Tests run: 8, Failures: 0, Errors: 0, Skipped: 0, Time elapsed: 0.06 sec - in org.eclipse.jkube.kit.build.service.docker.helper.ImageNameFormatterTest
Running org.eclipse.jkube.kit.build.service.docker.helper.AnsiLoggerFacadeTest
T>Yet another Test emphasis
Tests run: 1, Failures: 0, Errors: 0, Skipped: 0, Time elapsed: 0.014 sec - in org.eclipse.jkube.kit.build.service.docker.helper.AnsiLoggerFacadeTest

Results :

Tests run: 64, Failures: 0, Errors: 0, Skipped: 0

[INFO] 
[INFO] --- maven-jar-plugin:2.4:jar (default-jar) @ jkube-kit-build-service-docker ---
[INFO] Building jar: /home/jenkins/agent/workspace/simplified-downloads-eclipse-release/jkube/jkube-kit/build/service/docker/target/jkube-kit-build-service-docker-1.0.2.jar
[INFO] 
[INFO] --- maven-failsafe-plugin:2.19.1:integration-test (default) @ jkube-kit-build-service-docker ---
[WARNING] File encoding has not been set, using platform encoding UTF-8, i.e. build is platform dependent! The file encoding for reports output files should be provided by the POM property ${project.reporting.outputEncoding}.
[INFO] 
[INFO] --- maven-failsafe-plugin:2.19.1:verify (default) @ jkube-kit-build-service-docker ---
[WARNING] File encoding has not been set, using platform encoding UTF-8, i.e. build is platform dependent! The file encoding for reports output files should be provided by the POM property ${project.reporting.outputEncoding}.
[INFO] 
[INFO] --- maven-install-plugin:2.4:install (default-install) @ jkube-kit-build-service-docker ---
[INFO] Installing /home/jenkins/agent/workspace/simplified-downloads-eclipse-release/jkube/jkube-kit/build/service/docker/target/jkube-kit-build-service-docker-1.0.2.jar to /home/jenkins/.m2/repository/org/eclipse/jkube/jkube-kit-build-service-docker/1.0.2/jkube-kit-build-service-docker-1.0.2.jar
[INFO] Installing /home/jenkins/agent/workspace/simplified-downloads-eclipse-release/jkube/jkube-kit/build/service/docker/pom.xml to /home/jenkins/.m2/repository/org/eclipse/jkube/jkube-kit-build-service-docker/1.0.2/jkube-kit-build-service-docker-1.0.2.pom
[INFO] 
[INFO] -----------< org.eclipse.jkube:jkube-kit-build-service-jib >------------
[INFO] Building JKube Kit :: Build :: Service :: JIB 1.0.2              [11/39]
[INFO] --------------------------------[ jar ]---------------------------------
[INFO] 
[INFO] --- maven-clean-plugin:2.5:clean (default-clean) @ jkube-kit-build-service-jib ---
[INFO] 
[INFO] --- maven-enforcer-plugin:1.4.1:enforce (dependency-convergence) @ jkube-kit-build-service-jib ---
[INFO] 
[INFO] --- maven-resources-plugin:2.6:resources (default-resources) @ jkube-kit-build-service-jib ---
[INFO] Using 'UTF-8' encoding to copy filtered resources.
[INFO] skip non existing resourceDirectory /home/jenkins/agent/workspace/simplified-downloads-eclipse-release/jkube/jkube-kit/build/service/jib/src/main/resources
[INFO] 
[INFO] --- maven-compiler-plugin:3.8.1:compile (default-compile) @ jkube-kit-build-service-jib ---
[INFO] Changes detected - recompiling the module!
[INFO] Compiling 1 source file to /home/jenkins/agent/workspace/simplified-downloads-eclipse-release/jkube/jkube-kit/build/service/jib/target/classes
[INFO] 
[INFO] --- maven-resources-plugin:2.6:testResources (default-testResources) @ jkube-kit-build-service-jib ---
[INFO] Using 'UTF-8' encoding to copy filtered resources.
[INFO] skip non existing resourceDirectory /home/jenkins/agent/workspace/simplified-downloads-eclipse-release/jkube/jkube-kit/build/service/jib/src/test/resources
[INFO] 
[INFO] --- maven-compiler-plugin:3.8.1:testCompile (default-testCompile) @ jkube-kit-build-service-jib ---
[INFO] Changes detected - recompiling the module!
[INFO] Compiling 1 source file to /home/jenkins/agent/workspace/simplified-downloads-eclipse-release/jkube/jkube-kit/build/service/jib/target/test-classes
[INFO] 
[INFO] --- maven-surefire-plugin:2.19.1:test (default-test) @ jkube-kit-build-service-jib ---

-------------------------------------------------------
 T E S T S
-------------------------------------------------------
Running org.eclipse.jkube.kit.service.jib.JibServiceUtilTest
Tests run: 7, Failures: 0, Errors: 0, Skipped: 0, Time elapsed: 0.229 sec - in org.eclipse.jkube.kit.service.jib.JibServiceUtilTest

Results :

Tests run: 7, Failures: 0, Errors: 0, Skipped: 0

[INFO] 
[INFO] --- maven-jar-plugin:2.4:jar (default-jar) @ jkube-kit-build-service-jib ---
[INFO] Building jar: /home/jenkins/agent/workspace/simplified-downloads-eclipse-release/jkube/jkube-kit/build/service/jib/target/jkube-kit-build-service-jib-1.0.2.jar
[INFO] 
[INFO] --- maven-failsafe-plugin:2.19.1:integration-test (default) @ jkube-kit-build-service-jib ---
[WARNING] File encoding has not been set, using platform encoding UTF-8, i.e. build is platform dependent! The file encoding for reports output files should be provided by the POM property ${project.reporting.outputEncoding}.
[INFO] 
[INFO] --- maven-failsafe-plugin:2.19.1:verify (default) @ jkube-kit-build-service-jib ---
[WARNING] File encoding has not been set, using platform encoding UTF-8, i.e. build is platform dependent! The file encoding for reports output files should be provided by the POM property ${project.reporting.outputEncoding}.
[INFO] 
[INFO] --- maven-install-plugin:2.4:install (default-install) @ jkube-kit-build-service-jib ---
[INFO] Installing /home/jenkins/agent/workspace/simplified-downloads-eclipse-release/jkube/jkube-kit/build/service/jib/target/jkube-kit-build-service-jib-1.0.2.jar to /home/jenkins/.m2/repository/org/eclipse/jkube/jkube-kit-build-service-jib/1.0.2/jkube-kit-build-service-jib-1.0.2.jar
[INFO] Installing /home/jenkins/agent/workspace/simplified-downloads-eclipse-release/jkube/jkube-kit/build/service/jib/pom.xml to /home/jenkins/.m2/repository/org/eclipse/jkube/jkube-kit-build-service-jib/1.0.2/jkube-kit-build-service-jib-1.0.2.pom
[INFO] 
[INFO] -------------< org.eclipse.jkube:jkube-kit-config-service >-------------
[INFO] Building JKube Kit :: Config :: Service 1.0.2                    [12/39]
[INFO] --------------------------------[ jar ]---------------------------------
[INFO] 
[INFO] --- maven-clean-plugin:2.5:clean (default-clean) @ jkube-kit-config-service ---
[INFO] 
[INFO] --- maven-enforcer-plugin:1.4.1:enforce (dependency-convergence) @ jkube-kit-config-service ---
[INFO] 
[INFO] --- maven-resources-plugin:2.6:resources (default-resources) @ jkube-kit-config-service ---
[INFO] Using 'UTF-8' encoding to copy filtered resources.
[INFO] skip non existing resourceDirectory /home/jenkins/agent/workspace/simplified-downloads-eclipse-release/jkube/jkube-kit/config/service/src/main/resources
[INFO] 
[INFO] --- maven-compiler-plugin:3.8.1:compile (default-compile) @ jkube-kit-config-service ---
[INFO] Changes detected - recompiling the module!
[INFO] Compiling 21 source files to /home/jenkins/agent/workspace/simplified-downloads-eclipse-release/jkube/jkube-kit/config/service/target/classes
[INFO] /home/jenkins/agent/workspace/simplified-downloads-eclipse-release/jkube/jkube-kit/config/service/src/main/java/org/eclipse/jkube/kit/config/service/kubernetes/KubernetesUndeployService.java: Some input files use unchecked or unsafe operations.
[INFO] /home/jenkins/agent/workspace/simplified-downloads-eclipse-release/jkube/jkube-kit/config/service/src/main/java/org/eclipse/jkube/kit/config/service/kubernetes/KubernetesUndeployService.java: Recompile with -Xlint:unchecked for details.
[INFO] 
[INFO] --- maven-resources-plugin:2.6:testResources (default-testResources) @ jkube-kit-config-service ---
[INFO] Using 'UTF-8' encoding to copy filtered resources.
[INFO] Copying 2 resources
[INFO] 
[INFO] --- maven-compiler-plugin:3.8.1:testCompile (default-testCompile) @ jkube-kit-config-service ---
[INFO] Changes detected - recompiling the module!
[INFO] Compiling 11 source files to /home/jenkins/agent/workspace/simplified-downloads-eclipse-release/jkube/jkube-kit/config/service/target/test-classes
[INFO] /home/jenkins/agent/workspace/simplified-downloads-eclipse-release/jkube/jkube-kit/config/service/src/test/java/org/eclipse/jkube/kit/config/service/openshift/ImageStreamServiceTest.java: /home/jenkins/agent/workspace/simplified-downloads-eclipse-release/jkube/jkube-kit/config/service/src/test/java/org/eclipse/jkube/kit/config/service/openshift/ImageStreamServiceTest.java uses unchecked or unsafe operations.
[INFO] /home/jenkins/agent/workspace/simplified-downloads-eclipse-release/jkube/jkube-kit/config/service/src/test/java/org/eclipse/jkube/kit/config/service/openshift/ImageStreamServiceTest.java: Recompile with -Xlint:unchecked for details.
[INFO] 
[INFO] --- maven-surefire-plugin:2.19.1:test (default-test) @ jkube-kit-config-service ---

-------------------------------------------------------
 T E S T S
-------------------------------------------------------
Running org.eclipse.jkube.kit.config.service.kubernetes.DockerBuildServiceTest
Tests run: 1, Failures: 0, Errors: 0, Skipped: 0, Time elapsed: 0.167 sec - in org.eclipse.jkube.kit.config.service.kubernetes.DockerBuildServiceTest
Running org.eclipse.jkube.kit.config.service.kubernetes.JibBuildServiceTest
Tests run: 7, Failures: 0, Errors: 0, Skipped: 0, Time elapsed: 0.261 sec - in org.eclipse.jkube.kit.config.service.kubernetes.JibBuildServiceTest
Running org.eclipse.jkube.kit.config.service.kubernetes.KubernetesUndeployServiceTest
Tests run: 6, Failures: 0, Errors: 0, Skipped: 0, Time elapsed: 0.545 sec - in org.eclipse.jkube.kit.config.service.kubernetes.KubernetesUndeployServiceTest
Running org.eclipse.jkube.kit.config.service.openshift.PatchServiceTest
SLF4J: Failed to load class "org.slf4j.impl.StaticLoggerBinder".
SLF4J: Defaulting to no-operation (NOP) logger implementation
SLF4J: See http://www.slf4j.org/codes.html#StaticLoggerBinder for further details.
Oct 30, 2020 4:10:12 PM okhttp3.mockwebserver.MockWebServer$2 execute
INFO: MockWebServer[34845] starting to accept connections
Oct 30, 2020 4:10:12 PM okhttp3.mockwebserver.MockWebServer$3 processOneRequest
INFO: MockWebServer[34845] received request: GET /apis HTTP/1.1 and responded: HTTP/1.1 404 Client Error
Oct 30, 2020 4:10:12 PM okhttp3.mockwebserver.MockWebServer$3 processOneRequest
INFO: MockWebServer[34845] received request: GET /apis/route.openshift.io/v1/namespaces/test/routes/route HTTP/1.1 and responded: HTTP/1.1 200 OK
Oct 30, 2020 4:10:12 PM okhttp3.mockwebserver.MockWebServer$3 processOneRequest
INFO: MockWebServer[34845] received request: GET /apis/route.openshift.io/v1/namespaces/test/routes/route HTTP/1.1 and responded: HTTP/1.1 200 OK
Oct 30, 2020 4:10:12 PM okhttp3.mockwebserver.MockWebServer$3 processOneRequest
INFO: MockWebServer[34845] received request: PATCH /apis/route.openshift.io/v1/namespaces/test/routes/route HTTP/1.1 and responded: HTTP/1.1 200 OK
Oct 30, 2020 4:10:12 PM okhttp3.mockwebserver.MockWebServer$2 execute
INFO: MockWebServer[50744] starting to accept connections
Oct 30, 2020 4:10:12 PM okhttp3.mockwebserver.MockWebServer$3 processOneRequest
INFO: MockWebServer[50744] received request: GET /apis HTTP/1.1 and responded: HTTP/1.1 404 Client Error
Oct 30, 2020 4:10:12 PM okhttp3.mockwebserver.MockWebServer$3 processOneRequest
INFO: MockWebServer[50744] received request: GET /api/v1/namespaces/test/services/service1 HTTP/1.1 and responded: HTTP/1.1 200 OK
Oct 30, 2020 4:10:12 PM okhttp3.mockwebserver.MockWebServer$3 processOneRequest
INFO: MockWebServer[50744] received request: GET /api/v1/namespaces/test/services/service1 HTTP/1.1 and responded: HTTP/1.1 200 OK
Oct 30, 2020 4:10:12 PM okhttp3.mockwebserver.MockWebServer$3 processOneRequest
INFO: MockWebServer[50744] received request: GET /api/v1/namespaces/test/services/service1 HTTP/1.1 and responded: HTTP/1.1 200 OK
Oct 30, 2020 4:10:12 PM okhttp3.mockwebserver.MockWebServer$3 processOneRequest
INFO: MockWebServer[50744] received request: PATCH /api/v1/namespaces/test/services/service1 HTTP/1.1 and responded: HTTP/1.1 200 OK
Oct 30, 2020 4:10:12 PM okhttp3.mockwebserver.MockWebServer$2 execute
INFO: MockWebServer[49908] starting to accept connections
Oct 30, 2020 4:10:12 PM okhttp3.mockwebserver.MockWebServer$3 processOneRequest
INFO: MockWebServer[49908] received request: GET /apis HTTP/1.1 and responded: HTTP/1.1 404 Client Error
Oct 30, 2020 4:10:12 PM okhttp3.mockwebserver.MockWebServer$2 execute
INFO: MockWebServer[41233] starting to accept connections
Oct 30, 2020 4:10:12 PM okhttp3.mockwebserver.MockWebServer$3 processOneRequest
INFO: MockWebServer[41233] received request: GET /apis HTTP/1.1 and responded: HTTP/1.1 404 Client Error
Oct 30, 2020 4:10:12 PM okhttp3.mockwebserver.MockWebServer$3 processOneRequest
INFO: MockWebServer[41233] received request: GET /api/v1/namespaces/test/secrets/secret HTTP/1.1 and responded: HTTP/1.1 200 OK
Oct 30, 2020 4:10:12 PM okhttp3.mockwebserver.MockWebServer$3 processOneRequest
INFO: MockWebServer[41233] received request: GET /api/v1/namespaces/test/secrets/secret HTTP/1.1 and responded: HTTP/1.1 200 OK
Oct 30, 2020 4:10:12 PM okhttp3.mockwebserver.MockWebServer$3 processOneRequest
INFO: MockWebServer[41233] received request: PATCH /api/v1/namespaces/test/secrets/secret HTTP/1.1 and responded: HTTP/1.1 200 OK
Tests run: 4, Failures: 0, Errors: 0, Skipped: 0, Time elapsed: 0.72 sec - in org.eclipse.jkube.kit.config.service.openshift.PatchServiceTest
Running org.eclipse.jkube.kit.config.service.openshift.OpenshiftUndeployServiceTest
Tests run: 7, Failures: 0, Errors: 0, Skipped: 0, Time elapsed: 0.382 sec - in org.eclipse.jkube.kit.config.service.openshift.OpenshiftUndeployServiceTest
Running org.eclipse.jkube.kit.config.service.openshift.OpenshiftBuildServiceTest
Oct 30, 2020 4:10:13 PM okhttp3.mockwebserver.MockWebServer$2 execute
INFO: MockWebServer[39096] starting to accept connections
Oct 30, 2020 4:10:13 PM okhttp3.mockwebserver.MockWebServer$3 processOneRequest
INFO: MockWebServer[39096] received request: GET /apis HTTP/1.1 and responded: HTTP/1.1 404 Client Error
Oct 30, 2020 4:10:13 PM okhttp3.mockwebserver.MockWebServer$2 execute
INFO: MockWebServer[37393] starting to accept connections
Oct 30, 2020 4:10:13 PM okhttp3.mockwebserver.MockWebServer$3 processOneRequest
INFO: MockWebServer[37393] received request: GET /apis HTTP/1.1 and responded: HTTP/1.1 404 Client Error
Oct 30, 2020 4:10:13 PM okhttp3.mockwebserver.MockWebServer$3 processOneRequest
INFO: MockWebServer[37393] received request: GET /apis/build.openshift.io/v1/namespaces/test/buildconfigs/myapp-s2i-suffix2 HTTP/1.1 and responded: HTTP/1.1 404 Client Error
Creating BuildServiceConfig myapp-s2i-suffix2 for Source build
Creating ImageStream myapp
Oct 30, 2020 4:10:13 PM okhttp3.mockwebserver.MockWebServer$3 processOneRequest
INFO: MockWebServer[37393] received request: GET /apis/image.openshift.io/v1/namespaces/test/imagestreams/myapp HTTP/1.1 and responded: HTTP/1.1 404 Client Error
Oct 30, 2020 4:10:13 PM okhttp3.mockwebserver.MockWebServer$3 processOneRequest
INFO: MockWebServer[37393] received request: POST /apis/image.openshift.io/v1/namespaces/test/imagestreams HTTP/1.1 and responded: HTTP/1.1 201 OK
Oct 30, 2020 4:10:13 PM okhttp3.mockwebserver.MockWebServer$3 processOneRequest
INFO: MockWebServer[37393] received request: POST /apis/build.openshift.io/v1/namespaces/test/buildconfigs HTTP/1.1 and responded: HTTP/1.1 201 OK
Starting Build myapp-s2i-suffix2
Oct 30, 2020 4:10:13 PM okhttp3.mockwebserver.MockWebServer$3 processOneRequest
INFO: MockWebServer[37393] received request: POST /apis/build.openshift.io/v1/namespaces/test/buildconfigs/myapp-s2i-suffix2/instantiatebinary?name=myapp-s2i-suffix2&namespace=test HTTP/1.1 and responded: HTTP/1.1 201 OK
Oct 30, 2020 4:10:13 PM okhttp3.mockwebserver.MockWebServer$3 processOneRequest
INFO: MockWebServer[37393] received request: GET /api/v1/namespaces/test/pods?fieldSelector=metadata.name%3Dmyapp-build&watch=true HTTP/1.1 and responded: HTTP/1.1 404 Client Error
Could not watch pod
Waiting for build myapp to complete...
Exception in thread "OkHttp Dispatcher" java.util.concurrent.RejectedExecutionException: Task java.util.concurrent.ScheduledThreadPoolExecutor$ScheduledFutureTask@2341b7a7 rejected from java.util.concurrent.ScheduledThreadPoolExecutor@767a292b[Terminated, pool size = 0, active threads = 0, queued tasks = 0, completed tasks = 0]
	at java.util.concurrent.ThreadPoolExecutor$AbortPolicy.rejectedExecution(ThreadPoolExecutor.java:2063)
	at java.util.concurrent.ThreadPoolExecutor.reject(ThreadPoolExecutor.java:830)
	at java.util.concurrent.ScheduledThreadPoolExecutor.delayedExecute(ScheduledThreadPoolExecutor.java:326)
	at java.util.concurrent.ScheduledThreadPoolExecutor.schedule(ScheduledThreadPoolExecutor.java:533)
	at java.util.concurrent.ScheduledThreadPoolExecutor.submit(ScheduledThreadPoolExecutor.java:632)
	at java.util.concurrent.Executors$DelegatedExecutorService.submit(Executors.java:678)
	at io.fabric8.kubernetes.client.dsl.internal.WatchConnectionManager.scheduleReconnect(WatchConnectionManager.java:304)
	at io.fabric8.kubernetes.client.dsl.internal.WatchConnectionManager.access$800(WatchConnectionManager.java:50)
	at io.fabric8.kubernetes.client.dsl.internal.WatchConnectionManager$1.onFailure(WatchConnectionManager.java:216)
	at okhttp3.internal.ws.RealWebSocket.failWebSocket(RealWebSocket.java:571)
	at okhttp3.internal.ws.RealWebSocket$2.onResponse(RealWebSocket.java:198)
	at okhttp3.RealCall$AsyncCall.execute(RealCall.java:203)
	at okhttp3.internal.NamedRunnable.run(NamedRunnable.java:32)
	at java.util.concurrent.ThreadPoolExecutor.runWorker(ThreadPoolExecutor.java:1149)
	at java.util.concurrent.ThreadPoolExecutor$Worker.run(ThreadPoolExecutor.java:624)
	at java.lang.Thread.run(Thread.java:748)
Oct 30, 2020 4:10:13 PM okhttp3.mockwebserver.MockWebServer$3 processOneRequest
INFO: MockWebServer[37393] received request: GET /api/v1/namespaces/test/pods/myapp-build/log?pretty=false&follow=true HTTP/1.1 and responded: HTTP/1.1 404 Client Error
Oct 30, 2020 4:10:13 PM okhttp3.mockwebserver.MockWebServer$3 processOneRequest
INFO: MockWebServer[37393] received request: GET /apis/build.openshift.io/v1/namespaces/test/builds/myapp HTTP/1.1 and responded: HTTP/1.1 200 OK
Build myapp is already finished
Build myapp in status Complete
Oct 30, 2020 4:10:13 PM okhttp3.mockwebserver.MockWebServer$3 processOneRequest
INFO: MockWebServer[37393] received request: GET /apis/image.openshift.io/v1/namespaces/test/imagestreams/myapp HTTP/1.1 and responded: HTTP/1.1 200 OK
Found tag on ImageStream myapp tag: abcdef0123456789
Oct 30, 2020 4:10:13 PM okhttp3.mockwebserver.MockWebServer$3 processOneRequest
INFO: MockWebServer[37393] received request: GET /apis/build.openshift.io/v1/namespaces/test/builds?fieldSelector=metadata.name%3Dmyapp&watch=true HTTP/1.1 and responded: HTTP/1.1 101 Switching Protocols
ImageStream myapp written to /tmp/junit5992473536325838915/openshift-build-service/null-is.yml
Oct 30, 2020 4:10:13 PM okhttp3.mockwebserver.MockWebServer$2 execute
INFO: MockWebServer[44864] starting to accept connections
Oct 30, 2020 4:10:13 PM okhttp3.mockwebserver.MockWebServer$3 processOneRequest
INFO: MockWebServer[44864] received request: GET /apis HTTP/1.1 and responded: HTTP/1.1 404 Client Error
Creating BuildServiceConfig myapp-s2i-suffix2 for Source build
Oct 30, 2020 4:10:13 PM okhttp3.mockwebserver.MockWebServer$3 processOneRequest
INFO: MockWebServer[44864] received request: GET /apis/build.openshift.io/v1/namespaces/test/buildconfigs/myapp-s2i-suffix2 HTTP/1.1 and responded: HTTP/1.1 404 Client Error
Creating ImageStream myapp
Oct 30, 2020 4:10:13 PM okhttp3.mockwebserver.MockWebServer$3 processOneRequest
INFO: MockWebServer[44864] received request: GET /apis/image.openshift.io/v1/namespaces/test/imagestreams/myapp HTTP/1.1 and responded: HTTP/1.1 404 Client Error
Oct 30, 2020 4:10:13 PM okhttp3.mockwebserver.MockWebServer$3 processOneRequest
INFO: MockWebServer[44864] received request: POST /apis/image.openshift.io/v1/namespaces/test/imagestreams HTTP/1.1 and responded: HTTP/1.1 201 OK
Oct 30, 2020 4:10:13 PM okhttp3.mockwebserver.MockWebServer$3 processOneRequest
INFO: MockWebServer[44864] received request: POST /apis/build.openshift.io/v1/namespaces/test/buildconfigs HTTP/1.1 and responded: HTTP/1.1 201 OK
Starting Build myapp-s2i-suffix2
Oct 30, 2020 4:10:13 PM okhttp3.mockwebserver.MockWebServer$3 processOneRequest
INFO: MockWebServer[44864] received request: POST /apis/build.openshift.io/v1/namespaces/test/buildconfigs/myapp-s2i-suffix2/instantiatebinary?name=myapp-s2i-suffix2&namespace=test HTTP/1.1 and responded: HTTP/1.1 201 OK
Oct 30, 2020 4:10:14 PM okhttp3.mockwebserver.MockWebServer$3 processOneRequest
INFO: MockWebServer[44864] received request: GET /api/v1/namespaces/test/pods?fieldSelector=metadata.name%3Dmyapp-build&watch=true HTTP/1.1 and responded: HTTP/1.1 404 Client Error
Could not watch pod
Waiting for build myapp to complete...
Oct 30, 2020 4:10:14 PM okhttp3.mockwebserver.MockWebServer$3 processOneRequest
INFO: MockWebServer[44864] received request: GET /api/v1/namespaces/test/pods/myapp-build/log?pretty=false&follow=true HTTP/1.1 and responded: HTTP/1.1 404 Client Error
Oct 30, 2020 4:10:14 PM okhttp3.mockwebserver.MockWebServer$3 processOneRequest
INFO: MockWebServer[44864] received request: GET /apis/build.openshift.io/v1/namespaces/test/builds/myapp HTTP/1.1 and responded: HTTP/1.1 200 OK
Build myapp is already finished
Oct 30, 2020 4:10:14 PM okhttp3.mockwebserver.MockWebServer$3 processOneRequest
INFO: MockWebServer[44864] received request: GET /apis/build.openshift.io/v1/namespaces/test/builds?fieldSelector=metadata.name%3Dmyapp&watch=true HTTP/1.1 and responded: HTTP/1.1 101 Switching Protocols
Oct 30, 2020 4:10:14 PM okhttp3.mockwebserver.MockWebServer$2 execute
INFO: MockWebServer[58615] starting to accept connections
Oct 30, 2020 4:10:14 PM okhttp3.mockwebserver.MockWebServer$3 processOneRequest
INFO: MockWebServer[58615] received request: GET /apis HTTP/1.1 and responded: HTTP/1.1 404 Client Error
Oct 30, 2020 4:10:14 PM okhttp3.mockwebserver.MockWebServer$3 processOneRequest
INFO: MockWebServer[58615] received request: GET /apis/build.openshift.io/v1/namespaces/test/buildconfigs/myapp-s2i HTTP/1.1 and responded: HTTP/1.1 404 Client Error
Creating BuildServiceConfig myapp-s2i for Source build
Oct 30, 2020 4:10:14 PM okhttp3.mockwebserver.MockWebServer$3 processOneRequest
INFO: MockWebServer[58615] received request: GET /apis/image.openshift.io/v1/namespaces/test/imagestreams/myapp HTTP/1.1 and responded: HTTP/1.1 404 Client Error
Creating ImageStream myapp
Oct 30, 2020 4:10:14 PM okhttp3.mockwebserver.MockWebServer$3 processOneRequest
INFO: MockWebServer[58615] received request: POST /apis/image.openshift.io/v1/namespaces/test/imagestreams HTTP/1.1 and responded: HTTP/1.1 201 OK
Oct 30, 2020 4:10:14 PM okhttp3.mockwebserver.MockWebServer$3 processOneRequest
INFO: MockWebServer[58615] received request: POST /apis/build.openshift.io/v1/namespaces/test/buildconfigs HTTP/1.1 and responded: HTTP/1.1 201 OK
Starting Build myapp-s2i
Oct 30, 2020 4:10:14 PM okhttp3.mockwebserver.MockWebServer$3 processOneRequest
INFO: MockWebServer[58615] received request: POST /apis/build.openshift.io/v1/namespaces/test/buildconfigs/myapp-s2i/instantiatebinary?name=myapp-s2i&namespace=test HTTP/1.1 and responded: HTTP/1.1 201 OK
Oct 30, 2020 4:10:14 PM okhttp3.mockwebserver.MockWebServer$3 processOneRequest
INFO: MockWebServer[58615] received request: GET /api/v1/namespaces/test/pods?fieldSelector=metadata.name%3Dmyapp-build&watch=true HTTP/1.1 and responded: HTTP/1.1 404 Client Error
Could not watch pod
Waiting for build myapp to complete...
Oct 30, 2020 4:10:14 PM okhttp3.mockwebserver.MockWebServer$3 processOneRequest
INFO: MockWebServer[58615] received request: GET /api/v1/namespaces/test/pods/myapp-build/log?pretty=false&follow=true HTTP/1.1 and responded: HTTP/1.1 404 Client Error
Oct 30, 2020 4:10:14 PM okhttp3.mockwebserver.MockWebServer$3 processOneRequest
INFO: MockWebServer[58615] received request: GET /apis/build.openshift.io/v1/namespaces/test/builds/myapp HTTP/1.1 and responded: HTTP/1.1 200 OK
Build myapp is already finished
Build myapp in status Complete
Oct 30, 2020 4:10:14 PM okhttp3.mockwebserver.MockWebServer$3 processOneRequest
INFO: MockWebServer[58615] received request: GET /apis/image.openshift.io/v1/namespaces/test/imagestreams/myapp HTTP/1.1 and responded: HTTP/1.1 200 OK
Found tag on ImageStream myapp tag: abcdef0123456789
ImageStream myapp written to /tmp/junit8618274070889404043/openshift-build-service/null-is.yml
Oct 30, 2020 4:10:14 PM okhttp3.mockwebserver.MockWebServer$3 processOneRequest
INFO: MockWebServer[58615] received request: GET /apis/build.openshift.io/v1/namespaces/test/builds?fieldSelector=metadata.name%3Dmyapp&watch=true HTTP/1.1 and responded: HTTP/1.1 101 Switching Protocols
Oct 30, 2020 4:10:14 PM okhttp3.mockwebserver.MockWebServer$2 execute
INFO: MockWebServer[42927] starting to accept connections
Oct 30, 2020 4:10:14 PM okhttp3.mockwebserver.MockWebServer$3 processOneRequest
INFO: MockWebServer[42927] received request: GET /apis HTTP/1.1 and responded: HTTP/1.1 404 Client Error
Oct 30, 2020 4:10:14 PM okhttp3.mockwebserver.MockWebServer$2 execute
INFO: MockWebServer[51656] starting to accept connections
Oct 30, 2020 4:10:14 PM okhttp3.mockwebserver.MockWebServer$3 processOneRequest
INFO: MockWebServer[51656] received request: GET /apis HTTP/1.1 and responded: HTTP/1.1 404 Client Error
Oct 30, 2020 4:10:14 PM okhttp3.mockwebserver.MockWebServer$3 processOneRequest
INFO: MockWebServer[51656] received request: GET /apis/build.openshift.io/v1/namespaces/test/buildconfigs/myapp-docker HTTP/1.1 and responded: HTTP/1.1 404 Client Error
Creating BuildServiceConfig myapp-docker for Docker build
Oct 30, 2020 4:10:14 PM okhttp3.mockwebserver.MockWebServer$3 processOneRequest
INFO: MockWebServer[51656] received request: GET /apis/image.openshift.io/v1/namespaces/test/imagestreams/myapp HTTP/1.1 and responded: HTTP/1.1 404 Client Error
Creating ImageStream myapp
Oct 30, 2020 4:10:14 PM okhttp3.mockwebserver.MockWebServer$3 processOneRequest
INFO: MockWebServer[51656] received request: POST /apis/image.openshift.io/v1/namespaces/test/imagestreams HTTP/1.1 and responded: HTTP/1.1 201 OK
Oct 30, 2020 4:10:14 PM okhttp3.mockwebserver.MockWebServer$3 processOneRequest
INFO: MockWebServer[51656] received request: POST /apis/build.openshift.io/v1/namespaces/test/buildconfigs HTTP/1.1 and responded: HTTP/1.1 201 OK
Starting Build myapp-docker
Oct 30, 2020 4:10:14 PM okhttp3.mockwebserver.MockWebServer$3 processOneRequest
INFO: MockWebServer[51656] received request: POST /apis/build.openshift.io/v1/namespaces/test/buildconfigs/myapp-docker/instantiatebinary?name=myapp-docker&namespace=test HTTP/1.1 and responded: HTTP/1.1 201 OK
Oct 30, 2020 4:10:14 PM okhttp3.mockwebserver.MockWebServer$3 processOneRequest
INFO: MockWebServer[51656] received request: GET /api/v1/namespaces/test/pods?fieldSelector=metadata.name%3Dmyapp-build&watch=true HTTP/1.1 and responded: HTTP/1.1 404 Client Error
Could not watch pod
Waiting for build myapp to complete...
Oct 30, 2020 4:10:14 PM okhttp3.mockwebserver.MockWebServer$3 processOneRequest
INFO: MockWebServer[51656] received request: GET /api/v1/namespaces/test/pods/myapp-build/log?pretty=false&follow=true HTTP/1.1 and responded: HTTP/1.1 404 Client Error
Oct 30, 2020 4:10:14 PM okhttp3.mockwebserver.MockWebServer$3 processOneRequest
INFO: MockWebServer[51656] received request: GET /apis/build.openshift.io/v1/namespaces/test/builds/myapp HTTP/1.1 and responded: HTTP/1.1 200 OK
Build myapp is already finished
Build myapp in status Complete
Oct 30, 2020 4:10:14 PM okhttp3.mockwebserver.MockWebServer$3 processOneRequest
INFO: MockWebServer[51656] received request: GET /apis/image.openshift.io/v1/namespaces/test/imagestreams/myapp HTTP/1.1 and responded: HTTP/1.1 200 OK
Found tag on ImageStream myapp tag: abcdef0123456789
ImageStream myapp written to /tmp/junit3605814260096940907/openshift-build-service/null-is.yml
Oct 30, 2020 4:10:14 PM okhttp3.mockwebserver.MockWebServer$3 processOneRequest
INFO: MockWebServer[51656] received request: GET /apis/build.openshift.io/v1/namespaces/test/builds?fieldSelector=metadata.name%3Dmyapp&watch=true HTTP/1.1 and responded: HTTP/1.1 101 Switching Protocols
Oct 30, 2020 4:10:15 PM okhttp3.mockwebserver.MockWebServer$2 execute
INFO: MockWebServer[53050] starting to accept connections
Oct 30, 2020 4:10:15 PM okhttp3.mockwebserver.MockWebServer$3 processOneRequest
INFO: MockWebServer[53050] received request: GET /apis HTTP/1.1 and responded: HTTP/1.1 404 Client Error
Oct 30, 2020 4:10:15 PM okhttp3.mockwebserver.MockWebServer$3 processOneRequest
INFO: MockWebServer[53050] received request: GET /apis/build.openshift.io/v1/namespaces/test/buildconfigs/myapp-s2i-suffix2 HTTP/1.1 and responded: HTTP/1.1 404 Client Error
Creating BuildServiceConfig myapp-s2i-suffix2 for Source build
Creating ImageStream myapp
Oct 30, 2020 4:10:15 PM okhttp3.mockwebserver.MockWebServer$3 processOneRequest
INFO: MockWebServer[53050] received request: GET /apis/image.openshift.io/v1/namespaces/test/imagestreams/myapp HTTP/1.1 and responded: HTTP/1.1 404 Client Error
Oct 30, 2020 4:10:15 PM okhttp3.mockwebserver.MockWebServer$3 processOneRequest
INFO: MockWebServer[53050] received request: POST /apis/image.openshift.io/v1/namespaces/test/imagestreams HTTP/1.1 and responded: HTTP/1.1 201 OK
Oct 30, 2020 4:10:15 PM okhttp3.mockwebserver.MockWebServer$3 processOneRequest
INFO: MockWebServer[53050] received request: POST /apis/build.openshift.io/v1/namespaces/test/buildconfigs HTTP/1.1 and responded: HTTP/1.1 201 OK
Starting Build myapp-s2i-suffix2
Oct 30, 2020 4:10:15 PM okhttp3.mockwebserver.MockWebServer$3 processOneRequest
INFO: MockWebServer[53050] received request: POST /apis/build.openshift.io/v1/namespaces/test/buildconfigs/myapp-s2i-suffix2/instantiatebinary?name=myapp-s2i-suffix2&namespace=test HTTP/1.1 and responded: HTTP/1.1 201 OK
Oct 30, 2020 4:10:15 PM okhttp3.mockwebserver.MockWebServer$3 processOneRequest
INFO: MockWebServer[53050] received request: GET /api/v1/namespaces/test/pods?fieldSelector=metadata.name%3Dmyapp-build&watch=true HTTP/1.1 and responded: HTTP/1.1 404 Client Error
Could not watch pod
Waiting for build myapp to complete...
Oct 30, 2020 4:10:15 PM okhttp3.mockwebserver.MockWebServer$3 processOneRequest
INFO: MockWebServer[53050] received request: GET /api/v1/namespaces/test/pods/myapp-build/log?pretty=false&follow=true HTTP/1.1 and responded: HTTP/1.1 404 Client Error
Oct 30, 2020 4:10:15 PM okhttp3.mockwebserver.MockWebServer$3 processOneRequest
INFO: MockWebServer[53050] received request: GET /apis/build.openshift.io/v1/namespaces/test/builds/myapp HTTP/1.1 and responded: HTTP/1.1 200 OK
Build myapp is already finished
Build myapp in status Complete
Oct 30, 2020 4:10:15 PM okhttp3.mockwebserver.MockWebServer$3 processOneRequest
INFO: MockWebServer[53050] received request: GET /apis/image.openshift.io/v1/namespaces/test/imagestreams/myapp HTTP/1.1 and responded: HTTP/1.1 200 OK
Found tag on ImageStream myapp tag: abcdef0123456789
ImageStream myapp written to /tmp/junit2732999713700412485/openshift-build-service/null-is.yml
Oct 30, 2020 4:10:15 PM okhttp3.mockwebserver.MockWebServer$3 processOneRequest
INFO: MockWebServer[53050] received request: GET /apis/build.openshift.io/v1/namespaces/test/builds?fieldSelector=metadata.name%3Dmyapp&watch=true HTTP/1.1 and responded: HTTP/1.1 101 Switching Protocols
Oct 30, 2020 4:10:15 PM okhttp3.mockwebserver.MockWebServer$2 execute
INFO: MockWebServer[46416] starting to accept connections
Oct 30, 2020 4:10:15 PM okhttp3.mockwebserver.MockWebServer$3 processOneRequest
INFO: MockWebServer[46416] received request: GET /apis HTTP/1.1 and responded: HTTP/1.1 404 Client Error
Oct 30, 2020 4:10:15 PM okhttp3.mockwebserver.MockWebServer$3 processOneRequest
INFO: MockWebServer[46416] received request: GET /apis/build.openshift.io/v1/namespaces/test/buildconfigs/myapp-s2i-suffix2 HTTP/1.1 and responded: HTTP/1.1 404 Client Error
Creating BuildServiceConfig myapp-s2i-suffix2 for Source build
Oct 30, 2020 4:10:15 PM okhttp3.mockwebserver.MockWebServer$3 processOneRequest
INFO: MockWebServer[46416] received request: GET /apis/image.openshift.io/v1/namespaces/test/imagestreams/myapp HTTP/1.1 and responded: HTTP/1.1 404 Client Error
Creating ImageStream myapp
Oct 30, 2020 4:10:15 PM okhttp3.mockwebserver.MockWebServer$3 processOneRequest
INFO: MockWebServer[46416] received request: POST /apis/image.openshift.io/v1/namespaces/test/imagestreams HTTP/1.1 and responded: HTTP/1.1 201 OK
Oct 30, 2020 4:10:15 PM okhttp3.mockwebserver.MockWebServer$3 processOneRequest
INFO: MockWebServer[46416] received request: POST /apis/build.openshift.io/v1/namespaces/test/buildconfigs HTTP/1.1 and responded: HTTP/1.1 201 OK
Starting Build myapp-s2i-suffix2
Oct 30, 2020 4:10:15 PM okhttp3.mockwebserver.MockWebServer$3 processOneRequest
INFO: MockWebServer[46416] received request: POST /apis/build.openshift.io/v1/namespaces/test/buildconfigs/myapp-s2i-suffix2/instantiatebinary?name=myapp-s2i-suffix2&namespace=test HTTP/1.1 and responded: HTTP/1.1 201 OK
Oct 30, 2020 4:10:15 PM okhttp3.mockwebserver.MockWebServer$3 processOneRequest
INFO: MockWebServer[46416] received request: GET /api/v1/namespaces/test/pods?fieldSelector=metadata.name%3Dmyapp-build&watch=true HTTP/1.1 and responded: HTTP/1.1 404 Client Error
Could not watch pod
Waiting for build myapp to complete...
Oct 30, 2020 4:10:15 PM okhttp3.mockwebserver.MockWebServer$3 processOneRequest
INFO: MockWebServer[46416] received request: GET /api/v1/namespaces/test/pods/myapp-build/log?pretty=false&follow=true HTTP/1.1 and responded: HTTP/1.1 404 Client Error
Oct 30, 2020 4:10:15 PM okhttp3.mockwebserver.MockWebServer$3 processOneRequest
INFO: MockWebServer[46416] received request: GET /apis/build.openshift.io/v1/namespaces/test/builds/myapp HTTP/1.1 and responded: HTTP/1.1 200 OK
Build myapp is already finished
Oct 30, 2020 4:10:15 PM okhttp3.mockwebserver.MockWebServer$3 processOneRequest
INFO: MockWebServer[46416] received request: GET /apis/build.openshift.io/v1/namespaces/test/builds?fieldSelector=metadata.name%3Dmyapp&watch=true HTTP/1.1 and responded: HTTP/1.1 101 Switching Protocols
Oct 30, 2020 4:10:15 PM okhttp3.mockwebserver.MockWebServer$2 execute
INFO: MockWebServer[36578] starting to accept connections
Oct 30, 2020 4:10:15 PM okhttp3.mockwebserver.MockWebServer$3 processOneRequest
INFO: MockWebServer[36578] received request: GET /apis HTTP/1.1 and responded: HTTP/1.1 404 Client Error
Oct 30, 2020 4:10:15 PM okhttp3.mockwebserver.MockWebServer$3 processOneRequest
INFO: MockWebServer[36578] received request: GET /apis/build.openshift.io/v1/namespaces/test/buildconfigs/myapp-s2i-suffix2 HTTP/1.1 and responded: HTTP/1.1 200 OK
Oct 30, 2020 4:10:15 PM okhttp3.mockwebserver.MockWebServer$3 processOneRequest
INFO: MockWebServer[36578] received request: GET /apis/build.openshift.io/v1/namespaces/test/buildconfigs/myapp-s2i-suffix2 HTTP/1.1 and responded: HTTP/1.1 200 OK
Oct 30, 2020 4:10:15 PM okhttp3.mockwebserver.MockWebServer$3 processOneRequest
INFO: MockWebServer[36578] received request: GET /apis/build.openshift.io/v1/namespaces/test/buildconfigs/myapp-s2i-suffix2 HTTP/1.1 and responded: HTTP/1.1 200 OK
Oct 30, 2020 4:10:16 PM okhttp3.mockwebserver.MockWebServer$3 processOneRequest
INFO: MockWebServer[36578] received request: PATCH /apis/build.openshift.io/v1/namespaces/test/buildconfigs/myapp-s2i-suffix2 HTTP/1.1 and responded: HTTP/1.1 200 OK
Updating BuildServiceConfig myapp-s2i-suffix2 for Source strategy
Oct 30, 2020 4:10:16 PM okhttp3.mockwebserver.MockWebServer$3 processOneRequest
INFO: MockWebServer[36578] received request: GET /apis/image.openshift.io/v1/namespaces/test/imagestreams/myapp HTTP/1.1 and responded: HTTP/1.1 200 OK
Adding to ImageStream myapp
Starting Build myapp-s2i-suffix2
Oct 30, 2020 4:10:16 PM okhttp3.mockwebserver.MockWebServer$3 processOneRequest
INFO: MockWebServer[36578] received request: POST /apis/build.openshift.io/v1/namespaces/test/buildconfigs/myapp-s2i-suffix2/instantiatebinary?name=myapp-s2i-suffix2&namespace=test HTTP/1.1 and responded: HTTP/1.1 201 OK
Oct 30, 2020 4:10:16 PM okhttp3.mockwebserver.MockWebServer$3 processOneRequest
INFO: MockWebServer[36578] received request: GET /api/v1/namespaces/test/pods?fieldSelector=metadata.name%3Dmyapp-build&watch=true HTTP/1.1 and responded: HTTP/1.1 404 Client Error
Could not watch pod
Waiting for build myapp to complete...
Oct 30, 2020 4:10:16 PM okhttp3.mockwebserver.MockWebServer$3 processOneRequest
INFO: MockWebServer[36578] received request: GET /api/v1/namespaces/test/pods/myapp-build/log?pretty=false&follow=true HTTP/1.1 and responded: HTTP/1.1 404 Client Error
Oct 30, 2020 4:10:16 PM okhttp3.mockwebserver.MockWebServer$3 processOneRequest
INFO: MockWebServer[36578] received request: GET /apis/build.openshift.io/v1/namespaces/test/builds/myapp HTTP/1.1 and responded: HTTP/1.1 200 OK
Build myapp is already finished
Build myapp in status Complete
Oct 30, 2020 4:10:16 PM okhttp3.mockwebserver.MockWebServer$3 processOneRequest
INFO: MockWebServer[36578] received request: GET /apis/image.openshift.io/v1/namespaces/test/imagestreams/myapp HTTP/1.1 and responded: HTTP/1.1 200 OK
Found tag on ImageStream myapp tag: abcdef0123456789
ImageStream myapp written to /tmp/junit7734211389119431468/openshift-build-service/null-is.yml
Oct 30, 2020 4:10:16 PM okhttp3.mockwebserver.MockWebServer$3 processOneRequest
INFO: MockWebServer[36578] received request: GET /apis/build.openshift.io/v1/namespaces/test/builds?fieldSelector=metadata.name%3Dmyapp&watch=true HTTP/1.1 and responded: HTTP/1.1 101 Switching Protocols
Oct 30, 2020 4:10:16 PM okhttp3.mockwebserver.MockWebServer$2 execute
INFO: MockWebServer[47527] starting to accept connections
Oct 30, 2020 4:10:16 PM okhttp3.mockwebserver.MockWebServer$3 processOneRequest
INFO: MockWebServer[47527] received request: GET /apis HTTP/1.1 and responded: HTTP/1.1 404 Client Error
Oct 30, 2020 4:10:16 PM okhttp3.mockwebserver.MockWebServer$3 processOneRequest
INFO: MockWebServer[47527] received request: GET /apis/build.openshift.io/v1/namespaces/test/buildconfigs/myapp-docker HTTP/1.1 and responded: HTTP/1.1 404 Client Error
Creating BuildServiceConfig myapp-docker for Docker build
Oct 30, 2020 4:10:16 PM okhttp3.mockwebserver.MockWebServer$3 processOneRequest
INFO: MockWebServer[47527] received request: GET /apis/image.openshift.io/v1/namespaces/test/imagestreams/myapp HTTP/1.1 and responded: HTTP/1.1 404 Client Error
Creating ImageStream myapp
Oct 30, 2020 4:10:16 PM okhttp3.mockwebserver.MockWebServer$3 processOneRequest
INFO: MockWebServer[47527] received request: POST /apis/image.openshift.io/v1/namespaces/test/imagestreams HTTP/1.1 and responded: HTTP/1.1 201 OK
Oct 30, 2020 4:10:16 PM okhttp3.mockwebserver.MockWebServer$3 processOneRequest
INFO: MockWebServer[47527] received request: POST /apis/build.openshift.io/v1/namespaces/test/buildconfigs HTTP/1.1 and responded: HTTP/1.1 201 OK
Starting Build myapp-docker
Oct 30, 2020 4:10:16 PM okhttp3.mockwebserver.MockWebServer$3 processOneRequest
INFO: MockWebServer[47527] received request: POST /apis/build.openshift.io/v1/namespaces/test/buildconfigs/myapp-docker/instantiatebinary?name=myapp-docker&namespace=test HTTP/1.1 and responded: HTTP/1.1 201 OK
Oct 30, 2020 4:10:16 PM okhttp3.mockwebserver.MockWebServer$3 processOneRequest
INFO: MockWebServer[47527] received request: GET /api/v1/namespaces/test/pods?fieldSelector=metadata.name%3Dmyapp-build&watch=true HTTP/1.1 and responded: HTTP/1.1 404 Client Error
Could not watch pod
Waiting for build myapp to complete...
Oct 30, 2020 4:10:16 PM okhttp3.mockwebserver.MockWebServer$3 processOneRequest
INFO: MockWebServer[47527] received request: GET /api/v1/namespaces/test/pods/myapp-build/log?pretty=false&follow=true HTTP/1.1 and responded: HTTP/1.1 404 Client Error
Oct 30, 2020 4:10:16 PM okhttp3.mockwebserver.MockWebServer$3 processOneRequest
INFO: MockWebServer[47527] received request: GET /apis/build.openshift.io/v1/namespaces/test/builds/myapp HTTP/1.1 and responded: HTTP/1.1 200 OK
Build myapp is already finished
Build myapp in status Complete
Oct 30, 2020 4:10:16 PM okhttp3.mockwebserver.MockWebServer$3 processOneRequest
INFO: MockWebServer[47527] received request: GET /apis/image.openshift.io/v1/namespaces/test/imagestreams/myapp HTTP/1.1 and responded: HTTP/1.1 200 OK
Found tag on ImageStream myapp tag: abcdef0123456789
ImageStream myapp written to /tmp/junit2685902309990214877/openshift-build-service/null-is.yml
Oct 30, 2020 4:10:16 PM okhttp3.mockwebserver.MockWebServer$3 processOneRequest
INFO: MockWebServer[47527] received request: GET /apis/build.openshift.io/v1/namespaces/test/builds?fieldSelector=metadata.name%3Dmyapp&watch=true HTTP/1.1 and responded: HTTP/1.1 101 Switching Protocols
Oct 30, 2020 4:10:16 PM okhttp3.mockwebserver.MockWebServer$2 execute
INFO: MockWebServer[40396] starting to accept connections
Oct 30, 2020 4:10:16 PM okhttp3.mockwebserver.MockWebServer$3 processOneRequest
INFO: MockWebServer[40396] received request: GET /apis HTTP/1.1 and responded: HTTP/1.1 404 Client Error
Oct 30, 2020 4:10:16 PM okhttp3.mockwebserver.MockWebServer$3 processOneRequest
INFO: MockWebServer[40396] received request: GET /apis/build.openshift.io/v1/namespaces/test/buildconfigs/myapp-s2i-suffix2 HTTP/1.1 and responded: HTTP/1.1 404 Client Error
Creating BuildServiceConfig myapp-s2i-suffix2 for Source build
Oct 30, 2020 4:10:16 PM okhttp3.mockwebserver.MockWebServer$2 execute
INFO: MockWebServer[58635] starting to accept connections
Oct 30, 2020 4:10:16 PM okhttp3.mockwebserver.MockWebServer$3 processOneRequest
INFO: MockWebServer[58635] received request: GET /apis HTTP/1.1 and responded: HTTP/1.1 404 Client Error
Oct 30, 2020 4:10:16 PM okhttp3.mockwebserver.MockWebServer$3 processOneRequest
INFO: MockWebServer[58635] received request: GET /apis/build.openshift.io/v1/namespaces/test/buildconfigs/myapp HTTP/1.1 and responded: HTTP/1.1 404 Client Error
Creating BuildServiceConfig myapp for Docker build
Oct 30, 2020 4:10:16 PM okhttp3.mockwebserver.MockWebServer$3 processOneRequest
INFO: MockWebServer[58635] received request: GET /apis/image.openshift.io/v1/namespaces/test/imagestreams/myapp HTTP/1.1 and responded: HTTP/1.1 404 Client Error
Creating ImageStream myapp
Oct 30, 2020 4:10:16 PM okhttp3.mockwebserver.MockWebServer$3 processOneRequest
INFO: MockWebServer[58635] received request: POST /apis/image.openshift.io/v1/namespaces/test/imagestreams HTTP/1.1 and responded: HTTP/1.1 201 OK
Oct 30, 2020 4:10:16 PM okhttp3.mockwebserver.MockWebServer$3 processOneRequest
INFO: MockWebServer[58635] received request: POST /apis/build.openshift.io/v1/namespaces/test/buildconfigs HTTP/1.1 and responded: HTTP/1.1 201 OK
Starting Build myapp
Oct 30, 2020 4:10:16 PM okhttp3.mockwebserver.MockWebServer$3 processOneRequest
INFO: MockWebServer[58635] received request: POST /apis/build.openshift.io/v1/namespaces/test/buildconfigs/myapp/instantiatebinary?name=myapp&namespace=test HTTP/1.1 and responded: HTTP/1.1 201 OK
Oct 30, 2020 4:10:17 PM okhttp3.mockwebserver.MockWebServer$3 processOneRequest
INFO: MockWebServer[58635] received request: GET /api/v1/namespaces/test/pods?fieldSelector=metadata.name%3Dmyapp-build&watch=true HTTP/1.1 and responded: HTTP/1.1 404 Client Error
Could not watch pod
Waiting for build myapp to complete...
Oct 30, 2020 4:10:17 PM okhttp3.mockwebserver.MockWebServer$3 processOneRequest
INFO: MockWebServer[58635] received request: GET /api/v1/namespaces/test/pods/myapp-build/log?pretty=false&follow=true HTTP/1.1 and responded: HTTP/1.1 404 Client Error
Oct 30, 2020 4:10:17 PM okhttp3.mockwebserver.MockWebServer$3 processOneRequest
INFO: MockWebServer[58635] received request: GET /apis/build.openshift.io/v1/namespaces/test/builds/myapp HTTP/1.1 and responded: HTTP/1.1 200 OK
Build myapp is already finished
Build myapp in status Complete
Oct 30, 2020 4:10:17 PM okhttp3.mockwebserver.MockWebServer$3 processOneRequest
INFO: MockWebServer[58635] received request: GET /apis/image.openshift.io/v1/namespaces/test/imagestreams/myapp HTTP/1.1 and responded: HTTP/1.1 200 OK
Found tag on ImageStream myapp tag: abcdef0123456789
ImageStream myapp written to /tmp/junit5415913860439763478/openshift-build-service/null-is.yml
Oct 30, 2020 4:10:17 PM okhttp3.mockwebserver.MockWebServer$3 processOneRequest
INFO: MockWebServer[58635] received request: GET /apis/build.openshift.io/v1/namespaces/test/builds?fieldSelector=metadata.name%3Dmyapp&watch=true HTTP/1.1 and responded: HTTP/1.1 101 Switching Protocols
Tests run: 12, Failures: 0, Errors: 0, Skipped: 0, Time elapsed: 3.993 sec - in org.eclipse.jkube.kit.config.service.openshift.OpenshiftBuildServiceTest
Running org.eclipse.jkube.kit.config.service.openshift.ImageStreamServiceTest
{apiVersion=v1, kind=List, items=[{apiVersion=image.openshift.io/v1, kind=ImageStream, metadata={name=test}, spec={tags=[{from={kind=ImageStreamImage, name=test@ab12cd, namespace=default}, name=1.0}]}}]}
{apiVersion=v1, kind=List, items=[{apiVersion=image.openshift.io/v1, kind=ImageStream, metadata={name=second-test}, spec={tags=[{from={kind=ImageStreamImage, name=second-test@secondIS, namespace=default}, name=1.0}]}}, {apiVersion=image.openshift.io/v1, kind=ImageStream, metadata={name=test}, spec={tags=[{from={kind=ImageStreamImage, name=test@ab12cd, namespace=default}, name=1.0}]}}]}
Tests run: 3, Failures: 0, Errors: 0, Skipped: 0, Time elapsed: 0.283 sec - in org.eclipse.jkube.kit.config.service.openshift.ImageStreamServiceTest
Running org.eclipse.jkube.kit.config.service.JKubeServiceHubTest
Tests run: 10, Failures: 0, Errors: 0, Skipped: 0, Time elapsed: 0.29 sec - in org.eclipse.jkube.kit.config.service.JKubeServiceHubTest
Running org.eclipse.jkube.kit.config.service.PortForwardServiceTest
Oct 30, 2020 4:10:17 PM okhttp3.mockwebserver.MockWebServer$2 execute
INFO: MockWebServer[54805] starting to accept connections
Oct 30, 2020 4:10:17 PM okhttp3.mockwebserver.MockWebServer$3 processOneRequest
INFO: MockWebServer[54805] received request: GET /apis HTTP/1.1 and responded: HTTP/1.1 404 Client Error
Oct 30, 2020 4:10:17 PM okhttp3.mockwebserver.MockWebServer$3 processOneRequest
INFO: MockWebServer[54805] received request: GET /api/v1/namespaces/test/pods?labelSelector=mykey%3Dmyvalue HTTP/1.1 and responded: HTTP/1.1 200 OK
Oct 30, 2020 4:10:18 PM okhttp3.mockwebserver.MockWebServer$3 processOneRequest
INFO: MockWebServer[54805] received request: GET /api/v1/namespaces/test/pods?labelSelector=mykey%3Dmyvalue&watch=true HTTP/1.1 and responded: HTTP/1.1 101 Switching Protocols
Oct 30, 2020 4:10:19 PM okhttp3.mockwebserver.MockWebServer$3 processOneRequest
INFO: MockWebServer[54805] received request: GET /api/v1/namespaces/test/pods?labelSelector=mykey%3Dmyvalue&resourceVersion=1&watch=true HTTP/1.1 and responded: HTTP/1.1 404 Client Error
Tests run: 1, Failures: 0, Errors: 0, Skipped: 0, Time elapsed: 4.274 sec - in org.eclipse.jkube.kit.config.service.PortForwardServiceTest
Running org.eclipse.jkube.kit.config.service.ApplyServiceTest
Oct 30, 2020 4:10:22 PM okhttp3.mockwebserver.MockWebServer$2 execute
INFO: MockWebServer[37762] starting to accept connections
Oct 30, 2020 4:10:22 PM okhttp3.mockwebserver.MockWebServer$3 processOneRequest
INFO: MockWebServer[37762] received request: GET /apis HTTP/1.1 and responded: HTTP/1.1 404 Client Error
Oct 30, 2020 4:10:22 PM okhttp3.mockwebserver.MockWebServer$3 processOneRequest
INFO: MockWebServer[37762] received request: GET /apis/apiextensions.k8s.io/v1beta1/customresourcedefinitions/virtualservices.networking.istio.io HTTP/1.1 and responded: HTTP/1.1 200 OK
Oct 30, 2020 4:10:22 PM okhttp3.mockwebserver.MockWebServer$3 processOneRequest
INFO: MockWebServer[37762] received request: GET /apis/apiextensions.k8s.io/v1beta1/customresourcedefinitions/gateways.networking.istio.io HTTP/1.1 and responded: HTTP/1.1 200 OK
Oct 30, 2020 4:10:22 PM okhttp3.mockwebserver.MockWebServer$3 processOneRequest
INFO: MockWebServer[37762] received request: GET /apis/networking.istio.io/v1alpha3/namespaces/jkube/virtualservices/reviews-route HTTP/1.1 and responded: HTTP/1.1 404 Client Error
Oct 30, 2020 4:10:22 PM okhttp3.mockwebserver.MockWebServer$3 processOneRequest
INFO: MockWebServer[37762] received request: POST /apis/networking.istio.io/v1alpha3/namespaces/jkube/virtualservices HTTP/1.1 and responded: HTTP/1.1 404 Client Error
Oct 30, 2020 4:10:22 PM okhttp3.mockwebserver.MockWebServer$2 execute
INFO: MockWebServer[39178] starting to accept connections
Oct 30, 2020 4:10:22 PM okhttp3.mockwebserver.MockWebServer$3 processOneRequest
INFO: MockWebServer[39178] received request: GET /apis HTTP/1.1 and responded: HTTP/1.1 404 Client Error
Oct 30, 2020 4:10:22 PM okhttp3.mockwebserver.MockWebServer$3 processOneRequest
INFO: MockWebServer[39178] received request: GET /apis/route.openshift.io/v1/namespaces/default/routes/route HTTP/1.1 and responded: HTTP/1.1 200 OK
Oct 30, 2020 4:10:22 PM okhttp3.mockwebserver.MockWebServer$3 processOneRequest
INFO: MockWebServer[39178] received request: GET /apis/route.openshift.io/v1/namespaces/default/routes/route HTTP/1.1 and responded: HTTP/1.1 200 OK
Oct 30, 2020 4:10:22 PM okhttp3.mockwebserver.MockWebServer$3 processOneRequest
INFO: MockWebServer[39178] received request: GET /apis/route.openshift.io/v1/namespaces/default/routes/route HTTP/1.1 and responded: HTTP/1.1 200 OK
Oct 30, 2020 4:10:22 PM okhttp3.mockwebserver.MockWebServer$3 processOneRequest
INFO: MockWebServer[39178] received request: PATCH /apis/route.openshift.io/v1/namespaces/default/routes/route HTTP/1.1 and responded: HTTP/1.1 200 OK
Oct 30, 2020 4:10:22 PM okhttp3.mockwebserver.MockWebServer$2 execute
INFO: MockWebServer[44491] starting to accept connections
Oct 30, 2020 4:10:22 PM okhttp3.mockwebserver.MockWebServer$3 processOneRequest
INFO: MockWebServer[44491] received request: GET /apis HTTP/1.1 and responded: HTTP/1.1 404 Client Error
Oct 30, 2020 4:10:22 PM okhttp3.mockwebserver.MockWebServer$3 processOneRequest
INFO: MockWebServer[44491] received request: GET /apis/route.openshift.io/v1/namespaces/default/routes/route HTTP/1.1 and responded: HTTP/1.1 404 Client Error
Oct 30, 2020 4:10:22 PM okhttp3.mockwebserver.MockWebServer$3 processOneRequest
INFO: MockWebServer[44491] received request: POST /apis/route.openshift.io/v1/namespaces/default/routes HTTP/1.1 and responded: HTTP/1.1 201 OK
Oct 30, 2020 4:10:22 PM okhttp3.mockwebserver.MockWebServer$2 execute
INFO: MockWebServer[38475] starting to accept connections
Oct 30, 2020 4:10:22 PM okhttp3.mockwebserver.MockWebServer$3 processOneRequest
INFO: MockWebServer[38475] received request: GET /apis HTTP/1.1 and responded: HTTP/1.1 404 Client Error
Oct 30, 2020 4:10:22 PM okhttp3.mockwebserver.MockWebServer$3 processOneRequest
INFO: MockWebServer[38475] received request: GET /apis/apiextensions.k8s.io/v1beta1/customresourcedefinitions/virtualservices.networking.istio.io HTTP/1.1 and responded: HTTP/1.1 200 OK
Oct 30, 2020 4:10:22 PM okhttp3.mockwebserver.MockWebServer$3 processOneRequest
INFO: MockWebServer[38475] received request: GET /apis/apiextensions.k8s.io/v1beta1/customresourcedefinitions/gateways.networking.istio.io HTTP/1.1 and responded: HTTP/1.1 200 OK
Oct 30, 2020 4:10:22 PM okhttp3.mockwebserver.MockWebServer$3 processOneRequest
INFO: MockWebServer[38475] received request: DELETE /apis/networking.istio.io/v1alpha3/namespaces/jkube/virtualservices/reviews-route HTTP/1.1 and responded: HTTP/1.1 404 Client Error
Oct 30, 2020 4:10:22 PM okhttp3.mockwebserver.MockWebServer$2 execute
INFO: MockWebServer[44588] starting to accept connections
Oct 30, 2020 4:10:22 PM okhttp3.mockwebserver.MockWebServer$3 processOneRequest
INFO: MockWebServer[44588] received request: GET /apis HTTP/1.1 and responded: HTTP/1.1 404 Client Error
Oct 30, 2020 4:10:22 PM okhttp3.mockwebserver.MockWebServer$3 processOneRequest
INFO: MockWebServer[44588] received request: GET /apis/apiextensions.k8s.io/v1beta1/customresourcedefinitions/virtualservices.networking.istio.io HTTP/1.1 and responded: HTTP/1.1 200 OK
Oct 30, 2020 4:10:22 PM okhttp3.mockwebserver.MockWebServer$3 processOneRequest
INFO: MockWebServer[44588] received request: GET /apis/apiextensions.k8s.io/v1beta1/customresourcedefinitions/gateways.networking.istio.io HTTP/1.1 and responded: HTTP/1.1 200 OK
Oct 30, 2020 4:10:22 PM okhttp3.mockwebserver.MockWebServer$3 processOneRequest
INFO: MockWebServer[44588] received request: GET /apis/networking.istio.io/v1alpha3/namespaces/jkube/virtualservices/reviews-route HTTP/1.1 and responded: HTTP/1.1 404 Client Error
Oct 30, 2020 4:10:22 PM okhttp3.mockwebserver.MockWebServer$3 processOneRequest
INFO: MockWebServer[44588] received request: POST /apis/networking.istio.io/v1alpha3/namespaces/jkube/virtualservices HTTP/1.1 and responded: HTTP/1.1 404 Client Error
Oct 30, 2020 4:10:22 PM okhttp3.mockwebserver.MockWebServer$2 execute
INFO: MockWebServer[49335] starting to accept connections
Oct 30, 2020 4:10:22 PM okhttp3.mockwebserver.MockWebServer$3 processOneRequest
INFO: MockWebServer[49335] received request: GET /apis HTTP/1.1 and responded: HTTP/1.1 404 Client Error
Oct 30, 2020 4:10:22 PM okhttp3.mockwebserver.MockWebServer$2 execute
INFO: MockWebServer[54566] starting to accept connections
Oct 30, 2020 4:10:22 PM okhttp3.mockwebserver.MockWebServer$3 processOneRequest
INFO: MockWebServer[54566] received request: GET /apis HTTP/1.1 and responded: HTTP/1.1 404 Client Error
Oct 30, 2020 4:10:22 PM okhttp3.mockwebserver.MockWebServer$3 processOneRequest
INFO: MockWebServer[54566] received request: GET /apis/route.openshift.io/v1/namespaces/default/routes/route HTTP/1.1 and responded: HTTP/1.1 404 Client Error
Oct 30, 2020 4:10:22 PM okhttp3.mockwebserver.MockWebServer$2 execute
INFO: MockWebServer[56285] starting to accept connections
Oct 30, 2020 4:10:22 PM okhttp3.mockwebserver.MockWebServer$3 processOneRequest
INFO: MockWebServer[56285] received request: GET /apis HTTP/1.1 and responded: HTTP/1.1 404 Client Error
Tests run: 8, Failures: 0, Errors: 3, Skipped: 0, Time elapsed: 0.569 sec <<< FAILURE! - in org.eclipse.jkube.kit.config.service.ApplyServiceTest
testProcessCustomEntitiesReplaceCustomResources(org.eclipse.jkube.kit.config.service.ApplyServiceTest)  Time elapsed: 0.137 sec  <<< ERROR!
io.fabric8.kubernetes.client.KubernetesClientException: Failure executing: POST at: http://localhost:37762/apis/networking.istio.io/v1alpha3/namespaces/jkube/virtualservices.
	at org.eclipse.jkube.kit.config.service.ApplyServiceTest.testProcessCustomEntitiesReplaceCustomResources(ApplyServiceTest.java:201)

testProcessCustomEntitiesRecreateModeTrue(org.eclipse.jkube.kit.config.service.ApplyServiceTest)  Time elapsed: 0.088 sec  <<< ERROR!
io.fabric8.kubernetes.client.KubernetesClientException: Failure executing: DELETE at: http://localhost:38475/apis/networking.istio.io/v1alpha3/namespaces/jkube/virtualservices/reviews-route.
	at org.eclipse.jkube.kit.config.service.ApplyServiceTest.testProcessCustomEntitiesRecreateModeTrue(ApplyServiceTest.java:243)

testProcessCustomEntities(org.eclipse.jkube.kit.config.service.ApplyServiceTest)  Time elapsed: 0.088 sec  <<< ERROR!
io.fabric8.kubernetes.client.KubernetesClientException: Failure executing: POST at: http://localhost:44588/apis/networking.istio.io/v1alpha3/namespaces/jkube/virtualservices.
	at org.eclipse.jkube.kit.config.service.ApplyServiceTest.testProcessCustomEntities(ApplyServiceTest.java:160)


Results :

Tests in error: 
  ApplyServiceTest.testProcessCustomEntities:160 » KubernetesClient Failure exec...
  ApplyServiceTest.testProcessCustomEntitiesRecreateModeTrue:243 » KubernetesClient
  ApplyServiceTest.testProcessCustomEntitiesReplaceCustomResources:201 » KubernetesClient

Tests run: 59, Failures: 0, Errors: 3, Skipped: 0

[INFO] ------------------------------------------------------------------------
[INFO] Reactor Summary for Eclipse JKube 1.0.2:
[INFO] 
[INFO] Eclipse JKube ...................................... SUCCESS [  6.529 s]
[INFO] JKube Kit :: Parent ................................ SUCCESS [  1.050 s]
[INFO] JKube Kit :: Documentation ......................... SUCCESS [  8.148 s]
[INFO] JKube Kit :: Common :: Test ........................ SUCCESS [  0.463 s]
[INFO] JKube Kit :: Common ................................ SUCCESS [ 13.870 s]
[INFO] JKube Kit :: Common Maven .......................... SUCCESS [  2.754 s]
[INFO] JKube Kit :: Config :: Image ....................... SUCCESS [  3.092 s]
[INFO] JKube Kit :: Config :: Resource .................... SUCCESS [  4.369 s]
[INFO] JKube Kit :: Build :: API .......................... SUCCESS [  2.783 s]
[INFO] JKube Kit :: Build :: Service :: Docker ............ SUCCESS [  6.206 s]
[INFO] JKube Kit :: Build :: Service :: JIB ............... SUCCESS [  1.435 s]
[INFO] JKube Kit :: Config :: Service ..................... FAILURE [ 14.185 s]
[INFO] JKube Kit :: Generator :: API ...................... SKIPPED
[INFO] JKube Kit :: Generator :: Java Exec ................ SKIPPED
[INFO] JKube Kit :: Generator :: WildFly Swarm ............ SKIPPED
[INFO] JKube Kit :: Generator :: Karaf .................... SKIPPED
[INFO] JKube Kit :: Generator :: WebApp ................... SKIPPED
[INFO] JKube Kit :: Enricher :: API ....................... SKIPPED
[INFO] JKube Kit :: Enricher :: Generic ................... SKIPPED
[INFO] JKube Kit :: Enricher :: Specific .................. SKIPPED
[INFO] JKube Kit :: Profile ............................... SKIPPED
[INFO] JKube Kit :: Resource :: Service ................... SKIPPED
[INFO] JKube Kit :: Resource :: Helm ...................... SKIPPED
[INFO] JKube Kit :: Watcher :: API ........................ SKIPPED
[INFO] JKube Kit :: Watcher :: Standard ................... SKIPPED
[INFO] JKube Kit :: Spring-Boot ........................... SKIPPED
[INFO] JKube Kit :: Thorntail ............................. SKIPPED
[INFO] JKube Kit :: Vert.x ................................ SKIPPED
[INFO] JKube Kit :: Quarkus ............................... SKIPPED
[INFO] JKube Kit :: Open Liberty .......................... SKIPPED
[INFO] JKube Kit :: WildFly JAR ........................... SKIPPED
[INFO] JKube Kit .......................................... SKIPPED
[INFO] Kubernetes Maven Plugin :: Parent .................. SKIPPED
[INFO] Kubernetes Maven Plugin :: Plugin .................. SKIPPED
[INFO] Kubernetes Maven Plugin :: Integration Tests ....... SKIPPED
[INFO] Kubernetes Maven Plugin :: Documentation ........... SKIPPED
[INFO] OpenShift Maven Plugin:: Parent .................... SKIPPED
[INFO] OpenShift Maven Plugin :: Plugin ................... SKIPPED
[INFO] OpenShift Maven Plugin :: Integration Tests ........ SKIPPED
[INFO] ------------------------------------------------------------------------
[INFO] BUILD FAILURE
[INFO] ------------------------------------------------------------------------
[INFO] Total time:  01:06 min
[INFO] Finished at: 2020-10-30T16:10:22Z
[INFO] ------------------------------------------------------------------------
[ERROR] Failed to execute goal org.apache.maven.plugins:maven-surefire-plugin:2.19.1:test (default-test) on project jkube-kit-config-service: There are test failures.
[ERROR] 
[ERROR] Please refer to /home/jenkins/agent/workspace/simplified-downloads-eclipse-release/jkube/jkube-kit/config/service/target/surefire-reports for the individual test results.
[ERROR] -> [Help 1]
[ERROR] 
[ERROR] To see the full stack trace of the errors, re-run Maven with the -e switch.
[ERROR] Re-run Maven using the -X switch to enable full debug logging.
[ERROR] 
[ERROR] For more information about the errors and possible solutions, please read the following articles:
[ERROR] [Help 1] http://cwiki.apache.org/confluence/display/MAVEN/MojoFailureException
[ERROR] 
[ERROR] After correcting the problems, you can resume the build with the command
[ERROR]   mvn <args> -rf :jkube-kit-config-service
[Pipeline] }
$ ssh-agent -k
unset SSH_AUTH_SOCK;
unset SSH_AGENT_PID;
echo Agent pid 133 killed;
[ssh-agent] Stopped.
[Pipeline] // sshagent
[Pipeline] }
[Pipeline] // withEnv
[Pipeline] }
[Pipeline] // stage
[Pipeline] }
[Pipeline] // withEnv
[Pipeline] }
[Pipeline] // node
[Pipeline] End of Pipeline
ERROR: script returned exit code 1
Finished: FAILURE